lucene-dev mailing list archives

Site index · List index
Message view « Date » · « Thread »
Top « Date » · « Thread »
From Policeman Jenkins Server <jenk...@thetaphi.de>
Subject [JENKINS] Lucene-Solr-6.x-Linux (64bit/jdk1.8.0_92) - Build # 929 - Failure!
Date Mon, 20 Jun 2016 14:08:02 GMT
Build: http://jenkins.thetaphi.de/job/Lucene-Solr-6.x-Linux/929/
Java: 64bit/jdk1.8.0_92 -XX:-UseCompressedOops -XX:+UseConcMarkSweepGC

1 tests failed.
FAILED:  org.apache.solr.handler.TestReqParamsAPI.test

Error Message:
Could not get expected value  'P val' for path 'response/params/y/p' full output: {   "responseHeader":{     "status":0,     "QTime":0},   "response":{     "znodeVersion":1,     "params":{       "x":{         "a":"A val",         "b":"B val",         "":{"v":0}},       "y":{         "c":"CY val",         "b":"BY val",         "i":20,         "d":[           "val 1",           "val 2"],         "":{"v":0}}}}},  from server:  https://127.0.0.1:34577/_ibq/collection1

Stack Trace:
java.lang.AssertionError: Could not get expected value  'P val' for path 'response/params/y/p' full output: {
  "responseHeader":{
    "status":0,
    "QTime":0},
  "response":{
    "znodeVersion":1,
    "params":{
      "x":{
        "a":"A val",
        "b":"B val",
        "":{"v":0}},
      "y":{
        "c":"CY val",
        "b":"BY val",
        "i":20,
        "d":[
          "val 1",
          "val 2"],
        "":{"v":0}}}}},  from server:  https://127.0.0.1:34577/_ibq/collection1
	at __randomizedtesting.SeedInfo.seed([24E8C4BDAA7BFB10:ACBCFB67048796E8]:0)
	at org.junit.Assert.fail(Assert.java:93)
	at org.junit.Assert.assertTrue(Assert.java:43)
	at org.apache.solr.core.TestSolrConfigHandler.testForResponseElement(TestSolrConfigHandler.java:481)
	at org.apache.solr.handler.TestReqParamsAPI.testReqParams(TestReqParamsAPI.java:215)
	at org.apache.solr.handler.TestReqParamsAPI.test(TestReqParamsAPI.java:61)
	at sun.reflect.NativeMethodAccessorImpl.invoke0(Native Method)
	at sun.reflect.NativeMethodAccessorImpl.invoke(NativeMethodAccessorImpl.java:62)
	at sun.reflect.DelegatingMethodAccessorImpl.invoke(DelegatingMethodAccessorImpl.java:43)
	at java.lang.reflect.Method.invoke(Method.java:498)
	at com.carrotsearch.randomizedtesting.RandomizedRunner.invoke(RandomizedRunner.java:1764)
	at com.carrotsearch.randomizedtesting.RandomizedRunner$8.evaluate(RandomizedRunner.java:871)
	at com.carrotsearch.randomizedtesting.RandomizedRunner$9.evaluate(RandomizedRunner.java:907)
	at com.carrotsearch.randomizedtesting.RandomizedRunner$10.evaluate(RandomizedRunner.java:921)
	at org.apache.solr.BaseDistributedSearchTestCase$ShardsRepeatRule$ShardsFixedStatement.callStatement(BaseDistributedSearchTestCase.java:992)
	at org.apache.solr.BaseDistributedSearchTestCase$ShardsRepeatRule$ShardsStatement.evaluate(BaseDistributedSearchTestCase.java:967)
	at com.carrotsearch.randomizedtesting.rules.SystemPropertiesRestoreRule$1.evaluate(SystemPropertiesRestoreRule.java:57)
	at org.apache.lucene.util.TestRuleSetupTeardownChained$1.evaluate(TestRuleSetupTeardownChained.java:49)
	at org.apache.lucene.util.AbstractBeforeAfterRule$1.evaluate(AbstractBeforeAfterRule.java:45)
	at org.apache.lucene.util.TestRuleThreadAndTestName$1.evaluate(TestRuleThreadAndTestName.java:48)
	at org.apache.lucene.util.TestRuleIgnoreAfterMaxFailures$1.evaluate(TestRuleIgnoreAfterMaxFailures.java:64)
	at org.apache.lucene.util.TestRuleMarkFailure$1.evaluate(TestRuleMarkFailure.java:47)
	at com.carrotsearch.randomizedtesting.rules.StatementAdapter.evaluate(StatementAdapter.java:36)
	at com.carrotsearch.randomizedtesting.ThreadLeakControl$StatementRunner.run(ThreadLeakControl.java:367)
	at com.carrotsearch.randomizedtesting.ThreadLeakControl.forkTimeoutingTask(ThreadLeakControl.java:809)
	at com.carrotsearch.randomizedtesting.ThreadLeakControl$3.evaluate(ThreadLeakControl.java:460)
	at com.carrotsearch.randomizedtesting.RandomizedRunner.runSingleTest(RandomizedRunner.java:880)
	at com.carrotsearch.randomizedtesting.RandomizedRunner$5.evaluate(RandomizedRunner.java:781)
	at com.carrotsearch.randomizedtesting.RandomizedRunner$6.evaluate(RandomizedRunner.java:816)
	at com.carrotsearch.randomizedtesting.RandomizedRunner$7.evaluate(RandomizedRunner.java:827)
	at com.carrotsearch.randomizedtesting.rules.StatementAdapter.evaluate(StatementAdapter.java:36)
	at com.carrotsearch.randomizedtesting.rules.SystemPropertiesRestoreRule$1.evaluate(SystemPropertiesRestoreRule.java:57)
	at org.apache.lucene.util.AbstractBeforeAfterRule$1.evaluate(AbstractBeforeAfterRule.java:45)
	at com.carrotsearch.randomizedtesting.rules.StatementAdapter.evaluate(StatementAdapter.java:36)
	at org.apache.lucene.util.TestRuleStoreClassName$1.evaluate(TestRuleStoreClassName.java:41)
	at com.carrotsearch.randomizedtesting.rules.NoShadowingOrOverridesOnMethodsRule$1.evaluate(NoShadowingOrOverridesOnMethodsRule.java:40)
	at com.carrotsearch.randomizedtesting.rules.NoShadowingOrOverridesOnMethodsRule$1.evaluate(NoShadowingOrOverridesOnMethodsRule.java:40)
	at com.carrotsearch.randomizedtesting.rules.StatementAdapter.evaluate(StatementAdapter.java:36)
	at com.carrotsearch.randomizedtesting.rules.StatementAdapter.evaluate(StatementAdapter.java:36)
	at com.carrotsearch.randomizedtesting.rules.StatementAdapter.evaluate(StatementAdapter.java:36)
	at org.apache.lucene.util.TestRuleAssertionsRequired$1.evaluate(TestRuleAssertionsRequired.java:53)
	at org.apache.lucene.util.TestRuleMarkFailure$1.evaluate(TestRuleMarkFailure.java:47)
	at org.apache.lucene.util.TestRuleIgnoreAfterMaxFailures$1.evaluate(TestRuleIgnoreAfterMaxFailures.java:64)
	at org.apache.lucene.util.TestRuleIgnoreTestSuites$1.evaluate(TestRuleIgnoreTestSuites.java:54)
	at com.carrotsearch.randomizedtesting.rules.StatementAdapter.evaluate(StatementAdapter.java:36)
	at com.carrotsearch.randomizedtesting.ThreadLeakControl$StatementRunner.run(ThreadLeakControl.java:367)
	at java.lang.Thread.run(Thread.java:745)




Build Log:
[...truncated 11300 lines...]
   [junit4] Suite: org.apache.solr.handler.TestReqParamsAPI
   [junit4]   2> Creating dataDir: /home/jenkins/workspace/Lucene-Solr-6.x-Linux/solr/build/solr-core/test/J1/temp/solr.handler.TestReqParamsAPI_24E8C4BDAA7BFB10-001/init-core-data-001
   [junit4]   2> 622724 INFO  (SUITE-TestReqParamsAPI-seed#[24E8C4BDAA7BFB10]-worker) [    ] o.a.s.SolrTestCaseJ4 Randomized ssl (true) and clientAuth (false) via: @org.apache.solr.util.RandomizeSSL(reason=, ssl=NaN, value=NaN, clientAuth=NaN)
   [junit4]   2> 622725 INFO  (SUITE-TestReqParamsAPI-seed#[24E8C4BDAA7BFB10]-worker) [    ] o.a.s.BaseDistributedSearchTestCase Setting hostContext system property: /_ibq/
   [junit4]   2> 622726 INFO  (TEST-TestReqParamsAPI.test-seed#[24E8C4BDAA7BFB10]) [    ] o.a.s.c.ZkTestServer STARTING ZK TEST SERVER
   [junit4]   2> 622726 INFO  (Thread-1594) [    ] o.a.s.c.ZkTestServer client port:0.0.0.0/0.0.0.0:0
   [junit4]   2> 622726 INFO  (Thread-1594) [    ] o.a.s.c.ZkTestServer Starting server
   [junit4]   2> 622826 INFO  (TEST-TestReqParamsAPI.test-seed#[24E8C4BDAA7BFB10]) [    ] o.a.s.c.ZkTestServer start zk server on port:42614
   [junit4]   2> 622826 INFO  (TEST-TestReqParamsAPI.test-seed#[24E8C4BDAA7BFB10]) [    ] o.a.s.c.c.SolrZkClient Using default ZkCredentialsProvider
   [junit4]   2> 622827 INFO  (TEST-TestReqParamsAPI.test-seed#[24E8C4BDAA7BFB10]) [    ] o.a.s.c.c.ConnectionManager Waiting for client to connect to ZooKeeper
   [junit4]   2> 622828 INFO  (zkCallback-871-thread-1) [    ] o.a.s.c.c.ConnectionManager Watcher org.apache.solr.common.cloud.ConnectionManager@7e62afea name:ZooKeeperConnection Watcher:127.0.0.1:42614 got event WatchedEvent state:SyncConnected type:None path:null path:null type:None
   [junit4]   2> 622828 INFO  (TEST-TestReqParamsAPI.test-seed#[24E8C4BDAA7BFB10]) [    ] o.a.s.c.c.ConnectionManager Client is connected to ZooKeeper
   [junit4]   2> 622828 INFO  (TEST-TestReqParamsAPI.test-seed#[24E8C4BDAA7BFB10]) [    ] o.a.s.c.c.SolrZkClient Using default ZkACLProvider
   [junit4]   2> 622828 INFO  (TEST-TestReqParamsAPI.test-seed#[24E8C4BDAA7BFB10]) [    ] o.a.s.c.c.SolrZkClient makePath: /solr
   [junit4]   2> 622829 INFO  (TEST-TestReqParamsAPI.test-seed#[24E8C4BDAA7BFB10]) [    ] o.a.s.c.c.SolrZkClient Using default ZkCredentialsProvider
   [junit4]   2> 622831 INFO  (TEST-TestReqParamsAPI.test-seed#[24E8C4BDAA7BFB10]) [    ] o.a.s.c.c.ConnectionManager Waiting for client to connect to ZooKeeper
   [junit4]   2> 622844 INFO  (zkCallback-872-thread-1) [    ] o.a.s.c.c.ConnectionManager Watcher org.apache.solr.common.cloud.ConnectionManager@6eed831a name:ZooKeeperConnection Watcher:127.0.0.1:42614/solr got event WatchedEvent state:SyncConnected type:None path:null path:null type:None
   [junit4]   2> 622844 INFO  (TEST-TestReqParamsAPI.test-seed#[24E8C4BDAA7BFB10]) [    ] o.a.s.c.c.ConnectionManager Client is connected to ZooKeeper
   [junit4]   2> 622844 INFO  (TEST-TestReqParamsAPI.test-seed#[24E8C4BDAA7BFB10]) [    ] o.a.s.c.c.SolrZkClient Using default ZkACLProvider
   [junit4]   2> 622844 INFO  (TEST-TestReqParamsAPI.test-seed#[24E8C4BDAA7BFB10]) [    ] o.a.s.c.c.SolrZkClient makePath: /collections/collection1
   [junit4]   2> 622845 INFO  (TEST-TestReqParamsAPI.test-seed#[24E8C4BDAA7BFB10]) [    ] o.a.s.c.c.SolrZkClient makePath: /collections/collection1/shards
   [junit4]   2> 622846 INFO  (TEST-TestReqParamsAPI.test-seed#[24E8C4BDAA7BFB10]) [    ] o.a.s.c.c.SolrZkClient makePath: /collections/control_collection
   [junit4]   2> 622846 INFO  (TEST-TestReqParamsAPI.test-seed#[24E8C4BDAA7BFB10]) [    ] o.a.s.c.c.SolrZkClient makePath: /collections/control_collection/shards
   [junit4]   2> 622847 INFO  (TEST-TestReqParamsAPI.test-seed#[24E8C4BDAA7BFB10]) [    ] o.a.s.c.AbstractZkTestCase put /home/jenkins/workspace/Lucene-Solr-6.x-Linux/solr/core/src/test-files/solr/collection1/conf/solrconfig-tlog.xml to /configs/conf1/solrconfig.xml
   [junit4]   2> 622847 INFO  (TEST-TestReqParamsAPI.test-seed#[24E8C4BDAA7BFB10]) [    ] o.a.s.c.c.SolrZkClient makePath: /configs/conf1/solrconfig.xml
   [junit4]   2> 622848 INFO  (TEST-TestReqParamsAPI.test-seed#[24E8C4BDAA7BFB10]) [    ] o.a.s.c.AbstractZkTestCase put /home/jenkins/workspace/Lucene-Solr-6.x-Linux/solr/core/src/test-files/solr/collection1/conf/schema.xml to /configs/conf1/schema.xml
   [junit4]   2> 622849 INFO  (TEST-TestReqParamsAPI.test-seed#[24E8C4BDAA7BFB10]) [    ] o.a.s.c.c.SolrZkClient makePath: /configs/conf1/schema.xml
   [junit4]   2> 622849 INFO  (TEST-TestReqParamsAPI.test-seed#[24E8C4BDAA7BFB10]) [    ] o.a.s.c.AbstractZkTestCase put /home/jenkins/workspace/Lucene-Solr-6.x-Linux/solr/core/src/test-files/solr/collection1/conf/solrconfig.snippet.randomindexconfig.xml to /configs/conf1/solrconfig.snippet.randomindexconfig.xml
   [junit4]   2> 622850 INFO  (TEST-TestReqParamsAPI.test-seed#[24E8C4BDAA7BFB10]) [    ] o.a.s.c.c.SolrZkClient makePath: /configs/conf1/solrconfig.snippet.randomindexconfig.xml
   [junit4]   2> 622851 INFO  (TEST-TestReqParamsAPI.test-seed#[24E8C4BDAA7BFB10]) [    ] o.a.s.c.AbstractZkTestCase put /home/jenkins/workspace/Lucene-Solr-6.x-Linux/solr/core/src/test-files/solr/collection1/conf/stopwords.txt to /configs/conf1/stopwords.txt
   [junit4]   2> 622851 INFO  (TEST-TestReqParamsAPI.test-seed#[24E8C4BDAA7BFB10]) [    ] o.a.s.c.c.SolrZkClient makePath: /configs/conf1/stopwords.txt
   [junit4]   2> 622851 INFO  (TEST-TestReqParamsAPI.test-seed#[24E8C4BDAA7BFB10]) [    ] o.a.s.c.AbstractZkTestCase put /home/jenkins/workspace/Lucene-Solr-6.x-Linux/solr/core/src/test-files/solr/collection1/conf/protwords.txt to /configs/conf1/protwords.txt
   [junit4]   2> 622851 INFO  (TEST-TestReqParamsAPI.test-seed#[24E8C4BDAA7BFB10]) [    ] o.a.s.c.c.SolrZkClient makePath: /configs/conf1/protwords.txt
   [junit4]   2> 622853 INFO  (TEST-TestReqParamsAPI.test-seed#[24E8C4BDAA7BFB10]) [    ] o.a.s.c.AbstractZkTestCase put /home/jenkins/workspace/Lucene-Solr-6.x-Linux/solr/core/src/test-files/solr/collection1/conf/currency.xml to /configs/conf1/currency.xml
   [junit4]   2> 622853 INFO  (TEST-TestReqParamsAPI.test-seed#[24E8C4BDAA7BFB10]) [    ] o.a.s.c.c.SolrZkClient makePath: /configs/conf1/currency.xml
   [junit4]   2> 622853 INFO  (TEST-TestReqParamsAPI.test-seed#[24E8C4BDAA7BFB10]) [    ] o.a.s.c.AbstractZkTestCase put /home/jenkins/workspace/Lucene-Solr-6.x-Linux/solr/core/src/test-files/solr/collection1/conf/enumsConfig.xml to /configs/conf1/enumsConfig.xml
   [junit4]   2> 622855 INFO  (TEST-TestReqParamsAPI.test-seed#[24E8C4BDAA7BFB10]) [    ] o.a.s.c.c.SolrZkClient makePath: /configs/conf1/enumsConfig.xml
   [junit4]   2> 622856 INFO  (TEST-TestReqParamsAPI.test-seed#[24E8C4BDAA7BFB10]) [    ] o.a.s.c.AbstractZkTestCase put /home/jenkins/workspace/Lucene-Solr-6.x-Linux/solr/core/src/test-files/solr/collection1/conf/open-exchange-rates.json to /configs/conf1/open-exchange-rates.json
   [junit4]   2> 622856 INFO  (TEST-TestReqParamsAPI.test-seed#[24E8C4BDAA7BFB10]) [    ] o.a.s.c.c.SolrZkClient makePath: /configs/conf1/open-exchange-rates.json
   [junit4]   2> 622857 INFO  (TEST-TestReqParamsAPI.test-seed#[24E8C4BDAA7BFB10]) [    ] o.a.s.c.AbstractZkTestCase put /home/jenkins/workspace/Lucene-Solr-6.x-Linux/solr/core/src/test-files/solr/collection1/conf/mapping-ISOLatin1Accent.txt to /configs/conf1/mapping-ISOLatin1Accent.txt
   [junit4]   2> 622857 INFO  (TEST-TestReqParamsAPI.test-seed#[24E8C4BDAA7BFB10]) [    ] o.a.s.c.c.SolrZkClient makePath: /configs/conf1/mapping-ISOLatin1Accent.txt
   [junit4]   2> 622857 INFO  (TEST-TestReqParamsAPI.test-seed#[24E8C4BDAA7BFB10]) [    ] o.a.s.c.AbstractZkTestCase put /home/jenkins/workspace/Lucene-Solr-6.x-Linux/solr/core/src/test-files/solr/collection1/conf/old_synonyms.txt to /configs/conf1/old_synonyms.txt
   [junit4]   2> 622857 INFO  (TEST-TestReqParamsAPI.test-seed#[24E8C4BDAA7BFB10]) [    ] o.a.s.c.c.SolrZkClient makePath: /configs/conf1/old_synonyms.txt
   [junit4]   2> 622858 INFO  (TEST-TestReqParamsAPI.test-seed#[24E8C4BDAA7BFB10]) [    ] o.a.s.c.AbstractZkTestCase put /home/jenkins/workspace/Lucene-Solr-6.x-Linux/solr/core/src/test-files/solr/collection1/conf/synonyms.txt to /configs/conf1/synonyms.txt
   [junit4]   2> 622858 INFO  (TEST-TestReqParamsAPI.test-seed#[24E8C4BDAA7BFB10]) [    ] o.a.s.c.c.SolrZkClient makePath: /configs/conf1/synonyms.txt
   [junit4]   2> 622859 INFO  (TEST-TestReqParamsAPI.test-seed#[24E8C4BDAA7BFB10]) [    ] o.a.s.c.c.SolrZkClient Using default ZkCredentialsProvider
   [junit4]   2> 622867 INFO  (TEST-TestReqParamsAPI.test-seed#[24E8C4BDAA7BFB10]) [    ] o.a.s.c.c.ConnectionManager Waiting for client to connect to ZooKeeper
   [junit4]   2> 622868 INFO  (zkCallback-874-thread-1) [    ] o.a.s.c.c.ConnectionManager Watcher org.apache.solr.common.cloud.ConnectionManager@3953b3ae name:ZooKeeperConnection Watcher:127.0.0.1:42614/solr got event WatchedEvent state:SyncConnected type:None path:null path:null type:None
   [junit4]   2> 622868 INFO  (TEST-TestReqParamsAPI.test-seed#[24E8C4BDAA7BFB10]) [    ] o.a.s.c.c.ConnectionManager Client is connected to ZooKeeper
   [junit4]   2> 622868 INFO  (TEST-TestReqParamsAPI.test-seed#[24E8C4BDAA7BFB10]) [    ] o.a.s.c.c.SolrZkClient Using default ZkACLProvider
   [junit4]   2> 622954 INFO  (TEST-TestReqParamsAPI.test-seed#[24E8C4BDAA7BFB10]) [    ] o.a.s.SolrTestCaseJ4 Writing core.properties file to /home/jenkins/workspace/Lucene-Solr-6.x-Linux/solr/build/solr-core/test/J1/temp/solr.handler.TestReqParamsAPI_24E8C4BDAA7BFB10-001/control-001/cores/collection1
   [junit4]   2> 622956 INFO  (TEST-TestReqParamsAPI.test-seed#[24E8C4BDAA7BFB10]) [    ] o.e.j.s.Server jetty-9.3.8.v20160314
   [junit4]   2> 622957 INFO  (TEST-TestReqParamsAPI.test-seed#[24E8C4BDAA7BFB10]) [    ] o.e.j.s.h.ContextHandler Started o.e.j.s.ServletContextHandler@259ffc5{/_ibq,null,AVAILABLE}
   [junit4]   2> 622959 INFO  (TEST-TestReqParamsAPI.test-seed#[24E8C4BDAA7BFB10]) [    ] o.e.j.s.ServerConnector Started ServerConnector@75a925fd{SSL,[ssl, http/1.1]}{127.0.0.1:43885}
   [junit4]   2> 622960 INFO  (TEST-TestReqParamsAPI.test-seed#[24E8C4BDAA7BFB10]) [    ] o.e.j.s.Server Started @625276ms
   [junit4]   2> 622960 INFO  (TEST-TestReqParamsAPI.test-seed#[24E8C4BDAA7BFB10]) [    ] o.a.s.c.s.e.JettySolrRunner Jetty properties: {solr.data.dir=/home/jenkins/workspace/Lucene-Solr-6.x-Linux/solr/build/solr-core/test/J1/temp/solr.handler.TestReqParamsAPI_24E8C4BDAA7BFB10-001/tempDir-001/control/data, hostContext=/_ibq, hostPort=43885, coreRootDirectory=/home/jenkins/workspace/Lucene-Solr-6.x-Linux/solr/build/solr-core/test/J1/temp/solr.handler.TestReqParamsAPI_24E8C4BDAA7BFB10-001/control-001/cores}
   [junit4]   2> 622960 INFO  (TEST-TestReqParamsAPI.test-seed#[24E8C4BDAA7BFB10]) [    ] o.a.s.s.SolrDispatchFilter SolrDispatchFilter.init(): sun.misc.Launcher$AppClassLoader@73d16e93
   [junit4]   2> 622960 INFO  (TEST-TestReqParamsAPI.test-seed#[24E8C4BDAA7BFB10]) [    ] o.a.s.c.SolrResourceLoader new SolrResourceLoader for directory: '/home/jenkins/workspace/Lucene-Solr-6.x-Linux/solr/build/solr-core/test/J1/temp/solr.handler.TestReqParamsAPI_24E8C4BDAA7BFB10-001/control-001'
   [junit4]   2> 622960 INFO  (TEST-TestReqParamsAPI.test-seed#[24E8C4BDAA7BFB10]) [    ] o.a.s.c.SolrResourceLoader JNDI not configured for solr (NoInitialContextEx)
   [junit4]   2> 622960 INFO  (TEST-TestReqParamsAPI.test-seed#[24E8C4BDAA7BFB10]) [    ] o.a.s.c.SolrResourceLoader solr home defaulted to 'solr/' (could not find system property or JNDI)
   [junit4]   2> 622960 INFO  (TEST-TestReqParamsAPI.test-seed#[24E8C4BDAA7BFB10]) [    ] o.a.s.c.c.SolrZkClient Using default ZkCredentialsProvider
   [junit4]   2> 622961 INFO  (TEST-TestReqParamsAPI.test-seed#[24E8C4BDAA7BFB10]) [    ] o.a.s.c.c.ConnectionManager Waiting for client to connect to ZooKeeper
   [junit4]   2> 622963 INFO  (zkCallback-875-thread-1) [    ] o.a.s.c.c.ConnectionManager Watcher org.apache.solr.common.cloud.ConnectionManager@2f5fe822 name:ZooKeeperConnection Watcher:127.0.0.1:42614/solr got event WatchedEvent state:SyncConnected type:None path:null path:null type:None
   [junit4]   2> 622963 INFO  (TEST-TestReqParamsAPI.test-seed#[24E8C4BDAA7BFB10]) [    ] o.a.s.c.c.ConnectionManager Client is connected to ZooKeeper
   [junit4]   2> 622964 INFO  (TEST-TestReqParamsAPI.test-seed#[24E8C4BDAA7BFB10]) [    ] o.a.s.c.c.SolrZkClient Using default ZkACLProvider
   [junit4]   2> 622964 INFO  (TEST-TestReqParamsAPI.test-seed#[24E8C4BDAA7BFB10]) [    ] o.a.s.s.SolrDispatchFilter Loading solr.xml from SolrHome (not found in ZooKeeper)
   [junit4]   2> 622964 INFO  (TEST-TestReqParamsAPI.test-seed#[24E8C4BDAA7BFB10]) [    ] o.a.s.c.SolrXmlConfig Loading container configuration from /home/jenkins/workspace/Lucene-Solr-6.x-Linux/solr/build/solr-core/test/J1/temp/solr.handler.TestReqParamsAPI_24E8C4BDAA7BFB10-001/control-001/solr.xml
   [junit4]   2> 622968 INFO  (TEST-TestReqParamsAPI.test-seed#[24E8C4BDAA7BFB10]) [    ] o.a.s.c.CorePropertiesLocator Config-defined core root directory: /home/jenkins/workspace/Lucene-Solr-6.x-Linux/solr/build/solr-core/test/J1/temp/solr.handler.TestReqParamsAPI_24E8C4BDAA7BFB10-001/control-001/cores
   [junit4]   2> 622968 INFO  (TEST-TestReqParamsAPI.test-seed#[24E8C4BDAA7BFB10]) [    ] o.a.s.c.CoreContainer New CoreContainer 1131814411
   [junit4]   2> 622968 INFO  (TEST-TestReqParamsAPI.test-seed#[24E8C4BDAA7BFB10]) [    ] o.a.s.c.CoreContainer Loading cores into CoreContainer [instanceDir=/home/jenkins/workspace/Lucene-Solr-6.x-Linux/solr/build/solr-core/test/J1/temp/solr.handler.TestReqParamsAPI_24E8C4BDAA7BFB10-001/control-001]
   [junit4]   2> 622968 WARN  (TEST-TestReqParamsAPI.test-seed#[24E8C4BDAA7BFB10]) [    ] o.a.s.c.CoreContainer Couldn't add files from /home/jenkins/workspace/Lucene-Solr-6.x-Linux/solr/build/solr-core/test/J1/temp/solr.handler.TestReqParamsAPI_24E8C4BDAA7BFB10-001/control-001/lib to classpath: /home/jenkins/workspace/Lucene-Solr-6.x-Linux/solr/build/solr-core/test/J1/temp/solr.handler.TestReqParamsAPI_24E8C4BDAA7BFB10-001/control-001/lib
   [junit4]   2> 622969 INFO  (TEST-TestReqParamsAPI.test-seed#[24E8C4BDAA7BFB10]) [    ] o.a.s.h.c.HttpShardHandlerFactory created with socketTimeout : 90000,urlScheme : ,connTimeout : 15000,maxConnectionsPerHost : 20,maxConnections : 10000,corePoolSize : 0,maximumPoolSize : 2147483647,maxThreadIdleTime : 5,sizeOfQueue : -1,fairnessPolicy : false,useRetries : false,
   [junit4]   2> 622970 INFO  (TEST-TestReqParamsAPI.test-seed#[24E8C4BDAA7BFB10]) [    ] o.a.s.u.UpdateShardHandler Creating UpdateShardHandler HTTP client with params: socketTimeout=340000&connTimeout=45000&retry=true
   [junit4]   2> 622970 INFO  (TEST-TestReqParamsAPI.test-seed#[24E8C4BDAA7BFB10]) [    ] o.a.s.l.LogWatcher SLF4J impl is org.slf4j.impl.Log4jLoggerFactory
   [junit4]   2> 622970 INFO  (TEST-TestReqParamsAPI.test-seed#[24E8C4BDAA7BFB10]) [    ] o.a.s.l.LogWatcher Registering Log Listener [Log4j (org.slf4j.impl.Log4jLoggerFactory)]
   [junit4]   2> 622970 INFO  (TEST-TestReqParamsAPI.test-seed#[24E8C4BDAA7BFB10]) [    ] o.a.s.c.ZkContainer Zookeeper client=127.0.0.1:42614/solr
   [junit4]   2> 622970 INFO  (TEST-TestReqParamsAPI.test-seed#[24E8C4BDAA7BFB10]) [    ] o.a.s.c.ZkController zkHost includes chroot
   [junit4]   2> 622970 INFO  (TEST-TestReqParamsAPI.test-seed#[24E8C4BDAA7BFB10]) [    ] o.a.s.c.c.SolrZkClient Using default ZkCredentialsProvider
   [junit4]   2> 622971 INFO  (TEST-TestReqParamsAPI.test-seed#[24E8C4BDAA7BFB10]) [    ] o.a.s.c.c.ConnectionManager Waiting for client to connect to ZooKeeper
   [junit4]   2> 622972 INFO  (zkCallback-878-thread-1) [    ] o.a.s.c.c.ConnectionManager Watcher org.apache.solr.common.cloud.ConnectionManager@571a1dcc name:ZooKeeperConnection Watcher:127.0.0.1:42614 got event WatchedEvent state:SyncConnected type:None path:null path:null type:None
   [junit4]   2> 622972 INFO  (TEST-TestReqParamsAPI.test-seed#[24E8C4BDAA7BFB10]) [    ] o.a.s.c.c.ConnectionManager Client is connected to ZooKeeper
   [junit4]   2> 622973 INFO  (TEST-TestReqParamsAPI.test-seed#[24E8C4BDAA7BFB10]) [    ] o.a.s.c.c.SolrZkClient Using default ZkACLProvider
   [junit4]   2> 622975 INFO  (TEST-TestReqParamsAPI.test-seed#[24E8C4BDAA7BFB10]) [n:127.0.0.1:43885__ibq    ] o.a.s.c.ZkController Added new OnReconnect listener org.apache.solr.cloud.ZkController$$Lambda$58/923839115@100da232
   [junit4]   2> 622976 INFO  (TEST-TestReqParamsAPI.test-seed#[24E8C4BDAA7BFB10]) [n:127.0.0.1:43885__ibq    ] o.a.s.c.c.ConnectionManager Waiting for client to connect to ZooKeeper
   [junit4]   2> 622976 INFO  (zkCallback-879-thread-1-processing-n:127.0.0.1:43885__ibq) [n:127.0.0.1:43885__ibq    ] o.a.s.c.c.ConnectionManager Watcher org.apache.solr.common.cloud.ConnectionManager@1f66d6d5 name:ZooKeeperConnection Watcher:127.0.0.1:42614/solr got event WatchedEvent state:SyncConnected type:None path:null path:null type:None
   [junit4]   2> 622976 INFO  (TEST-TestReqParamsAPI.test-seed#[24E8C4BDAA7BFB10]) [n:127.0.0.1:43885__ibq    ] o.a.s.c.c.ConnectionManager Client is connected to ZooKeeper
   [junit4]   2> 622977 INFO  (TEST-TestReqParamsAPI.test-seed#[24E8C4BDAA7BFB10]) [n:127.0.0.1:43885__ibq    ] o.a.s.c.c.SolrZkClient makePath: /overseer/queue
   [junit4]   2> 622978 INFO  (TEST-TestReqParamsAPI.test-seed#[24E8C4BDAA7BFB10]) [n:127.0.0.1:43885__ibq    ] o.a.s.c.c.SolrZkClient makePath: /overseer/collection-queue-work
   [junit4]   2> 622980 INFO  (TEST-TestReqParamsAPI.test-seed#[24E8C4BDAA7BFB10]) [n:127.0.0.1:43885__ibq    ] o.a.s.c.c.SolrZkClient makePath: /overseer/collection-map-running
   [junit4]   2> 622981 INFO  (TEST-TestReqParamsAPI.test-seed#[24E8C4BDAA7BFB10]) [n:127.0.0.1:43885__ibq    ] o.a.s.c.c.SolrZkClient makePath: /overseer/collection-map-completed
   [junit4]   2> 622982 INFO  (TEST-TestReqParamsAPI.test-seed#[24E8C4BDAA7BFB10]) [n:127.0.0.1:43885__ibq    ] o.a.s.c.c.SolrZkClient makePath: /overseer/collection-map-failure
   [junit4]   2> 622982 INFO  (TEST-TestReqParamsAPI.test-seed#[24E8C4BDAA7BFB10]) [n:127.0.0.1:43885__ibq    ] o.a.s.c.c.SolrZkClient makePath: /live_nodes
   [junit4]   2> 622983 INFO  (TEST-TestReqParamsAPI.test-seed#[24E8C4BDAA7BFB10]) [n:127.0.0.1:43885__ibq    ] o.a.s.c.c.SolrZkClient makePath: /aliases.json
   [junit4]   2> 622984 INFO  (TEST-TestReqParamsAPI.test-seed#[24E8C4BDAA7BFB10]) [n:127.0.0.1:43885__ibq    ] o.a.s.c.c.SolrZkClient makePath: /clusterstate.json
   [junit4]   2> 622984 INFO  (TEST-TestReqParamsAPI.test-seed#[24E8C4BDAA7BFB10]) [n:127.0.0.1:43885__ibq    ] o.a.s.c.c.SolrZkClient makePath: /security.json
   [junit4]   2> 622985 INFO  (TEST-TestReqParamsAPI.test-seed#[24E8C4BDAA7BFB10]) [n:127.0.0.1:43885__ibq    ] o.a.s.c.c.ZkStateReader Updating cluster state from ZooKeeper... 
   [junit4]   2> 622985 INFO  (TEST-TestReqParamsAPI.test-seed#[24E8C4BDAA7BFB10]) [n:127.0.0.1:43885__ibq    ] o.a.s.c.c.ZkStateReader Loaded cluster properties: {urlScheme=https}
   [junit4]   2> 622987 INFO  (TEST-TestReqParamsAPI.test-seed#[24E8C4BDAA7BFB10]) [n:127.0.0.1:43885__ibq    ] o.a.s.c.c.ZkStateReader Updated live nodes from ZooKeeper... (0) -> (0)
   [junit4]   2> 622988 INFO  (TEST-TestReqParamsAPI.test-seed#[24E8C4BDAA7BFB10]) [n:127.0.0.1:43885__ibq    ] o.a.s.c.c.SolrZkClient makePath: /overseer_elect
   [junit4]   2> 622990 INFO  (TEST-TestReqParamsAPI.test-seed#[24E8C4BDAA7BFB10]) [n:127.0.0.1:43885__ibq    ] o.a.s.c.c.SolrZkClient makePath: /overseer_elect/election
   [junit4]   2> 622991 INFO  (TEST-TestReqParamsAPI.test-seed#[24E8C4BDAA7BFB10]) [n:127.0.0.1:43885__ibq    ] o.a.s.c.Overseer Overseer (id=null) closing
   [junit4]   2> 622991 INFO  (TEST-TestReqParamsAPI.test-seed#[24E8C4BDAA7BFB10]) [n:127.0.0.1:43885__ibq    ] o.a.s.c.LeaderElector Joined leadership election with path: /overseer_elect/election/96103967575048197-127.0.0.1:43885__ibq-n_0000000000
   [junit4]   2> 622991 INFO  (TEST-TestReqParamsAPI.test-seed#[24E8C4BDAA7BFB10]) [n:127.0.0.1:43885__ibq    ] o.a.s.c.OverseerElectionContext I am going to be the leader 127.0.0.1:43885__ibq
   [junit4]   2> 622991 INFO  (TEST-TestReqParamsAPI.test-seed#[24E8C4BDAA7BFB10]) [n:127.0.0.1:43885__ibq    ] o.a.s.c.c.SolrZkClient makePath: /overseer_elect/leader
   [junit4]   2> 622992 INFO  (TEST-TestReqParamsAPI.test-seed#[24E8C4BDAA7BFB10]) [n:127.0.0.1:43885__ibq    ] o.a.s.c.Overseer Overseer (id=96103967575048197-127.0.0.1:43885__ibq-n_0000000000) starting
   [junit4]   2> 622993 INFO  (TEST-TestReqParamsAPI.test-seed#[24E8C4BDAA7BFB10]) [n:127.0.0.1:43885__ibq    ] o.a.s.c.c.SolrZkClient makePath: /overseer/queue-work
   [junit4]   2> 622996 INFO  (TEST-TestReqParamsAPI.test-seed#[24E8C4BDAA7BFB10]) [n:127.0.0.1:43885__ibq    ] o.a.s.c.OverseerAutoReplicaFailoverThread Starting OverseerAutoReplicaFailoverThread autoReplicaFailoverWorkLoopDelay=10000 autoReplicaFailoverWaitAfterExpiration=30000 autoReplicaFailoverBadNodeExpiration=60000
   [junit4]   2> 622997 INFO  (OverseerCollectionConfigSetProcessor-96103967575048197-127.0.0.1:43885__ibq-n_0000000000) [n:127.0.0.1:43885__ibq    ] o.a.s.c.OverseerTaskProcessor Process current queue of overseer operations
   [junit4]   2> 622997 INFO  (TEST-TestReqParamsAPI.test-seed#[24E8C4BDAA7BFB10]) [n:127.0.0.1:43885__ibq    ] o.a.s.c.ZkController Register node as live in ZooKeeper:/live_nodes/127.0.0.1:43885__ibq
   [junit4]   2> 622997 INFO  (OverseerStateUpdate-96103967575048197-127.0.0.1:43885__ibq-n_0000000000) [n:127.0.0.1:43885__ibq    ] o.a.s.c.Overseer Starting to work on the main queue
   [junit4]   2> 622997 INFO  (TEST-TestReqParamsAPI.test-seed#[24E8C4BDAA7BFB10]) [n:127.0.0.1:43885__ibq    ] o.a.s.c.c.SolrZkClient makePath: /live_nodes/127.0.0.1:43885__ibq
   [junit4]   2> 623000 INFO  (zkCallback-879-thread-1-processing-n:127.0.0.1:43885__ibq) [n:127.0.0.1:43885__ibq    ] o.a.s.c.c.ZkStateReader A live node change: [WatchedEvent state:SyncConnected type:NodeChildrenChanged path:/live_nodes], has occurred - updating... (live nodes size: [0])
   [junit4]   2> 623000 INFO  (OverseerStateUpdate-96103967575048197-127.0.0.1:43885__ibq-n_0000000000) [n:127.0.0.1:43885__ibq    ] o.a.s.c.c.ZkStateReader Updated live nodes from ZooKeeper... (0) -> (1)
   [junit4]   2> 623000 INFO  (zkCallback-879-thread-1-processing-n:127.0.0.1:43885__ibq) [n:127.0.0.1:43885__ibq    ] o.a.s.c.c.ZkStateReader Updated live nodes from ZooKeeper... (1) -> (1)
   [junit4]   2> 623016 INFO  (TEST-TestReqParamsAPI.test-seed#[24E8C4BDAA7BFB10]) [n:127.0.0.1:43885__ibq    ] o.a.s.c.CoreContainer Security conf doesn't exist. Skipping setup for authorization module.
   [junit4]   2> 623017 INFO  (TEST-TestReqParamsAPI.test-seed#[24E8C4BDAA7BFB10]) [n:127.0.0.1:43885__ibq    ] o.a.s.c.CoreContainer No authentication plugin used.
   [junit4]   2> 623017 INFO  (TEST-TestReqParamsAPI.test-seed#[24E8C4BDAA7BFB10]) [n:127.0.0.1:43885__ibq    ] o.a.s.c.CorePropertiesLocator Looking for core definitions underneath /home/jenkins/workspace/Lucene-Solr-6.x-Linux/solr/build/solr-core/test/J1/temp/solr.handler.TestReqParamsAPI_24E8C4BDAA7BFB10-001/control-001/cores
   [junit4]   2> 623017 INFO  (TEST-TestReqParamsAPI.test-seed#[24E8C4BDAA7BFB10]) [n:127.0.0.1:43885__ibq    ] o.a.s.c.CoreDescriptor Created CoreDescriptor: {name=collection1, config=solrconfig.xml, transient=false, schema=schema.xml, loadOnStartup=true, configSetProperties=configsetprops.json, collection=control_collection, coreNodeName=, dataDir=data/, shard=}
   [junit4]   2> 623017 INFO  (TEST-TestReqParamsAPI.test-seed#[24E8C4BDAA7BFB10]) [n:127.0.0.1:43885__ibq    ] o.a.s.c.CorePropertiesLocator Found core collection1 in /home/jenkins/workspace/Lucene-Solr-6.x-Linux/solr/build/solr-core/test/J1/temp/solr.handler.TestReqParamsAPI_24E8C4BDAA7BFB10-001/control-001/cores/collection1
   [junit4]   2> 623018 INFO  (TEST-TestReqParamsAPI.test-seed#[24E8C4BDAA7BFB10]) [n:127.0.0.1:43885__ibq    ] o.a.s.c.CorePropertiesLocator Found 1 core definitions
   [junit4]   2> 623018 INFO  (TEST-TestReqParamsAPI.test-seed#[24E8C4BDAA7BFB10]) [n:127.0.0.1:43885__ibq    ] o.a.s.s.SolrDispatchFilter user.dir=/home/jenkins/workspace/Lucene-Solr-6.x-Linux/solr/build/solr-core/test/J1
   [junit4]   2> 623018 INFO  (TEST-TestReqParamsAPI.test-seed#[24E8C4BDAA7BFB10]) [n:127.0.0.1:43885__ibq    ] o.a.s.s.SolrDispatchFilter SolrDispatchFilter.init() done
   [junit4]   2> 623018 INFO  (coreLoadExecutor-2235-thread-1-processing-n:127.0.0.1:43885__ibq) [n:127.0.0.1:43885__ibq c:control_collection   x:collection1] o.a.s.c.ZkController publishing state=down
   [junit4]   2> 623018 INFO  (coreLoadExecutor-2235-thread-1-processing-n:127.0.0.1:43885__ibq) [n:127.0.0.1:43885__ibq c:control_collection   x:collection1] o.a.s.c.ZkController numShards not found on descriptor - reading it from system property
   [junit4]   2> 623019 INFO  (coreLoadExecutor-2235-thread-1-processing-n:127.0.0.1:43885__ibq) [n:127.0.0.1:43885__ibq c:control_collection   x:collection1] o.a.s.c.ZkController Collection control_collection not visible yet, but flagging it so a watch is registered when it becomes visible
   [junit4]   2> 623019 INFO  (OverseerStateUpdate-96103967575048197-127.0.0.1:43885__ibq-n_0000000000) [n:127.0.0.1:43885__ibq    ] o.a.s.c.Overseer processMessage: queueSize: 1, message = {
   [junit4]   2>   "core":"collection1",
   [junit4]   2>   "roles":null,
   [junit4]   2>   "base_url":"https://127.0.0.1:43885/_ibq",
   [junit4]   2>   "node_name":"127.0.0.1:43885__ibq",
   [junit4]   2>   "numShards":"1",
   [junit4]   2>   "state":"down",
   [junit4]   2>   "shard":null,
   [junit4]   2>   "collection":"control_collection",
   [junit4]   2>   "operation":"state"} current state version: 0
   [junit4]   2> 623019 INFO  (OverseerStateUpdate-96103967575048197-127.0.0.1:43885__ibq-n_0000000000) [n:127.0.0.1:43885__ibq    ] o.a.s.c.o.ReplicaMutator Update state numShards=1 message={
   [junit4]   2>   "core":"collection1",
   [junit4]   2>   "roles":null,
   [junit4]   2>   "base_url":"https://127.0.0.1:43885/_ibq",
   [junit4]   2>   "node_name":"127.0.0.1:43885__ibq",
   [junit4]   2>   "numShards":"1",
   [junit4]   2>   "state":"down",
   [junit4]   2>   "shard":null,
   [junit4]   2>   "collection":"control_collection",
   [junit4]   2>   "operation":"state"}
   [junit4]   2> 623020 INFO  (coreLoadExecutor-2235-thread-1-processing-n:127.0.0.1:43885__ibq) [n:127.0.0.1:43885__ibq c:control_collection   x:collection1] o.a.s.c.c.ZkStateReader Deleting data for [control_collection]
   [junit4]   2> 623020 INFO  (OverseerStateUpdate-96103967575048197-127.0.0.1:43885__ibq-n_0000000000) [n:127.0.0.1:43885__ibq    ] o.a.s.c.o.ClusterStateMutator building a new cName: control_collection
   [junit4]   2> 623020 INFO  (OverseerStateUpdate-96103967575048197-127.0.0.1:43885__ibq-n_0000000000) [n:127.0.0.1:43885__ibq    ] o.a.s.c.o.ReplicaMutator Assigning new node to shard shard=shard1
   [junit4]   2> 623020 INFO  (coreLoadExecutor-2235-thread-1-processing-n:127.0.0.1:43885__ibq) [n:127.0.0.1:43885__ibq c:control_collection   x:collection1] o.a.s.c.ZkController look for our core node name
   [junit4]   2> 623021 INFO  (zkCallback-879-thread-1-processing-n:127.0.0.1:43885__ibq) [n:127.0.0.1:43885__ibq    ] o.a.s.c.c.ZkStateReader A cluster state change: [WatchedEvent state:SyncConnected type:NodeDataChanged path:/clusterstate.json], has occurred - updating... (live nodes size: [1])
   [junit4]   2> 624021 INFO  (coreLoadExecutor-2235-thread-1-processing-n:127.0.0.1:43885__ibq) [n:127.0.0.1:43885__ibq c:control_collection   x:collection1] o.a.s.c.ZkController waiting to find shard id in clusterstate for collection1
   [junit4]   2> 624021 INFO  (coreLoadExecutor-2235-thread-1-processing-n:127.0.0.1:43885__ibq) [n:127.0.0.1:43885__ibq c:control_collection   x:collection1] o.a.s.c.ZkController Check for collection zkNode:control_collection
   [junit4]   2> 624021 INFO  (coreLoadExecutor-2235-thread-1-processing-n:127.0.0.1:43885__ibq) [n:127.0.0.1:43885__ibq c:control_collection   x:collection1] o.a.s.c.ZkController Collection zkNode exists
   [junit4]   2> 624021 INFO  (coreLoadExecutor-2235-thread-1-processing-n:127.0.0.1:43885__ibq) [n:127.0.0.1:43885__ibq c:control_collection   x:collection1] o.a.s.c.c.ZkStateReader Load collection config from: [/collections/control_collection]
   [junit4]   2> 624021 INFO  (coreLoadExecutor-2235-thread-1-processing-n:127.0.0.1:43885__ibq) [n:127.0.0.1:43885__ibq c:control_collection   x:collection1] o.a.s.c.c.ZkStateReader path=[/collections/control_collection] [configName]=[conf1] specified config exists in ZooKeeper
   [junit4]   2> 624022 INFO  (coreLoadExecutor-2235-thread-1-processing-n:127.0.0.1:43885__ibq) [n:127.0.0.1:43885__ibq c:control_collection   x:collection1] o.a.s.c.SolrResourceLoader new SolrResourceLoader for directory: '/home/jenkins/workspace/Lucene-Solr-6.x-Linux/solr/build/solr-core/test/J1/temp/solr.handler.TestReqParamsAPI_24E8C4BDAA7BFB10-001/control-001/cores/collection1'
   [junit4]   2> 624022 INFO  (coreLoadExecutor-2235-thread-1-processing-n:127.0.0.1:43885__ibq) [n:127.0.0.1:43885__ibq c:control_collection   x:collection1] o.a.s.c.SolrResourceLoader JNDI not configured for solr (NoInitialContextEx)
   [junit4]   2> 624022 INFO  (coreLoadExecutor-2235-thread-1-processing-n:127.0.0.1:43885__ibq) [n:127.0.0.1:43885__ibq c:control_collection   x:collection1] o.a.s.c.SolrResourceLoader solr home defaulted to 'solr/' (could not find system property or JNDI)
   [junit4]   2> 624023 INFO  (coreLoadExecutor-2235-thread-1-processing-n:127.0.0.1:43885__ibq) [n:127.0.0.1:43885__ibq c:control_collection   x:collection1] o.a.s.c.Config loaded config solrconfig.xml with version 0 
   [junit4]   2> 624027 INFO  (coreLoadExecutor-2235-thread-1-processing-n:127.0.0.1:43885__ibq) [n:127.0.0.1:43885__ibq c:control_collection   x:collection1] o.a.s.c.SolrConfig current version of requestparams : -1
   [junit4]   2> 624030 INFO  (coreLoadExecutor-2235-thread-1-processing-n:127.0.0.1:43885__ibq) [n:127.0.0.1:43885__ibq c:control_collection   x:collection1] o.a.s.c.SolrConfig Using Lucene MatchVersion: 6.2.0
   [junit4]   2> 624050 INFO  (coreLoadExecutor-2235-thread-1-processing-n:127.0.0.1:43885__ibq) [n:127.0.0.1:43885__ibq c:control_collection   x:collection1] o.a.s.c.SolrConfig Loaded SolrConfig: solrconfig.xml
   [junit4]   2> 624053 INFO  (coreLoadExecutor-2235-thread-1-processing-n:127.0.0.1:43885__ibq) [n:127.0.0.1:43885__ibq c:control_collection   x:collection1] o.a.s.s.IndexSchema [collection1] Schema name=test
   [junit4]   2> 624130 INFO  (coreLoadExecutor-2235-thread-1-processing-n:127.0.0.1:43885__ibq) [n:127.0.0.1:43885__ibq c:control_collection   x:collection1] o.a.s.s.OpenExchangeRatesOrgProvider Initialized with rates=open-exchange-rates.json, refreshInterval=1440.
   [junit4]   2> 624134 INFO  (coreLoadExecutor-2235-thread-1-processing-n:127.0.0.1:43885__ibq) [n:127.0.0.1:43885__ibq c:control_collection   x:collection1] o.a.s.s.IndexSchema default search field in schema is text
   [junit4]   2> 624135 INFO  (coreLoadExecutor-2235-thread-1-processing-n:127.0.0.1:43885__ibq) [n:127.0.0.1:43885__ibq c:control_collection   x:collection1] o.a.s.s.IndexSchema unique key field: id
   [junit4]   2> 624141 INFO  (coreLoadExecutor-2235-thread-1-processing-n:127.0.0.1:43885__ibq) [n:127.0.0.1:43885__ibq c:control_collection   x:collection1] o.a.s.s.FileExchangeRateProvider Reloading exchange rates from file currency.xml
   [junit4]   2> 624143 INFO  (coreLoadExecutor-2235-thread-1-processing-n:127.0.0.1:43885__ibq) [n:127.0.0.1:43885__ibq c:control_collection   x:collection1] o.a.s.s.FileExchangeRateProvider Reloading exchange rates from file currency.xml
   [junit4]   2> 624144 INFO  (coreLoadExecutor-2235-thread-1-processing-n:127.0.0.1:43885__ibq) [n:127.0.0.1:43885__ibq c:control_collection   x:collection1] o.a.s.s.OpenExchangeRatesOrgProvider Reloading exchange rates from open-exchange-rates.json
   [junit4]   2> 624145 INFO  (coreLoadExecutor-2235-thread-1-processing-n:127.0.0.1:43885__ibq) [n:127.0.0.1:43885__ibq c:control_collection   x:collection1] o.a.s.s.OpenExchangeRatesOrgProvider Reloading exchange rates from open-exchange-rates.json
   [junit4]   2> 624146 INFO  (coreLoadExecutor-2235-thread-1-processing-n:127.0.0.1:43885__ibq) [n:127.0.0.1:43885__ibq c:control_collection   x:collection1] o.a.s.c.ConfigSetProperties Did not find ConfigSet properties, assuming default properties: Can't find resource 'configsetprops.json' in classpath or '/configs/conf1', cwd=/home/jenkins/workspace/Lucene-Solr-6.x-Linux/solr/build/solr-core/test/J1
   [junit4]   2> 624146 INFO  (coreLoadExecutor-2235-thread-1-processing-n:127.0.0.1:43885__ibq) [n:127.0.0.1:43885__ibq c:control_collection   x:collection1] o.a.s.c.CoreContainer Creating SolrCore 'collection1' using configuration from collection control_collection
   [junit4]   2> 624146 INFO  (coreLoadExecutor-2235-thread-1-processing-n:127.0.0.1:43885__ibq) [n:127.0.0.1:43885__ibq c:control_collection s:shard1 r:core_node1 x:collection1] o.a.s.c.SolrCore org.apache.solr.core.MockDirectoryFactory
   [junit4]   2> 624146 INFO  (coreLoadExecutor-2235-thread-1-processing-n:127.0.0.1:43885__ibq) [n:127.0.0.1:43885__ibq c:control_collection s:shard1 r:core_node1 x:collection1] o.a.s.c.SolrCore [[collection1] ] Opening new SolrCore at [/home/jenkins/workspace/Lucene-Solr-6.x-Linux/solr/build/solr-core/test/J1/temp/solr.handler.TestReqParamsAPI_24E8C4BDAA7BFB10-001/control-001/cores/collection1], dataDir=[/home/jenkins/workspace/Lucene-Solr-6.x-Linux/solr/build/solr-core/test/J1/temp/solr.handler.TestReqParamsAPI_24E8C4BDAA7BFB10-001/control-001/cores/collection1/data/]
   [junit4]   2> 624146 INFO  (coreLoadExecutor-2235-thread-1-processing-n:127.0.0.1:43885__ibq) [n:127.0.0.1:43885__ibq c:control_collection s:shard1 r:core_node1 x:collection1] o.a.s.c.JmxMonitoredMap JMX monitoring is enabled. Adding Solr mbeans to JMX Server: com.sun.jmx.mbeanserver.JmxMBeanServer@3a672b49
   [junit4]   2> 624146 INFO  (coreLoadExecutor-2235-thread-1-processing-n:127.0.0.1:43885__ibq) [n:127.0.0.1:43885__ibq c:control_collection s:shard1 r:core_node1 x:collection1] o.a.s.c.CachingDirectoryFactory return new directory for /home/jenkins/workspace/Lucene-Solr-6.x-Linux/solr/build/solr-core/test/J1/temp/solr.handler.TestReqParamsAPI_24E8C4BDAA7BFB10-001/control-001/cores/collection1/data
   [junit4]   2> 624146 INFO  (coreLoadExecutor-2235-thread-1-processing-n:127.0.0.1:43885__ibq) [n:127.0.0.1:43885__ibq c:control_collection s:shard1 r:core_node1 x:collection1] o.a.s.c.SolrCore New index directory detected: old=null new=/home/jenkins/workspace/Lucene-Solr-6.x-Linux/solr/build/solr-core/test/J1/temp/solr.handler.TestReqParamsAPI_24E8C4BDAA7BFB10-001/control-001/cores/collection1/data/index/
   [junit4]   2> 624147 WARN  (coreLoadExecutor-2235-thread-1-processing-n:127.0.0.1:43885__ibq) [n:127.0.0.1:43885__ibq c:control_collection s:shard1 r:core_node1 x:collection1] o.a.s.c.SolrCore [collection1] Solr index directory '/home/jenkins/workspace/Lucene-Solr-6.x-Linux/solr/build/solr-core/test/J1/temp/solr.handler.TestReqParamsAPI_24E8C4BDAA7BFB10-001/control-001/cores/collection1/data/index' doesn't exist. Creating new index...
   [junit4]   2> 624147 INFO  (coreLoadExecutor-2235-thread-1-processing-n:127.0.0.1:43885__ibq) [n:127.0.0.1:43885__ibq c:control_collection s:shard1 r:core_node1 x:collection1] o.a.s.c.CachingDirectoryFactory return new directory for /home/jenkins/workspace/Lucene-Solr-6.x-Linux/solr/build/solr-core/test/J1/temp/solr.handler.TestReqParamsAPI_24E8C4BDAA7BFB10-001/control-001/cores/collection1/data/index
   [junit4]   2> 624147 INFO  (coreLoadExecutor-2235-thread-1-processing-n:127.0.0.1:43885__ibq) [n:127.0.0.1:43885__ibq c:control_collection s:shard1 r:core_node1 x:collection1] o.a.s.u.RandomMergePolicy RandomMergePolicy wrapping class org.apache.lucene.index.TieredMergePolicy: [TieredMergePolicy: maxMergeAtOnce=45, maxMergeAtOnceExplicit=11, maxMergedSegmentMB=69.5966796875, floorSegmentMB=1.9736328125, forceMergeDeletesPctAllowed=15.711360986410412, segmentsPerTier=46.0, maxCFSSegmentSizeMB=8.796093022207999E12, noCFSRatio=0.21543813296637673
   [junit4]   2> 624147 INFO  (coreLoadExecutor-2235-thread-1-processing-n:127.0.0.1:43885__ibq) [n:127.0.0.1:43885__ibq c:control_collection s:shard1 r:core_node1 x:collection1] o.a.s.c.SolrDeletionPolicy SolrDeletionPolicy.onCommit: commits: num=1
   [junit4]   2> 	commit{dir=MockDirectoryWrapper(RAMDirectory@5b62f9d lockFactory=org.apache.lucene.store.SingleInstanceLockFactory@77f91a9a),segFN=segments_1,generation=1}
   [junit4]   2> 624147 INFO  (coreLoadExecutor-2235-thread-1-processing-n:127.0.0.1:43885__ibq) [n:127.0.0.1:43885__ibq c:control_collection s:shard1 r:core_node1 x:collection1] o.a.s.c.SolrDeletionPolicy newest commit generation = 1
   [junit4]   2> 624149 INFO  (coreLoadExecutor-2235-thread-1-processing-n:127.0.0.1:43885__ibq) [n:127.0.0.1:43885__ibq c:control_collection s:shard1 r:core_node1 x:collection1] o.a.s.u.p.UpdateRequestProcessorChain creating updateRequestProcessorChain "nodistrib"
   [junit4]   2> 624151 INFO  (coreLoadExecutor-2235-thread-1-processing-n:127.0.0.1:43885__ibq) [n:127.0.0.1:43885__ibq c:control_collection s:shard1 r:core_node1 x:collection1] o.a.s.u.p.UpdateRequestProcessorChain creating updateRequestProcessorChain "dedupe"
   [junit4]   2> 624151 INFO  (OldIndexDirectoryCleanupThreadForCore-collection1) [n:127.0.0.1:43885__ibq c:control_collection s:shard1 r:core_node1 x:collection1] o.a.s.c.SolrCore Looking for old index directories to cleanup for core collection1 in /home/jenkins/workspace/Lucene-Solr-6.x-Linux/solr/build/solr-core/test/J1/temp/solr.handler.TestReqParamsAPI_24E8C4BDAA7BFB10-001/control-001/cores/collection1/data/
   [junit4]   2> 624151 INFO  (coreLoadExecutor-2235-thread-1-processing-n:127.0.0.1:43885__ibq) [n:127.0.0.1:43885__ibq c:control_collection s:shard1 r:core_node1 x:collection1] o.a.s.u.p.UpdateRequestProcessorChain inserting DistributedUpdateProcessorFactory into updateRequestProcessorChain "dedupe"
   [junit4]   2> 624151 INFO  (coreLoadExecutor-2235-thread-1-processing-n:127.0.0.1:43885__ibq) [n:127.0.0.1:43885__ibq c:control_collection s:shard1 r:core_node1 x:collection1] o.a.s.u.p.UpdateRequestProcessorChain creating updateRequestProcessorChain "stored_sig"
   [junit4]   2> 624151 WARN  (OldIndexDirectoryCleanupThreadForCore-collection1) [n:127.0.0.1:43885__ibq c:control_collection s:shard1 r:core_node1 x:collection1] o.a.s.c.DirectoryFactory /home/jenkins/workspace/Lucene-Solr-6.x-Linux/solr/build/solr-core/test/J1/temp/solr.handler.TestReqParamsAPI_24E8C4BDAA7BFB10-001/control-001/cores/collection1/data/ does not point to a valid data directory; skipping clean-up of old index directories.
   [junit4]   2> 624151 INFO  (coreLoadExecutor-2235-thread-1-processing-n:127.0.0.1:43885__ibq) [n:127.0.0.1:43885__ibq c:control_collection s:shard1 r:core_node1 x:collection1] o.a.s.u.p.UpdateRequestProcessorChain inserting DistributedUpdateProcessorFactory into updateRequestProcessorChain "stored_sig"
   [junit4]   2> 624152 INFO  (coreLoadExecutor-2235-thread-1-processing-n:127.0.0.1:43885__ibq) [n:127.0.0.1:43885__ibq c:control_collection s:shard1 r:core_node1 x:collection1] o.a.s.u.p.UpdateRequestProcessorChain creating updateRequestProcessorChain "distrib-dup-test-chain-explicit"
   [junit4]   2> 624152 INFO  (coreLoadExecutor-2235-thread-1-processing-n:127.0.0.1:43885__ibq) [n:127.0.0.1:43885__ibq c:control_collection s:shard1 r:core_node1 x:collection1] o.a.s.u.p.UpdateRequestProcessorChain creating updateRequestProcessorChain "distrib-dup-test-chain-implicit"
   [junit4]   2> 624152 INFO  (coreLoadExecutor-2235-thread-1-processing-n:127.0.0.1:43885__ibq) [n:127.0.0.1:43885__ibq c:control_collection s:shard1 r:core_node1 x:collection1] o.a.s.u.p.UpdateRequestProcessorChain inserting DistributedUpdateProcessorFactory into updateRequestProcessorChain "distrib-dup-test-chain-implicit"
   [junit4]   2> 624152 INFO  (coreLoadExecutor-2235-thread-1-processing-n:127.0.0.1:43885__ibq) [n:127.0.0.1:43885__ibq c:control_collection s:shard1 r:core_node1 x:collection1] o.a.s.c.SolrCore no updateRequestProcessorChain defined as default, creating implicit default
   [junit4]   2> 624152 WARN  (coreLoadExecutor-2235-thread-1-processing-n:127.0.0.1:43885__ibq) [n:127.0.0.1:43885__ibq c:control_collection s:shard1 r:core_node1 x:collection1] o.a.s.c.RequestHandlers INVALID paramSet a in requestHandler {type = requestHandler,name = /dump,class = DumpRequestHandler,args = {defaults={a=A,b=B}}}
   [junit4]   2> 624154 INFO  (coreLoadExecutor-2235-thread-1-processing-n:127.0.0.1:43885__ibq) [n:127.0.0.1:43885__ibq c:control_collection s:shard1 r:core_node1 x:collection1] o.a.s.h.l.XMLLoader xsltCacheLifetimeSeconds=60
   [junit4]   2> 624154 INFO  (coreLoadExecutor-2235-thread-1-processing-n:127.0.0.1:43885__ibq) [n:127.0.0.1:43885__ibq c:control_collection s:shard1 r:core_node1 x:collection1] o.a.s.h.l.XMLLoader xsltCacheLifetimeSeconds=60
   [junit4]   2> 624155 INFO  (coreLoadExecutor-2235-thread-1-processing-n:127.0.0.1:43885__ibq) [n:127.0.0.1:43885__ibq c:control_collection s:shard1 r:core_node1 x:collection1] o.a.s.h.l.XMLLoader xsltCacheLifetimeSeconds=60
   [junit4]   2> 624155 INFO  (coreLoadExecutor-2235-thread-1-processing-n:127.0.0.1:43885__ibq) [n:127.0.0.1:43885__ibq c:control_collection s:shard1 r:core_node1 x:collection1] o.a.s.h.l.XMLLoader xsltCacheLifetimeSeconds=60
   [junit4]   2> 624158 INFO  (coreLoadExecutor-2235-thread-1-processing-n:127.0.0.1:43885__ibq) [n:127.0.0.1:43885__ibq c:control_collection s:shard1 r:core_node1 x:collection1] o.a.s.c.RequestHandlers Registered paths: /admin/mbeans,standard,/update/json/docs,/admin/luke,/export,/get,/admin/properties,/update/json,/admin/threads,/dump,/update/csv,/sql,/graph,/admin/segments,/admin/system,/replication,/config,/stream,/schema,/admin/plugins,/admin/logging,/admin/ping,/update,/admin/file
   [junit4]   2> 624158 INFO  (coreLoadExecutor-2235-thread-1-processing-n:127.0.0.1:43885__ibq) [n:127.0.0.1:43885__ibq c:control_collection s:shard1 r:core_node1 x:collection1] o.a.s.c.SolrCore Using default statsCache cache: org.apache.solr.search.stats.LocalStatsCache
   [junit4]   2> 624158 INFO  (coreLoadExecutor-2235-thread-1-processing-n:127.0.0.1:43885__ibq) [n:127.0.0.1:43885__ibq c:control_collection s:shard1 r:core_node1 x:collection1] o.a.s.u.UpdateHandler Using UpdateLog implementation: org.apache.solr.update.UpdateLog
   [junit4]   2> 624158 INFO  (coreLoadExecutor-2235-thread-1-processing-n:127.0.0.1:43885__ibq) [n:127.0.0.1:43885__ibq c:control_collection s:shard1 r:core_node1 x:collection1] o.a.s.u.UpdateLog Initializing UpdateLog: dataDir= defaultSyncLevel=FLUSH numRecordsToKeep=100 maxNumLogsToKeep=10 numVersionBuckets=65536
   [junit4]   2> 624159 INFO  (coreLoadExecutor-2235-thread-1-processing-n:127.0.0.1:43885__ibq) [n:127.0.0.1:43885__ibq c:control_collection s:shard1 r:core_node1 x:collection1] o.a.s.u.CommitTracker Hard AutoCommit: disabled
   [junit4]   2> 624159 INFO  (coreLoadExecutor-2235-thread-1-processing-n:127.0.0.1:43885__ibq) [n:127.0.0.1:43885__ibq c:control_collection s:shard1 r:core_node1 x:collection1] o.a.s.u.CommitTracker Soft AutoCommit: disabled
   [junit4]   2> 624159 INFO  (coreLoadExecutor-2235-thread-1-processing-n:127.0.0.1:43885__ibq) [n:127.0.0.1:43885__ibq c:control_collection s:shard1 r:core_node1 x:collection1] o.a.s.u.RandomMergePolicy RandomMergePolicy wrapping class org.apache.lucene.index.TieredMergePolicy: [TieredMergePolicy: maxMergeAtOnce=22, maxMergeAtOnceExplicit=13, maxMergedSegmentMB=68.1611328125, floorSegmentMB=0.2802734375, forceMergeDeletesPctAllowed=20.48741020287931, segmentsPerTier=35.0, maxCFSSegmentSizeMB=8.796093022207999E12, noCFSRatio=0.0
   [junit4]   2> 624160 INFO  (coreLoadExecutor-2235-thread-1-processing-n:127.0.0.1:43885__ibq) [n:127.0.0.1:43885__ibq c:control_collection s:shard1 r:core_node1 x:collection1] o.a.s.c.SolrDeletionPolicy SolrDeletionPolicy.onInit: commits: num=1
   [junit4]   2> 	commit{dir=MockDirectoryWrapper(RAMDirectory@5b62f9d lockFactory=org.apache.lucene.store.SingleInstanceLockFactory@77f91a9a),segFN=segments_1,generation=1}
   [junit4]   2> 624160 INFO  (coreLoadExecutor-2235-thread-1-processing-n:127.0.0.1:43885__ibq) [n:127.0.0.1:43885__ibq c:control_collection s:shard1 r:core_node1 x:collection1] o.a.s.c.SolrDeletionPolicy newest commit generation = 1
   [junit4]   2> 624160 INFO  (coreLoadExecutor-2235-thread-1-processing-n:127.0.0.1:43885__ibq) [n:127.0.0.1:43885__ibq c:control_collection s:shard1 r:core_node1 x:collection1] o.a.s.s.SolrIndexSearcher Opening [Searcher@6ce39351[collection1] main]
   [junit4]   2> 624160 INFO  (coreLoadExecutor-2235-thread-1-processing-n:127.0.0.1:43885__ibq) [n:127.0.0.1:43885__ibq c:control_collection s:shard1 r:core_node1 x:collection1] o.a.s.c.c.ZkStateReader Load collection config from: [/collections/control_collection]
   [junit4]   2> 624160 INFO  (coreLoadExecutor-2235-thread-1-processing-n:127.0.0.1:43885__ibq) [n:127.0.0.1:43885__ibq c:control_collection s:shard1 r:core_node1 x:collection1] o.a.s.c.c.ZkStateReader path=[/collections/control_collection] [configName]=[conf1] specified config exists in ZooKeeper
   [junit4]   2> 624160 INFO  (coreLoadExecutor-2235-thread-1-processing-n:127.0.0.1:43885__ibq) [n:127.0.0.1:43885__ibq c:control_collection s:shard1 r:core_node1 x:collection1] o.a.s.r.ManagedResourceStorage Setting up ZooKeeper-based storage for the RestManager with znodeBase: /configs/conf1
   [junit4]   2> 624161 INFO  (coreLoadExecutor-2235-thread-1-processing-n:127.0.0.1:43885__ibq) [n:127.0.0.1:43885__ibq c:control_collection s:shard1 r:core_node1 x:collection1] o.a.s.r.ManagedResourceStorage Configured ZooKeeperStorageIO with znodeBase: /configs/conf1
   [junit4]   2> 624161 INFO  (coreLoadExecutor-2235-thread-1-processing-n:127.0.0.1:43885__ibq) [n:127.0.0.1:43885__ibq c:control_collection s:shard1 r:core_node1 x:collection1] o.a.s.r.RestManager Initializing RestManager with initArgs: {}
   [junit4]   2> 624161 INFO  (coreLoadExecutor-2235-thread-1-processing-n:127.0.0.1:43885__ibq) [n:127.0.0.1:43885__ibq c:control_collection s:shard1 r:core_node1 x:collection1] o.a.s.r.ManagedResourceStorage Reading _rest_managed.json using ZooKeeperStorageIO:path=/configs/conf1
   [junit4]   2> 624161 INFO  (coreLoadExecutor-2235-thread-1-processing-n:127.0.0.1:43885__ibq) [n:127.0.0.1:43885__ibq c:control_collection s:shard1 r:core_node1 x:collection1] o.a.s.r.ManagedResourceStorage No data found for znode /configs/conf1/_rest_managed.json
   [junit4]   2> 624161 INFO  (coreLoadExecutor-2235-thread-1-processing-n:127.0.0.1:43885__ibq) [n:127.0.0.1:43885__ibq c:control_collection s:shard1 r:core_node1 x:collection1] o.a.s.r.ManagedResourceStorage Loaded null at path _rest_managed.json using ZooKeeperStorageIO:path=/configs/conf1
   [junit4]   2> 624161 INFO  (coreLoadExecutor-2235-thread-1-processing-n:127.0.0.1:43885__ibq) [n:127.0.0.1:43885__ibq c:control_collection s:shard1 r:core_node1 x:collection1] o.a.s.r.RestManager Initializing 0 registered ManagedResources
   [junit4]   2> 624161 INFO  (coreLoadExecutor-2235-thread-1-processing-n:127.0.0.1:43885__ibq) [n:127.0.0.1:43885__ibq c:control_collection s:shard1 r:core_node1 x:collection1] o.a.s.h.ReplicationHandler Commits will be reserved for  10000
   [junit4]   2> 624163 INFO  (coreLoadExecutor-2235-thread-1-processing-n:127.0.0.1:43885__ibq) [n:127.0.0.1:43885__ibq c:control_collection s:shard1 r:core_node1 x:collection1] o.a.s.u.UpdateLog Looking up max value of version field to seed version buckets
   [junit4]   2> 624163 INFO  (coreLoadExecutor-2235-thread-1-processing-n:127.0.0.1:43885__ibq) [n:127.0.0.1:43885__ibq c:control_collection s:shard1 r:core_node1 x:collection1] o.a.s.u.VersionInfo Refreshing highest value of _version_ for 65536 version buckets from index
   [junit4]   2> 624163 INFO  (coreLoadExecutor-2235-thread-1-processing-n:127.0.0.1:43885__ibq) [n:127.0.0.1:43885__ibq c:control_collection s:shard1 r:core_node1 x:collection1] o.a.s.u.VersionInfo No terms found for _version_, cannot seed version bucket highest value from index
   [junit4]   2> 624163 INFO  (coreLoadExecutor-2235-thread-1-processing-n:127.0.0.1:43885__ibq) [n:127.0.0.1:43885__ibq c:control_collection s:shard1 r:core_node1 x:collection1] o.a.s.u.UpdateLog Could not find max version in index or recent updates, using new clock 1537663482706526208
   [junit4]   2> 624164 INFO  (searcherExecutor-2236-thread-1-processing-n:127.0.0.1:43885__ibq x:collection1 s:shard1 c:control_collection r:core_node1) [n:127.0.0.1:43885__ibq c:control_collection s:shard1 r:core_node1 x:collection1] o.a.s.c.SolrCore [collection1] Registered new searcher Searcher@6ce39351[collection1] main{ExitableDirectoryReader(UninvertingDirectoryReader())}
   [junit4]   2> 624165 INFO  (coreLoadExecutor-2235-thread-1-processing-n:127.0.0.1:43885__ibq) [n:127.0.0.1:43885__ibq c:control_collection s:shard1 r:core_node1 x:collection1] o.a.s.u.UpdateLog Took 1.0ms to seed version buckets with highest version 1537663482706526208
   [junit4]   2> 624165 INFO  (coreLoadExecutor-2235-thread-1-processing-n:127.0.0.1:43885__ibq) [n:127.0.0.1:43885__ibq c:control_collection s:shard1 r:core_node1 x:collection1] o.a.s.c.ZkController watch zkdir /configs/conf1
   [junit4]   2> 624165 INFO  (coreLoadExecutor-2235-thread-1-processing-n:127.0.0.1:43885__ibq) [n:127.0.0.1:43885__ibq c:control_collection s:shard1 r:core_node1 x:collection1] o.a.s.c.CoreContainer registering core: collection1
   [junit4]   2> 624165 INFO  (coreZkRegister-2229-thread-1-processing-n:127.0.0.1:43885__ibq x:collection1 s:shard1 c:control_collection r:core_node1) [n:127.0.0.1:43885__ibq c:control_collection s:shard1 r:core_node1 x:collection1] o.a.s.c.ZkController Register replica - core:collection1 address:https://127.0.0.1:43885/_ibq collection:control_collection shard:shard1
   [junit4]   2> 624166 INFO  (coreZkRegister-2229-thread-1-processing-n:127.0.0.1:43885__ibq x:collection1 s:shard1 c:control_collection r:core_node1) [n:127.0.0.1:43885__ibq c:control_collection s:shard1 r:core_node1 x:collection1] o.a.s.c.c.SolrZkClient makePath: /collections/control_collection/leader_elect/shard1/election
   [junit4]   2> 624168 INFO  (coreZkRegister-2229-thread-1-processing-n:127.0.0.1:43885__ibq x:collection1 s:shard1 c:control_collection r:core_node1) [n:127.0.0.1:43885__ibq c:control_collection s:shard1 r:core_node1 x:collection1] o.a.s.c.LeaderElector Joined leadership election with path: /collections/control_collection/leader_elect/shard1/election/96103967575048197-core_node1-n_0000000000
   [junit4]   2> 624168 INFO  (coreZkRegister-2229-thread-1-processing-n:127.0.0.1:43885__ibq x:collection1 s:shard1 c:control_collection r:core_node1) [n:127.0.0.1:43885__ibq c:control_collection s:shard1 r:core_node1 x:collection1] o.a.s.c.ShardLeaderElectionContext Running the leader process for shard=shard1 and weAreReplacement=false and leaderVoteWait=10000
   [junit4]   2> 624170 INFO  (coreZkRegister-2229-thread-1-processing-n:127.0.0.1:43885__ibq x:collection1 s:shard1 c:control_collection r:core_node1) [n:127.0.0.1:43885__ibq c:control_collection s:shard1 r:core_node1 x:collection1] o.a.s.c.ShardLeaderElectionContext Enough replicas found to continue.
   [junit4]   2> 624170 INFO  (coreZkRegister-2229-thread-1-processing-n:127.0.0.1:43885__ibq x:collection1 s:shard1 c:control_collection r:core_node1) [n:127.0.0.1:43885__ibq c:control_collection s:shard1 r:core_node1 x:collection1] o.a.s.c.ShardLeaderElectionContext I may be the new leader - try and sync
   [junit4]   2> 624170 INFO  (OverseerStateUpdate-96103967575048197-127.0.0.1:43885__ibq-n_0000000000) [n:127.0.0.1:43885__ibq    ] o.a.s.c.Overseer processMessage: queueSize: 1, message = {
   [junit4]   2>   "operation":"leader",
   [junit4]   2>   "shard":"shard1",
   [junit4]   2>   "collection":"control_collection"} current state version: 1
   [junit4]   2> 624170 INFO  (coreZkRegister-2229-thread-1-processing-n:127.0.0.1:43885__ibq x:collection1 s:shard1 c:control_collection r:core_node1) [n:127.0.0.1:43885__ibq c:control_collection s:shard1 r:core_node1 x:collection1] o.a.s.c.SyncStrategy Sync replicas to https://127.0.0.1:43885/_ibq/collection1/
   [junit4]   2> 624170 INFO  (coreZkRegister-2229-thread-1-processing-n:127.0.0.1:43885__ibq x:collection1 s:shard1 c:control_collection r:core_node1) [n:127.0.0.1:43885__ibq c:control_collection s:shard1 r:core_node1 x:collection1] o.a.s.c.SyncStrategy Sync Success - now sync replicas to me
   [junit4]   2> 624170 INFO  (coreZkRegister-2229-thread-1-processing-n:127.0.0.1:43885__ibq x:collection1 s:shard1 c:control_collection r:core_node1) [n:127.0.0.1:43885__ibq c:control_collection s:shard1 r:core_node1 x:collection1] o.a.s.c.SyncStrategy https://127.0.0.1:43885/_ibq/collection1/ has no replicas
   [junit4]   2> 624171 INFO  (coreZkRegister-2229-thread-1-processing-n:127.0.0.1:43885__ibq x:collection1 s:shard1 c:control_collection r:core_node1) [n:127.0.0.1:43885__ibq c:control_collection s:shard1 r:core_node1 x:collection1] o.a.s.c.c.SolrZkClient makePath: /collections/control_collection/leaders/shard1
   [junit4]   2> 624173 INFO  (coreZkRegister-2229-thread-1-processing-n:127.0.0.1:43885__ibq x:collection1 s:shard1 c:control_collection r:core_node1) [n:127.0.0.1:43885__ibq c:control_collection s:shard1 r:core_node1 x:collection1] o.a.s.c.ShardLeaderElectionContextBase Creating leader registration node /collections/control_collection/leaders/shard1/leader after winning as /collections/control_collection/leader_elect/shard1/election/96103967575048197-core_node1-n_0000000000
   [junit4]   2> 624175 INFO  (coreZkRegister-2229-thread-1-processing-n:127.0.0.1:43885__ibq x:collection1 s:shard1 c:control_collection r:core_node1) [n:127.0.0.1:43885__ibq c:control_collection s:shard1 r:core_node1 x:collection1] o.a.s.c.ShardLeaderElectionContext I am the new leader: https://127.0.0.1:43885/_ibq/collection1/ shard1
   [junit4]   2> 624175 INFO  (OverseerStateUpdate-96103967575048197-127.0.0.1:43885__ibq-n_0000000000) [n:127.0.0.1:43885__ibq    ] o.a.s.c.Overseer processMessage: queueSize: 1, message = {
   [junit4]   2>   "operation":"leader",
   [junit4]   2>   "shard":"shard1",
   [junit4]   2>   "collection":"control_collection",
   [junit4]   2>   "base_url":"https://127.0.0.1:43885/_ibq",
   [junit4]   2>   "core":"collection1",
   [junit4]   2>   "state":"active"} current state version: 1
   [junit4]   2> 624277 INFO  (zkCallback-879-thread-1-processing-n:127.0.0.1:43885__ibq) [n:127.0.0.1:43885__ibq    ] o.a.s.c.c.ZkStateReader A cluster state change: [WatchedEvent state:SyncConnected type:NodeDataChanged path:/clusterstate.json], has occurred - updating... (live nodes size: [1])
   [junit4]   2> 624284 INFO  (coreZkRegister-2229-thread-1-processing-n:127.0.0.1:43885__ibq x:collection1 s:shard1 c:control_collection r:core_node1) [n:127.0.0.1:43885__ibq c:control_collection s:shard1 r:core_node1 x:collection1] o.a.s.c.ZkController We are https://127.0.0.1:43885/_ibq/collection1/ and leader is https://127.0.0.1:43885/_ibq/collection1/
   [junit4]   2> 624284 INFO  (coreZkRegister-2229-thread-1-processing-n:127.0.0.1:43885__ibq x:collection1 s:shard1 c:control_collection r:core_node1) [n:127.0.0.1:43885__ibq c:control_collection s:shard1 r:core_node1 x:collection1] o.a.s.c.ZkController No LogReplay needed for core=collection1 baseURL=https://127.0.0.1:43885/_ibq
   [junit4]   2> 624284 INFO  (coreZkRegister-2229-thread-1-processing-n:127.0.0.1:43885__ibq x:collection1 s:shard1 c:control_collection r:core_node1) [n:127.0.0.1:43885__ibq c:control_collection s:shard1 r:core_node1 x:collection1] o.a.s.c.ZkController I am the leader, no recovery necessary
   [junit4]   2> 624284 INFO  (coreZkRegister-2229-thread-1-processing-n:127.0.0.1:43885__ibq x:collection1 s:shard1 c:control_collection r:core_node1) [n:127.0.0.1:43885__ibq c:control_collection s:shard1 r:core_node1 x:collection1] o.a.s.c.ZkController publishing state=active
   [junit4]   2> 624284 INFO  (coreZkRegister-2229-thread-1-processing-n:127.0.0.1:43885__ibq x:collection1 s:shard1 c:control_collection r:core_node1) [n:127.0.0.1:43885__ibq c:control_collection s:shard1 r:core_node1 x:collection1] o.a.s.c.ZkController numShards not found on descriptor - reading it from system property
   [junit4]   2> 624285 INFO  (OverseerStateUpdate-96103967575048197-127.0.0.1:43885__ibq-n_0000000000) [n:127.0.0.1:43885__ibq    ] o.a.s.c.Overseer processMessage: queueSize: 1, message = {
   [junit4]   2>   "core":"collection1",
   [junit4]   2>   "core_node_name":"core_node1",
   [junit4]   2>   "roles":null,
   [junit4]   2>   "base_url":"https://127.0.0.1:43885/_ibq",
   [junit4]   2>   "node_name":"127.0.0.1:43885__ibq",
   [junit4]   2>   "numShards":"1",
   [junit4]   2>   "state":"active",
   [junit4]   2>   "shard":"shard1",
   [junit4]   2>   "collection":"control_collection",
   [junit4]   2>   "operation":"state"} current state version: 2
   [junit4]   2> 624286 INFO  (OverseerStateUpdate-96103967575048197-127.0.0.1:43885__ibq-n_0000000000) [n:127.0.0.1:43885__ibq    ] o.a.s.c.o.ReplicaMutator Update state numShards=1 message={
   [junit4]   2>   "core":"collection1",
   [junit4]   2>   "core_node_name":"core_node1",
   [junit4]   2>   "roles":null,
   [junit4]   2>   "base_url":"https://127.0.0.1:43885/_ibq",
   [junit4]   2>   "node_name":"127.0.0.1:43885__ibq",
   [junit4]   2>   "numShards":"1",
   [junit4]   2>   "state":"active",
   [junit4]   2>   "shard":"shard1",
   [junit4]   2>   "collection":"control_collection",
   [junit4]   2>   "operation":"state"}
   [junit4]   2> 624388 INFO  (zkCallback-879-thread-3-processing-n:127.0.0.1:43885__ibq) [n:127.0.0.1:43885__ibq    ] o.a.s.c.c.ZkStateReader A cluster state change: [WatchedEvent state:SyncConnected type:NodeDataChanged path:/clusterstate.json], has occurred - updating... (live nodes size: [1])
   [junit4]   2> 624520 INFO  (TEST-TestReqParamsAPI.test-seed#[24E8C4BDAA7BFB10]) [    ] o.a.s.c.c.SolrZkClient Using default ZkCredentialsProvider
   [junit4]   2> 624521 INFO  (TEST-TestReqParamsAPI.test-seed#[24E8C4BDAA7BFB10]) [    ] o.a.s.c.c.ConnectionManager Waiting for client to connect to ZooKeeper
   [junit4]   2> 624524 INFO  (zkCallback-883-thread-1) [    ] o.a.s.c.c.ConnectionManager Watcher org.apache.solr.common.cloud.ConnectionManager@5fcd6d9 name:ZooKeeperConnection Watcher:127.0.0.1:42614/solr got event WatchedEvent state:SyncConnected type:None path:null path:null type:None
   [junit4]   2> 624524 INFO  (TEST-TestReqParamsAPI.test-seed#[24E8C4BDAA7BFB10]) [    ] o.a.s.c.c.ConnectionManager Client is connected to ZooKeeper
   [junit4]   2> 624524 INFO  (TEST-TestReqParamsAPI.test-seed#[24E8C4BDAA7BFB10]) [    ] o.a.s.c.c.SolrZkClient Using default ZkACLProvider
   [junit4]   2> 624524 INFO  (TEST-TestReqParamsAPI.test-seed#[24E8C4BDAA7BFB10]) [    ] o.a.s.c.c.ZkStateReader Updating cluster state from ZooKeeper... 
   [junit4]   2> 624525 INFO  (TEST-TestReqParamsAPI.test-seed#[24E8C4BDAA7BFB10]) [    ] o.a.s.c.c.ZkStateReader Loaded cluster properties: {urlScheme=https}
   [junit4]   2> 624526 INFO  (TEST-TestReqParamsAPI.test-seed#[24E8C4BDAA7BFB10]) [    ] o.a.s.c.c.ZkStateReader Updated live nodes from ZooKeeper... (0) -> (1)
   [junit4]   2> 624527 INFO  (TEST-TestReqParamsAPI.test-seed#[24E8C4BDAA7BFB10]) [    ] o.a.s.c.ChaosMonkey monkey: init - expire sessions:false cause connection loss:false
   [junit4]   2> 624527 INFO  (TEST-TestReqParamsAPI.test-seed#[24E8C4BDAA7BFB10]) [    ] o.a.s.c.AbstractFullDistribZkTestBase Creating collection1 with stateFormat=2
   [junit4]   2> 624527 INFO  (TEST-TestReqParamsAPI.test-seed#[24E8C4BDAA7BFB10]) [    ] o.a.s.c.c.SolrZkClient Using default ZkCredentialsProvider
   [junit4]   2> 624528 INFO  (TEST-TestReqParamsAPI.test-seed#[24E8C4BDAA7BFB10]) [    ] o.a.s.c.c.ConnectionManager Waiting for client to connect to ZooKeeper
   [junit4]   2> 624528 INFO  (zkCallback-884-thread-1) [    ] o.a.s.c.c.ConnectionManager Watcher org.apache.solr.common.cloud.ConnectionManager@50c369b5 name:ZooKeeperConnection Watcher:127.0.0.1:42614/solr got event WatchedEvent state:SyncConnected type:None path:null path:null type:None
   [junit4]   2> 624528 INFO  (TEST-TestReqParamsAPI.test-seed#[24E8C4BDAA7BFB10]) [    ] o.a.s.c.c.ConnectionManager Client is connected to ZooKeeper
   [junit4]   2> 624529 INFO  (TEST-TestReqParamsAPI.test-seed#[24E8C4BDAA7BFB10]) [    ] o.a.s.c.c.SolrZkClient Using default ZkACLProvider
   [junit4]   2> 624530 INFO  (OverseerStateUpdate-96103967575048197-127.0.0.1:43885__ibq-n_0000000000) [n:127.0.0.1:43885__ibq    ] o.a.s.c.Overseer processMessage: queueSize: 1, message = {
   [junit4]   2>   "operation":"create",
   [junit4]   2>   "name":"collection1",
   [junit4]   2>   "numShards":"2",
   [junit4]   2>   "stateFormat":"2"} current state version: 3
   [junit4]   2> 624530 INFO  (OverseerStateUpdate-96103967575048197-127.0.0.1:43885__ibq-n_0000000000) [n:127.0.0.1:43885__ibq    ] o.a.s.c.o.ClusterStateMutator building a new cName: collection1
   [junit4]   2> 624598 INFO  (TEST-TestReqParamsAPI.test-seed#[24E8C4BDAA7BFB10]) [    ] o.a.s.SolrTestCaseJ4 Writing core.properties file to /home/jenkins/workspace/Lucene-Solr-6.x-Linux/solr/build/solr-core/test/J1/temp/solr.handler.TestReqParamsAPI_24E8C4BDAA7BFB10-001/shard-1-001/cores/collection1
   [junit4]   2> 624599 INFO  (TEST-TestReqParamsAPI.test-seed#[24E8C4BDAA7BFB10]) [    ] o.a.s.c.AbstractFullDistribZkTestBase create jetty 1 in directory /home/jenkins/workspace/Lucene-Solr-6.x-Linux/solr/build/solr-core/test/J1/temp/solr.handler.TestReqParamsAPI_24E8C4BDAA7BFB10-001/shard-1-001
   [junit4]   2> 624600 INFO  (TEST-TestReqParamsAPI.test-seed#[24E8C4BDAA7BFB10]) [    ] o.e.j.s.Server jetty-9.3.8.v20160314
   [junit4]   2> 624601 INFO  (TEST-TestReqParamsAPI.test-seed#[24E8C4BDAA7BFB10]) [    ] o.e.j.s.h.ContextHandler Started o.e.j.s.ServletContextHandler@79b5206d{/_ibq,null,AVAILABLE}
   [junit4]   2> 624602 INFO  (TEST-TestReqParamsAPI.test-seed#[24E8C4BDAA7BFB10]) [    ] o.e.j.s.ServerConnector Started ServerConnector@6f97e91f{SSL,[ssl, http/1.1]}{127.0.0.1:37083}
   [junit4]   2> 624602 INFO  (TEST-TestReqParamsAPI.test-seed#[24E8C4BDAA7BFB10]) [    ] o.e.j.s.Server Started @626919ms
   [junit4]   2> 624603 INFO  (TEST-TestReqParamsAPI.test-seed#[24E8C4BDAA7BFB10]) [    ] o.a.s.c.s.e.JettySolrRunner Jetty properties: {solr.data.dir=/home/jenkins/workspace/Lucene-Solr-6.x-Linux/solr/build/solr-core/test/J1/temp/solr.handler.TestReqParamsAPI_24E8C4BDAA7BFB10-001/tempDir-001/jetty1, solrconfig=solrconfig.xml, hostContext=/_ibq, hostPort=37083, coreRootDirectory=/home/jenkins/workspace/Lucene-Solr-6.x-Linux/solr/build/solr-core/test/J1/../../../../../../../../../home/jenkins/workspace/Lucene-Solr-6.x-Linux/solr/build/solr-core/test/J1/temp/solr.handler.TestReqParamsAPI_24E8C4BDAA7BFB10-001/shard-1-001/cores}
   [junit4]   2> 624603 INFO  (TEST-TestReqParamsAPI.test-seed#[24E8C4BDAA7BFB10]) [    ] o.a.s.s.SolrDispatchFilter SolrDispatchFilter.init(): sun.misc.Launcher$AppClassLoader@73d16e93
   [junit4]   2> 624603 INFO  (TEST-TestReqParamsAPI.test-seed#[24E8C4BDAA7BFB10]) [    ] o.a.s.c.SolrResourceLoader new SolrResourceLoader for directory: '/home/jenkins/workspace/Lucene-Solr-6.x-Linux/solr/build/solr-core/test/J1/temp/solr.handler.TestReqParamsAPI_24E8C4BDAA7BFB10-001/shard-1-001'
   [junit4]   2> 624603 INFO  (TEST-TestReqParamsAPI.test-seed#[24E8C4BDAA7BFB10]) [    ] o.a.s.c.SolrResourceLoader JNDI not configured for solr (NoInitialContextEx)
   [junit4]   2> 624603 INFO  (TEST-TestReqParamsAPI.test-seed#[24E8C4BDAA7BFB10]) [    ] o.a.s.c.SolrResourceLoader solr home defaulted to 'solr/' (could not find system property or JNDI)
   [junit4]   2> 624603 INFO  (TEST-TestReqParamsAPI.test-seed#[24E8C4BDAA7BFB10]) [    ] o.a.s.c.c.SolrZkClient Using default ZkCredentialsProvider
   [junit4]   2> 624603 INFO  (TEST-TestReqParamsAPI.test-seed#[24E8C4BDAA7BFB10]) [    ] o.a.s.c.c.ConnectionManager Waiting for client to connect to ZooKeeper
   [junit4]   2> 624604 INFO  (zkCallback-885-thread-1) [    ] o.a.s.c.c.ConnectionManager Watcher org.apache.solr.common.cloud.ConnectionManager@10465199 name:ZooKeeperConnection Watcher:127.0.0.1:42614/solr got event WatchedEvent state:SyncConnected type:None path:null path:null type:None
   [junit4]   2> 624604 INFO  (TEST-TestReqParamsAPI.test-seed#[24E8C4BDAA7BFB10]) [    ] o.a.s.c.c.ConnectionManager Client is connected to ZooKeeper
   [junit4]   2> 624605 INFO  (TEST-TestReqParamsAPI.test-seed#[24E8C4BDAA7BFB10]) [    ] o.a.s.c.c.SolrZkClient Using default ZkACLProvider
   [junit4]   2> 624605 INFO  (TEST-TestReqParamsAPI.test-seed#[24E8C4BDAA7BFB10]) [    ] o.a.s.s.SolrDispatchFilter Loading solr.xml from SolrHome (not found in ZooKeeper)
   [junit4]   2> 624605 INFO  (TEST-TestReqParamsAPI.test-seed#[24E8C4BDAA7BFB10]) [    ] o.a.s.c.SolrXmlConfig Loading container configuration from /home/jenkins/workspace/Lucene-Solr-6.x-Linux/solr/build/solr-core/test/J1/temp/solr.handler.TestReqParamsAPI_24E8C4BDAA7BFB10-001/shard-1-001/solr.xml
   [junit4]   2> 624617 INFO  (TEST-TestReqParamsAPI.test-seed#[24E8C4BDAA7BFB10]) [    ] o.a.s.c.CorePropertiesLocator Config-defined core root directory: /home/jenkins/workspace/Lucene-Solr-6.x-Linux/solr/build/solr-core/test/J1/../../../../../../../../../home/jenkins/workspace/Lucene-Solr-6.x-Linux/solr/build/solr-core/test/J1/temp/solr.handler.TestReqParamsAPI_24E8C4BDAA7BFB10-001/shard-1-001/cores
   [junit4]   2> 624617 INFO  (TEST-TestReqParamsAPI.test-seed#[24E8C4BDAA7BFB10]) [    ] o.a.s.c.CoreContainer New CoreContainer 759528048
   [junit4]   2> 624617 INFO  (TEST-TestReqParamsAPI.test-seed#[24E8C4BDAA7BFB10]) [    ] o.a.s.c.CoreContainer Loading cores into CoreContainer [instanceDir=/home/jenkins/workspace/Lucene-Solr-6.x-Linux/solr/build/solr-core/test/J1/temp/solr.handler.TestReqParamsAPI_24E8C4BDAA7BFB10-001/shard-1-001]
   [junit4]   2> 624617 WARN  (TEST-TestReqParamsAPI.test-seed#[24E8C4BDAA7BFB10]) [    ] o.a.s.c.CoreContainer Couldn't add files from /home/jenkins/workspace/Lucene-Solr-6.x-Linux/solr/build/solr-core/test/J1/temp/solr.handler.TestReqParamsAPI_24E8C4BDAA7BFB10-001/shard-1-001/lib to classpath: /home/jenkins/workspace/Lucene-Solr-6.x-Linux/solr/build/solr-core/test/J1/temp/solr.handler.TestReqParamsAPI_24E8C4BDAA7BFB10-001/shard-1-001/lib
   [junit4]   2> 624617 INFO  (TEST-TestReqParamsAPI.test-seed#[24E8C4BDAA7BFB10]) [    ] o.a.s.h.c.HttpShardHandlerFactory created with socketTimeout : 90000,urlScheme : ,connTimeout : 15000,maxConnectionsPerHost : 20,maxConnections : 10000,corePoolSize : 0,maximumPoolSize : 2147483647,maxThreadIdleTime : 5,sizeOfQueue : -1,fairnessPolicy : false,useRetries : false,
   [junit4]   2> 624619 INFO  (TEST-TestReqParamsAPI.test-seed#[24E8C4BDAA7BFB10]) [    ] o.a.s.u.UpdateShardHandler Creating UpdateShardHandler HTTP client with params: socketTimeout=340000&connTimeout=45000&retry=true
   [junit4]   2> 624620 INFO  (TEST-TestReqParamsAPI.test-seed#[24E8C4BDAA7BFB10]) [    ] o.a.s.l.LogWatcher SLF4J impl is org.slf4j.impl.Log4jLoggerFactory
   [junit4]   2> 624620 INFO  (TEST-TestReqParamsAPI.test-seed#[24E8C4BDAA7BFB10]) [    ] o.a.s.l.LogWatcher Registering Log Listener [Log4j (org.slf4j.impl.Log4jLoggerFactory)]
   [junit4]   2> 624620 INFO  (TEST-TestReqParamsAPI.test-seed#[24E8C4BDAA7BFB10]) [    ] o.a.s.c.ZkContainer Zookeeper client=127.0.0.1:42614/solr
   [junit4]   2> 624620 INFO  (TEST-TestReqParamsAPI.test-seed#[24E8C4BDAA7BFB10]) [    ] o.a.s.c.ZkController zkHost includes chroot
   [junit4]   2> 624620 INFO  (TEST-TestReqParamsAPI.test-seed#[24E8C4BDAA7BFB10]) [    ] o.a.s.c.c.SolrZkClient Using default ZkCredentialsProvider
   [junit4]   2> 624621 INFO  (TEST-TestReqParamsAPI.test-seed#[24E8C4BDAA7BFB10]) [    ] o.a.s.c.c.ConnectionManager Waiting for client to connect to ZooKeeper
   [junit4]   2> 624624 INFO  (zkCallback-888-thread-1) [    ] o.a.s.c.c.ConnectionManager Watcher org.apache.solr.common.cloud.ConnectionManager@2e3c00be name:ZooKeeperConnection Watcher:127.0.0.1:42614 got event WatchedEvent state:SyncConnected type:None path:null path:null type:None
   [junit4]   2> 624625 INFO  (TEST-TestReqParamsAPI.test-seed#[24E8C4BDAA7BFB10]) [    ] o.a.s.c.c.ConnectionManager Client is connected to ZooKeeper
   [junit4]   2> 624625 INFO  (TEST-TestReqParamsAPI.test-seed#[24E8C4BDAA7BFB10]) [    ] o.a.s.c.c.SolrZkClient Using default ZkACLProvider
   [junit4]   2> 624626 INFO  (TEST-TestReqParamsAPI.test-seed#[24E8C4BDAA7BFB10]) [n:127.0.0.1:37083__ibq    ] o.a.s.c.ZkController Added new OnReconnect listener org.apache.solr.cloud.ZkController$$Lambda$58/923839115@4d5f2a80
   [junit4]   2> 624626 INFO  (TEST-TestReqParamsAPI.test-seed#[24E8C4BDAA7BFB10]) [n:127.0.0.1:37083__ibq    ] o.a.s.c.c.ConnectionManager Waiting for client to connect to ZooKeeper
   [junit4]   2> 624627 INFO  (zkCallback-889-thread-1-processing-n:127.0.0.1:37083__ibq) [n:127.0.0.1:37083__ibq    ] o.a.s.c.c.ConnectionManager Watcher org.apache.solr.common.cloud.ConnectionManager@35b72036 name:ZooKeeperConnection Watcher:127.0.0.1:42614/solr got event WatchedEvent state:SyncConnected type:None path:null path:null type:None
   [junit4]   2> 624627 INFO  (TEST-TestReqParamsAPI.test-seed#[24E8C4BDAA7BFB10]) [n:127.0.0.1:37083__ibq    ] o.a.s.c.c.ConnectionManager Client is connected to ZooKeeper
   [junit4]   2> 624629 INFO  (TEST-TestReqParamsAPI.test-seed#[24E8C4BDAA7BFB10]) [n:127.0.0.1:37083__ibq    ] o.a.s.c.c.ZkStateReader Updating cluster state from ZooKeeper... 
   [junit4]   2> 624631 INFO  (TEST-TestReqParamsAPI.test-seed#[24E8C4BDAA7BFB10]) [n:127.0.0.1:37083__ibq    ] o.a.s.c.c.ZkStateReader Loaded cluster properties: {urlScheme=https}
   [junit4]   2> 624631 INFO  (TEST-TestReqParamsAPI.test-seed#[24E8C4BDAA7BFB10]) [n:127.0.0.1:37083__ibq    ] o.a.s.c.c.ZkStateReader Updated live nodes from ZooKeeper... (0) -> (1)
   [junit4]   2> 624631 INFO  (OverseerStateUpdate-96103967575048197-127.0.0.1:43885__ibq-n_0000000000) [n:127.0.0.1:43885__ibq    ] o.a.s.c.o.ZkStateWriter going to create_collection /collections/collection1/state.json
   [junit4]   2> 624632 INFO  (TEST-TestReqParamsAPI.test-seed#[24E8C4BDAA7BFB10]) [n:127.0.0.1:37083__ibq    ] o.a.s.c.Overseer Overseer (id=null) closing
   [junit4]   2> 624633 INFO  (TEST-TestReqParamsAPI.test-seed#[24E8C4BDAA7BFB10]) [n:127.0.0.1:37083__ibq    ] o.a.s.c.LeaderElector Joined leadership election with path: /overseer_elect/election/96103967575048202-127.0.0.1:37083__ibq-n_0000000001
   [junit4]   2> 624633 INFO  (TEST-TestReqParamsAPI.test-seed#[24E8C4BDAA7BFB10]) [n:127.0.0.1:37083__ibq    ] o.a.s.c.LeaderElector Watching path /overseer_elect/election/96103967575048197-127.0.0.1:43885__ibq-n_0000000000 to know if I could be the leader
   [junit4]   2> 624633 INFO  (TEST-TestReqParamsAPI.test-seed#[24E8C4BDAA7BFB10]) [n:127.0.0.1:37083__ibq    ] o.a.s.c.ZkController Publish node=127.0.0.1:37083__ibq as DOWN
   [junit4]   2> 624634 INFO  (OverseerStateUpdate-96103967575048197-127.0.0.1:43885__ibq-n_0000000000) [n:127.0.0.1:43885__ibq    ] o.a.s.c.Overseer processMessage: queueSize: 1, message = {
   [junit4]   2>   "operation":"downnode",
   [junit4]   2>   "node_name":"127.0.0.1:37083__ibq"} current state version: 3
   [junit4]   2> 624634 INFO  (OverseerStateUpdate-96103967575048197-127.0.0.1:43885__ibq-n_0000000000) [n:127.0.0.1:43885__ibq    ] o.a.s.c.o.NodeMutator DownNode state invoked for node: 127.0.0.1:37083__ibq
   [junit4]   2> 624635 INFO  (zkCallback-883-thread-1) [    ] o.a.s.c.c.ZkStateReader A cluster state change: [WatchedEvent state:SyncConnected type:NodeDataChanged path:/clusterstate.json], has occurred - updating... (live nodes size: [1])
   [junit4]   2> 624635 INFO  (zkCallback-889-thread-1-processing-n:127.0.0.1:37083__ibq) [n:127.0.0.1:37083__ibq    ] o.a.s.c.c.ZkStateReader A cluster state change: [WatchedEvent state:SyncConnected type:NodeDataChanged path:/clusterstate.json], has occurred - updating... (live nodes size: [1])
   [junit4]   2> 624635 INFO  (zkCallback-879-thread-1-processing-n:127.0.0.1:43885__ibq) [n:127.0.0.1:43885__ibq    ] o.a.s.c.c.ZkStateReader A cluster state change: [WatchedEvent state:SyncConnected type:NodeDataChanged path:/clusterstate.json], has occurred - updating... (live nodes size: [1])
   [junit4]   2> 624737 INFO  (OverseerStateUpdate-96103967575048197-127.0.0.1:43885__ibq-n_0000000000) [n:127.0.0.1:43885__ibq    ] o.a.s.c.o.ZkStateWriter going to update_collection /collections/collection1/state.json version: 0
   [junit4]   2> 625634 INFO  (TEST-TestReqParamsAPI.test-seed#[24E8C4BDAA7BFB10]) [n:127.0.0.1:37083__ibq    ] o.a.s.c.ZkController Register node as live in ZooKeeper:/live_nodes/127.0.0.1:37083__ibq
   [junit4]   2> 625634 INFO  (TEST-TestReqParamsAPI.test-seed#[24E8C4BDAA7BFB10]) [n:127.0.0.1:37083__ibq    ] o.a.s.c.c.SolrZkClient makePath: /live_nodes/127.0.0.1:37083__ibq
   [junit4]   2> 625635 INFO  (zkCallback-883-thread-1) [    ] o.a.s.c.c.ZkStateReader A live node change: [WatchedEvent state:SyncConnected type:NodeChildrenChanged path:/live_nodes], has occurred - updating... (live nodes size: [1])
   [junit4]   2> 625635 INFO  (zkCallback-879-thread-2-processing-n:127.0.0.1:43885__ibq) [n:127.0.0.1:43885__ibq    ] o.a.s.c.c.ZkStateReader A live node change: [WatchedEvent state:SyncConnected type:NodeChildrenChanged path:/live_nodes], has occurred - updating... (live nodes size: [1])
   [junit4]   2> 625635 INFO  (zkCallback-883-thread-1) [    ] o.a.s.c.c.ZkStateReader Updated live nodes from ZooKeeper... (1) -> (2)
   [junit4]   2> 625635 INFO  (zkCallback-879-thread-2-processing-n:127.0.0.1:43885__ibq) [n:127.0.0.1:43885__ibq    ] o.a.s.c.c.ZkStateReader Updated live nodes from ZooKeeper... (1) -> (2)
   [junit4]   2> 625635 INFO  (zkCallback-889-thread-1-processing-n:127.0.0.1:37083__ibq) [n:127.0.0.1:37083__ibq    ] o.a.s.c.c.ZkStateReader A live node change: [WatchedEvent state:SyncConnected type:NodeChildrenChanged path:/live_nodes], has occurred - updating... (live nodes size: [1])
   [junit4]   2> 625636 INFO  (zkCallback-889-thread-1-processing-n:127.0.0.1:37083__ibq) [n:127.0.0.1:37083__ibq    ] o.a.s.c.c.ZkStateReader Updated live nodes from ZooKeeper... (1) -> (2)
   [junit4]   2> 625647 INFO  (TEST-TestReqParamsAPI.test-seed#[24E8C4BDAA7BFB10]) [n:127.0.0.1:37083__ibq    ] o.a.s.c.CoreContainer Security conf doesn't exist. Skipping setup for authorization module.
   [junit4]   2> 625647 INFO  (TEST-TestReqParamsAPI.test-seed#[24E8C4BDAA7BFB10]) [n:127.0.0.1:37083__ibq    ] o.a.s.c.CoreContainer No authentication plugin used.
   [junit4]   2> 625648 INFO  (TEST-TestReqParamsAPI.test-seed#[24E8C4BDAA7BFB10]) [n:127.0.0.1:37083__ibq    ] o.a.s.c.CorePropertiesLocator Looking for core definitions underneath /home/jenkins/workspace/Lucene-Solr-6.x-Linux/solr/build/solr-core/test/J1/../../../../../../../../../home/jenkins/workspace/Lucene-Solr-6.x-Linux/solr/build/solr-core/test/J1/temp/solr.handler.TestReqParamsAPI_24E8C4BDAA7BFB10-001/shard-1-001/cores
   [junit4]   2> 625648 INFO  (TEST-TestReqParamsAPI.test-seed#[24E8C4BDAA7BFB10]) [n:127.0.0.1:37083__ibq    ] o.a.s.c.CoreDescriptor Created CoreDescriptor: {name=collection1, config=solrconfig.xml, transient=false, schema=schema.xml, loadOnStartup=true, configSetProperties=configsetprops.json, collection=collection1, coreNodeName=, dataDir=data/, shard=}
   [junit4]   2> 625648 INFO  (TEST-TestReqParamsAPI.test-seed#[24E8C4BDAA7BFB10]) [n:127.0.0.1:37083__ibq    ] o.a.s.c.CorePropertiesLocator Found core collection1 in /home/jenkins/workspace/Lucene-Solr-6.x-Linux/solr/build/solr-core/test/J1/../../../../../../../../../home/jenkins/workspace/Lucene-Solr-6.x-Linux/solr/build/solr-core/test/J1/temp/solr.handler.TestReqParamsAPI_24E8C4BDAA7BFB10-001/shard-1-001/cores/collection1
   [junit4]   2> 625648 INFO  (TEST-TestReqParamsAPI.test-seed#[24E8C4BDAA7BFB10]) [n:127.0.0.1:37083__ibq    ] o.a.s.c.CorePropertiesLocator Found 1 core definitions
   [junit4]   2> 625649 INFO  (TEST-TestReqParamsAPI.test-seed#[24E8C4BDAA7BFB10]) [n:127.0.0.1:37083__ibq    ] o.a.s.s.SolrDispatchFilter user.dir=/home/jenkins/workspace/Lucene-Solr-6.x-Linux/solr/build/solr-core/test/J1
   [junit4]   2> 625649 INFO  (TEST-TestReqParamsAPI.test-seed#[24E8C4BDAA7BFB10]) [n:127.0.0.1:37083__ibq    ] o.a.s.s.SolrDispatchFilter SolrDispatchFilter.init() done
   [junit4]   2> 625649 INFO  (coreLoadExecutor-2246-thread-1-processing-n:127.0.0.1:37083__ibq) [n:127.0.0.1:37083__ibq c:collection1   x:collection1] o.a.s.c.ZkController publishing state=down
   [junit4]   2> 625649 INFO  (coreLoadExecutor-2246-thread-1-processing-n:127.0.0.1:37083__ibq) [n:127.0.0.1:37083__ibq c:collection1   x:collection1] o.a.s.c.ZkController numShards not found on descriptor - reading it from system property
   [junit4]   2> 625649 INFO  (coreLoadExecutor-2246-thread-1-processing-n:127.0.0.1:37083__ibq) [n:127.0.0.1:37083__ibq c:collection1   x:collection1] o.a.s.c.ZkController Registering watch for collection collection1
   [junit4]   2> 625651 INFO  (OverseerStateUpdate-96103967575048197-127.0.0.1:43885__ibq-n_0000000000) [n:127.0.0.1:43885__ibq    ] o.a.s.c.Overseer processMessage: queueSize: 1, message = {
   [junit4]   2>   "core":"collection1",
   [junit4]   2>   "roles":null,
   [junit4]   2>   "base_url":"https://127.0.0.1:37083/_ibq",
   [junit4]   2>   "node_name":"127.0.0.1:37083__ibq",
   [junit4]   2>   "numShards":"2",
   [junit4]   2>   "state":"down",
   [junit4]   2>   "shard":null,
   [junit4]   2>   "collection":"collection1",
   [junit4]   2>   "operation":"state"} current state version: 4
   [junit4]   2> 625651 INFO  (coreLoadExecutor-2246-thread-1-processing-n:127.0.0.1:37083__ibq) [n:127.0.0.1:37083__ibq c:collection1   x:collection1] o.a.s.c.c.ZkStateReader Add data for [collection1] ver [1]
   [junit4]   2> 625651 INFO  (OverseerStateUpdate-96103967575048197-127.0.0.1:43885__ibq-n_0000000000) [n:127.0.0.1:43885__ibq    ] o.a.s.c.o.ReplicaMutator Update state numShards=2 message={
   [junit4]   2>   "core":"collection1",
   [junit4]   2>   "roles":null,
   [junit4]   2>   "base_url":"https://127.0.0.1:37083/_ibq",
   [junit4]   2>   "node_name":"127.0.0.1:37083__ibq",
   [junit4]   2>   "numShards":"2",
   [junit4]   2>   "state":"down",
   [junit4]   2>   "shard":null,
   [junit4]   2>   "collection":"collection1",
   [junit4]   2>   "operation":"state"}
   [junit4]   2> 625651 INFO  (OverseerStateUpdate-96103967575048197-127.0.0.1:43885__ibq-n_0000000000) [n:127.0.0.1:43885__ibq    ] o.a.s.c.o.ReplicaMutator Collection already exists with numShards=2
   [junit4]   2> 625651 INFO  (coreLoadExecutor-2246-thread-1-processing-n:127.0.0.1:37083__ibq) [n:127.0.0.1:37083__ibq c:collection1   x:collection1] o.a.s.c.ZkController look for our core node name
   [junit4]   2> 625651 INFO  (OverseerStateUpdate-96103967575048197-127.0.0.1:43885__ibq-n_0000000000) [n:127.0.0.1:43885__ibq    ] o.a.s.c.o.ReplicaMutator Assigning new node to shard shard=shard2
   [junit4]   2> 625752 INFO  (OverseerStateUpdate-96103967575048197-127.0.0.1:43885__ibq-n_0000000000) [n:127.0.0.1:43885__ibq    ] o.a.s.c.o.ZkStateWriter going to update_collection /collections/collection1/state.json version: 1
   [junit4]   2> 625753 INFO  (zkCallback-889-thread-1-processing-n:127.0.0.1:37083__ibq) [n:127.0.0.1:37083__ibq    ] o.a.s.c.c.ZkStateReader A cluster state change: [WatchedEvent state:SyncConnected type:NodeDataChanged path:/collections/collection1/state.json] for collection [collection1] has occurred - updating... (live nodes size: [2])
   [junit4]   2> 625753 INFO  (zkCallback-889-thread-1-processing-n:127.0.0.1:37083__ibq) [n:127.0.0.1:37083__ibq    ] o.a.s.c.c.ZkStateReader Updating data for [collection1] from [1] to [2]
   [junit4]   2> 626651 INFO  (coreLoadExecutor-2246-thread-1-processing-n:127.0.0.1:37083__ibq) [n:127.0.0.1:37083__ibq c:collection1   x:collection1] o.a.s.c.ZkController waiting to find shard id in clusterstate for collection1
   [junit4]   2> 626651 INFO  (coreLoadExecutor-2246-thread-1-processing-n:127.0.0.1:37083__ibq) [n:127.0.0.1:37083__ibq c:collection1   x:collection1] o.a.s.c.ZkController Check for collection zkNode:collection1
   [junit4]   2> 626652 INFO  (coreLoadExecutor-2246-thread-1-processing-n:127.0.0.1:37083__ibq) [n:127.0.0.1:37083__ibq c:collection1   x:collection1] o.a.s.c.ZkController Collection zkNode exists
   [junit4]   2> 626652 INFO  (coreLoadExecutor-2246-thread-1-processing-n:127.0.0.1:37083__ibq) [n:127.0.0.1:37083__ibq c:collection1   x:collection1] o.a.s.c.c.ZkStateReader Load collection config from: [/collections/collection1]
   [junit4]   2> 626652 INFO  (coreLoadExecutor-2246-thread-1-processing-n:127.0.0.1:37083__ibq) [n:127.0.0.1:37083__ibq c:collection1   x:collection1] o.a.s.c.c.ZkStateReader path=[/collections/collection1] [configName]=[conf1] specified config exists in ZooKeeper
   [junit4]   2> 626652 INFO  (coreLoadExecutor-2246-thread-1-processing-n:127.0.0.1:37083__ibq) [n:127.0.0.1:37083__ibq c:collection1   x:collection1] o.a.s.c.SolrResourceLoader new SolrResourceLoader for directory: '/home/jenkins/workspace/Lucene-Solr-6.x-Linux/solr/build/solr-core/test/J1/temp/solr.handler.TestReqParamsAPI_24E8C4BDAA7BFB10-001/shard-1-001/cores/collection1'
   [junit4]   2> 626652 INFO  (coreLoadExecutor-2246-thread-1-processing-n:127.0.0.1:37083__ibq) [n:127.0.0.1:37083__ibq c:collection1   x:collection1] o.a.s.c.SolrResourceLoader JNDI not configured for solr (NoInitialContextEx)
   [junit4]   2> 626652 INFO  (coreLoadExecutor-2246-thread-1-processing-n:127.0.0.1:37083__ibq) [n:127.0.0.1:37083__ibq c:collection1   x:collection1] o.a.s.c.SolrResourceLoader solr home defaulted to 'solr/' (could not find system property or JNDI)
   [junit4]   2> 626653 INFO  (coreLoadExecutor-2246-thread-1-processing-n:127.0.0.1:37083__ibq) [n:127.0.0.1:37083__ibq c:collection1   x:collection1] o.a.s.c.Config loaded config solrconfig.xml with version 0 
   [junit4]   2> 626656 INFO  (coreLoadExecutor-2246-thread-1-processing-n:127.0.0.1:37083__ibq) [n:127.0.0.1:37083__ibq c:collection1   x:collection1] o.a.s.c.SolrConfig current version of requestparams : -1
   [junit4]   2> 626660 INFO  (coreLoadExecutor-2246-thread-1-processing-n:127.0.0.1:37083__ibq) [n:127.0.0.1:37083__ibq c:collection1   x:collection1] o.a.s.c.SolrConfig Using Lucene MatchVersion: 6.2.0
   [junit4]   2> 626666 INFO  (coreLoadExecutor-2246-thread-1-processing-n:127.0.0.1:37083__ibq) [n:127.0.0.1:37083__ibq c:collection1   x:collection1] o.a.s.c.SolrConfig Loaded SolrConfig: solrconfig.xml
   [junit4]   2> 626669 INFO  (coreLoadExecutor-2246-thread-1-processing-n:127.0.0.1:37083__ibq) [n:127.0.0.1:37083__ibq c:collection1   x:collection1] o.a.s.s.IndexSchema [collection1] Schema name=test
   [junit4]   2> 626738 INFO  (coreLoadExecutor-2246-thread-1-processing-n:127.0.0.1:37083__ibq) [n:127.0.0.1:37083__ibq c:collection1   x:collection1] o.a.s.s.OpenExchangeRatesOrgProvider Initialized with rates=open-exchange-rates.json, refreshInterval=1440.
   [junit4]   2> 626741 INFO  (coreLoadExecutor-2246-thread-1-processing-n:127.0.0.1:37083__ibq) [n:127.0.0.1:37083__ibq c:collection1   x:collection1] o.a.s.s.IndexSchema default search field in schema is text
   [junit4]   2> 626743 INFO  (coreLoadExecutor-2246-thread-1-processing-n:127.0.0.1:37083__ibq) [n:127.0.0.1:37083__ibq c:collection1   x:collection1] o.a.s.s.IndexSchema unique key field: id
   [junit4]   2> 626747 INFO  (coreLoadExecutor-2246-thread-1-processing-n:127.0.0.1:37083__ibq) [n:127.0.0.1:37083__ibq c:collection1   x:collection1] o.a.s.s.FileExchangeRateProvider Reloading exchange rates from file currency.xml
   [junit4]   2> 626748 INFO  (coreLoadExecutor-2246-thread-1-processing-n:127.

[...truncated too long message...]

001/cores/collection1/data [CachedDir<<refCount=0;path=/home/jenkins/workspace/Lucene-Solr-6.x-Linux/solr/build/solr-core/test/J1/../../../../../../../../../home/jenkins/workspace/Lucene-Solr-6.x-Linux/solr/build/solr-core/test/J1/temp/solr.handler.TestReqParamsAPI_24E8C4BDAA7BFB10-001/shard-4-001/cores/collection1/data;done=false>>]
   [junit4]   2> 651401 INFO  (coreCloseExecutor-2363-thread-1) [n:127.0.0.1:34577__ibq c:collection1 s:shard1 r:core_node4 x:collection1] o.a.s.c.CachingDirectoryFactory Closing directory, CoreContainer#isShutdown=true
   [junit4]   2> 651401 INFO  (coreCloseExecutor-2363-thread-1) [n:127.0.0.1:34577__ibq c:collection1 s:shard1 r:core_node4 x:collection1] o.a.s.c.CachingDirectoryFactory Closing directory: /home/jenkins/workspace/Lucene-Solr-6.x-Linux/solr/build/solr-core/test/J1/../../../../../../../../../home/jenkins/workspace/Lucene-Solr-6.x-Linux/solr/build/solr-core/test/J1/temp/solr.handler.TestReqParamsAPI_24E8C4BDAA7BFB10-001/shard-4-001/cores/collection1/data
   [junit4]   2> 651402 INFO  (TEST-TestReqParamsAPI.test-seed#[24E8C4BDAA7BFB10]) [    ] o.a.s.c.Overseer Overseer (id=96103967575048211-127.0.0.1:34577__ibq-n_0000000004) closing
   [junit4]   2> 651403 INFO  (OverseerStateUpdate-96103967575048211-127.0.0.1:34577__ibq-n_0000000004) [n:127.0.0.1:34577__ibq    ] o.a.s.c.Overseer Overseer Loop exiting : 127.0.0.1:34577__ibq
   [junit4]   2> 651403 INFO  (zkCallback-908-thread-2-processing-n:127.0.0.1:34577__ibq) [n:127.0.0.1:34577__ibq    ] o.a.s.c.c.ZkStateReader A live node change: [WatchedEvent state:SyncConnected type:NodeChildrenChanged path:/live_nodes], has occurred - updating... (live nodes size: [1])
   [junit4]   2> 651403 WARN  (zkCallback-908-thread-2-processing-n:127.0.0.1:34577__ibq) [n:127.0.0.1:34577__ibq    ] o.a.s.c.c.ZkStateReader ZooKeeper watch triggered, but Solr cannot talk to ZK: [KeeperErrorCode = Session expired for /live_nodes]
   [junit4]   2> 651404 INFO  (TEST-TestReqParamsAPI.test-seed#[24E8C4BDAA7BFB10]) [    ] o.e.j.s.ServerConnector Stopped ServerConnector@758234eb{SSL,[ssl, http/1.1]}{127.0.0.1:0}
   [junit4]   2> 651404 INFO  (TEST-TestReqParamsAPI.test-seed#[24E8C4BDAA7BFB10]) [    ] o.e.j.s.h.ContextHandler Stopped o.e.j.s.ServletContextHandler@5a273678{/_ibq,null,UNAVAILABLE}
   [junit4]   2> 651404 INFO  (TEST-TestReqParamsAPI.test-seed#[24E8C4BDAA7BFB10]) [    ] o.a.s.c.ZkTestServer connecting to 127.0.0.1:42614 42614
   [junit4]   2> 651489 INFO  (Thread-1594) [    ] o.a.s.c.ZkTestServer connecting to 127.0.0.1:42614 42614
   [junit4]   2> 651489 WARN  (Thread-1594) [    ] o.a.s.c.ZkTestServer Watch limit violations: 
   [junit4]   2> Maximum concurrent create/delete watches above limit:
   [junit4]   2> 
   [junit4]   2> 	35	/solr/configs/conf1
   [junit4]   2> 	6	/solr/aliases.json
   [junit4]   2> 	5	/solr/security.json
   [junit4]   2> 
   [junit4]   2> Maximum concurrent data watches above limit:
   [junit4]   2> 
   [junit4]   2> 	6	/solr/clusterstate.json
   [junit4]   2> 	6	/solr/clusterprops.json
   [junit4]   2> 	4	/solr/collections/collection1/state.json
   [junit4]   2> 
   [junit4]   2> Maximum concurrent children watches above limit:
   [junit4]   2> 
   [junit4]   2> 	30	/solr/overseer/queue
   [junit4]   2> 	30	/solr/overseer/collection-queue-work
   [junit4]   2> 	15	/solr/overseer/queue-work
   [junit4]   2> 	6	/solr/live_nodes
   [junit4]   2> 	6	/solr/collections
   [junit4]   2> 
   [junit4]   2> NOTE: reproduce with: ant test  -Dtestcase=TestReqParamsAPI -Dtests.method=test -Dtests.seed=24E8C4BDAA7BFB10 -Dtests.multiplier=3 -Dtests.slow=true -Dtests.locale=ar-SY -Dtests.timezone=Pacific/Fiji -Dtests.asserts=true -Dtests.file.encoding=UTF-8
   [junit4] FAILURE 28.8s J1 | TestReqParamsAPI.test <<<
   [junit4]    > Throwable #1: java.lang.AssertionError: Could not get expected value  'P val' for path 'response/params/y/p' full output: {
   [junit4]    >   "responseHeader":{
   [junit4]    >     "status":0,
   [junit4]    >     "QTime":0},
   [junit4]    >   "response":{
   [junit4]    >     "znodeVersion":1,
   [junit4]    >     "params":{
   [junit4]    >       "x":{
   [junit4]    >         "a":"A val",
   [junit4]    >         "b":"B val",
   [junit4]    >         "":{"v":0}},
   [junit4]    >       "y":{
   [junit4]    >         "c":"CY val",
   [junit4]    >         "b":"BY val",
   [junit4]    >         "i":20,
   [junit4]    >         "d":[
   [junit4]    >           "val 1",
   [junit4]    >           "val 2"],
   [junit4]    >         "":{"v":0}}}}},  from server:  https://127.0.0.1:34577/_ibq/collection1
   [junit4]    > 	at __randomizedtesting.SeedInfo.seed([24E8C4BDAA7BFB10:ACBCFB67048796E8]:0)
   [junit4]    > 	at org.apache.solr.core.TestSolrConfigHandler.testForResponseElement(TestSolrConfigHandler.java:481)
   [junit4]    > 	at org.apache.solr.handler.TestReqParamsAPI.testReqParams(TestReqParamsAPI.java:215)
   [junit4]    > 	at org.apache.solr.handler.TestReqParamsAPI.test(TestReqParamsAPI.java:61)
   [junit4]    > 	at org.apache.solr.BaseDistributedSearchTestCase$ShardsRepeatRule$ShardsFixedStatement.callStatement(BaseDistributedSearchTestCase.java:992)
   [junit4]    > 	at org.apache.solr.BaseDistributedSearchTestCase$ShardsRepeatRule$ShardsStatement.evaluate(BaseDistributedSearchTestCase.java:967)
   [junit4]    > 	at java.lang.Thread.run(Thread.java:745)
   [junit4]   2> 651491 INFO  (SUITE-TestReqParamsAPI-seed#[24E8C4BDAA7BFB10]-worker) [    ] o.a.s.SolrTestCaseJ4 ###deleteCore
   [junit4]   2> NOTE: leaving temporary files on disk at: /home/jenkins/workspace/Lucene-Solr-6.x-Linux/solr/build/solr-core/test/J1/temp/solr.handler.TestReqParamsAPI_24E8C4BDAA7BFB10-001
   [junit4]   2> Jun 20, 2016 1:43:18 PM com.carrotsearch.randomizedtesting.ThreadLeakControl checkThreadLeaks
   [junit4]   2> WARNING: Will linger awaiting termination of 1 leaked thread(s).
   [junit4]   2> NOTE: test params are: codec=Asserting(Lucene62): {}, docValues:{}, maxPointsInLeafNode=264, maxMBSortInHeap=7.535271690605796, sim=ClassicSimilarity, locale=ar-SY, timezone=Pacific/Fiji
   [junit4]   2> NOTE: Linux 4.4.0-24-generic amd64/Oracle Corporation 1.8.0_92 (64-bit)/cpus=12,threads=1,free=318489512,total=518979584
   [junit4]   2> NOTE: All tests run in this JVM: [TestAddFieldRealTimeGet, TestDownShardTolerantSearch, ZkSolrClientTest, TestReloadAndDeleteDocs, DistributedQueueTest, BufferStoreTest, TestSolrCoreProperties, TestQuerySenderNoQuery, MergeStrategyTest, OpenExchangeRatesOrgProviderTest, BasicAuthIntegrationTest, TestWordDelimiterFilterFactory, TestManagedSynonymFilterFactory, BJQParserTest, CoreAdminRequestStatusTest, DocumentBuilderTest, ShardRoutingTest, TestCollationFieldDocValues, ClusterStateUpdateTest, TestSurroundQueryParser, TestBlendedInfixSuggestions, SpellPossibilityIteratorTest, TestLMJelinekMercerSimilarityFactory, TermVectorComponentTest, UpdateRequestProcessorFactoryTest, MultiTermTest, TestSubQueryTransformerCrossCore, CollectionsAPIAsyncDistributedZkTest, TestPartialUpdateDeduplication, UniqFieldsUpdateProcessorFactoryTest, AtomicUpdatesTest, AnalyticsMergeStrategyTest, FacetPivotSmallTest, TestSimpleQParserPlugin, TestRTimerTree, TestSolrCloudWithKerberosAlt, TestBinaryResponseWriter, HdfsRecoveryZkTest, TestSchemaManager, TestDFRSimilarityFactory, AsyncMigrateRouteKeyTest, EnumFieldTest, SolrPluginUtilsTest, TestQueryUtils, SpatialFilterTest, TestCustomDocTransformer, HLLUtilTest, ResponseHeaderTest, TestSystemIdResolver, HighlighterMaxOffsetTest, OpenCloseCoreStressTest, RuleEngineTest, TestCollectionAPI, TestExactSharedStatsCache, AddBlockUpdateTest, TestMinMaxOnMultiValuedField, SortByFunctionTest, HdfsThreadLeakTest, ConvertedLegacyTest, SharedFSAutoReplicaFailoverUtilsTest, BasicFunctionalityTest, TestLeaderInitiatedRecoveryThread, ZkControllerTest, TestTrie, TestOnReconnectListenerSupport, OutOfBoxZkACLAndCredentialsProvidersTest, BlockJoinFacetSimpleTest, ExitableDirectoryReaderTest, TestQueryTypes, DocValuesTest, TestCloudManagedSchema, HdfsWriteToMultipleCollectionsTest, BigEndianAscendingWordDeserializerTest, SolrIndexConfigTest, ExplicitHLLTest, NumericFieldsTest, SolrIndexSplitterTest, DistributedExpandComponentTest, TestEmbeddedSolrServerConstructors, TriLevelCompositeIdRoutingTest, SecurityConfHandlerTest, DistributedTermsComponentTest, TestInfoStreamLogging, SuggestComponentTest, TestBlobHandler, TestNoOpRegenerator, HighlighterTest, TestFieldCacheVsDocValues, DistributedMLTComponentTest, CheckHdfsIndexTest, DirectSolrSpellCheckerTest, TestLFUCache, RestartWhileUpdatingTest, TestFastLRUCache, TestManagedResourceStorage, TestRawResponseWriter, TestReqParamsAPI]
   [junit4] Completed [232/615 (1!)] on J1 in 29.04s, 1 test, 1 failure <<< FAILURES!

[...truncated 1229 lines...]
BUILD FAILED
/home/jenkins/workspace/Lucene-Solr-6.x-Linux/build.xml:740: The following error occurred while executing this line:
/home/jenkins/workspace/Lucene-Solr-6.x-Linux/build.xml:684: The following error occurred while executing this line:
/home/jenkins/workspace/Lucene-Solr-6.x-Linux/build.xml:59: The following error occurred while executing this line:
/home/jenkins/workspace/Lucene-Solr-6.x-Linux/solr/build.xml:233: The following error occurred while executing this line:
/home/jenkins/workspace/Lucene-Solr-6.x-Linux/solr/common-build.xml:530: The following error occurred while executing this line:
/home/jenkins/workspace/Lucene-Solr-6.x-Linux/lucene/common-build.xml:1427: The following error occurred while executing this line:
/home/jenkins/workspace/Lucene-Solr-6.x-Linux/lucene/common-build.xml:984: There were test failures: 615 suites (10 ignored), 2591 tests, 1 failure, 116 ignored (72 assumptions) [seed: 24E8C4BDAA7BFB10]

Total time: 58 minutes 48 seconds
Build step 'Invoke Ant' marked build as failure
Archiving artifacts
[WARNINGS] Skipping publisher since build result is FAILURE
Recording test results
Email was triggered for: Failure - Any
Sending email for trigger: Failure - Any



Mime
View raw message