lucene-dev mailing list archives

Site index · List index
Message view « Date » · « Thread »
Top « Date » · « Thread »
From Policeman Jenkins Server <jenk...@thetaphi.de>
Subject [JENKINS] Lucene-Solr-6.x-Solaris (64bit/jdk1.8.0) - Build # 172 - Failure!
Date Thu, 02 Jun 2016 02:09:40 GMT
Build: http://jenkins.thetaphi.de/job/Lucene-Solr-6.x-Solaris/172/
Java: 64bit/jdk1.8.0 -XX:+UseCompressedOops -XX:+UseConcMarkSweepGC

1 tests failed.
FAILED:  junit.framework.TestSuite.org.apache.solr.handler.TestReplicationHandler

Error Message:
ObjectTracker found 1 object(s) that were not released!!! [NRTCachingDirectory]

Stack Trace:
java.lang.AssertionError: ObjectTracker found 1 object(s) that were not released!!! [NRTCachingDirectory]
	at __randomizedtesting.SeedInfo.seed([3DA09A7DE6BD43F2]:0)
	at org.junit.Assert.fail(Assert.java:93)
	at org.junit.Assert.assertTrue(Assert.java:43)
	at org.junit.Assert.assertNull(Assert.java:551)
	at org.apache.solr.SolrTestCaseJ4.afterClass(SolrTestCaseJ4.java:256)
	at sun.reflect.GeneratedMethodAccessor21.invoke(Unknown Source)
	at sun.reflect.DelegatingMethodAccessorImpl.invoke(DelegatingMethodAccessorImpl.java:43)
	at java.lang.reflect.Method.invoke(Method.java:498)
	at com.carrotsearch.randomizedtesting.RandomizedRunner.invoke(RandomizedRunner.java:1764)
	at com.carrotsearch.randomizedtesting.RandomizedRunner$7.evaluate(RandomizedRunner.java:834)
	at com.carrotsearch.randomizedtesting.rules.StatementAdapter.evaluate(StatementAdapter.java:36)
	at com.carrotsearch.randomizedtesting.rules.SystemPropertiesRestoreRule$1.evaluate(SystemPropertiesRestoreRule.java:57)
	at org.apache.lucene.util.AbstractBeforeAfterRule$1.evaluate(AbstractBeforeAfterRule.java:45)
	at com.carrotsearch.randomizedtesting.rules.StatementAdapter.evaluate(StatementAdapter.java:36)
	at org.apache.lucene.util.TestRuleStoreClassName$1.evaluate(TestRuleStoreClassName.java:41)
	at com.carrotsearch.randomizedtesting.rules.NoShadowingOrOverridesOnMethodsRule$1.evaluate(NoShadowingOrOverridesOnMethodsRule.java:40)
	at com.carrotsearch.randomizedtesting.rules.NoShadowingOrOverridesOnMethodsRule$1.evaluate(NoShadowingOrOverridesOnMethodsRule.java:40)
	at com.carrotsearch.randomizedtesting.rules.StatementAdapter.evaluate(StatementAdapter.java:36)
	at com.carrotsearch.randomizedtesting.rules.StatementAdapter.evaluate(StatementAdapter.java:36)
	at com.carrotsearch.randomizedtesting.rules.StatementAdapter.evaluate(StatementAdapter.java:36)
	at org.apache.lucene.util.TestRuleAssertionsRequired$1.evaluate(TestRuleAssertionsRequired.java:53)
	at org.apache.lucene.util.TestRuleMarkFailure$1.evaluate(TestRuleMarkFailure.java:47)
	at org.apache.lucene.util.TestRuleIgnoreAfterMaxFailures$1.evaluate(TestRuleIgnoreAfterMaxFailures.java:64)
	at org.apache.lucene.util.TestRuleIgnoreTestSuites$1.evaluate(TestRuleIgnoreTestSuites.java:54)
	at com.carrotsearch.randomizedtesting.rules.StatementAdapter.evaluate(StatementAdapter.java:36)
	at com.carrotsearch.randomizedtesting.ThreadLeakControl$StatementRunner.run(ThreadLeakControl.java:367)
	at java.lang.Thread.run(Thread.java:745)




Build Log:
[...truncated 10934 lines...]
   [junit4] Suite: org.apache.solr.handler.TestReplicationHandler
   [junit4]   2> Creating dataDir: /export/home/jenkins/workspace/Lucene-Solr-6.x-Solaris/solr/build/solr-core/test/J0/temp/solr.handler.TestReplicationHandler_3DA09A7DE6BD43F2-001/init-core-data-001
   [junit4]   2> 732496 INFO  (TEST-TestReplicationHandler.doTestDetails-seed#[3DA09A7DE6BD43F2]) [    ] o.a.s.SolrTestCaseJ4 ###Starting doTestDetails
   [junit4]   2> 732497 INFO  (TEST-TestReplicationHandler.doTestDetails-seed#[3DA09A7DE6BD43F2]) [    ] o.a.s.SolrTestCaseJ4 Writing core.properties file to /export/home/jenkins/workspace/Lucene-Solr-6.x-Solaris/solr/build/solr-core/test/J0/temp/solr.handler.TestReplicationHandler_3DA09A7DE6BD43F2-001/solr-instance-001/collection1
   [junit4]   2> 732501 INFO  (TEST-TestReplicationHandler.doTestDetails-seed#[3DA09A7DE6BD43F2]) [    ] o.e.j.s.Server jetty-9.3.8.v20160314
   [junit4]   2> 732502 INFO  (TEST-TestReplicationHandler.doTestDetails-seed#[3DA09A7DE6BD43F2]) [    ] o.e.j.s.h.ContextHandler Started o.e.j.s.ServletContextHandler@4fa74495{/solr,null,AVAILABLE}
   [junit4]   2> 732505 INFO  (TEST-TestReplicationHandler.doTestDetails-seed#[3DA09A7DE6BD43F2]) [    ] o.e.j.s.ServerConnector Started ServerConnector@24f3b3d3{HTTP/1.1,[http/1.1]}{127.0.0.1:44762}
   [junit4]   2> 732505 INFO  (TEST-TestReplicationHandler.doTestDetails-seed#[3DA09A7DE6BD43F2]) [    ] o.e.j.s.Server Started @736185ms
   [junit4]   2> 732505 INFO  (TEST-TestReplicationHandler.doTestDetails-seed#[3DA09A7DE6BD43F2]) [    ] o.a.s.c.s.e.JettySolrRunner Jetty properties: {solr.data.dir=/export/home/jenkins/workspace/Lucene-Solr-6.x-Solaris/solr/build/solr-core/test/J0/temp/solr.handler.TestReplicationHandler_3DA09A7DE6BD43F2-001/solr-instance-001/collection1/data, hostContext=/solr, hostPort=44762}
   [junit4]   2> 732505 INFO  (TEST-TestReplicationHandler.doTestDetails-seed#[3DA09A7DE6BD43F2]) [    ] o.a.s.s.SolrDispatchFilter SolrDispatchFilter.init(): sun.misc.Launcher$AppClassLoader@6d06d69c
   [junit4]   2> 732505 INFO  (TEST-TestReplicationHandler.doTestDetails-seed#[3DA09A7DE6BD43F2]) [    ] o.a.s.c.SolrResourceLoader new SolrResourceLoader for directory: '/export/home/jenkins/workspace/Lucene-Solr-6.x-Solaris/solr/build/solr-core/test/J0/temp/solr.handler.TestReplicationHandler_3DA09A7DE6BD43F2-001/solr-instance-001'
   [junit4]   2> 732506 INFO  (TEST-TestReplicationHandler.doTestDetails-seed#[3DA09A7DE6BD43F2]) [    ] o.a.s.c.SolrResourceLoader JNDI not configured for solr (NoInitialContextEx)
   [junit4]   2> 732506 INFO  (TEST-TestReplicationHandler.doTestDetails-seed#[3DA09A7DE6BD43F2]) [    ] o.a.s.c.SolrResourceLoader solr home defaulted to 'solr/' (could not find system property or JNDI)
   [junit4]   2> 732506 INFO  (TEST-TestReplicationHandler.doTestDetails-seed#[3DA09A7DE6BD43F2]) [    ] o.a.s.c.SolrXmlConfig Loading container configuration from /export/home/jenkins/workspace/Lucene-Solr-6.x-Solaris/solr/build/solr-core/test/J0/temp/solr.handler.TestReplicationHandler_3DA09A7DE6BD43F2-001/solr-instance-001/solr.xml
   [junit4]   2> 732509 INFO  (TEST-TestReplicationHandler.doTestDetails-seed#[3DA09A7DE6BD43F2]) [    ] o.a.s.c.CorePropertiesLocator Config-defined core root directory: /export/home/jenkins/workspace/Lucene-Solr-6.x-Solaris/solr/build/solr-core/test/J0/temp/solr.handler.TestReplicationHandler_3DA09A7DE6BD43F2-001/solr-instance-001/.
   [junit4]   2> 732509 INFO  (TEST-TestReplicationHandler.doTestDetails-seed#[3DA09A7DE6BD43F2]) [    ] o.a.s.c.CoreContainer New CoreContainer 117112315
   [junit4]   2> 732509 INFO  (TEST-TestReplicationHandler.doTestDetails-seed#[3DA09A7DE6BD43F2]) [    ] o.a.s.c.CoreContainer Loading cores into CoreContainer [instanceDir=/export/home/jenkins/workspace/Lucene-Solr-6.x-Solaris/solr/build/solr-core/test/J0/temp/solr.handler.TestReplicationHandler_3DA09A7DE6BD43F2-001/solr-instance-001]
   [junit4]   2> 732509 WARN  (TEST-TestReplicationHandler.doTestDetails-seed#[3DA09A7DE6BD43F2]) [    ] o.a.s.c.CoreContainer Couldn't add files from /export/home/jenkins/workspace/Lucene-Solr-6.x-Solaris/solr/build/solr-core/test/J0/temp/solr.handler.TestReplicationHandler_3DA09A7DE6BD43F2-001/solr-instance-001/lib to classpath: /export/home/jenkins/workspace/Lucene-Solr-6.x-Solaris/solr/build/solr-core/test/J0/temp/solr.handler.TestReplicationHandler_3DA09A7DE6BD43F2-001/solr-instance-001/lib
   [junit4]   2> 732510 INFO  (TEST-TestReplicationHandler.doTestDetails-seed#[3DA09A7DE6BD43F2]) [    ] o.a.s.h.c.HttpShardHandlerFactory created with socketTimeout : 90000,urlScheme : ,connTimeout : 15000,maxConnectionsPerHost : 20,maxConnections : 10000,corePoolSize : 0,maximumPoolSize : 2147483647,maxThreadIdleTime : 5,sizeOfQueue : -1,fairnessPolicy : false,useRetries : false,
   [junit4]   2> 732511 INFO  (TEST-TestReplicationHandler.doTestDetails-seed#[3DA09A7DE6BD43F2]) [    ] o.a.s.u.UpdateShardHandler Creating UpdateShardHandler HTTP client with params: socketTimeout=340000&connTimeout=45000&retry=true
   [junit4]   2> 732511 INFO  (TEST-TestReplicationHandler.doTestDetails-seed#[3DA09A7DE6BD43F2]) [    ] o.a.s.l.LogWatcher SLF4J impl is org.slf4j.impl.Log4jLoggerFactory
   [junit4]   2> 732511 INFO  (TEST-TestReplicationHandler.doTestDetails-seed#[3DA09A7DE6BD43F2]) [    ] o.a.s.l.LogWatcher Registering Log Listener [Log4j (org.slf4j.impl.Log4jLoggerFactory)]
   [junit4]   2> 732511 INFO  (TEST-TestReplicationHandler.doTestDetails-seed#[3DA09A7DE6BD43F2]) [    ] o.a.s.c.CoreContainer Security conf doesn't exist. Skipping setup for authorization module.
   [junit4]   2> 732511 INFO  (TEST-TestReplicationHandler.doTestDetails-seed#[3DA09A7DE6BD43F2]) [    ] o.a.s.c.CoreContainer No authentication plugin used.
   [junit4]   2> 732512 INFO  (TEST-TestReplicationHandler.doTestDetails-seed#[3DA09A7DE6BD43F2]) [    ] o.a.s.c.CorePropertiesLocator Looking for core definitions underneath /export/home/jenkins/workspace/Lucene-Solr-6.x-Solaris/solr/build/solr-core/test/J0/temp/solr.handler.TestReplicationHandler_3DA09A7DE6BD43F2-001/solr-instance-001/.
   [junit4]   2> 732512 INFO  (TEST-TestReplicationHandler.doTestDetails-seed#[3DA09A7DE6BD43F2]) [    ] o.a.s.c.CoreDescriptor Created CoreDescriptor: {name=collection1, config=solrconfig.xml, loadOnStartup=true, schema=schema.xml, configSetProperties=configsetprops.json, transient=false, dataDir=data/}
   [junit4]   2> 732512 INFO  (TEST-TestReplicationHandler.doTestDetails-seed#[3DA09A7DE6BD43F2]) [    ] o.a.s.c.CorePropertiesLocator Found core collection1 in /export/home/jenkins/workspace/Lucene-Solr-6.x-Solaris/solr/build/solr-core/test/J0/temp/solr.handler.TestReplicationHandler_3DA09A7DE6BD43F2-001/solr-instance-001/./collection1
   [junit4]   2> 732513 INFO  (TEST-TestReplicationHandler.doTestDetails-seed#[3DA09A7DE6BD43F2]) [    ] o.a.s.c.CorePropertiesLocator Found 1 core definitions
   [junit4]   2> 732513 INFO  (TEST-TestReplicationHandler.doTestDetails-seed#[3DA09A7DE6BD43F2]) [    ] o.a.s.s.SolrDispatchFilter user.dir=/export/home/jenkins/workspace/Lucene-Solr-6.x-Solaris/solr/build/solr-core/test/J0
   [junit4]   2> 732513 INFO  (TEST-TestReplicationHandler.doTestDetails-seed#[3DA09A7DE6BD43F2]) [    ] o.a.s.s.SolrDispatchFilter SolrDispatchFilter.init() done
   [junit4]   2> 732514 INFO  (coreLoadExecutor-3232-thread-1) [    ] o.a.s.c.SolrResourceLoader new SolrResourceLoader for directory: '/export/home/jenkins/workspace/Lucene-Solr-6.x-Solaris/solr/build/solr-core/test/J0/temp/solr.handler.TestReplicationHandler_3DA09A7DE6BD43F2-001/solr-instance-001/collection1'
   [junit4]   2> 732514 INFO  (coreLoadExecutor-3232-thread-1) [    ] o.a.s.c.SolrResourceLoader JNDI not configured for solr (NoInitialContextEx)
   [junit4]   2> 732514 INFO  (coreLoadExecutor-3232-thread-1) [    ] o.a.s.c.SolrResourceLoader solr home defaulted to 'solr/' (could not find system property or JNDI)
   [junit4]   2> 732519 INFO  (coreLoadExecutor-3232-thread-1) [    ] o.a.s.c.SolrConfig current version of requestparams : -1
   [junit4]   2> 732521 WARN  (coreLoadExecutor-3232-thread-1) [    ] o.a.s.c.Config Beginning with Solr 5.5, <mergePolicy> is deprecated, use <mergePolicyFactory> instead.
   [junit4]   2> 732524 INFO  (coreLoadExecutor-3232-thread-1) [    ] o.a.s.c.SolrConfig Using Lucene MatchVersion: 6.1.0
   [junit4]   2> 732533 INFO  (coreLoadExecutor-3232-thread-1) [    ] o.a.s.c.SolrConfig Loaded SolrConfig: solrconfig.xml
   [junit4]   2> 732536 INFO  (coreLoadExecutor-3232-thread-1) [    ] o.a.s.s.IndexSchema [collection1] Schema name=test
   [junit4]   2> 732538 INFO  (coreLoadExecutor-3232-thread-1) [    ] o.a.s.s.IndexSchema unique key field: id
   [junit4]   2> 732539 INFO  (coreLoadExecutor-3232-thread-1) [    ] o.a.s.c.ConfigSetProperties Did not find ConfigSet properties, assuming default properties: Can't find resource 'configsetprops.json' in classpath or '/export/home/jenkins/workspace/Lucene-Solr-6.x-Solaris/solr/build/solr-core/test/J0/temp/solr.handler.TestReplicationHandler_3DA09A7DE6BD43F2-001/solr-instance-001/collection1'
   [junit4]   2> 732539 INFO  (coreLoadExecutor-3232-thread-1) [    ] o.a.s.c.CoreContainer Creating SolrCore 'collection1' using configuration from instancedir /export/home/jenkins/workspace/Lucene-Solr-6.x-Solaris/solr/build/solr-core/test/J0/temp/solr.handler.TestReplicationHandler_3DA09A7DE6BD43F2-001/solr-instance-001/./collection1
   [junit4]   2> 732540 INFO  (coreLoadExecutor-3232-thread-1) [    x:collection1] o.a.s.c.SolrCore org.apache.solr.core.MockDirectoryFactory
   [junit4]   2> 732540 INFO  (coreLoadExecutor-3232-thread-1) [    x:collection1] o.a.s.c.SolrCore [[collection1] ] Opening new SolrCore at [/export/home/jenkins/workspace/Lucene-Solr-6.x-Solaris/solr/build/solr-core/test/J0/temp/solr.handler.TestReplicationHandler_3DA09A7DE6BD43F2-001/solr-instance-001/collection1], dataDir=[/export/home/jenkins/workspace/Lucene-Solr-6.x-Solaris/solr/build/solr-core/test/J0/temp/solr.handler.TestReplicationHandler_3DA09A7DE6BD43F2-001/solr-instance-001/./collection1/data/]
   [junit4]   2> 732540 INFO  (coreLoadExecutor-3232-thread-1) [    x:collection1] o.a.s.c.SolrCore JMX monitoring not detected for core: collection1
   [junit4]   2> 732540 INFO  (coreLoadExecutor-3232-thread-1) [    x:collection1] o.a.s.c.CachingDirectoryFactory return new directory for /export/home/jenkins/workspace/Lucene-Solr-6.x-Solaris/solr/build/solr-core/test/J0/temp/solr.handler.TestReplicationHandler_3DA09A7DE6BD43F2-001/solr-instance-001/./collection1/data
   [junit4]   2> 732540 INFO  (coreLoadExecutor-3232-thread-1) [    x:collection1] o.a.s.c.SolrCore New index directory detected: old=null new=/export/home/jenkins/workspace/Lucene-Solr-6.x-Solaris/solr/build/solr-core/test/J0/temp/solr.handler.TestReplicationHandler_3DA09A7DE6BD43F2-001/solr-instance-001/./collection1/data/index/
   [junit4]   2> 732540 WARN  (coreLoadExecutor-3232-thread-1) [    x:collection1] o.a.s.c.SolrCore [collection1] Solr index directory '/export/home/jenkins/workspace/Lucene-Solr-6.x-Solaris/solr/build/solr-core/test/J0/temp/solr.handler.TestReplicationHandler_3DA09A7DE6BD43F2-001/solr-instance-001/./collection1/data/index' doesn't exist. Creating new index...
   [junit4]   2> 732541 INFO  (coreLoadExecutor-3232-thread-1) [    x:collection1] o.a.s.c.CachingDirectoryFactory return new directory for /export/home/jenkins/workspace/Lucene-Solr-6.x-Solaris/solr/build/solr-core/test/J0/temp/solr.handler.TestReplicationHandler_3DA09A7DE6BD43F2-001/solr-instance-001/./collection1/data/index
   [junit4]   2> 732541 INFO  (coreLoadExecutor-3232-thread-1) [    x:collection1] o.a.s.u.RandomMergePolicy RandomMergePolicy wrapping class org.apache.lucene.index.TieredMergePolicy: [TieredMergePolicy: maxMergeAtOnce=17, maxMergeAtOnceExplicit=35, maxMergedSegmentMB=25.6416015625, floorSegmentMB=2.0205078125, forceMergeDeletesPctAllowed=29.65117463504148, segmentsPerTier=36.0, maxCFSSegmentSizeMB=0.7705078125, noCFSRatio=1.0
   [junit4]   2> 732541 INFO  (coreLoadExecutor-3232-thread-1) [    x:collection1] o.a.s.c.SolrDeletionPolicy SolrDeletionPolicy.onCommit: commits: num=1
   [junit4]   2> 	commit{dir=MockDirectoryWrapper(RAMDirectory@4f047674 lockFactory=org.apache.lucene.store.SingleInstanceLockFactory@7fc473c6),segFN=segments_1,generation=1}
   [junit4]   2> 732541 INFO  (coreLoadExecutor-3232-thread-1) [    x:collection1] o.a.s.c.SolrDeletionPolicy newest commit generation = 1
   [junit4]   2> 732542 INFO  (OldIndexDirectoryCleanupThreadForCore-collection1) [    x:collection1] o.a.s.c.SolrCore Looking for old index directories to cleanup for core collection1 in /export/home/jenkins/workspace/Lucene-Solr-6.x-Solaris/solr/build/solr-core/test/J0/temp/solr.handler.TestReplicationHandler_3DA09A7DE6BD43F2-001/solr-instance-001/./collection1/data/
   [junit4]   2> 732543 INFO  (coreLoadExecutor-3232-thread-1) [    x:collection1] o.a.s.c.SolrCore no updateRequestProcessorChain defined as default, creating implicit default
   [junit4]   2> 732544 INFO  (coreLoadExecutor-3232-thread-1) [    x:collection1] o.a.s.h.l.XMLLoader xsltCacheLifetimeSeconds=60
   [junit4]   2> 732545 INFO  (coreLoadExecutor-3232-thread-1) [    x:collection1] o.a.s.h.l.XMLLoader xsltCacheLifetimeSeconds=60
   [junit4]   2> 732546 INFO  (coreLoadExecutor-3232-thread-1) [    x:collection1] o.a.s.h.l.XMLLoader xsltCacheLifetimeSeconds=60
   [junit4]   2> 732547 INFO  (coreLoadExecutor-3232-thread-1) [    x:collection1] o.a.s.h.l.XMLLoader xsltCacheLifetimeSeconds=60
   [junit4]   2> 732548 INFO  (coreLoadExecutor-3232-thread-1) [    x:collection1] o.a.s.c.PluginBag requestHandler : 'lazy' created with startup=lazy 
   [junit4]   2> 732549 INFO  (coreLoadExecutor-3232-thread-1) [    x:collection1] o.a.s.c.RequestHandlers Registered paths: /admin/mbeans,standard,lazy,/update/json/docs,/admin/luke,/export,/get,/admin/properties,/update/json,/admin/threads,/update/csv,/sql,/graph,/admin/segments,/admin/system,/replication,defaults,/config,/stream,/schema,/admin/plugins,/admin/logging,/admin/ping,/update,/admin/file
   [junit4]   2> 732549 INFO  (coreLoadExecutor-3232-thread-1) [    x:collection1] o.a.s.c.SolrCore Using default statsCache cache: org.apache.solr.search.stats.LocalStatsCache
   [junit4]   2> 732550 INFO  (coreLoadExecutor-3232-thread-1) [    x:collection1] o.a.s.u.CommitTracker Hard AutoCommit: disabled
   [junit4]   2> 732550 INFO  (coreLoadExecutor-3232-thread-1) [    x:collection1] o.a.s.u.CommitTracker Soft AutoCommit: disabled
   [junit4]   2> 732550 INFO  (coreLoadExecutor-3232-thread-1) [    x:collection1] o.a.s.u.RandomMergePolicy RandomMergePolicy wrapping class org.apache.lucene.index.TieredMergePolicy: [TieredMergePolicy: maxMergeAtOnce=16, maxMergeAtOnceExplicit=16, maxMergedSegmentMB=38.7158203125, floorSegmentMB=1.98828125, forceMergeDeletesPctAllowed=1.806029557904958, segmentsPerTier=46.0, maxCFSSegmentSizeMB=8.796093022207999E12, noCFSRatio=1.0
   [junit4]   2> 732551 INFO  (coreLoadExecutor-3232-thread-1) [    x:collection1] o.a.s.c.SolrDeletionPolicy SolrDeletionPolicy.onInit: commits: num=1
   [junit4]   2> 	commit{dir=MockDirectoryWrapper(RAMDirectory@4f047674 lockFactory=org.apache.lucene.store.SingleInstanceLockFactory@7fc473c6),segFN=segments_1,generation=1}
   [junit4]   2> 732551 INFO  (coreLoadExecutor-3232-thread-1) [    x:collection1] o.a.s.c.SolrDeletionPolicy newest commit generation = 1
   [junit4]   2> 732551 INFO  (coreLoadExecutor-3232-thread-1) [    x:collection1] o.a.s.s.SolrIndexSearcher Opening [Searcher@29ccc085[collection1] main]
   [junit4]   2> 732551 INFO  (coreLoadExecutor-3232-thread-1) [    x:collection1] o.a.s.r.ManagedResourceStorage File-based storage initialized to use dir: /export/home/jenkins/workspace/Lucene-Solr-6.x-Solaris/solr/build/solr-core/test/J0/temp/solr.handler.TestReplicationHandler_3DA09A7DE6BD43F2-001/solr-instance-001/collection1/conf
   [junit4]   2> 732551 INFO  (coreLoadExecutor-3232-thread-1) [    x:collection1] o.a.s.r.RestManager Initializing RestManager with initArgs: {storageDir=/export/home/jenkins/workspace/Lucene-Solr-6.x-Solaris/solr/build/solr-core/test/J0/temp/solr.handler.TestReplicationHandler_3DA09A7DE6BD43F2-001/solr-instance-001/collection1/conf}
   [junit4]   2> 732551 INFO  (coreLoadExecutor-3232-thread-1) [    x:collection1] o.a.s.r.ManagedResourceStorage Reading _rest_managed.json using file:dir=/export/home/jenkins/workspace/Lucene-Solr-6.x-Solaris/solr/build/solr-core/test/J0/temp/solr.handler.TestReplicationHandler_3DA09A7DE6BD43F2-001/solr-instance-001/collection1/conf
   [junit4]   2> 732551 INFO  (coreLoadExecutor-3232-thread-1) [    x:collection1] o.a.s.r.RestManager Initializing 0 registered ManagedResources
   [junit4]   2> 732551 INFO  (coreLoadExecutor-3232-thread-1) [    x:collection1] o.a.s.h.ReplicationHandler Replication enabled for following config files: schema.xml,xslt/dummy.xsl
   [junit4]   2> 732552 INFO  (coreLoadExecutor-3232-thread-1) [    x:collection1] o.a.s.h.ReplicationHandler Commits will be reserved for  10000
   [junit4]   2> 732552 INFO  (searcherExecutor-3233-thread-1-processing-x:collection1) [    x:collection1] o.a.s.c.SolrCore [collection1] Registered new searcher Searcher@29ccc085[collection1] main{ExitableDirectoryReader(UninvertingDirectoryReader())}
   [junit4]   2> 732552 INFO  (coreLoadExecutor-3232-thread-1) [    x:collection1] o.a.s.c.CoreContainer registering core: collection1
   [junit4]   2> 733019 INFO  (TEST-TestReplicationHandler.doTestDetails-seed#[3DA09A7DE6BD43F2]) [    ] o.a.s.SolrTestCaseJ4 Writing core.properties file to /export/home/jenkins/workspace/Lucene-Solr-6.x-Solaris/solr/build/solr-core/test/J0/temp/solr.handler.TestReplicationHandler_3DA09A7DE6BD43F2-001/solr-instance-002/collection1
   [junit4]   2> 733023 INFO  (TEST-TestReplicationHandler.doTestDetails-seed#[3DA09A7DE6BD43F2]) [    ] o.e.j.s.Server jetty-9.3.8.v20160314
   [junit4]   2> 733025 INFO  (TEST-TestReplicationHandler.doTestDetails-seed#[3DA09A7DE6BD43F2]) [    ] o.e.j.s.h.ContextHandler Started o.e.j.s.ServletContextHandler@1f1c9fed{/solr,null,AVAILABLE}
   [junit4]   2> 733025 INFO  (TEST-TestReplicationHandler.doTestDetails-seed#[3DA09A7DE6BD43F2]) [    ] o.e.j.s.ServerConnector Started ServerConnector@32c497f5{HTTP/1.1,[http/1.1]}{127.0.0.1:33599}
   [junit4]   2> 733025 INFO  (TEST-TestReplicationHandler.doTestDetails-seed#[3DA09A7DE6BD43F2]) [    ] o.e.j.s.Server Started @736706ms
   [junit4]   2> 733025 INFO  (TEST-TestReplicationHandler.doTestDetails-seed#[3DA09A7DE6BD43F2]) [    ] o.a.s.c.s.e.JettySolrRunner Jetty properties: {solr.data.dir=/export/home/jenkins/workspace/Lucene-Solr-6.x-Solaris/solr/build/solr-core/test/J0/temp/solr.handler.TestReplicationHandler_3DA09A7DE6BD43F2-001/solr-instance-002/collection1/data, hostContext=/solr, hostPort=33599}
   [junit4]   2> 733025 INFO  (TEST-TestReplicationHandler.doTestDetails-seed#[3DA09A7DE6BD43F2]) [    ] o.a.s.s.SolrDispatchFilter SolrDispatchFilter.init(): sun.misc.Launcher$AppClassLoader@6d06d69c
   [junit4]   2> 733025 INFO  (TEST-TestReplicationHandler.doTestDetails-seed#[3DA09A7DE6BD43F2]) [    ] o.a.s.c.SolrResourceLoader new SolrResourceLoader for directory: '/export/home/jenkins/workspace/Lucene-Solr-6.x-Solaris/solr/build/solr-core/test/J0/temp/solr.handler.TestReplicationHandler_3DA09A7DE6BD43F2-001/solr-instance-002'
   [junit4]   2> 733026 INFO  (TEST-TestReplicationHandler.doTestDetails-seed#[3DA09A7DE6BD43F2]) [    ] o.a.s.c.SolrResourceLoader JNDI not configured for solr (NoInitialContextEx)
   [junit4]   2> 733026 INFO  (TEST-TestReplicationHandler.doTestDetails-seed#[3DA09A7DE6BD43F2]) [    ] o.a.s.c.SolrResourceLoader solr home defaulted to 'solr/' (could not find system property or JNDI)
   [junit4]   2> 733026 INFO  (TEST-TestReplicationHandler.doTestDetails-seed#[3DA09A7DE6BD43F2]) [    ] o.a.s.c.SolrXmlConfig Loading container configuration from /export/home/jenkins/workspace/Lucene-Solr-6.x-Solaris/solr/build/solr-core/test/J0/temp/solr.handler.TestReplicationHandler_3DA09A7DE6BD43F2-001/solr-instance-002/solr.xml
   [junit4]   2> 733030 INFO  (TEST-TestReplicationHandler.doTestDetails-seed#[3DA09A7DE6BD43F2]) [    ] o.a.s.c.CorePropertiesLocator Config-defined core root directory: /export/home/jenkins/workspace/Lucene-Solr-6.x-Solaris/solr/build/solr-core/test/J0/temp/solr.handler.TestReplicationHandler_3DA09A7DE6BD43F2-001/solr-instance-002/.
   [junit4]   2> 733030 INFO  (TEST-TestReplicationHandler.doTestDetails-seed#[3DA09A7DE6BD43F2]) [    ] o.a.s.c.CoreContainer New CoreContainer 1567322002
   [junit4]   2> 733030 INFO  (TEST-TestReplicationHandler.doTestDetails-seed#[3DA09A7DE6BD43F2]) [    ] o.a.s.c.CoreContainer Loading cores into CoreContainer [instanceDir=/export/home/jenkins/workspace/Lucene-Solr-6.x-Solaris/solr/build/solr-core/test/J0/temp/solr.handler.TestReplicationHandler_3DA09A7DE6BD43F2-001/solr-instance-002]
   [junit4]   2> 733031 WARN  (TEST-TestReplicationHandler.doTestDetails-seed#[3DA09A7DE6BD43F2]) [    ] o.a.s.c.CoreContainer Couldn't add files from /export/home/jenkins/workspace/Lucene-Solr-6.x-Solaris/solr/build/solr-core/test/J0/temp/solr.handler.TestReplicationHandler_3DA09A7DE6BD43F2-001/solr-instance-002/lib to classpath: /export/home/jenkins/workspace/Lucene-Solr-6.x-Solaris/solr/build/solr-core/test/J0/temp/solr.handler.TestReplicationHandler_3DA09A7DE6BD43F2-001/solr-instance-002/lib
   [junit4]   2> 733031 INFO  (TEST-TestReplicationHandler.doTestDetails-seed#[3DA09A7DE6BD43F2]) [    ] o.a.s.h.c.HttpShardHandlerFactory created with socketTimeout : 90000,urlScheme : ,connTimeout : 15000,maxConnectionsPerHost : 20,maxConnections : 10000,corePoolSize : 0,maximumPoolSize : 2147483647,maxThreadIdleTime : 5,sizeOfQueue : -1,fairnessPolicy : false,useRetries : false,
   [junit4]   2> 733032 INFO  (TEST-TestReplicationHandler.doTestDetails-seed#[3DA09A7DE6BD43F2]) [    ] o.a.s.u.UpdateShardHandler Creating UpdateShardHandler HTTP client with params: socketTimeout=340000&connTimeout=45000&retry=true
   [junit4]   2> 733032 INFO  (TEST-TestReplicationHandler.doTestDetails-seed#[3DA09A7DE6BD43F2]) [    ] o.a.s.l.LogWatcher SLF4J impl is org.slf4j.impl.Log4jLoggerFactory
   [junit4]   2> 733032 INFO  (TEST-TestReplicationHandler.doTestDetails-seed#[3DA09A7DE6BD43F2]) [    ] o.a.s.l.LogWatcher Registering Log Listener [Log4j (org.slf4j.impl.Log4jLoggerFactory)]
   [junit4]   2> 733032 INFO  (TEST-TestReplicationHandler.doTestDetails-seed#[3DA09A7DE6BD43F2]) [    ] o.a.s.c.CoreContainer Security conf doesn't exist. Skipping setup for authorization module.
   [junit4]   2> 733032 INFO  (TEST-TestReplicationHandler.doTestDetails-seed#[3DA09A7DE6BD43F2]) [    ] o.a.s.c.CoreContainer No authentication plugin used.
   [junit4]   2> 733033 INFO  (TEST-TestReplicationHandler.doTestDetails-seed#[3DA09A7DE6BD43F2]) [    ] o.a.s.c.CorePropertiesLocator Looking for core definitions underneath /export/home/jenkins/workspace/Lucene-Solr-6.x-Solaris/solr/build/solr-core/test/J0/temp/solr.handler.TestReplicationHandler_3DA09A7DE6BD43F2-001/solr-instance-002/.
   [junit4]   2> 733034 INFO  (TEST-TestReplicationHandler.doTestDetails-seed#[3DA09A7DE6BD43F2]) [    ] o.a.s.c.CoreDescriptor Created CoreDescriptor: {name=collection1, config=solrconfig.xml, loadOnStartup=true, schema=schema.xml, configSetProperties=configsetprops.json, transient=false, dataDir=data/}
   [junit4]   2> 733034 INFO  (TEST-TestReplicationHandler.doTestDetails-seed#[3DA09A7DE6BD43F2]) [    ] o.a.s.c.CorePropertiesLocator Found core collection1 in /export/home/jenkins/workspace/Lucene-Solr-6.x-Solaris/solr/build/solr-core/test/J0/temp/solr.handler.TestReplicationHandler_3DA09A7DE6BD43F2-001/solr-instance-002/./collection1
   [junit4]   2> 733034 INFO  (TEST-TestReplicationHandler.doTestDetails-seed#[3DA09A7DE6BD43F2]) [    ] o.a.s.c.CorePropertiesLocator Found 1 core definitions
   [junit4]   2> 733035 INFO  (TEST-TestReplicationHandler.doTestDetails-seed#[3DA09A7DE6BD43F2]) [    ] o.a.s.s.SolrDispatchFilter user.dir=/export/home/jenkins/workspace/Lucene-Solr-6.x-Solaris/solr/build/solr-core/test/J0
   [junit4]   2> 733035 INFO  (TEST-TestReplicationHandler.doTestDetails-seed#[3DA09A7DE6BD43F2]) [    ] o.a.s.s.SolrDispatchFilter SolrDispatchFilter.init() done
   [junit4]   2> 733035 INFO  (coreLoadExecutor-3242-thread-1) [    ] o.a.s.c.SolrResourceLoader new SolrResourceLoader for directory: '/export/home/jenkins/workspace/Lucene-Solr-6.x-Solaris/solr/build/solr-core/test/J0/temp/solr.handler.TestReplicationHandler_3DA09A7DE6BD43F2-001/solr-instance-002/collection1'
   [junit4]   2> 733036 INFO  (coreLoadExecutor-3242-thread-1) [    ] o.a.s.c.SolrResourceLoader JNDI not configured for solr (NoInitialContextEx)
   [junit4]   2> 733036 INFO  (coreLoadExecutor-3242-thread-1) [    ] o.a.s.c.SolrResourceLoader solr home defaulted to 'solr/' (could not find system property or JNDI)
   [junit4]   2> 733043 INFO  (coreLoadExecutor-3242-thread-1) [    ] o.a.s.c.SolrConfig current version of requestparams : -1
   [junit4]   2> 733048 WARN  (coreLoadExecutor-3242-thread-1) [    ] o.a.s.c.Config Beginning with Solr 5.5, <mergePolicy> is deprecated, use <mergePolicyFactory> instead.
   [junit4]   2> 733048 INFO  (coreLoadExecutor-3242-thread-1) [    ] o.a.s.c.SolrConfig Using Lucene MatchVersion: 6.1.0
   [junit4]   2> 733056 INFO  (coreLoadExecutor-3242-thread-1) [    ] o.a.s.c.SolrConfig Loaded SolrConfig: solrconfig.xml
   [junit4]   2> 733058 INFO  (coreLoadExecutor-3242-thread-1) [    ] o.a.s.s.IndexSchema [collection1] Schema name=test
   [junit4]   2> 733060 INFO  (coreLoadExecutor-3242-thread-1) [    ] o.a.s.s.IndexSchema unique key field: id
   [junit4]   2> 733061 INFO  (coreLoadExecutor-3242-thread-1) [    ] o.a.s.c.ConfigSetProperties Did not find ConfigSet properties, assuming default properties: Can't find resource 'configsetprops.json' in classpath or '/export/home/jenkins/workspace/Lucene-Solr-6.x-Solaris/solr/build/solr-core/test/J0/temp/solr.handler.TestReplicationHandler_3DA09A7DE6BD43F2-001/solr-instance-002/collection1'
   [junit4]   2> 733061 INFO  (coreLoadExecutor-3242-thread-1) [    ] o.a.s.c.CoreContainer Creating SolrCore 'collection1' using configuration from instancedir /export/home/jenkins/workspace/Lucene-Solr-6.x-Solaris/solr/build/solr-core/test/J0/temp/solr.handler.TestReplicationHandler_3DA09A7DE6BD43F2-001/solr-instance-002/./collection1
   [junit4]   2> 733062 INFO  (coreLoadExecutor-3242-thread-1) [    x:collection1] o.a.s.c.SolrCore org.apache.solr.core.MockDirectoryFactory
   [junit4]   2> 733062 INFO  (coreLoadExecutor-3242-thread-1) [    x:collection1] o.a.s.c.SolrCore [[collection1] ] Opening new SolrCore at [/export/home/jenkins/workspace/Lucene-Solr-6.x-Solaris/solr/build/solr-core/test/J0/temp/solr.handler.TestReplicationHandler_3DA09A7DE6BD43F2-001/solr-instance-002/collection1], dataDir=[/export/home/jenkins/workspace/Lucene-Solr-6.x-Solaris/solr/build/solr-core/test/J0/temp/solr.handler.TestReplicationHandler_3DA09A7DE6BD43F2-001/solr-instance-002/./collection1/data/]
   [junit4]   2> 733062 INFO  (coreLoadExecutor-3242-thread-1) [    x:collection1] o.a.s.c.SolrCore JMX monitoring not detected for core: collection1
   [junit4]   2> 733062 INFO  (coreLoadExecutor-3242-thread-1) [    x:collection1] o.a.s.c.CachingDirectoryFactory return new directory for /export/home/jenkins/workspace/Lucene-Solr-6.x-Solaris/solr/build/solr-core/test/J0/temp/solr.handler.TestReplicationHandler_3DA09A7DE6BD43F2-001/solr-instance-002/./collection1/data
   [junit4]   2> 733062 INFO  (coreLoadExecutor-3242-thread-1) [    x:collection1] o.a.s.c.SolrCore New index directory detected: old=null new=/export/home/jenkins/workspace/Lucene-Solr-6.x-Solaris/solr/build/solr-core/test/J0/temp/solr.handler.TestReplicationHandler_3DA09A7DE6BD43F2-001/solr-instance-002/./collection1/data/index/
   [junit4]   2> 733062 WARN  (coreLoadExecutor-3242-thread-1) [    x:collection1] o.a.s.c.SolrCore [collection1] Solr index directory '/export/home/jenkins/workspace/Lucene-Solr-6.x-Solaris/solr/build/solr-core/test/J0/temp/solr.handler.TestReplicationHandler_3DA09A7DE6BD43F2-001/solr-instance-002/./collection1/data/index' doesn't exist. Creating new index...
   [junit4]   2> 733062 INFO  (coreLoadExecutor-3242-thread-1) [    x:collection1] o.a.s.c.CachingDirectoryFactory return new directory for /export/home/jenkins/workspace/Lucene-Solr-6.x-Solaris/solr/build/solr-core/test/J0/temp/solr.handler.TestReplicationHandler_3DA09A7DE6BD43F2-001/solr-instance-002/./collection1/data/index
   [junit4]   2> 733063 INFO  (coreLoadExecutor-3242-thread-1) [    x:collection1] o.a.s.u.RandomMergePolicy RandomMergePolicy wrapping class org.apache.lucene.index.TieredMergePolicy: [TieredMergePolicy: maxMergeAtOnce=17, maxMergeAtOnceExplicit=35, maxMergedSegmentMB=25.6416015625, floorSegmentMB=2.0205078125, forceMergeDeletesPctAllowed=29.65117463504148, segmentsPerTier=36.0, maxCFSSegmentSizeMB=0.7705078125, noCFSRatio=1.0
   [junit4]   2> 733063 INFO  (coreLoadExecutor-3242-thread-1) [    x:collection1] o.a.s.c.SolrDeletionPolicy SolrDeletionPolicy.onCommit: commits: num=1
   [junit4]   2> 	commit{dir=MockDirectoryWrapper(RAMDirectory@601bdacc lockFactory=org.apache.lucene.store.SingleInstanceLockFactory@557b223a),segFN=segments_1,generation=1}
   [junit4]   2> 733063 INFO  (coreLoadExecutor-3242-thread-1) [    x:collection1] o.a.s.c.SolrDeletionPolicy newest commit generation = 1
   [junit4]   2> 733064 INFO  (OldIndexDirectoryCleanupThreadForCore-collection1) [    x:collection1] o.a.s.c.SolrCore Looking for old index directories to cleanup for core collection1 in /export/home/jenkins/workspace/Lucene-Solr-6.x-Solaris/solr/build/solr-core/test/J0/temp/solr.handler.TestReplicationHandler_3DA09A7DE6BD43F2-001/solr-instance-002/./collection1/data/
   [junit4]   2> 733068 INFO  (coreLoadExecutor-3242-thread-1) [    x:collection1] o.a.s.c.SolrCore no updateRequestProcessorChain defined as default, creating implicit default
   [junit4]   2> 733070 INFO  (coreLoadExecutor-3242-thread-1) [    x:collection1] o.a.s.h.l.XMLLoader xsltCacheLifetimeSeconds=60
   [junit4]   2> 733070 INFO  (coreLoadExecutor-3242-thread-1) [    x:collection1] o.a.s.h.l.XMLLoader xsltCacheLifetimeSeconds=60
   [junit4]   2> 733072 INFO  (coreLoadExecutor-3242-thread-1) [    x:collection1] o.a.s.h.l.XMLLoader xsltCacheLifetimeSeconds=60
   [junit4]   2> 733072 INFO  (coreLoadExecutor-3242-thread-1) [    x:collection1] o.a.s.h.l.XMLLoader xsltCacheLifetimeSeconds=60
   [junit4]   2> 733075 INFO  (coreLoadExecutor-3242-thread-1) [    x:collection1] o.a.s.c.PluginBag requestHandler : 'lazy' created with startup=lazy 
   [junit4]   2> 733075 INFO  (coreLoadExecutor-3242-thread-1) [    x:collection1] o.a.s.c.RequestHandlers Registered paths: /admin/mbeans,standard,lazy,/update/json/docs,/admin/luke,/export,/get,/admin/properties,/update/json,/admin/threads,/update/csv,/sql,/graph,/admin/segments,/admin/system,/replication,defaults,/config,/stream,/schema,/admin/plugins,/admin/logging,/admin/ping,/update,/admin/file
   [junit4]   2> 733075 INFO  (coreLoadExecutor-3242-thread-1) [    x:collection1] o.a.s.c.SolrCore Using default statsCache cache: org.apache.solr.search.stats.LocalStatsCache
   [junit4]   2> 733075 INFO  (coreLoadExecutor-3242-thread-1) [    x:collection1] o.a.s.u.CommitTracker Hard AutoCommit: disabled
   [junit4]   2> 733075 INFO  (coreLoadExecutor-3242-thread-1) [    x:collection1] o.a.s.u.CommitTracker Soft AutoCommit: disabled
   [junit4]   2> 733075 INFO  (coreLoadExecutor-3242-thread-1) [    x:collection1] o.a.s.u.RandomMergePolicy RandomMergePolicy wrapping class org.apache.lucene.index.TieredMergePolicy: [TieredMergePolicy: maxMergeAtOnce=16, maxMergeAtOnceExplicit=16, maxMergedSegmentMB=38.7158203125, floorSegmentMB=1.98828125, forceMergeDeletesPctAllowed=1.806029557904958, segmentsPerTier=46.0, maxCFSSegmentSizeMB=8.796093022207999E12, noCFSRatio=1.0
   [junit4]   2> 733075 INFO  (coreLoadExecutor-3242-thread-1) [    x:collection1] o.a.s.c.SolrDeletionPolicy SolrDeletionPolicy.onInit: commits: num=1
   [junit4]   2> 	commit{dir=MockDirectoryWrapper(RAMDirectory@601bdacc lockFactory=org.apache.lucene.store.SingleInstanceLockFactory@557b223a),segFN=segments_1,generation=1}
   [junit4]   2> 733075 INFO  (coreLoadExecutor-3242-thread-1) [    x:collection1] o.a.s.c.SolrDeletionPolicy newest commit generation = 1
   [junit4]   2> 733076 INFO  (coreLoadExecutor-3242-thread-1) [    x:collection1] o.a.s.s.SolrIndexSearcher Opening [Searcher@c122607[collection1] main]
   [junit4]   2> 733076 INFO  (coreLoadExecutor-3242-thread-1) [    x:collection1] o.a.s.r.ManagedResourceStorage File-based storage initialized to use dir: /export/home/jenkins/workspace/Lucene-Solr-6.x-Solaris/solr/build/solr-core/test/J0/temp/solr.handler.TestReplicationHandler_3DA09A7DE6BD43F2-001/solr-instance-002/collection1/conf
   [junit4]   2> 733076 INFO  (coreLoadExecutor-3242-thread-1) [    x:collection1] o.a.s.r.RestManager Initializing RestManager with initArgs: {storageDir=/export/home/jenkins/workspace/Lucene-Solr-6.x-Solaris/solr/build/solr-core/test/J0/temp/solr.handler.TestReplicationHandler_3DA09A7DE6BD43F2-001/solr-instance-002/collection1/conf}
   [junit4]   2> 733076 INFO  (coreLoadExecutor-3242-thread-1) [    x:collection1] o.a.s.r.ManagedResourceStorage Reading _rest_managed.json using file:dir=/export/home/jenkins/workspace/Lucene-Solr-6.x-Solaris/solr/build/solr-core/test/J0/temp/solr.handler.TestReplicationHandler_3DA09A7DE6BD43F2-001/solr-instance-002/collection1/conf
   [junit4]   2> 733076 INFO  (coreLoadExecutor-3242-thread-1) [    x:collection1] o.a.s.r.RestManager Initializing 0 registered ManagedResources
   [junit4]   2> 733078 INFO  (coreLoadExecutor-3242-thread-1) [    x:collection1] o.a.s.h.ReplicationHandler Poll scheduled at an interval of 1000ms
   [junit4]   2> 733079 INFO  (coreLoadExecutor-3242-thread-1) [    x:collection1] o.a.s.c.CoreContainer registering core: collection1
   [junit4]   2> 733079 INFO  (searcherExecutor-3243-thread-1-processing-x:collection1) [    x:collection1] o.a.s.c.SolrCore [collection1] Registered new searcher Searcher@c122607[collection1] main{ExitableDirectoryReader(UninvertingDirectoryReader())}
   [junit4]   2> 733322 INFO  (qtp1037686742-6200) [    x:collection1] o.a.s.c.S.Request [collection1]  webapp=/solr path=/replication params={qt=/replication&wt=javabin&version=2&command=indexversion} status=0 QTime=0
   [junit4]   2> 733538 INFO  (qtp1037686742-6202) [    x:collection1] o.a.s.c.S.Request [collection1]  webapp=/solr path=/select params={q=*:*&sort=id+desc&wt=javabin&version=2} hits=0 status=0 QTime=0
   [junit4]   2> 733541 INFO  (qtp1037686742-6198) [    x:collection1] o.a.s.c.S.Request [collection1]  webapp=/solr path=/replication params={_trace=getDetails&qt=/replication&wt=javabin&version=2&command=details} status=0 QTime=1
   [junit4]   2> 733546 INFO  (qtp1037686742-6204) [    x:collection1] o.a.s.c.S.Request [collection1]  webapp=/solr path=/replication params={slave=false&qt=/replication&wt=javabin&version=2&command=details} status=0 QTime=0
   [junit4]   2> 733546 INFO  (qtp1296679370-6216) [    x:collection1] o.a.s.c.S.Request [collection1]  webapp=/solr path=/replication params={_trace=getDetails&qt=/replication&wt=javabin&version=2&command=details} status=0 QTime=2
   [junit4]   2> 733549 INFO  (qtp1037686742-6203) [    x:collection1] o.a.s.u.p.LogUpdateProcessorFactory [collection1]  webapp=/solr path=/update params={wt=javabin&version=2}{add=[0]} 0 0
   [junit4]   2> 733551 INFO  (qtp1037686742-6197) [    x:collection1] o.a.s.u.DirectUpdateHandler2 start commit{,optimize=false,openSearcher=true,waitSearcher=true,expungeDeletes=false,softCommit=false,prepareCommit=false}
   [junit4]   2> 733553 INFO  (qtp1037686742-6197) [    x:collection1] o.a.s.c.SolrDeletionPolicy SolrDeletionPolicy.onCommit: commits: num=2
   [junit4]   2> 	commit{dir=MockDirectoryWrapper(RAMDirectory@4f047674 lockFactory=org.apache.lucene.store.SingleInstanceLockFactory@7fc473c6),segFN=segments_1,generation=1}
   [junit4]   2> 	commit{dir=MockDirectoryWrapper(RAMDirectory@4f047674 lockFactory=org.apache.lucene.store.SingleInstanceLockFactory@7fc473c6),segFN=segments_2,generation=2}
   [junit4]   2> 733554 INFO  (qtp1037686742-6197) [    x:collection1] o.a.s.c.SolrDeletionPolicy newest commit generation = 2
   [junit4]   2> 733558 INFO  (qtp1037686742-6197) [    x:collection1] o.a.s.s.SolrIndexSearcher Opening [Searcher@145f16b7[collection1] main]
   [junit4]   2> 733558 INFO  (qtp1037686742-6197) [    x:collection1] o.a.s.u.DirectUpdateHandler2 end_commit_flush
   [junit4]   2> 733558 INFO  (searcherExecutor-3233-thread-1-processing-x:collection1) [    x:collection1] o.a.s.c.SolrCore [collection1] Registered new searcher Searcher@145f16b7[collection1] main{ExitableDirectoryReader(UninvertingDirectoryReader(Uninverting(_0(6.1.0):c1)))}
   [junit4]   2> 733558 INFO  (qtp1037686742-6197) [    x:collection1] o.a.s.u.p.LogUpdateProcessorFactory [collection1]  webapp=/solr path=/update params={waitSearcher=true&commit=true&softCommit=false&wt=javabin&version=2}{commit=} 0 7
   [junit4]   2> 733566 WARN  (explicit-fetchindex-cmd) [    x:collection1] o.a.s.h.IndexFetcher 'masterUrl' must be specified without the /replication suffix
   [junit4]   2> 733569 INFO  (qtp1037686742-6200) [    x:collection1] o.a.s.c.S.Request [collection1]  webapp=/solr path=/replication params={qt=/replication&wt=javabin&version=2&command=indexversion} status=0 QTime=0
   [junit4]   2> 733570 INFO  (explicit-fetchindex-cmd) [    x:collection1] o.a.s.h.IndexFetcher Master's generation: 2
   [junit4]   2> 733570 INFO  (explicit-fetchindex-cmd) [    x:collection1] o.a.s.h.IndexFetcher Slave's generation: 1
   [junit4]   2> 733570 INFO  (explicit-fetchindex-cmd) [    x:collection1] o.a.s.h.IndexFetcher Starting replication process
   [junit4]   2> 733575 INFO  (qtp1037686742-6201) [    x:collection1] o.a.s.c.S.Request [collection1]  webapp=/solr path=/replication params={generation=2&qt=/replication&wt=javabin&version=2&command=filelist} status=0 QTime=3
   [junit4]   2> 733575 INFO  (explicit-fetchindex-cmd) [    x:collection1] o.a.s.h.IndexFetcher Number of files in latest index in master: 4
   [junit4]   2> 733576 INFO  (explicit-fetchindex-cmd) [    x:collection1] o.a.s.c.CachingDirectoryFactory return new directory for /export/home/jenkins/workspace/Lucene-Solr-6.x-Solaris/solr/build/solr-core/test/J0/temp/solr.handler.TestReplicationHandler_3DA09A7DE6BD43F2-001/solr-instance-002/./collection1/data/index.20160602054834650
   [junit4]   2> 733576 INFO  (explicit-fetchindex-cmd) [    x:collection1] o.a.s.u.DefaultSolrCoreState Rollback old IndexWriter... core=collection1
   [junit4]   2> 733576 INFO  (explicit-fetchindex-cmd) [    x:collection1] o.a.s.u.RandomMergePolicy RandomMergePolicy wrapping class org.apache.lucene.index.TieredMergePolicy: [TieredMergePolicy: maxMergeAtOnce=24, maxMergeAtOnceExplicit=25, maxMergedSegmentMB=17.283203125, floorSegmentMB=1.4599609375, forceMergeDeletesPctAllowed=7.692666145827718, segmentsPerTier=39.0, maxCFSSegmentSizeMB=8.796093022207999E12, noCFSRatio=0.7939532932276266
   [junit4]   2> 733577 INFO  (explicit-fetchindex-cmd) [    x:collection1] o.a.s.c.SolrDeletionPolicy SolrDeletionPolicy.onInit: commits: num=1
   [junit4]   2> 	commit{dir=MockDirectoryWrapper(RAMDirectory@601bdacc lockFactory=org.apache.lucene.store.SingleInstanceLockFactory@557b223a),segFN=segments_1,generation=1}
   [junit4]   2> 733578 INFO  (explicit-fetchindex-cmd) [    x:collection1] o.a.s.c.SolrDeletionPolicy newest commit generation = 1
   [junit4]   2> 733578 INFO  (explicit-fetchindex-cmd) [    x:collection1] o.a.s.u.DefaultSolrCoreState New IndexWriter is ready to be used.
   [junit4]   2> 733578 INFO  (explicit-fetchindex-cmd) [    x:collection1] o.a.s.c.SolrDeletionPolicy SolrDeletionPolicy.onCommit: commits: num=1
   [junit4]   2> 	commit{dir=MockDirectoryWrapper(RAMDirectory@601bdacc lockFactory=org.apache.lucene.store.SingleInstanceLockFactory@557b223a),segFN=segments_1,generation=1}
   [junit4]   2> 733578 INFO  (explicit-fetchindex-cmd) [    x:collection1] o.a.s.c.SolrDeletionPolicy newest commit generation = 1
   [junit4]   2> 733579 INFO  (explicit-fetchindex-cmd) [    x:collection1] o.a.s.u.DefaultSolrCoreState Rollback old IndexWriter... core=collection1
   [junit4]   2> 733579 INFO  (explicit-fetchindex-cmd) [    x:collection1] o.a.s.h.IndexFetcher Starting download (fullCopy=false) to MockDirectoryWrapper(RAMDirectory@74f76017 lockFactory=org.apache.lucene.store.SingleInstanceLockFactory@18095fc0)
   [junit4]   2> 733585 INFO  (qtp1037686742-6202) [    x:collection1] o.a.s.c.S.Request [collection1]  webapp=/solr path=/replication params={generation=2&qt=/replication&file=_0.cfe&checksum=true&wt=filestream&command=filecontent} status=0 QTime=0
   [junit4]   2> 733589 INFO  (qtp1037686742-6198) [    x:collection1] o.a.s.c.S.Request [collection1]  webapp=/solr path=/replication params={generation=2&qt=/replication&file=_0.si&checksum=true&wt=filestream&command=filecontent} status=0 QTime=0
   [junit4]   2> 733592 INFO  (qtp1037686742-6204) [    x:collection1] o.a.s.c.S.Request [collection1]  webapp=/solr path=/replication params={generation=2&qt=/replication&file=_0.cfs&checksum=true&wt=filestream&command=filecontent} status=0 QTime=0
   [junit4]   2> 733594 INFO  (qtp1037686742-6203) [    x:collection1] o.a.s.c.S.Request [collection1]  webapp=/solr path=/replication params={generation=2&qt=/replication&file=segments_2&checksum=true&wt=filestream&command=filecontent} status=0 QTime=0
   [junit4]   2> 733594 INFO  (explicit-fetchindex-cmd) [    x:collection1] o.a.s.h.IndexFetcher Total time taken for download (fullCopy=false,bytesDownloaded=1684) : 0 secs (null bytes/sec) to MockDirectoryWrapper(RAMDirectory@74f76017 lockFactory=org.apache.lucene.store.SingleInstanceLockFactory@18095fc0)
   [junit4]   2> 733595 INFO  (explicit-fetchindex-cmd) [    x:collection1] o.a.s.u.RandomMergePolicy RandomMergePolicy wrapping class org.apache.lucene.index.MockRandomMergePolicy: org.apache.lucene.index.MockRandomMergePolicy@7e04b1e1
   [junit4]   2> 733595 INFO  (explicit-fetchindex-cmd) [    x:collection1] o.a.s.c.SolrDeletionPolicy SolrDeletionPolicy.onInit: commits: num=2
   [junit4]   2> 	commit{dir=MockDirectoryWrapper(RAMDirectory@601bdacc lockFactory=org.apache.lucene.store.SingleInstanceLockFactory@557b223a),segFN=segments_1,generation=1}
   [junit4]   2> 	commit{dir=MockDirectoryWrapper(RAMDirectory@601bdacc lockFactory=org.apache.lucene.store.SingleInstanceLockFactory@557b223a),segFN=segments_2,generation=2}
   [junit4]   2> 733595 INFO  (explicit-fetchindex-cmd) [    x:collection1] o.a.s.c.SolrDeletionPolicy newest commit generation = 2
   [junit4]   2> 733596 INFO  (explicit-fetchindex-cmd) [    x:collection1] o.a.s.u.DefaultSolrCoreState New IndexWriter is ready to be used.
   [junit4]   2> 733596 INFO  (explicit-fetchindex-cmd) [    x:collection1] o.a.s.s.SolrIndexSearcher Opening [Searcher@1fae261f[collection1] main]
   [junit4]   2> 733596 INFO  (searcherExecutor-3243-thread-1-processing-x:collection1) [    x:collection1] o.a.s.c.SolrCore [collection1] Registered new searcher Searcher@1fae261f[collection1] main{ExitableDirectoryReader(UninvertingDirectoryReader(Uninverting(_0(6.1.0):c1)))}
   [junit4]   2> 733596 INFO  (explicit-fetchindex-cmd) [    x:collection1] o.a.s.c.CachingDirectoryFactory looking to close /export/home/jenkins/workspace/Lucene-Solr-6.x-Solaris/solr/build/solr-core/test/J0/temp/solr.handler.TestReplicationHandler_3DA09A7DE6BD43F2-001/solr-instance-002/./collection1/data/index.20160602054834650 [CachedDir<<refCount=0;path=/export/home/jenkins/workspace/Lucene-Solr-6.x-Solaris/solr/build/solr-core/test/J0/temp/solr.handler.TestReplicationHandler_3DA09A7DE6BD43F2-001/solr-instance-002/./collection1/data/index.20160602054834650;done=true>>]
   [junit4]   2> 733596 INFO  (explicit-fetchindex-cmd) [    x:collection1] o.a.s.c.CachingDirectoryFactory Closing directory, CoreContainer#isShutdown=false
   [junit4]   2> 733596 INFO  (explicit-fetchindex-cmd) [    x:collection1] o.a.s.c.CachingDirectoryFactory Closing directory: /export/home/jenkins/workspace/Lucene-Solr-6.x-Solaris/solr/build/solr-core/test/J0/temp/solr.handler.TestReplicationHandler_3DA09A7DE6BD43F2-001/solr-instance-002/./collection1/data/index.20160602054834650
   [junit4]   2> 733597 INFO  (qtp1296679370-6218) [    x:collection1] o.a.s.c.S.Request [collection1]  webapp=/solr path=/replication params={wait=true&masterUrl=http://127.0.0.1:44762/solr/collection1/replication&command=fetchindex} status=0 QTime=31
   [junit4]   2> 733611 INFO  (qtp1037686742-6197) [    x:collection1] o.a.s.c.S.Request [collection1]  webapp=/solr path=/replication params={slave=false&qt=/replication&wt=javabin&version=2&command=details} status=0 QTime=0
   [junit4]   2> 733612 INFO  (qtp1296679370-6219) [    x:collection1] o.a.s.c.S.Request [collection1]  webapp=/solr path=/replication params={_trace=getDetails&qt=/replication&wt=javabin&version=2&command=details} status=0 QTime=2
   [junit4]   2> 733615 INFO  (qtp1037686742-6200) [    x:collection1] o.a.s.u.p.LogUpdateProcessorFactory [collection1]  webapp=/solr path=/update params={wt=javabin&version=2}{add=[1]} 0 1
   [junit4]   2> 733618 INFO  (qtp1037686742-6201) [    x:collection1] o.a.s.u.DirectUpdateHandler2 start commit{,optimize=false,openSearcher=true,waitSearcher=true,expungeDeletes=false,softCommit=false,prepareCommit=false}
   [junit4]   2> 733631 INFO  (qtp1037686742-6201) [    x:collection1] o.a.s.c.SolrDeletionPolicy SolrDeletionPolicy.onCommit: commits: num=3
   [junit4]   2> 	commit{dir=MockDirectoryWrapper(RAMDirectory@4f047674 lockFactory=org.apache.lucene.store.SingleInstanceLockFactory@7fc473c6),segFN=segments_1,generation=1}
   [junit4]   2> 	commit{dir=MockDirectoryWrapper(RAMDirectory@4f047674 lockFactory=org.apache.lucene.store.SingleInstanceLockFactory@7fc473c6),segFN=segments_2,generation=2}
   [junit4]   2> 	commit{dir=MockDirectoryWrapper(RAMDirectory@4f047674 lockFactory=org.apache.lucene.store.SingleInstanceLockFactory@7fc473c6),segFN=segments_3,generation=3}
   [junit4]   2> 733631 INFO  (qtp1037686742-6201) [    x:collection1] o.a.s.c.SolrDeletionPolicy newest commit generation = 3
   [junit4]   2> 733631 INFO  (qtp1037686742-6201) [    x:collection1] o.a.s.s.SolrIndexSearcher Opening [Searcher@3898b2ad[collection1] main]
   [junit4]   2> 733631 INFO  (qtp1037686742-6201) [    x:collection1] o.a.s.u.DirectUpdateHandler2 end_commit_flush
   [junit4]   2> 733632 INFO  (searcherExecutor-3233-thread-1-processing-x:collection1) [    x:collection1] o.a.s.c.SolrCore [collection1] Registered new searcher Searcher@3898b2ad[collection1] main{ExitableDirectoryReader(UninvertingDirectoryReader(Uninverting(_0(6.1.0):c1) Uninverting(_1(6.1.0):c1)))}
   [junit4]   2> 733632 INFO  (qtp1037686742-6201) [    x:collection1] o.a.s.u.p.LogUpdateProcessorFactory [collection1]  webapp=/solr path=/update params={waitSearcher=true&commit=true&softCommit=false&wt=javabin&version=2}{commit=} 0 13
   [junit4]   2> 733637 WARN  (explicit-fetchindex-cmd) [    x:collection1] o.a.s.h.IndexFetcher 'masterUrl' must be specified without the /replication suffix
   [junit4]   2> 733639 INFO  (qtp1037686742-6202) [    x:collection1] o.a.s.c.S.Request [collection1]  webapp=/solr path=/replication params={qt=/replication&wt=javabin&version=2&command=indexversion} status=0 QTime=0
   [junit4]   2> 733639 INFO  (explicit-fetchindex-cmd) [    x:collection1] o.a.s.h.IndexFetcher Master's generation: 3
   [junit4]   2> 733639 INFO  (explicit-fetchindex-cmd) [    x:collection1] o.a.s.h.IndexFetcher Slave's generation: 2
   [junit4]   2> 733640 INFO  (explicit-fetchindex-cmd) [    x:collection1] o.a.s.h.IndexFetcher Starting replication process
   [junit4]   2> 733642 INFO  (qtp1037686742-6198) [    x:collection1] o.a.s.c.S.Request [collection1]  webapp=/solr path=/replication params={generation=3&qt=/replication&wt=javabin&version=2&command=filelist} status=0 QTime=1
   [junit4]   2> 733642 INFO  (explicit-fetchindex-cmd) [    x:collection1] o.a.s.h.IndexFetcher Number of files in latest index in master: 7
   [junit4]   2> 733643 INFO  (explicit-fetchindex-cmd) [    x:collection1] o.a.s.c.CachingDirectoryFactory return new directory for /export/home/jenkins/workspace/Lucene-Solr-6.x-Solaris/solr/build/solr-core/test/J0/temp/solr.handler.TestReplicationHandler_3DA09A7DE6BD43F2-001/solr-instance-002/./collection1/data/index.20160602054834718
   [junit4]   2> 733643 INFO  (explicit-fetchindex-cmd) [    x:collection1] o.a.s.u.DefaultSolrCoreState Rollback old IndexWriter... core=collection1
   [junit4]   2> 733648 INFO  (explicit-fetchindex-cmd) [    x:collection1] o.a.s.u.RandomMergePolicy RandomMergePolicy wrapping class org.apache.lucene.index.TieredMergePolicy: [TieredMergePolicy: maxMergeAtOnce=24, maxMergeAtOnceExplicit=25, maxMergedSegmentMB=17.283203125, floorSegmentMB=1.4599609375, forceMergeDeletesPctAllowed=7.692666145827718, segmentsPerTier=39.0, maxCFSSegmentSizeMB=8.796093022207999E12, noCFSRatio=0.7939532932276266
   [junit4]   2> 733648 INFO  (explicit-fetchindex-cmd) [    x:collection1] o.a.s.c.SolrDeletionPolicy SolrDeletionPolicy.onInit: commits: num=1
   [junit4]   2> 	commit{dir=MockDirectoryWrapper(RAMDirectory@601bdacc lockFactory=org.apache.lucene.store.SingleInstanceLockFactory@557b223a),segFN=segments_2,generation=2}
   [junit4]   2> 733648 INFO  (explicit-fetchindex-cmd) [    x:collection1] o.a.s.c.SolrDeletionPolicy newest commit generation = 2
   [junit4]   2> 733648 INFO  (explicit-fetchindex-cmd) [    x:collection1] o.a.s.u.DefaultSolrCoreState New IndexWriter is ready to be used.
   [junit4]   2> 733648 INFO  (explicit-fetchindex-cmd) [    x:collection1] o.a.s.c.SolrDeletionPolicy SolrDeletionPolicy.onCommit: commits: num=1
   [junit4]   2> 	commit{dir=MockDirectoryWrapper(RAMDirectory@601bdacc lockFactory=org.apache.lucene.store.SingleInstanceLockFactory@557b223a),segFN=segments_2,generation=2}
   [junit4]   2> 733648 INFO  (explicit-fetchindex-cmd) [    x:collection1] o.a.s.c.SolrDeletionPolicy newest commit generation = 2
   [junit4]   2> 733648 INFO  (explicit-fetchindex-cmd) [    x:collection1] o.a.s.u.DefaultSolrCoreState Rollback old IndexWriter... core=collection1
   [junit4]   2> 733648 INFO  (explicit-fetchindex-cmd) [    x:collection1] o.a.s.h.IndexFetcher Starting download (fullCopy=false) to MockDirectoryWrapper(RAMDirectory@47b80b01 lockFactory=org.apache.lucene.store.SingleInstanceLockFactory@64166512)
   [junit4]   2> 733648 INFO  (explicit-fetchindex-cmd) [    x:collection1] o.a.s.h.IndexFetcher Skipping download for _0.cfe because it already exists
   [junit4]   2> 733648 INFO  (explicit-fetchindex-cmd) [    x:collection1] o.a.s.h.IndexFetcher Skipping download for _0.si because it already exists
   [junit4]   2> 733648 INFO  (explicit-fetchindex-cmd) [    x:collection1] o.a.s.h.IndexFetcher Skipping download for _0.cfs because it already exists
   [junit4]   2> 733651 INFO  (qtp1037686742-6204) [    x:collection1] o.a.s.c.S.Request [collection1]  webapp=/solr path=/replication params={generation=3&qt=/replication&file=_1.cfs&checksum=true&wt=filestream&command=filecontent} status=0 QTime=0
   [junit4]   2> 733654 INFO  (qtp1037686742-6203) [    x:collection1] o.a.s.c.S.Request [collection1]  webapp=/solr path=/replication params={generation=3&qt=/replication&file=_1.cfe&checksum=true&wt=filestream&command=filecontent} status=0 QTime=0
   [junit4]   2> 733656 INFO  (qtp1037686742-6197) [    x:collection1] o.a.s.c.S.Request [collection1]  webapp=/solr path=/replication params={generation=3&qt=/replication&file=_1.si&checksum=true&wt=filestream&command=filecontent} status=0 QTime=0
   [junit4]   2> 733666 INFO  (qtp1037686742-6200) [    x:collection1] o.a.s.c.S.Request [collection1]  webapp=/solr path=/replication params={generation=3&qt=/replication&file=segments_3&checksum=true&wt=filestream&command=filecontent} status=0 QTime=0
   [junit4]   2> 733666 INFO  (explicit-fetchindex-cmd) [    x:collection1] o.a.s.h.IndexFetcher Total time taken for download (fullCopy=false,bytesDownloaded=1747) : 0 secs (null bytes/sec) to MockDirectoryWrapper(RAMDirectory@47b80b01 lockFactory=org.apache.lucene.store.SingleInstanceLockFactory@64166512)
   [junit4]   2> 733667 INFO  (explicit-fetchindex-cmd) [    x:collection1] o.a.s.u.RandomMergePolicy RandomMergePolicy wrapping class org.apache.lucene.index.MockRandomMergePolicy: org.apache.lucene.index.MockRandomMergePolicy@2be25b9a
   [junit4]   2> 733668 INFO  (explicit-fetchindex-cmd) [    x:collection1] o.a.s.c.SolrDeletionPolicy SolrDeletionPolicy.onInit: commits: num=2
   [junit4]   2> 	commit{dir=MockDirectoryWrapper(RAMDirectory@601bdacc lockFactory=org.apache.lucene.store.SingleInstanceLockFactory@557b223a),segFN=segments_2,generation=2}
   [junit4]   2> 	commit{dir=MockDirectoryWrapper(RAMDirectory@601bdacc lockFactory=org.apache.lucene.store.SingleInstanceLockFactory@557b223a),segFN=segments_3,generation=3}
   [junit4]   2> 733668 INFO  (explicit-fetchindex-cmd) [    x:collection1] o.a.s.c.SolrDeletionPolicy newest commit generation = 3
   [junit4]   2> 733668 INFO  (explicit-fetchindex-cmd) [    x:collection1] o.a.s.u.DefaultSolrCoreState New IndexWriter is ready to be used.
   [junit4]   2> 733669 INFO  (explicit-fetchindex-cmd) [    x:collection1] o.a.s.s.SolrIndexSearcher Opening [Searcher@7544b8e5[collection1] main]
   [junit4]   2> 733669 INFO  (searcherExecutor-3243-thread-1-processing-x:collection1) [    x:collection1] o.a.s.c.SolrCore [collection1] Registered new searcher Searcher@7544b8e5[collection1] main{ExitableDirectoryReader(UninvertingDirectoryReader(Uninverting(_0(6.1.0):c1) Uninverting(_1(6.1.0):c1)))}
   [junit4]   2> 733669 INFO  (explicit-fetchindex-cmd) [    x:collection1] o.a.s.c.CachingDirectoryFactory looking to close /export/home/jenkins/workspace/Lucene-Solr-6.x-Solaris/solr/build/solr-core/test/J0/temp/solr.handler.TestReplicationHandler_3DA09A7DE6BD43F2-001/solr-instance-002/./collection1/data/index.20160602054834718 [CachedDir<<refCount=0;path=/export/home/jenkins/workspace/Lucene-Solr-6.x-Solaris/solr/build/solr-core/test/J0/temp/solr.handler.TestReplicationHandler_3DA09A7DE6BD43F2-001/solr-instance-002/./collection1/data/index.20160602054834718;done=true>>]
   [junit4]   2> 733669 INFO  (explicit-fetchindex-cmd) [    x:collection1] o.a.s.c.CachingDirectoryFactory Closing directory, CoreContainer#isShutdown=false
   [junit4]   2> 733669 INFO  (explicit-fetchindex-cmd) [    x:collection1] o.a.s.c.CachingDirectoryFactory Closing directory: /export/home/jenkins/workspace/Lucene-Solr-6.x-Solaris/solr/build/solr-core/test/J0/temp/solr.handler.TestReplicationHandler_3DA09A7DE6BD43F2-001/solr-instance-002/./collection1/data/index.20160602054834718
   [junit4]   2> 733669 INFO  (qtp1296679370-6220) [    x:collection1] o.a.s.c.S.Request [collection1]  webapp=/solr path=/replication params={wait=true&masterUrl=http://127.0.0.1:44762/solr/collection1/replication&command=fetchindex} status=0 QTime=32
   [junit4]   2> 733674 INFO  (qtp1037686742-6201) [    x:collection1] o.a.s.c.S.Request [collection1]  webapp=/solr path=/replication params={slave=false&qt=/replication&wt=javabin&version=2&command=details} status=0 QTime=0
   [junit4]   2> 733675 INFO  (qtp1296679370-6221) [    x:collection1] o.a.s.c.S.Request [collection1]  webapp=/solr path=/replication params={_trace=getDetails&qt=/replication&wt=javabin&version=2&command=details} status=0 QTime=3
   [junit4]   2> 733677 INFO  (qtp1037686742-6202) [    x:collection1] o.a.s.u.p.LogUpdateProcessorFactory [collection1]  webapp=/solr path=/update params={wt=javabin&version=2}{add=[2]} 0 0
   [junit4]   2> 733679 INFO  (qtp1037686742-6198) [    x:collection1] o.a.s.u.DirectUpdateHandler2 start commit{,optimize=false,openSearcher=true,waitSearcher=true,expungeDeletes=false,softCommit=false,prepareCommit=false}
   [junit4]   2> 733681 INFO  (qtp1037686742-6198) [    x:collection1] o.a.s.c.SolrDeletionPolicy SolrDeletionPolicy.onCommit: commits: num=4
   [junit4]   2> 	commit{dir=MockDirectoryWrapper(RAMDirectory@4f047674 lockFactory=org.apache.lucene.store.SingleInstanceLockFactory@7fc473c6),segFN=segments_1,generation=1}
   [junit4]   2> 	commit{dir=MockDirectoryWrapper(RAMDirectory@4f047674 lockFactory=org.apache.lucene.store.SingleInstanceLockFactory@7fc473c6),segFN=segments_2,generation=2}
   [junit4]   2> 	commit{dir=MockDirectoryWrapper(RAMDirectory@4f047674 lockFactory=org.apache.lucene.store.SingleInstanceLockFactory@7fc473c6),segFN=segments_3,generation=3}
   [junit4]   2> 	commit{dir=MockDirectoryWrapper(RAMDirectory@4f047674 lockFactory=org.apache.lucene.store.SingleInstanceLockFactory@7fc473c6),segFN=segments_4,generation=4}
   [junit4]   2> 733681 INFO  (qtp1037686742-6198) [    x:collection1] o.a.s.c.SolrDeletionPolicy newest commit generation = 4
   [junit4]   2> 733681 INFO  (qtp1037686742-6198) [    x:collection1] o.a.s.s.SolrIndexSearcher Opening [Searcher@200c784c[collection1] main]
   [junit4]   2> 733681 INFO  (qtp1037686742-6198) [    x:collection1] o.a.s.u.DirectUpdateHandler2 end_commit_flush
   [junit4]   2> 733681 INFO  (searcherExecutor-3233-thread-1-processing-x:collection1) [    x:collection1] o.a.s.c.SolrCore [collection1] Registered new searcher Searcher@200c784c[collection1] main{ExitableDirectoryReader(UninvertingDirectoryReader(Uninverting(_0(6.1.0):c1) Uninverting(_1(6.1.0):c1) Uninverting(_2(6.1.0):c1)))}
   [junit4]   2> 733681 INFO  (qtp1037686742-6198) [    x:collection1] o.a.s.u.p.LogUpdateProcessorFactory [collection1]  webapp=/solr path=/update params={waitSearcher=true&commit=true&softCommit=false&wt=javabin&version=2}{commit=} 0 2
   [junit4]   2> 733683 WARN  (explicit-fetchindex-cmd) [    x:collection1] o.a.s.h.IndexFetcher 'masterUrl' must be specified without the /replication suffix
   [junit4]   2> 733686 INFO  (qtp1037686742-6198) [    x:collection1] o.a.s.c.S.Request [collection1]  webapp=/solr path=/replication params={qt=/replication&wt=javabin&version=2&command=indexversion} status=0 QTime=0
   [junit4]   2> 733687 INFO  (explicit-fetchindex-cmd) [    x:collection1] o.a.s.h.IndexFetcher Master's generation: 4
   [junit4]   2> 733687 INFO  (explicit-fetchindex-cmd) [    x:collection1] o.a.s.h.IndexFetcher Slave's generation: 3
   [junit4]   2> 733687 INFO  (explicit-fetchindex-cmd) [    x:collection1] o.a.s.h.IndexFetcher Starting replication process
   [junit4]   2> 733689 INFO  (qtp1037686742-6203) [    x:collection1] o.a.s.c.S.Request [collection1]  webapp=/solr path=/replication params={generation=4&qt=/replication&wt=javabin&version=2&command=filelist} status=0 QTime=1
   [junit4]   2> 733690 INFO  (explicit-fetchindex-cmd) [    x:collection1] o.a.s.h.IndexFetcher Number of files in latest index in master: 10
   [junit4]   2> 733690 INFO  (explicit-fetchindex-cmd) [    x:collection1] o.a.s.c.CachingDirectoryFactory return new directory for /export/home/jenkins/workspace/Lucene-Solr-6.x-Solaris/solr/build/solr-core/test/J0/temp/solr.handler.TestReplicationHandler_3DA09A7DE6BD43F2-001/solr-instance-002/./collection1/data/index.20160602054834765
   [junit4]   2> 733690 INFO  (explicit-fetchindex-cmd) [    x:collection1] o.a.s.u.DefaultSolrCoreState Rollback old IndexWriter... core=collection1
   [junit4]   2> 733692 INFO  (explicit-fetchindex-cmd) [    x:collection1] o.a.s.u.RandomMergePolicy RandomMergePolicy wrapping class org.apache.lucene.index.TieredMergePolicy: [TieredMergePolicy: maxMergeAtOnce=24, maxMergeAtOnceExplicit=25, maxMergedSegmentMB=17.283203125, floorSegmentMB=1.4599609375, forceMergeDeletesPctAllowed=7.692666145827718, segmentsPerTier=39.0, maxCFSSegmentSizeMB=8.796093022207999E12, noCFSRatio=0.7939532932276266
   [junit4]   2> 733693 INFO  (explicit-fetchindex-cmd) [    x:collection1] o.a.s.c.SolrDeletionPolicy SolrDeletionPolicy.onInit: commits: num=1
   [junit4]   2> 	commit{dir=MockDirectoryWrapper(RAMDirectory@601bdacc lockFactory=org.apache.lucene.store.SingleInstanceLockFactory@557b223a),segFN=segments_3,generation=3}
   [junit4]   2> 733693 INFO  (explicit-fetchindex-cmd) [    x:collection1] o.a.s.c.SolrDeletionPolicy newest commit generation = 3
   [junit4]   2> 733693 INFO  (explicit-fetchindex-cmd) [    x:collection1] o.a.s.u.DefaultSolrCoreState New IndexWriter is ready to be used.
   [junit4]   2> 733693 INFO  (explicit-fetchindex-cmd) [    x:collection1] o.a.s.c.SolrDeletionPolicy SolrDeletionPolicy.onCommit: commits: num=1
   [junit4]   2> 	commit{dir=MockDirectoryWrapper(RAMDirectory@601bdacc lockFactory=org.apache.lucene.store.SingleInstanceLockFactory@557b223a),segFN=segments_3,generation=3}
   [junit4]   2> 733693 INFO  (explicit-fetchindex-cmd) [    x:collection1] o.a.s.c.SolrDeletionPolicy newest commit generation = 3
   [junit4]   2> 733693 INFO  (explicit-fetchindex-cmd) [    x:collection1] o.a.s.u.DefaultSolrCoreState Rollback old IndexWriter... core=collection1
   [junit4]   2> 733693 INFO  (explicit-fetchindex-cmd) [    x:collection1] o.a.s.h.IndexFetcher Starting download (fullCopy=false) to MockDirectoryWrapper(RAMDirectory@1f2e0af6 lockFactory=org.apache.lucene.store.SingleInstanceLockFactory@447c3c0f)
   [junit4]   2> 733693 INFO  (explicit-fetchindex-cmd) [    x:collection1] o.a.s.h.IndexFetcher Skipping download for _0.cfe because it already exists
   [junit4]   2> 733693 INFO  (explicit-fetchindex-cmd) [    x:collection1] o.a.s.h.IndexFetcher Skipping download for _0.si because it already exists
   [junit4]   2> 733693 INFO  (explicit-fetchindex-cmd) [    x:collection1] o.a.s.h.IndexFetcher Skipping download for _0.cfs because it already exists
   [junit4]   2> 733693 INFO  (explicit-fetchindex-cmd) [    x:collection1] o.a.s.h.IndexFetcher Skipping download for _1.cfs because it already exists
   [junit4]   2> 733693 INFO  (explicit-fetchindex-cmd) [    x:collection1] o.a.s.h.IndexFetcher Skipping download for _1.cfe because it already exists
   [junit4]   2> 733693 INFO  (explicit-fetchindex-cmd) [    x:collection1] o.a.s.h.IndexFetcher Skipping download for _1.si because it already exists
   [junit4]   2> 733695 INFO  (qtp1037686742-6203) [    x:collection1] o.a.s.c.S.Request [collection1]  webapp=/solr path=/replication params={generation=4&qt=/replication&file=_2.si&checksum=true&wt=filestream&command=filecontent} status=0 QTime=0
   [junit4]   2> 733697 INFO  (qtp1037686742-6200) [    x:collection1] o.a.s.c.S.Request [collection1]  webapp=/solr path=/replication params={generation=4&qt=/replication&file=_2.cfe&checksum=true&wt=filestream&command=filecontent} status=0 QTime=0
   [junit4]   2> 733699 INFO  (qtp1037686742-6200) [    x:collection1] o.a.s.c.S.Request [collection1]  webapp=/solr path=/replication params={generation=4&qt=/replication&file=_2.cfs&checksum=true&wt=filestream&command=filecontent} status=0 QTime=0
   [junit4]   2> 733701 INFO  (qtp1037686742-6200) [    x:collection1] o.a.s.c.S.Request [collection1]  webapp=/solr path=/replication params={generation=4&qt=/replication&file=segments_4&checksum=true&wt=filestream&command=filecontent} status=0 QTime=0
   [junit4]   2> 733702 INFO  (explicit-fetchindex-cmd) [    x:collection1] o.a.s.h.IndexFetcher Total time taken for download (fullCopy=false,bytesDownloaded=1810) : 0 secs (null bytes/sec) to MockDirectoryWrapper(RAMDirectory@1f2e0af6 lockFactory=org.apache.lucene.store.SingleInstanceLockFactory@447c3c0f)
   [junit4]   2> 733703 INFO  (explicit-fetchindex-cmd) [    x:collection1] o.a.s.u.RandomMergePolicy RandomMergePolicy wrapping class org.apache.lucene.index.MockRandomMergePolicy: org.apache.lucene.index.MockRandomMergePolicy@6c268db5
   [junit4]   2> 733704 INFO  (explicit-fetchindex-cmd) [    x:collection1] o.a.s.c.SolrDeletionPolicy SolrDeletionPolicy.onInit: commits: num=2
   [junit4]   2> 	commit{dir=MockDirectoryWrapper(RAMDirectory@601bdacc lockFactory=org.apache.lucene.store.SingleInstanceLockFactory@557b223a),segFN=segments_3,generation=3}
   [junit4]   2> 	commit{dir=MockDirectoryWrapper(RAMDirectory@601bdacc lockFactory=org.apache.lucene.store.SingleInstanceLockFactory@557b223a),segFN=segments_4,generation=4}
   [junit4]   2> 733704 INFO  (explicit-fetchindex-cmd) [    x:collection1] o.a.s.c.SolrDeletionPolicy newest commit generation = 4
   [junit4]   2> 733704 INFO  (explicit-fetchindex-cmd) [    x:collection1] o.a.s.u.DefaultSolrCoreState New IndexWriter is ready to be used.
   [junit4]   2> 733705 INFO  (explicit-fetchindex-cmd) [    x:collection1] o.a.s.s.SolrIndexSearcher Opening [Searcher@2ad0a5fe[collection1] main]
   [junit4]   2> 733705 INFO  (searcherExecutor-3243-thread-1-processing-x:collection1) [    x:collection1] o.a.s.c.SolrCore [collection1] Registered new searcher Searcher@2ad0a5fe[collection1] main{ExitableDirectoryReader(UninvertingDirectoryReader(Uninverting(_0(6.1.0):c1) Uninverting(_1(6.1.0):c1) Uninverting(_2(6.1.0):c1)))}
   [junit4]   2> 733705 INFO  (explicit-fetchindex-cmd) [    x:collection1] o.a.s.c.CachingDirectoryFactory looking to close /export/home/jenkins/workspace/Lucene-Solr-6.x-Solaris/solr/build/solr-core/test/J0/temp/solr.handler.TestReplicationHandler_3DA09A7DE6BD43F2-001/solr-instance-002/./collection1/data/index.20160602054834765 [CachedDir<<refCount=0;path=/export/home/jenkins/workspace/Lucene-Solr-6.x-Solaris/solr/build/solr-core/test/J0/temp/solr.handler.TestReplicationHandler_3DA09A7DE6BD43F2-001/solr-instance-002/./collection1/data/index.20160602054834765;done=true>>]
   [junit4]   2> 733706 INFO  (explicit-fetchindex-cmd) [    x:collection1] o.a.s.c.CachingDirectoryFactory Closing directory, CoreContainer#isShutdown=false
   [junit4]   2> 733706 INFO  (explicit-fetchindex-cmd) [    x:collection1] o.a.s.c.CachingDirectoryFactory Closing directory: /export/home/jenkins/workspace/Lucene-Solr-6.x-Solaris/solr/build/solr-core/test/J0/temp/solr.handler.TestReplicationHandler_3DA09A7DE6BD43F2-001/solr-instance-002/./collection1/data/index.20160602054834765
   [junit4]   2> 733706 INFO  (qtp1296679370-6214) [    x:collection1] o.a.s.c.S.Request [collection1]  webapp=/solr path=/replication params={wait=true&masterUrl=http://127.0.0.1:44762/solr/collection1/replication&command=fetchindex} status=0 QTime=23
   [junit4]   2> 733707 INFO  (TEST-TestReplicationHandler.doTestDetails-seed#[3DA09A7DE6BD43F2]) [    ] o.a.s.SolrTestCaseJ4 Writing core.properties file to /export/home/jenkins/workspace/Lucene-Solr-6.x-Solaris/solr/build/solr-core/test/J0/temp/solr.handler.TestReplicationHandler_3DA09A7DE6BD43F2-001/solr-instance-003/collection1
   [junit4]   2> 733721 INFO  (TEST-TestReplicationHandler.doTestDetails-seed#[3DA09A7DE6BD43F2]) [    ] o.e.j.s.Server jetty-9.3.8.v20160314
   [junit4]   2> 733724 INFO  (TEST-TestReplicationHandler.doTestDetails-seed#[3DA09A7DE6BD43F2]) [    ] o.e.j.s.h.ContextHandler Started o.e.j.s.ServletContextHandler@36d71559{/solr,null,AVAILABLE}
   [junit4]   2> 733725 INFO  (TEST-TestReplicationHandler.doTestDetails-seed#[3DA09A7DE6BD43F2]) [    ] o.e.j.s.ServerConnector Started ServerConnector@763797bb{HTTP/1.1,[http/1.1]}{127.0.0.1:53743}
   [junit4]   2> 733725 INFO  (TEST-TestReplicationHandler.doTestDetails-seed#[3DA09A7DE6BD43F2]) [    ] o.e.j.s.Server Started @737406ms
   [junit4]   2> 733725 INFO  (TEST-TestReplicationHandler.doTestDetails-seed#[3DA09A7DE6BD43F2]) [    ] o.a.s.c.s.e.JettySolrRunner Jetty properties: {solr.data.dir=/export/home/jenkins/workspace/Lucene-Solr-6.x-Solaris/solr/build/solr-core/test/J0/temp/solr.handler.TestReplicationHandler_3DA09A7DE6BD43F2-001/solr-instance-003/collection1/data, hostContext=/solr, hostPort=53743}
   [junit4]   2> 733726 INFO  (TEST-TestReplicationHandler.doTestDetails-seed#[3DA09A7DE6BD43F2]) [    ] o.a.s.s.SolrDispatchFilter SolrDispatchFilter.init(): sun.misc.Launcher$AppClassLoader@6d06d69c
   [junit4]   2> 733726 INFO  (TEST-TestReplicationHandler.doTestDetails-seed#[3DA09A7DE6BD43F2]) [    ] o.a.s.c.SolrResourceLoader new SolrResourceLoader for directory: '/export/home/jenkins/workspace/Lucene-Solr-6.x-Solaris/solr/build/solr-core/test/J0/temp/solr.handler.TestReplicationHandler_3DA09A7DE6BD43F2-001/solr-instance-003'
   [junit4]   2> 733726 INFO  (TEST-TestReplicationHandler.doTestDetails-seed#[3DA09A7DE6BD43F2]) [    ] o.a.s.c.SolrResourceLoader JNDI not configured for solr (NoInitialContextEx)
   [junit4]   2> 733726 INFO  (TEST-TestReplicationHandler.doTestDetails-seed#[3DA09A7DE6BD43F2]) [    ] o.a.s.c.SolrResourceLoader solr home defaulted to 'solr/' (could not find system property or JNDI)
   [junit4]   2> 733726 INFO  (TEST-TestReplicationHandler.doTestDetails-seed#[3DA09A7DE6BD43F2]) [    ] o.a.s.c.SolrXmlConfig Loading container configuration from /export/home/jenkins/workspace/Lucene-Solr-6.x-Solaris/solr/build/solr-core/test/J0/temp/solr.handler.TestReplicationHandler_3DA09A7DE6BD43F2-001/solr-instance-003/solr.xml
   [junit4]   2> 733731 INFO  (TEST-TestReplicationHandler.doTestDetails-seed#[3DA09A7DE6BD43F2]) [    ] o.a.s.c.CorePropertiesLocator Config-defined core root directory: /export/home/jenkins/workspace/Lucene-Solr-6.x-Solaris/solr/build/solr-core/test/J0/temp/solr.handler.TestReplicationHandler_3DA09A7DE6BD43F2-001/solr-instance-003/.
   [junit4]   2> 733731 INFO  (TEST-TestReplicationHandler.doTestDetails-seed#[3DA09A7DE6BD43F2]) [    ] o.a.s.c.CoreContainer New CoreContainer 866063840
   [junit4]   2> 733731 INFO  (TEST-TestReplicationHandler.doTestDetails-seed#[3DA09A7DE6BD43F2]) [    ] o.a.s.c.CoreContainer Loading cores into CoreContainer [instanceDir=/export/home/jenkins/workspace/Lucene-Solr-6.x-Solaris/solr/build/solr-core/test/J0/temp/solr.handler.TestReplicationHandler_3DA09A7DE6BD43F2-001/solr-instance-003]
   [junit4]   2> 733732 WARN  (TEST-TestReplicationHandler.doTestDetails-seed#[3DA09A7DE6BD43F2]) [    ] o.a.s.c.CoreContainer Couldn't add files from /export/home/jenkins/workspace/Lucene-Solr-6.x-Solaris/solr/build/solr-core/test/J0/temp/solr.handler.TestReplicationHandler_3DA09A7DE6BD43F2-001/solr-instance-003/lib to classpath: /export/home/jenkins/workspace/Lucene-Solr-6.x-Solaris/solr/build/solr-core/test/J0/temp/solr.handler.TestReplicationHandler_3DA09A7DE6BD43F2-001/solr-instance-003/lib
   [junit4]   2> 733732 INFO  (TEST-TestReplicationHandler.doTestDetails-seed#[3DA09A7DE6BD43F2]) [    ] o.a.s.h.c.HttpShardHandlerFactory created with socketTimeout : 90000,urlScheme : ,connTimeout : 15000,maxConnectionsPerHost : 20,maxConnections : 10000,corePoolSize : 0,maximumPoolSize : 2147483647,maxThreadIdleTime : 5,sizeOfQueue : -1,fairnessPolicy : false,useRetries : false,
   [junit4]   2> 733733 INFO  (TEST-TestReplicationHandler.doTestDetails-seed#[3DA09A7DE6BD43F2]) [    ] o.a.s.u.UpdateShardHandler Creating UpdateShardHandler HTTP client with params: socketTimeout=340000&connTimeout=45000&retry=true
   [junit4]   2> 733733 INFO  (TEST-TestReplicationHandler.doTestDetails-seed#[3DA09A7DE6BD43F2]) [    ] o.a.s.l.LogWatcher SLF4J impl is org.slf4j.impl.Log4jLoggerFactory
   [junit4]   2> 733733 INFO  (TEST-TestReplicationHandler.doTestDetails-seed#[3DA09A7DE6BD43F2]) [    ] o.a.s.l.LogWatcher Registering Log Listener [Log4j (org.slf4j.impl.Log4jLoggerFactory)]
   [junit4]   2> 733733 INFO  (TEST-TestReplicationHandler.doTestDetails-seed#[3DA09A7DE6BD43F2]) [    ] o.a.s.c.CoreContainer Security conf doesn't exist. Skipping setup for authorization module.
   [junit4]   2> 733733 INFO  (TEST-TestReplicationHandler.doTestDetails-seed#[3DA09A7DE6BD43F2]) [    ] o.a.s.c.CoreContainer No authentication plugin used.
   [junit4]   2> 733734 INFO  (TEST-TestReplicationHandler.doTestDetails-seed#[3DA09A7DE6BD43F2]) [    ] o.a.s.c.CorePropertiesLocator Looking for core definitions underneath /export/home/jenkins/workspace/Lucene-Solr-6.x-Solaris/solr/build/solr-core/test/J0/temp/solr.handler.TestReplicationHandler_3DA09A7DE6BD43F2-001/solr-instance-003/.
   [junit4]   2> 733735 INFO  (TEST-TestReplicationHandler.doTestDetails-seed#[3DA09A7DE6BD43F2]) [    ] o.a.s.c.CoreDescriptor Created CoreDescriptor: {name=collection1, config=solrconfig.xml, loadOnStartup=true, schema=schema.xml, configSetProperties=configsetprops.json, transient=false, dataDir=data/}
   [junit4]   2> 733735 INFO  (TEST-TestReplicationHandler.doTestDetails-seed#[3DA09A7DE6BD43F2]) [    ] o.a.s.c.CorePropertiesLocator Found core collection1 in /export/home/jenkins/workspace/Lucene-Solr-6.x-Solaris/solr/build/solr-core/test/J0/temp/solr.handler.TestReplicationHandler_3DA09A7DE6BD43F2-001/solr-instance-003/./collection1
   [junit4]   2> 733735 INFO  (TEST-TestReplicationHandler.doTestDetails-seed#[3DA09A7DE6BD43F2]) [    ] o.a.s.c.CorePropertiesLocator Found 1 core definitions
   [junit4]   2> 733736 INFO  (coreLoadExecutor-3256-thread-1) [    ] o.a.s.c.SolrResourceLoader new SolrResourceLoader for directory: '/export/home/jenkins/workspace/Lucene-Solr-6.x-Solaris/solr/build/solr-core/test/J0/temp/solr.handler.TestReplicationHandler_3DA09A7DE6BD43F2-001/solr-instance-003/collection1'
   [junit4]   2> 733738 INFO  (TEST-TestReplicationHandler.doTestDetails-seed#[3DA09A7DE6BD43F2]) [    ] o.a.s.s.SolrDispatchFilter user.dir=/export/home/jenkins/workspace/Lucene-Solr-6.x-Solaris/solr/build/solr-core/test/J0
   [junit4]   2> 733738 INFO  (coreLoadExecutor-3256-thread-1) [    ] o.a.s.c.SolrResourceLoader JNDI not configured for solr (NoInitialContextEx)
   [junit4]   2> 733738 INFO  (TEST-TestReplicationHandler.doTestDetails-seed#[3DA09A7DE6BD43F2]) [    ] o.a.s.s.SolrDispatchFilter SolrDispatchFilter.init() done
   [junit4]   2> 733738 INFO  (coreLoadExecutor-3256-thread-1) [    ] o.a.s.c.SolrResourceLoader solr home defaulted to 'solr/' (could not find system property or JNDI)
   [junit4]   2> 733745 INFO  (coreLoadExecutor-3256-thread-1) [    ] o.a.s.c.SolrConfig current version of requestparams : -1
   [junit4]   2> 733747 WARN  (coreLoadExecutor-3256-thread-1) [    ] o.a.s.c.Config Beginning with Solr 5.5, <mergePolicy> is deprecated, use <mergePolicyFactory> instead.
   [junit4]   2> 733748 INFO  (coreLoadExecutor-3256-thread-1) [    ] o.a.s.c.SolrConfig Using Lucene MatchVersion: 6.1.0
   [junit4]   2> 733756 INFO  (coreLoadExecutor-3256-thread-1) [    ] o.a.s.c.SolrConfig Loaded SolrConfig: solrconfig.xml
   [junit4]   2> 733759 INFO  (coreLoadExecutor-3256-thread-1) [    ] o.a.s.s.IndexSchema [collection1] Schema name=test
   [junit4]   2> 733779 INFO  (coreLoadExecutor-3256-thread-1) [    ] o.a.s.s.IndexSchema unique key field: id
   [junit4]   2> 733781 INFO  (coreLoadExecutor-3256-thread-1) [    ] o.a.s.c.ConfigSetProperties Did not find ConfigSet properties, assuming default properties: Can't find resource 'configsetprops.json' in classpath or '/export/home/jenkins/workspace/Lucene-Solr-6.x-Solaris/solr/build/solr-core/test/J0/temp/solr.handler.TestReplicationHandler_3DA09A7DE6BD43F2-001/solr-instance-003/collection1'
   [junit4]   2> 733781 INFO  (coreLoadExecutor-3256-thread-1) [    ] o.a.s.c.CoreContainer Creating SolrCore 'collection1' using configuration from instancedir /export/home/jenkins/workspace/Lucene-Solr-6.x-Solaris/solr/build/solr-core/test/J0/temp/solr.handler.TestReplicationHandler_3DA09A7DE6BD43F2-001/solr-instance-003/./collection1
   [junit4]   2> 733781 INFO  (coreLoadExecutor-3256-thread-1) [    x:collection1] o.a.s.c.SolrCore org.apache.solr.core.MockDirectoryFactory
   [junit4]   2> 733781 INFO  (coreLoadExecutor-3256-thread-1) [    x:collection1] o.a.s.c.SolrCore [[collection1] ] Opening new SolrCore at [/export/home/jenkins/workspace/Lucene-Solr-6.x-Solaris/solr/build/solr-core/test/J0/temp/solr.handler.TestReplicationHandler_3DA09A7DE6BD43F2-001/solr-instance-003/collection1], dataDir=[/export/home/jenkins/workspace/Lucene-Solr-6.x-Solaris/solr/build/solr-core/test/J0/temp/solr.handler.TestReplicationHandler_3DA09A7DE6BD43F2-001/solr-instance-003/./collection1/data/]
   [junit4]   2> 733781 INFO  (coreLoadExecutor-3256-thread-1) [    x:collection1] o.a.s.c.SolrCore JMX monitoring not detected for core: collection1
   [junit4]   2> 733781 INFO  (coreLoadExecutor-3256-thread-1) [    x:collection1] o.a.s.c.CachingDirectoryFactory return new directory for /export/home/jenkins/workspace/Lucene-Solr-6.x-Solaris/solr/build/solr-core/test/J0/temp/solr.handler.TestReplicationHandler_3DA09A7DE6BD43F2-001/solr-instance-003/./collection1/data
   [junit4]   2> 733782 INFO  (coreLoadExecutor-3256-thread-1) [    x:collection1] o.a.s.c.SolrCore New index directory detected: old=null new=/export/home/jenkins/workspace/Lucene-Solr-6.x-Solaris/solr/build/solr-core/test/J0/temp/solr.handler.TestReplicationHandler_3DA09A7DE6BD43F2-001/solr-instance-003/./collection1/data/index/
   [junit4]   2> 733782 WARN  (coreLoadExecutor-3256-thread-1) [    x:collection1] o.a.s.c.SolrCore [collection1] Solr index directory '/export/home/jenkins/workspace/Lucene-Solr-6.x-Solaris/solr/build/solr-core/test/J0/temp/solr.handler.TestReplicationHandler_3DA09A7DE6BD43F2-001/solr-instance-003/./collection1/data/index' doesn't exist. Creating new index...
   [junit4]   2> 733782 INFO  (coreLoadExecutor-3256-thread-1) [    x:collection1] o.a.s.c.CachingDirectoryFactory return new directory for /export/home/jenkins/workspace/Lucene-Solr-6.x-Solaris/solr/build/solr-core/test/J0/temp/solr.handler.TestReplicationHandler_3DA09A7DE6BD43F2-001/solr-instance-003/./collection1/data/index
   [junit4]   2> 733782 INFO  (coreLoadExecutor-3256-thread-1) [    x:collection1] o.a.s.u.RandomMergePolicy RandomMergePolicy wrapping class org.apache.lucene.index.TieredMergePolicy: [TieredMergePolicy: maxMergeAtOnce=17, maxMergeAtOnceExplicit=35, maxMergedSegmentMB=25.6416015625, floorSegmentMB=2.0205078125, forceMergeDeletesPctAllowed=29.65117463504148, segmentsPerTier=36.0, maxCFSSegmentSizeMB=0.7705078125, noCFSRatio=1.0
   [junit4]   2> 733782 INFO  (coreLoadExecutor-3256-thread-1) [    x:collection1] o.a.s.c.SolrDeletionPolicy SolrDeletionPolicy.onCommit: commits: num=1
   [junit4]   2> 	commit{dir=MockDirectoryWrapper(RAMDirectory@55a5e25e lockFactory=org.apache.lucene.store.SingleInstanceLockFactory@1efefd73),segFN=segments_1,generation=1}
   [junit4]   2> 733782 INFO  (coreLoadExecutor-3256-thread-1) [    x:collection1] o.a.s.c.SolrDeletionPolicy newest commit generation = 1
   [junit4]   2> 733783 INFO  (OldIndexDirectoryCleanupThreadForCore-collection1) [    x:collection1] o.a.s.c.SolrCore Looking for old index directories to cleanup for core collection1 in /export/home/jenkins/workspace/Lucene-Solr-6.x-Solaris/solr/build/solr-core/test/J0/temp/solr.handler.TestReplicationHandler_3DA09A7DE6BD43F2-001/solr-instance-003/./collection1/data/
   [junit4]   2> 733784 INFO  (coreLoadExecutor-3256-thread-1) [    x:collection1] o.a.s.c.SolrCore no updateRequestProcessorChain defined as default, creating implicit default
   [junit4]   2> 733786 INFO  (coreLoadExecutor-3256-thread-1) [    x:collection1] o.a.s.h.l.XMLLoader xsltCacheLifetimeSeconds=60
   [junit4]   2> 733786 INFO  (coreLoadExecutor-3256-thread-1) [    x:collection1] o.a.s.h.l.XMLLoader xsltCacheLifetimeSeconds=60
   [junit4]   2> 733787 INFO  (coreLoadExecutor-3256-thread-1) [    x:collection1] o.a.s.h.l.XMLLoader xsltCacheLifetimeSeconds=60
   [junit4]   2> 733788 INFO  (coreLoadExecutor-3256-thread-1) [    x:collection1] o.a.s.h.l.XMLLoader xsltCacheLifetimeSeconds=60
   [junit4]   2> 733789 INFO  (coreLoadExecutor-3256-thread-1) [    x:collection1] o.a.s.c.PluginBag requestHandler : 'lazy' created with startup=lazy 
   [junit4]   2> 733789 INFO  (coreLoadExecutor-3256-thread-1) [    x:collection1] o.a.s.c.RequestHandlers Registered paths: /admin/mbeans,standard,lazy,/update/json/docs,/admin/luke,/export,/get,/admin/properties,/update/json,/admin/threads,/update/csv,/sql,/graph,/admin/segments,/admin/system,/replication,defaults,/config,/stream,/schema,/admin/plugins,/admin/logging,/admin/ping,/update,/admin/file
   [junit4]   2> 733789 INFO  (coreLoadExecutor-3256-thread-1) [    x:collection1] o.a.s.c.SolrCore Using default statsCache cache: org.apache.solr.search.stats.LocalStatsCache
   [junit4]   2> 733790 INFO  (coreLoadExecutor-3256-thread-1) [    x:collection1] o.a.s.u.CommitTracker Hard AutoCommit: disabled
   [junit4]   2> 733790 INFO  (coreLoadExecutor-3256-thread-1) [    x:collection1] o.a.s.u.CommitTracker Soft AutoCommit: disabled
   [junit4]   2> 733790 INFO  (coreLoadExecutor-3256-thread-1) [    x:collection1] o.a.s.u.RandomMergePolicy RandomMergePolicy wrapping class org.apache.lucene.index.TieredMergePolicy: [TieredMergePolicy: maxMergeAtOnce=16, maxMergeAtOnceExplicit=16, maxMergedSegmentMB=38.7158203125, floorSegmentMB=1.98828125, forceMergeDeletesPctAllowed=1.806029557904958, segmentsPerTier=46.0, maxCFSSegmentSizeMB=8.796093022207999E12, noCFSRatio=1.0
   [junit4]   2> 733790 INFO  (coreLoadExecutor-3256-thread-1) [    x:collection1] o.a.s.c.SolrDeletionPolicy SolrDeletionPolicy.onInit: commits: num=1
   [junit4]   2> 	commit{dir=MockDirectoryWrapper(RAMDirectory@55a5e25e lockFactory=org.apache.lucene.store.SingleInstanceLockFactory@1efefd73),segFN=segments_1,generation=1}
   [junit4]   2> 733790 INFO  (coreLoadExecutor-3256-thread-1) [    x:collection1] o.a.s.c.SolrDeletionPolicy newest commit generation = 1
   [junit4]   2> 733790 INFO  (coreLoadExecutor-3256-thread-1) [    x:collection1] o.a.s.s.SolrIndexSearcher Opening [Searcher@5773a897[collection1] main]
   [junit4]   2> 733790 INFO  (coreLoadExecutor-3256-thread-1) [    x:collection1] o.a.s.r.ManagedResourceStorage File-based storage initialized to use dir: /export/home/jenkins/workspace/Lucene-Solr-6.x-Solaris/solr/build/solr-core/test/J0/temp/solr.handler.TestReplicationHandler_3DA09A7DE6BD43F2-001/solr-instance-003/collection1/conf
   [junit4]   2> 733790 INFO  (coreLoadExecutor-3256-thread-1) [    x:collection1] o.a.s.r.RestManager Initializing RestManager with initArgs: {storageDir=/export/home/jenkins/workspace/Lucene-Solr-6.x-Solaris/solr/build/solr-core/test/J0/temp/solr.handler.TestReplicationHandler_3DA09A7DE6BD43F2-001/solr-instance-003/collection1/conf}
   [junit4]   2> 733790 INFO  (coreLoadExecutor-3256-thread-1) [    x:collection1] o.a.s.r.ManagedResourceStorage Reading _rest_managed.json using file:dir=/export/home/jenkins/workspace/Lucene-Solr-6.x-Solaris/solr/build/solr-core/test/J0/temp/solr.handler.TestReplicationHandler_3DA09A7DE6BD43F2-001/solr-instance-003/collection1/conf
   [junit4]   2> 733791 INFO  (coreLoadExecutor-3256-thread-1) [    x:collection1] o.a.s.r.RestManager Initializing 0 registered ManagedResources
   [junit4]   2> 733791 WARN  (coreLoadExecutor-3256-thread-1) [    x:collection1] o.a.s.h.IndexFetcher 'masterUrl' must be specified without the /replication suffix
   [junit4]   2> 733791 INFO  (coreLoadExecutor-3256-thread-1) [    x:collection1] o.a.s.h.ReplicationHandler  No value set for 'pollInterval'. Timer Task not started.
   [junit4]   2> 733791 INFO  (coreLoadExecutor-3256-thread-1) [    x:collection1] o.a.s.h.ReplicationHandler Replication enabled for following config files: schema.xml
   [junit4]   2> 733791 INFO  (coreLoadExecutor-3256-thread-1) [    x:collection1] o.a.s.h.ReplicationHandler Commits will be reserved for  10000
   [junit4]   2> 733792 INFO  (searcherExecutor-3257-thread-1-processing-x:collection1) [    x:collection1] o.a.s.c.SolrCore [collection1] Registered new searcher Searcher@5773a897[collection1] main{ExitableDirectoryReader(UninvertingDirectoryReader())}
   [junit4]   2> 733792 INFO  (coreLoadExecutor-3256-thread-1) [    x:collection1] o.a.s.c.CoreContainer registering core: collection1
   [junit4]   2> 734246 WARN  (qtp1133837083-6243) [    x:collection1] o.a.s.h.ReplicationHandler Exception while invoking 'details' method for replication on master 
   [junit4]   2> org.apache.solr.client.solrj.impl.HttpSolrClient$RemoteSolrException: Error from server at http://127.0.0.1:44762/solr: Expected mime type application/octet-stream but got text/html. <html>
   [junit4]   2> <head>
   [junit4]   2> <meta http-equiv="Content-Type" content="text/html;charset=ISO-8859-1"/>
   [junit4]   2> <title>Error 404 </title>
   [junit4]   2> </head>
   [junit4]   2> <body>
   [junit4]   2> <h2>HTTP ERROR: 404</h2>
   [junit4]   2> <p>Problem accessing /solr/replication. Reason:
   [junit4]   2> <pre>    Can not find: /solr/replication</pre></p>
   [junit4]   2> <hr /><a href="http://eclipse.org/jetty">Powered by Jetty:// 9.3.8.v20160314</a><hr/>
   [junit4]   2> </body>
   [junit4]   2> </html>
   [junit4]   2> 
   [junit4]   2> 	at org.apache.solr.client.solrj.impl.HttpSolrClient.executeMethod(HttpSolrClient.java:558)
   [junit4]   2> 	at org.apache.solr.client.solrj.impl.HttpSolrClient.request(HttpSolrClient.java:259)
   [junit4]   2> 	at org.apache.solr.client.solrj.impl.HttpSolrClient.request(HttpSolrClient.java:248)
   [junit4]   2> 	at org.apache.solr.client.solrj.SolrClient.request(SolrClient.java:1219)
   [junit4]   2> 	at org.apache.solr.handler.IndexFetcher.getDetails(IndexFetcher.java:1710)
   [junit4]   2> 	at org.apache.solr.handler.ReplicationHandler.getReplicationDetails(ReplicationHandler.java:873)
   [junit4]   2> 	at org.apache.solr.handler.ReplicationHandler.handleRequestBody(ReplicationHandler.java:313)
   [junit4]   2> 	at org.apache.solr.handler.RequestHandlerBase.handleRequest(RequestHandlerBase.java:156)
   [junit4]   2> 	at org.apache.solr.core.SolrCore.execute(SolrCore.java:2036)
   [junit4]   2> 	at org.apache.solr.servlet.HttpSolrCall.execute(HttpSolrCall.java:657)
   [junit4]   2> 	at org.apache.solr.servlet.HttpSolrCall.call(HttpSolrCall.java:464)
   [junit4]   2> 	at org.apache.solr.servlet.SolrDispatchFilter.doFilter(SolrDispatchFilter.java:257)
   [junit4]   2> 	at org.apache.solr.servlet.SolrDispatchFilter.doFilter(SolrDispatchFilter.java:208)
   [junit4]   2> 	at org.eclipse.jetty.servlet.ServletHandler$CachedChain.doFilter(ServletHandler.java:1676)
   [junit4]   2> 	at org.apache.solr.client.solrj.embedded.JettySolrRunner$DebugFilter.doFilter(JettySolrRunner.java:109)
   [junit4]   2> 	at org.eclipse.jetty.servlet.ServletHandler$CachedChain.doFilter(ServletHandler.java:1676)
   [junit4]   2> 	at org.eclipse.jetty.servlet.ServletHandler.doHandle(ServletHandler.java:581)
   [junit4]   2> 	at org.eclipse.jetty.server.session.SessionHandler.doHandle(SessionHandler.java:224)
   [junit4]   2> 	at org.eclipse.jetty.server.handler.ContextHandler.doHandle(ContextHandler.java:1160)
   [junit4]   2> 	at org.eclipse.jetty.servlet.ServletHandler.doScope(ServletHandler.java:511)
   [junit4]   2> 	at org.eclipse.jetty.server.session.SessionHandler.doScope(SessionHandler.java:185)
   [junit4]   2> 	at org.eclipse.jetty.server.handler.ContextHandler.doScope(ContextHandler.java:1092)
   [junit4]   2>

[...truncated too long message...]

ctory: /export/home/jenkins/workspace/Lucene-Solr-6.x-Solaris/solr/build/solr-core/test/J0/temp/solr.handler.TestReplicationHandler_3DA09A7DE6BD43F2-001/solr-instance-029/collection1/data
   [junit4]   2> 830191 INFO  (TEST-TestReplicationHandler.doTestStressReplication-seed#[3DA09A7DE6BD43F2]) [    ] o.e.j.s.h.ContextHandler Stopped o.e.j.s.ServletContextHandler@745e4559{/solr,null,UNAVAILABLE}
   [junit4]   2> 830195 INFO  (TEST-TestReplicationHandler.doTestStressReplication-seed#[3DA09A7DE6BD43F2]) [    ] o.e.j.s.ServerConnector Stopped ServerConnector@69062ac2{HTTP/1.1,[http/1.1]}{127.0.0.1:0}
   [junit4]   2> 830195 INFO  (TEST-TestReplicationHandler.doTestStressReplication-seed#[3DA09A7DE6BD43F2]) [    ] o.a.s.c.CoreContainer Shutting down CoreContainer instance=1992682621
   [junit4]   2> 830228 INFO  (coreCloseExecutor-3884-thread-1) [    x:collection1] o.a.s.c.SolrCore [collection1]  CLOSING SolrCore org.apache.solr.core.SolrCore@5cdb3fc2
   [junit4]   2> 830228 INFO  (coreCloseExecutor-3884-thread-1) [    x:collection1] o.a.s.u.DirectUpdateHandler2 closing DirectUpdateHandler2{commits=2,autocommits=0,soft autocommits=0,optimizes=0,rollbacks=0,expungeDeletes=0,docsPending=0,adds=0,deletesById=0,deletesByQuery=0,errors=0,cumulative_adds=6,cumulative_deletesById=0,cumulative_deletesByQuery=0,cumulative_errors=0}
   [junit4]   2> 830228 INFO  (coreCloseExecutor-3884-thread-1) [    x:collection1] o.a.s.u.SolrCoreState Closing SolrCoreState
   [junit4]   2> 830228 INFO  (coreCloseExecutor-3884-thread-1) [    x:collection1] o.a.s.u.DefaultSolrCoreState SolrCoreState ref count has reached 0 - closing IndexWriter
   [junit4]   2> 830228 INFO  (coreCloseExecutor-3884-thread-1) [    x:collection1] o.a.s.u.DefaultSolrCoreState closing IndexWriter with IndexWriterCloser
   [junit4]   2> 830229 INFO  (coreCloseExecutor-3884-thread-1) [    x:collection1] o.a.s.c.SolrCore [collection1] Closing main searcher on request.
   [junit4]   2> 830229 INFO  (coreCloseExecutor-3884-thread-1) [    x:collection1] o.a.s.c.CachingDirectoryFactory Closing NRTCachingDirectoryFactory - 2 directories currently being tracked
   [junit4]   2> 830229 INFO  (coreCloseExecutor-3884-thread-1) [    x:collection1] o.a.s.c.CachingDirectoryFactory looking to close /export/home/jenkins/workspace/Lucene-Solr-6.x-Solaris/solr/build/solr-core/test/J0/temp/solr.handler.TestReplicationHandler_3DA09A7DE6BD43F2-001/solr-instance-030/collection1/data/index.20160602055011008 [CachedDir<<refCount=0;path=/export/home/jenkins/workspace/Lucene-Solr-6.x-Solaris/solr/build/solr-core/test/J0/temp/solr.handler.TestReplicationHandler_3DA09A7DE6BD43F2-001/solr-instance-030/collection1/data/index.20160602055011008;done=false>>]
   [junit4]   2> 830229 INFO  (coreCloseExecutor-3884-thread-1) [    x:collection1] o.a.s.c.CachingDirectoryFactory Closing directory, CoreContainer#isShutdown=true
   [junit4]   2> 830229 INFO  (coreCloseExecutor-3884-thread-1) [    x:collection1] o.a.s.c.CachingDirectoryFactory Closing directory: /export/home/jenkins/workspace/Lucene-Solr-6.x-Solaris/solr/build/solr-core/test/J0/temp/solr.handler.TestReplicationHandler_3DA09A7DE6BD43F2-001/solr-instance-030/collection1/data/index.20160602055011008
   [junit4]   2> 830229 INFO  (coreCloseExecutor-3884-thread-1) [    x:collection1] o.a.s.c.CachingDirectoryFactory looking to close /export/home/jenkins/workspace/Lucene-Solr-6.x-Solaris/solr/build/solr-core/test/J0/temp/solr.handler.TestReplicationHandler_3DA09A7DE6BD43F2-001/solr-instance-030/collection1/data [CachedDir<<refCount=0;path=/export/home/jenkins/workspace/Lucene-Solr-6.x-Solaris/solr/build/solr-core/test/J0/temp/solr.handler.TestReplicationHandler_3DA09A7DE6BD43F2-001/solr-instance-030/collection1/data;done=false>>]
   [junit4]   2> 830229 INFO  (coreCloseExecutor-3884-thread-1) [    x:collection1] o.a.s.c.CachingDirectoryFactory Closing directory, CoreContainer#isShutdown=true
   [junit4]   2> 830229 INFO  (coreCloseExecutor-3884-thread-1) [    x:collection1] o.a.s.c.CachingDirectoryFactory Closing directory: /export/home/jenkins/workspace/Lucene-Solr-6.x-Solaris/solr/build/solr-core/test/J0/temp/solr.handler.TestReplicationHandler_3DA09A7DE6BD43F2-001/solr-instance-030/collection1/data
   [junit4]   2> 830230 INFO  (TEST-TestReplicationHandler.doTestStressReplication-seed#[3DA09A7DE6BD43F2]) [    ] o.e.j.s.h.ContextHandler Stopped o.e.j.s.ServletContextHandler@11d69256{/solr,null,UNAVAILABLE}
   [junit4]   2> 830232 INFO  (SUITE-TestReplicationHandler-seed#[3DA09A7DE6BD43F2]-worker) [    ] o.a.s.SolrTestCaseJ4 ###deleteCore
   [junit4]   2> ObjectTracker found 1 object(s) that were not released!!! [NRTCachingDirectory]
   [junit4]   2> org.apache.solr.common.util.ObjectReleaseTracker$ObjectTrackerException
   [junit4]   2> 	at org.apache.solr.common.util.ObjectReleaseTracker.track(ObjectReleaseTracker.java:42)
   [junit4]   2> 	at org.apache.solr.core.CachingDirectoryFactory.get(CachingDirectoryFactory.java:347)
   [junit4]   2> 	at org.apache.solr.handler.IndexFetcher.fetchLatestIndex(IndexFetcher.java:367)
   [junit4]   2> 	at org.apache.solr.handler.IndexFetcher.fetchLatestIndex(IndexFetcher.java:251)
   [junit4]   2> 	at org.apache.solr.handler.ReplicationHandler.doFetch(ReplicationHandler.java:388)
   [junit4]   2> 	at org.apache.solr.handler.ReplicationHandler$1.run(ReplicationHandler.java:276)
   [junit4]   2> 
   [junit4]   2> NOTE: test params are: codec=Asserting(Lucene60): {name=FST50, id=FST50, newname=FST50}, docValues:{}, maxPointsInLeafNode=368, maxMBSortInHeap=5.769266614582772, sim=RandomSimilarity(queryNorm=false,coord=yes): {}, locale=ga-IE, timezone=Asia/Kabul
   [junit4]   2> NOTE: SunOS 5.11 amd64/Oracle Corporation 1.8.0_92 (64-bit)/cpus=3,threads=1,free=81695744,total=223125504
   [junit4]   2> NOTE: All tests run in this JVM: [TestEmbeddedSolrServerConstructors, SOLR749Test, RollingRestartTest, TestCoreContainer, HLLSerializationTest, TestRestManager, ConjunctionSolrSpellCheckerTest, SimpleFacetsTest, DistributedFacetPivotLargeTest, HardAutoCommitTest, TestQuerySenderNoQuery, CloudMLTQParserTest, SaslZkACLProviderTest, TestManagedSchema, BlockCacheTest, TermsComponentTest, XsltUpdateRequestHandlerTest, HdfsRecoveryZkTest, TestTrieFacet, TestJsonFacets, TestInitQParser, TestSolr4Spatial2, ZkControllerTest, DocValuesTest, CloneFieldUpdateProcessorFactoryTest, AsyncMigrateRouteKeyTest, TestFieldCacheSortRandom, PathHierarchyTokenizerFactoryTest, SpatialFilterTest, MergeStrategyTest, AnalysisAfterCoreReloadTest, TestLFUCache, SparseHLLTest, TestUseDocValuesAsStored2, PreAnalyzedFieldTest, SimplePostToolTest, TestCursorMarkWithoutUniqueKey, TestNonDefinedSimilarityFactory, SyncSliceTest, TestSolrConfigHandlerCloud, TestTolerantUpdateProcessorCloud, TestSolrQueryResponse, CollectionStateFormat2Test, TestClusterStateMutator, IndexSchemaTest, RegexBoostProcessorTest, PeerSyncTest, TestGroupingSearch, TestPKIAuthenticationPlugin, TestRandomCollapseQParserPlugin, TestCloudInspectUtil, TestSolrXml, DistribCursorPagingTest, TestRawResponseWriter, TestCodecSupport, TestSurroundQueryParser, BJQParserTest, SuggesterFSTTest, JsonLoaderTest, TestExtendedDismaxParser, JavabinLoaderTest, TestAnalyzedSuggestions, TestManagedSynonymFilterFactory, RecoveryZkTest, CdcrReplicationDistributedZkTest, CoreMergeIndexesAdminHandlerTest, IgnoreCommitOptimizeUpdateProcessorFactoryTest, GraphQueryTest, TestHighlightDedupGrouping, DistributedQueryComponentOptimizationTest, PKIAuthenticationIntegrationTest, PingRequestHandlerTest, SortSpecParsingTest, TestRebalanceLeaders, TestPerFieldSimilarityWithDefaultOverride, TestIBSimilarityFactory, FacetPivotSmallTest, UUIDFieldTest, TestFunctionQuery, OverseerStatusTest, TestArbitraryIndexDir, DocValuesMissingTest, HdfsTlogReplayBufferedWhileIndexingTest, TestMissingGroups, SecurityConfHandlerTest, SchemaVersionSpecificBehaviorTest, TestReplicationHandler]
   [junit4]   2> NOTE: reproduce with: ant test  -Dtestcase=TestReplicationHandler -Dtests.seed=3DA09A7DE6BD43F2 -Dtests.slow=true -Dtests.locale=ga-IE -Dtests.timezone=Asia/Kabul -Dtests.asserts=true -Dtests.file.encoding=ISO-8859-1
   [junit4] ERROR   0.00s J0 | TestReplicationHandler (suite) <<<
   [junit4]    > Throwable #1: java.lang.AssertionError: ObjectTracker found 1 object(s) that were not released!!! [NRTCachingDirectory]
   [junit4]    > 	at __randomizedtesting.SeedInfo.seed([3DA09A7DE6BD43F2]:0)
   [junit4]    > 	at org.apache.solr.SolrTestCaseJ4.afterClass(SolrTestCaseJ4.java:256)
   [junit4]    > 	at java.lang.Thread.run(Thread.java:745)
   [junit4] Completed [134/612 (1!)] on J0 in 97.80s, 15 tests, 1 failure, 1 skipped <<< FAILURES!

[...truncated 1546 lines...]
BUILD FAILED
/export/home/jenkins/workspace/Lucene-Solr-6.x-Solaris/build.xml:740: The following error occurred while executing this line:
/export/home/jenkins/workspace/Lucene-Solr-6.x-Solaris/build.xml:684: The following error occurred while executing this line:
/export/home/jenkins/workspace/Lucene-Solr-6.x-Solaris/build.xml:59: The following error occurred while executing this line:
/export/home/jenkins/workspace/Lucene-Solr-6.x-Solaris/solr/build.xml:233: The following error occurred while executing this line:
/export/home/jenkins/workspace/Lucene-Solr-6.x-Solaris/solr/common-build.xml:531: The following error occurred while executing this line:
/export/home/jenkins/workspace/Lucene-Solr-6.x-Solaris/lucene/common-build.xml:1427: The following error occurred while executing this line:
/export/home/jenkins/workspace/Lucene-Solr-6.x-Solaris/lucene/common-build.xml:984: There were test failures: 612 suites (10 ignored), 2564 tests, 1 suite-level error, 87 ignored (72 assumptions) [seed: 3DA09A7DE6BD43F2]

Total time: 86 minutes 11 seconds
Build step 'Invoke Ant' marked build as failure
Archiving artifacts
[WARNINGS] Skipping publisher since build result is FAILURE
Recording test results
Email was triggered for: Failure - Any
Sending email for trigger: Failure - Any



Mime
View raw message