lucene-dev mailing list archives

Site index · List index
Message view « Date » · « Thread »
Top « Date » · « Thread »
From Policeman Jenkins Server <jenk...@thetaphi.de>
Subject [JENKINS-EA] Lucene-Solr-master-Linux (64bit/jdk-9-ea+120) - Build # 16889 - Still Failing!
Date Wed, 01 Jun 2016 12:08:28 GMT
Build: http://jenkins.thetaphi.de/job/Lucene-Solr-master-Linux/16889/
Java: 64bit/jdk-9-ea+120 -XX:-UseCompressedOops -XX:+UseG1GC

1 tests failed.
FAILED:  org.apache.solr.util.SolrPluginUtilsTest.testInvokeSetters

Error Message:
argument type mismatch

Stack Trace:
java.lang.IllegalArgumentException: argument type mismatch
	at __randomizedtesting.SeedInfo.seed([729B9C1F23267150:1B84371FD61013FB]:0)
	at jdk.internal.reflect.NativeMethodAccessorImpl.invoke0(java.base@9-ea/Native Method)
	at jdk.internal.reflect.NativeMethodAccessorImpl.invoke(java.base@9-ea/NativeMethodAccessorImpl.java:62)
	at jdk.internal.reflect.DelegatingMethodAccessorImpl.invoke(java.base@9-ea/DelegatingMethodAccessorImpl.java:43)
	at java.lang.reflect.Method.invoke(java.base@9-ea/Method.java:531)
	at org.apache.solr.util.SolrPluginUtils.invokeSetters(SolrPluginUtils.java:1071)
	at org.apache.solr.util.SolrPluginUtilsTest.implTestInvokeSetters(SolrPluginUtilsTest.java:482)
	at org.apache.solr.util.SolrPluginUtilsTest.testInvokeSetters(SolrPluginUtilsTest.java:474)
	at jdk.internal.reflect.NativeMethodAccessorImpl.invoke0(java.base@9-ea/Native Method)
	at jdk.internal.reflect.NativeMethodAccessorImpl.invoke(java.base@9-ea/NativeMethodAccessorImpl.java:62)
	at jdk.internal.reflect.DelegatingMethodAccessorImpl.invoke(java.base@9-ea/DelegatingMethodAccessorImpl.java:43)
	at java.lang.reflect.Method.invoke(java.base@9-ea/Method.java:531)
	at com.carrotsearch.randomizedtesting.RandomizedRunner.invoke(RandomizedRunner.java:1764)
	at com.carrotsearch.randomizedtesting.RandomizedRunner$8.evaluate(RandomizedRunner.java:871)
	at com.carrotsearch.randomizedtesting.RandomizedRunner$9.evaluate(RandomizedRunner.java:907)
	at com.carrotsearch.randomizedtesting.RandomizedRunner$10.evaluate(RandomizedRunner.java:921)
	at com.carrotsearch.randomizedtesting.rules.SystemPropertiesRestoreRule$1.evaluate(SystemPropertiesRestoreRule.java:57)
	at org.apache.lucene.util.TestRuleSetupTeardownChained$1.evaluate(TestRuleSetupTeardownChained.java:49)
	at org.apache.lucene.util.AbstractBeforeAfterRule$1.evaluate(AbstractBeforeAfterRule.java:45)
	at org.apache.lucene.util.TestRuleThreadAndTestName$1.evaluate(TestRuleThreadAndTestName.java:48)
	at org.apache.lucene.util.TestRuleIgnoreAfterMaxFailures$1.evaluate(TestRuleIgnoreAfterMaxFailures.java:64)
	at org.apache.lucene.util.TestRuleMarkFailure$1.evaluate(TestRuleMarkFailure.java:47)
	at com.carrotsearch.randomizedtesting.rules.StatementAdapter.evaluate(StatementAdapter.java:36)
	at com.carrotsearch.randomizedtesting.ThreadLeakControl$StatementRunner.run(ThreadLeakControl.java:367)
	at com.carrotsearch.randomizedtesting.ThreadLeakControl.forkTimeoutingTask(ThreadLeakControl.java:809)
	at com.carrotsearch.randomizedtesting.ThreadLeakControl$3.evaluate(ThreadLeakControl.java:460)
	at com.carrotsearch.randomizedtesting.RandomizedRunner.runSingleTest(RandomizedRunner.java:880)
	at com.carrotsearch.randomizedtesting.RandomizedRunner$5.evaluate(RandomizedRunner.java:781)
	at com.carrotsearch.randomizedtesting.RandomizedRunner$6.evaluate(RandomizedRunner.java:816)
	at com.carrotsearch.randomizedtesting.RandomizedRunner$7.evaluate(RandomizedRunner.java:827)
	at com.carrotsearch.randomizedtesting.rules.StatementAdapter.evaluate(StatementAdapter.java:36)
	at com.carrotsearch.randomizedtesting.rules.SystemPropertiesRestoreRule$1.evaluate(SystemPropertiesRestoreRule.java:57)
	at org.apache.lucene.util.AbstractBeforeAfterRule$1.evaluate(AbstractBeforeAfterRule.java:45)
	at com.carrotsearch.randomizedtesting.rules.StatementAdapter.evaluate(StatementAdapter.java:36)
	at org.apache.lucene.util.TestRuleStoreClassName$1.evaluate(TestRuleStoreClassName.java:41)
	at com.carrotsearch.randomizedtesting.rules.NoShadowingOrOverridesOnMethodsRule$1.evaluate(NoShadowingOrOverridesOnMethodsRule.java:40)
	at com.carrotsearch.randomizedtesting.rules.NoShadowingOrOverridesOnMethodsRule$1.evaluate(NoShadowingOrOverridesOnMethodsRule.java:40)
	at com.carrotsearch.randomizedtesting.rules.StatementAdapter.evaluate(StatementAdapter.java:36)
	at com.carrotsearch.randomizedtesting.rules.StatementAdapter.evaluate(StatementAdapter.java:36)
	at com.carrotsearch.randomizedtesting.rules.StatementAdapter.evaluate(StatementAdapter.java:36)
	at org.apache.lucene.util.TestRuleAssertionsRequired$1.evaluate(TestRuleAssertionsRequired.java:53)
	at org.apache.lucene.util.TestRuleMarkFailure$1.evaluate(TestRuleMarkFailure.java:47)
	at org.apache.lucene.util.TestRuleIgnoreAfterMaxFailures$1.evaluate(TestRuleIgnoreAfterMaxFailures.java:64)
	at org.apache.lucene.util.TestRuleIgnoreTestSuites$1.evaluate(TestRuleIgnoreTestSuites.java:54)
	at com.carrotsearch.randomizedtesting.rules.StatementAdapter.evaluate(StatementAdapter.java:36)
	at com.carrotsearch.randomizedtesting.ThreadLeakControl$StatementRunner.run(ThreadLeakControl.java:367)
	at java.lang.Thread.run(java.base@9-ea/Thread.java:843)




Build Log:
[...truncated 11717 lines...]
   [junit4] Suite: org.apache.solr.util.SolrPluginUtilsTest
   [junit4]   2> Creating dataDir: /home/jenkins/workspace/Lucene-Solr-master-Linux/solr/build/solr-core/test/J1/temp/solr.util.SolrPluginUtilsTest_729B9C1F23267150-001/init-core-data-001
   [junit4]   2> 1358503 INFO  (SUITE-SolrPluginUtilsTest-seed#[729B9C1F23267150]-worker)
[    ] o.a.s.SolrTestCaseJ4 Randomized ssl (false) and clientAuth (false)
   [junit4]   2> 1358504 INFO  (SUITE-SolrPluginUtilsTest-seed#[729B9C1F23267150]-worker)
[    ] o.a.s.SolrTestCaseJ4 ####initCore
   [junit4]   2> 1358504 INFO  (SUITE-SolrPluginUtilsTest-seed#[729B9C1F23267150]-worker)
[    ] o.a.s.c.SolrResourceLoader new SolrResourceLoader for directory: '/home/jenkins/workspace/Lucene-Solr-master-Linux/solr/core/src/test-files/solr/collection1'
   [junit4]   2> 1358505 INFO  (SUITE-SolrPluginUtilsTest-seed#[729B9C1F23267150]-worker)
[    ] o.a.s.c.SolrResourceLoader JNDI not configured for solr (NoInitialContextEx)
   [junit4]   2> 1358505 INFO  (SUITE-SolrPluginUtilsTest-seed#[729B9C1F23267150]-worker)
[    ] o.a.s.c.SolrResourceLoader using system property solr.solr.home: /home/jenkins/workspace/Lucene-Solr-master-Linux/solr/core/src/test-files/solr
   [junit4]   2> 1358505 INFO  (SUITE-SolrPluginUtilsTest-seed#[729B9C1F23267150]-worker)
[    ] o.a.s.c.SolrResourceLoader Adding 'file:/home/jenkins/workspace/Lucene-Solr-master-Linux/solr/core/src/test-files/solr/collection1/lib/classes/'
to classloader
   [junit4]   2> 1358505 INFO  (SUITE-SolrPluginUtilsTest-seed#[729B9C1F23267150]-worker)
[    ] o.a.s.c.SolrResourceLoader Adding 'file:/home/jenkins/workspace/Lucene-Solr-master-Linux/solr/core/src/test-files/solr/collection1/lib/README'
to classloader
   [junit4]   2> 1358523 INFO  (SUITE-SolrPluginUtilsTest-seed#[729B9C1F23267150]-worker)
[    ] o.a.s.c.SolrConfig current version of requestparams : -1
   [junit4]   2> 1358535 INFO  (SUITE-SolrPluginUtilsTest-seed#[729B9C1F23267150]-worker)
[    ] o.a.s.c.SolrConfig Using Lucene MatchVersion: 7.0.0
   [junit4]   2> 1358555 INFO  (SUITE-SolrPluginUtilsTest-seed#[729B9C1F23267150]-worker)
[    ] o.a.s.c.SolrConfig Loaded SolrConfig: solrconfig.xml
   [junit4]   2> 1358560 INFO  (SUITE-SolrPluginUtilsTest-seed#[729B9C1F23267150]-worker)
[    ] o.a.s.s.IndexSchema [null] Schema name=test
   [junit4]   2> 1358678 INFO  (SUITE-SolrPluginUtilsTest-seed#[729B9C1F23267150]-worker)
[    ] o.a.s.s.OpenExchangeRatesOrgProvider Initialized with rates=open-exchange-rates.json,
refreshInterval=1440.
   [junit4]   2> 1358685 INFO  (SUITE-SolrPluginUtilsTest-seed#[729B9C1F23267150]-worker)
[    ] o.a.s.s.IndexSchema default search field in schema is text
   [junit4]   2> 1358688 INFO  (SUITE-SolrPluginUtilsTest-seed#[729B9C1F23267150]-worker)
[    ] o.a.s.s.IndexSchema unique key field: id
   [junit4]   2> 1358693 INFO  (SUITE-SolrPluginUtilsTest-seed#[729B9C1F23267150]-worker)
[    ] o.a.s.s.FileExchangeRateProvider Reloading exchange rates from file currency.xml
   [junit4]   2> 1358695 INFO  (SUITE-SolrPluginUtilsTest-seed#[729B9C1F23267150]-worker)
[    ] o.a.s.s.FileExchangeRateProvider Reloading exchange rates from file currency.xml
   [junit4]   2> 1358696 INFO  (SUITE-SolrPluginUtilsTest-seed#[729B9C1F23267150]-worker)
[    ] o.a.s.s.OpenExchangeRatesOrgProvider Reloading exchange rates from open-exchange-rates.json
   [junit4]   2> 1358697 INFO  (SUITE-SolrPluginUtilsTest-seed#[729B9C1F23267150]-worker)
[    ] o.a.s.s.OpenExchangeRatesOrgProvider Reloading exchange rates from open-exchange-rates.json
   [junit4]   2> 1358697 INFO  (SUITE-SolrPluginUtilsTest-seed#[729B9C1F23267150]-worker)
[    ] o.a.s.c.SolrResourceLoader JNDI not configured for solr (NoInitialContextEx)
   [junit4]   2> 1358697 INFO  (SUITE-SolrPluginUtilsTest-seed#[729B9C1F23267150]-worker)
[    ] o.a.s.c.SolrResourceLoader using system property solr.solr.home: /home/jenkins/workspace/Lucene-Solr-master-Linux/solr/core/src/test-files/solr
   [junit4]   2> 1358697 INFO  (SUITE-SolrPluginUtilsTest-seed#[729B9C1F23267150]-worker)
[    ] o.a.s.c.SolrResourceLoader new SolrResourceLoader for directory: '/home/jenkins/workspace/Lucene-Solr-master-Linux/solr/core/src/test-files/solr'
   [junit4]   2> 1358697 INFO  (SUITE-SolrPluginUtilsTest-seed#[729B9C1F23267150]-worker)
[    ] o.a.s.c.SolrResourceLoader JNDI not configured for solr (NoInitialContextEx)
   [junit4]   2> 1358697 INFO  (SUITE-SolrPluginUtilsTest-seed#[729B9C1F23267150]-worker)
[    ] o.a.s.c.SolrResourceLoader using system property solr.solr.home: /home/jenkins/workspace/Lucene-Solr-master-Linux/solr/core/src/test-files/solr
   [junit4]   2> 1358697 INFO  (SUITE-SolrPluginUtilsTest-seed#[729B9C1F23267150]-worker)
[    ] o.a.s.c.CoreContainer New CoreContainer 1089571910
   [junit4]   2> 1358698 INFO  (SUITE-SolrPluginUtilsTest-seed#[729B9C1F23267150]-worker)
[    ] o.a.s.c.CoreContainer Loading cores into CoreContainer [instanceDir=/home/jenkins/workspace/Lucene-Solr-master-Linux/solr/core/src/test-files/solr]
   [junit4]   2> 1358698 WARN  (SUITE-SolrPluginUtilsTest-seed#[729B9C1F23267150]-worker)
[    ] o.a.s.c.CoreContainer Couldn't add files from /home/jenkins/workspace/Lucene-Solr-master-Linux/solr/core/src/test-files/solr/lib
to classpath: /home/jenkins/workspace/Lucene-Solr-master-Linux/solr/core/src/test-files/solr/lib
   [junit4]   2> 1358698 INFO  (SUITE-SolrPluginUtilsTest-seed#[729B9C1F23267150]-worker)
[    ] o.a.s.h.c.HttpShardHandlerFactory created with socketTimeout : 600000,connTimeout :
60000,maxConnectionsPerHost : 20,maxConnections : 10000,corePoolSize : 0,maximumPoolSize :
2147483647,maxThreadIdleTime : 5,sizeOfQueue : -1,fairnessPolicy : false,
   [junit4]   2> 1358701 INFO  (SUITE-SolrPluginUtilsTest-seed#[729B9C1F23267150]-worker)
[    ] o.a.s.u.UpdateShardHandler Creating UpdateShardHandler HTTP client with params: 
   [junit4]   2> 1358702 INFO  (SUITE-SolrPluginUtilsTest-seed#[729B9C1F23267150]-worker)
[    ] o.a.s.l.LogWatcher SLF4J impl is org.slf4j.impl.Log4jLoggerFactory
   [junit4]   2> 1358702 INFO  (SUITE-SolrPluginUtilsTest-seed#[729B9C1F23267150]-worker)
[    ] o.a.s.l.LogWatcher Registering Log Listener [Log4j (org.slf4j.impl.Log4jLoggerFactory)]
   [junit4]   2> 1358702 INFO  (SUITE-SolrPluginUtilsTest-seed#[729B9C1F23267150]-worker)
[    ] o.a.s.c.CoreContainer Security conf doesn't exist. Skipping setup for authorization
module.
   [junit4]   2> 1358702 INFO  (SUITE-SolrPluginUtilsTest-seed#[729B9C1F23267150]-worker)
[    ] o.a.s.c.CoreContainer No authentication plugin used.
   [junit4]   2> 1358703 INFO  (SUITE-SolrPluginUtilsTest-seed#[729B9C1F23267150]-worker)
[    ] o.a.s.c.CoreDescriptor Created CoreDescriptor: {schema=schema.xml, dataDir=/home/jenkins/workspace/Lucene-Solr-master-Linux/solr/build/solr-core/test/J1/temp/solr.util.SolrPluginUtilsTest_729B9C1F23267150-001/init-core-data-001,
collection=collection1, loadOnStartup=true, transient=false, name=collection1, shard=shard1,
config=solrconfig.xml, configSetProperties=configsetprops.json}
   [junit4]   2> 1358703 INFO  (coreLoadExecutor-4094-thread-1) [    ] o.a.s.c.SolrResourceLoader
new SolrResourceLoader for directory: '/home/jenkins/workspace/Lucene-Solr-master-Linux/solr/core/src/test-files/solr/collection1'
   [junit4]   2> 1358703 INFO  (coreLoadExecutor-4094-thread-1) [    ] o.a.s.c.SolrResourceLoader
JNDI not configured for solr (NoInitialContextEx)
   [junit4]   2> 1358703 INFO  (coreLoadExecutor-4094-thread-1) [    ] o.a.s.c.SolrResourceLoader
using system property solr.solr.home: /home/jenkins/workspace/Lucene-Solr-master-Linux/solr/core/src/test-files/solr
   [junit4]   2> 1358704 INFO  (coreLoadExecutor-4094-thread-1) [    ] o.a.s.c.SolrResourceLoader
Adding 'file:/home/jenkins/workspace/Lucene-Solr-master-Linux/solr/core/src/test-files/solr/collection1/lib/classes/'
to classloader
   [junit4]   2> 1358704 INFO  (coreLoadExecutor-4094-thread-1) [    ] o.a.s.c.SolrResourceLoader
Adding 'file:/home/jenkins/workspace/Lucene-Solr-master-Linux/solr/core/src/test-files/solr/collection1/lib/README'
to classloader
   [junit4]   2> 1358715 INFO  (coreLoadExecutor-4094-thread-1) [    ] o.a.s.c.SolrConfig
current version of requestparams : -1
   [junit4]   2> 1358757 INFO  (coreLoadExecutor-4094-thread-1) [    ] o.a.s.c.SolrConfig
Using Lucene MatchVersion: 7.0.0
   [junit4]   2> 1358784 INFO  (coreLoadExecutor-4094-thread-1) [    ] o.a.s.c.SolrConfig
Loaded SolrConfig: solrconfig.xml
   [junit4]   2> 1358788 INFO  (coreLoadExecutor-4094-thread-1) [    ] o.a.s.s.IndexSchema
[collection1] Schema name=test
   [junit4]   2> 1358860 INFO  (coreLoadExecutor-4094-thread-1) [    ] o.a.s.s.OpenExchangeRatesOrgProvider
Initialized with rates=open-exchange-rates.json, refreshInterval=1440.
   [junit4]   2> 1358864 INFO  (coreLoadExecutor-4094-thread-1) [    ] o.a.s.s.IndexSchema
default search field in schema is text
   [junit4]   2> 1358865 INFO  (coreLoadExecutor-4094-thread-1) [    ] o.a.s.s.IndexSchema
unique key field: id
   [junit4]   2> 1358868 INFO  (coreLoadExecutor-4094-thread-1) [    ] o.a.s.s.FileExchangeRateProvider
Reloading exchange rates from file currency.xml
   [junit4]   2> 1358869 INFO  (coreLoadExecutor-4094-thread-1) [    ] o.a.s.s.FileExchangeRateProvider
Reloading exchange rates from file currency.xml
   [junit4]   2> 1358869 INFO  (coreLoadExecutor-4094-thread-1) [    ] o.a.s.s.OpenExchangeRatesOrgProvider
Reloading exchange rates from open-exchange-rates.json
   [junit4]   2> 1358870 INFO  (coreLoadExecutor-4094-thread-1) [    ] o.a.s.s.OpenExchangeRatesOrgProvider
Reloading exchange rates from open-exchange-rates.json
   [junit4]   2> 1358870 INFO  (coreLoadExecutor-4094-thread-1) [    ] o.a.s.c.ConfigSetProperties
Did not find ConfigSet properties, assuming default properties: Can't find resource 'configsetprops.json'
in classpath or '/home/jenkins/workspace/Lucene-Solr-master-Linux/solr/core/src/test-files/solr/collection1'
   [junit4]   2> 1358870 INFO  (coreLoadExecutor-4094-thread-1) [    ] o.a.s.c.CoreContainer
Creating SolrCore 'collection1' using configuration from instancedir /home/jenkins/workspace/Lucene-Solr-master-Linux/solr/core/src/test-files/solr/collection1
   [junit4]   2> 1358871 INFO  (coreLoadExecutor-4094-thread-1) [    ] o.a.s.c.SolrCore
org.apache.solr.core.MockDirectoryFactory
   [junit4]   2> 1358871 INFO  (coreLoadExecutor-4094-thread-1) [    ] o.a.s.c.SolrCore
[[collection1] ] Opening new SolrCore at [/home/jenkins/workspace/Lucene-Solr-master-Linux/solr/core/src/test-files/solr/collection1],
dataDir=[/home/jenkins/workspace/Lucene-Solr-master-Linux/solr/build/solr-core/test/J1/temp/solr.util.SolrPluginUtilsTest_729B9C1F23267150-001/init-core-data-001/]
   [junit4]   2> 1358871 INFO  (coreLoadExecutor-4094-thread-1) [    ] o.a.s.c.JmxMonitoredMap
JMX monitoring is enabled. Adding Solr mbeans to JMX Server: com.sun.jmx.mbeanserver.JmxMBeanServer@2b6c439c
   [junit4]   2> 1358871 INFO  (coreLoadExecutor-4094-thread-1) [    ] o.a.s.c.CachingDirectoryFactory
return new directory for /home/jenkins/workspace/Lucene-Solr-master-Linux/solr/build/solr-core/test/J1/temp/solr.util.SolrPluginUtilsTest_729B9C1F23267150-001/init-core-data-001
   [junit4]   2> 1358871 INFO  (coreLoadExecutor-4094-thread-1) [    ] o.a.s.c.SolrCore
New index directory detected: old=null new=/home/jenkins/workspace/Lucene-Solr-master-Linux/solr/build/solr-core/test/J1/temp/solr.util.SolrPluginUtilsTest_729B9C1F23267150-001/init-core-data-001/index/
   [junit4]   2> 1358871 WARN  (coreLoadExecutor-4094-thread-1) [    ] o.a.s.c.SolrCore
[collection1] Solr index directory '/home/jenkins/workspace/Lucene-Solr-master-Linux/solr/build/solr-core/test/J1/temp/solr.util.SolrPluginUtilsTest_729B9C1F23267150-001/init-core-data-001/index'
doesn't exist. Creating new index...
   [junit4]   2> 1358871 INFO  (coreLoadExecutor-4094-thread-1) [    ] o.a.s.c.CachingDirectoryFactory
return new directory for /home/jenkins/workspace/Lucene-Solr-master-Linux/solr/build/solr-core/test/J1/temp/solr.util.SolrPluginUtilsTest_729B9C1F23267150-001/init-core-data-001/index
   [junit4]   2> 1358872 INFO  (coreLoadExecutor-4094-thread-1) [    ] o.a.s.u.RandomMergePolicy
RandomMergePolicy wrapping class org.apache.lucene.index.LogByteSizeMergePolicy: [LogByteSizeMergePolicy:
minMergeSize=1677721, mergeFactor=40, maxMergeSize=2147483648, maxMergeSizeForForcedMerge=9223372036854775807,
calibrateSizeByDeletes=false, maxMergeDocs=2147483647, maxCFSSegmentSizeMB=8.796093022207999E12,
noCFSRatio=0.0]
   [junit4]   2> 1358872 INFO  (coreLoadExecutor-4094-thread-1) [    ] o.a.s.c.SolrDeletionPolicy
SolrDeletionPolicy.onCommit: commits: num=1
   [junit4]   2> 	commit{dir=MockDirectoryWrapper(RAMDirectory@392efb33 lockFactory=org.apache.lucene.store.SingleInstanceLockFactory@4a47a49d),segFN=segments_1,generation=1}
   [junit4]   2> 1358872 INFO  (coreLoadExecutor-4094-thread-1) [    ] o.a.s.c.SolrDeletionPolicy
newest commit generation = 1
   [junit4]   2> 1358872 INFO  (OldIndexDirectoryCleanupThreadForCore-collection1) [  
 ] o.a.s.c.SolrCore Looking for old index directories to cleanup for core collection1 in /home/jenkins/workspace/Lucene-Solr-master-Linux/solr/build/solr-core/test/J1/temp/solr.util.SolrPluginUtilsTest_729B9C1F23267150-001/init-core-data-001/
   [junit4]   2> 1358874 INFO  (coreLoadExecutor-4094-thread-1) [    ] o.a.s.u.p.UpdateRequestProcessorChain
creating updateRequestProcessorChain "dedupe"
   [junit4]   2> 1358874 INFO  (coreLoadExecutor-4094-thread-1) [    ] o.a.s.u.p.UpdateRequestProcessorChain
inserting DistributedUpdateProcessorFactory into updateRequestProcessorChain "dedupe"
   [junit4]   2> 1358874 INFO  (coreLoadExecutor-4094-thread-1) [    ] o.a.s.u.p.UpdateRequestProcessorChain
creating updateRequestProcessorChain "dedupe-allfields"
   [junit4]   2> 1358874 INFO  (coreLoadExecutor-4094-thread-1) [    ] o.a.s.u.p.UpdateRequestProcessorChain
inserting DistributedUpdateProcessorFactory into updateRequestProcessorChain "dedupe-allfields"
   [junit4]   2> 1358874 INFO  (coreLoadExecutor-4094-thread-1) [    ] o.a.s.u.p.UpdateRequestProcessorChain
creating updateRequestProcessorChain "stored_sig"
   [junit4]   2> 1358874 INFO  (coreLoadExecutor-4094-thread-1) [    ] o.a.s.u.p.UpdateRequestProcessorChain
inserting DistributedUpdateProcessorFactory into updateRequestProcessorChain "stored_sig"
   [junit4]   2> 1358874 INFO  (coreLoadExecutor-4094-thread-1) [    ] o.a.s.u.p.UpdateRequestProcessorChain
creating updateRequestProcessorChain "uniq-fields"
   [junit4]   2> 1358875 INFO  (coreLoadExecutor-4094-thread-1) [    ] o.a.s.u.p.UpdateRequestProcessorChain
inserting DistributedUpdateProcessorFactory into updateRequestProcessorChain "uniq-fields"
   [junit4]   2> 1358875 INFO  (coreLoadExecutor-4094-thread-1) [    ] o.a.s.u.p.UpdateRequestProcessorChain
creating updateRequestProcessorChain "distrib-dup-test-chain-explicit"
   [junit4]   2> 1358875 INFO  (coreLoadExecutor-4094-thread-1) [    ] o.a.s.u.p.UpdateRequestProcessorChain
creating updateRequestProcessorChain "distrib-dup-test-chain-implicit"
   [junit4]   2> 1358875 INFO  (coreLoadExecutor-4094-thread-1) [    ] o.a.s.u.p.UpdateRequestProcessorChain
inserting DistributedUpdateProcessorFactory into updateRequestProcessorChain "distrib-dup-test-chain-implicit"
   [junit4]   2> 1358875 INFO  (coreLoadExecutor-4094-thread-1) [    ] o.a.s.c.SolrCore
no updateRequestProcessorChain defined as default, creating implicit default
   [junit4]   2> 1358876 INFO  (coreLoadExecutor-4094-thread-1) [    ] o.a.s.h.l.XMLLoader
xsltCacheLifetimeSeconds=60
   [junit4]   2> 1358877 INFO  (coreLoadExecutor-4094-thread-1) [    ] o.a.s.h.l.XMLLoader
xsltCacheLifetimeSeconds=60
   [junit4]   2> 1358877 INFO  (coreLoadExecutor-4094-thread-1) [    ] o.a.s.h.l.XMLLoader
xsltCacheLifetimeSeconds=60
   [junit4]   2> 1358877 INFO  (coreLoadExecutor-4094-thread-1) [    ] o.a.s.h.l.XMLLoader
xsltCacheLifetimeSeconds=60
   [junit4]   2> 1358880 INFO  (coreLoadExecutor-4094-thread-1) [    ] o.a.s.c.PluginBag
requestHandler : 'lazy' created with startup=lazy 
   [junit4]   2> 1358881 INFO  (coreLoadExecutor-4094-thread-1) [    ] o.a.s.c.RequestHandlers
Registered paths: /admin/mbeans,standard,spellCheckCompRH,lazy,/update/json/docs,/admin/luke,/export,spellCheckWithWordbreak_Direct,tvrh,/get,/admin/properties,/update/json,mltrh,/admin/threads,/search-facet-def,/update/csv,/sql,/graph,/search-facet-invariants,/admin/segments,spellCheckCompRH1,/mlt,/admin/system,/replication,dismax,defaults,/config,/stream,/schema,/admin/plugins,/admin/logging,spellCheckWithWordbreak,mock,/admin/ping,/update,/admin/file,/terms,spellCheckCompRH_Direct,/debug/dump
   [junit4]   2> 1358881 INFO  (coreLoadExecutor-4094-thread-1) [    ] o.a.s.c.SolrCore
Using default statsCache cache: org.apache.solr.search.stats.LocalStatsCache
   [junit4]   2> 1358881 INFO  (coreLoadExecutor-4094-thread-1) [    ] o.a.s.u.UpdateHandler
Using UpdateLog implementation: org.apache.solr.update.UpdateLog
   [junit4]   2> 1358881 INFO  (coreLoadExecutor-4094-thread-1) [    ] o.a.s.u.UpdateLog
Initializing UpdateLog: dataDir= defaultSyncLevel=FLUSH numRecordsToKeep=100 maxNumLogsToKeep=10
numVersionBuckets=65536
   [junit4]   2> 1358888 INFO  (coreLoadExecutor-4094-thread-1) [    ] o.a.s.u.CommitTracker
Hard AutoCommit: disabled
   [junit4]   2> 1358888 INFO  (coreLoadExecutor-4094-thread-1) [    ] o.a.s.u.CommitTracker
Soft AutoCommit: disabled
   [junit4]   2> 1358888 INFO  (coreLoadExecutor-4094-thread-1) [    ] o.a.s.u.RandomMergePolicy
RandomMergePolicy wrapping class org.apache.lucene.index.MockRandomMergePolicy: org.apache.lucene.index.MockRandomMergePolicy@75070ff5
   [junit4]   2> 1358888 INFO  (coreLoadExecutor-4094-thread-1) [    ] o.a.s.c.SolrDeletionPolicy
SolrDeletionPolicy.onInit: commits: num=1
   [junit4]   2> 	commit{dir=MockDirectoryWrapper(RAMDirectory@392efb33 lockFactory=org.apache.lucene.store.SingleInstanceLockFactory@4a47a49d),segFN=segments_1,generation=1}
   [junit4]   2> 1358888 INFO  (coreLoadExecutor-4094-thread-1) [    ] o.a.s.c.SolrDeletionPolicy
newest commit generation = 1
   [junit4]   2> 1358888 INFO  (coreLoadExecutor-4094-thread-1) [    ] o.a.s.s.SolrIndexSearcher
Opening [Searcher@134d2d86[collection1] main]
   [junit4]   2> 1358888 INFO  (coreLoadExecutor-4094-thread-1) [    ] o.a.s.r.RestManager
Initializing RestManager with initArgs: {storageIO=org.apache.solr.rest.ManagedResourceStorage$InMemoryStorageIO}
   [junit4]   2> 1358888 INFO  (coreLoadExecutor-4094-thread-1) [    ] o.a.s.r.ManagedResourceStorage
Reading _rest_managed.json using InMemoryStorage
   [junit4]   2> 1358888 INFO  (coreLoadExecutor-4094-thread-1) [    ] o.a.s.r.RestManager
Initializing 0 registered ManagedResources
   [junit4]   2> 1358888 INFO  (coreLoadExecutor-4094-thread-1) [    ] o.a.s.h.c.SpellCheckComponent
Initializing spell checkers
   [junit4]   2> 1358930 INFO  (coreLoadExecutor-4094-thread-1) [    ] o.a.s.s.DirectSolrSpellChecker
init: {name=direct,classname=DirectSolrSpellChecker,field=lowerfilt,minQueryLength=3}
   [junit4]   2> 1359072 INFO  (coreLoadExecutor-4094-thread-1) [    ] o.a.s.h.ReplicationHandler
Commits will be reserved for  10000
   [junit4]   2> 1359072 INFO  (searcherExecutor-4095-thread-1) [    ] o.a.s.h.c.SpellCheckComponent
Loading spell index for spellchecker: default
   [junit4]   2> 1359073 INFO  (searcherExecutor-4095-thread-1) [    ] o.a.s.h.c.SpellCheckComponent
Loading spell index for spellchecker: direct
   [junit4]   2> 1359073 INFO  (searcherExecutor-4095-thread-1) [    ] o.a.s.h.c.SpellCheckComponent
Loading spell index for spellchecker: wordbreak
   [junit4]   2> 1359073 INFO  (coreLoadExecutor-4094-thread-1) [    ] o.a.s.u.UpdateLog
Looking up max value of version field to seed version buckets
   [junit4]   2> 1359073 INFO  (searcherExecutor-4095-thread-1) [    ] o.a.s.h.c.SpellCheckComponent
Loading spell index for spellchecker: multipleFields
   [junit4]   2> 1359073 INFO  (coreLoadExecutor-4094-thread-1) [    ] o.a.s.u.VersionInfo
Refreshing highest value of _version_ for 65536 version buckets from index
   [junit4]   2> 1359073 INFO  (coreLoadExecutor-4094-thread-1) [    ] o.a.s.u.VersionInfo
No terms found for _version_, cannot seed version bucket highest value from index
   [junit4]   2> 1359073 INFO  (coreLoadExecutor-4094-thread-1) [    ] o.a.s.u.UpdateLog
Could not find max version in index or recent updates, using new clock 1535935422761271296
   [junit4]   2> 1359073 INFO  (searcherExecutor-4095-thread-1) [    ] o.a.s.h.c.SpellCheckComponent
Loading spell index for spellchecker: jarowinkler
   [junit4]   2> 1359073 INFO  (searcherExecutor-4095-thread-1) [    ] o.a.s.h.c.SpellCheckComponent
Loading spell index for spellchecker: external
   [junit4]   2> 1359073 INFO  (searcherExecutor-4095-thread-1) [    ] o.a.s.h.c.SpellCheckComponent
Loading spell index for spellchecker: freq
   [junit4]   2> 1359074 INFO  (searcherExecutor-4095-thread-1) [    ] o.a.s.h.c.SpellCheckComponent
Loading spell index for spellchecker: fqcn
   [junit4]   2> 1359074 INFO  (searcherExecutor-4095-thread-1) [    ] o.a.s.h.c.SpellCheckComponent
Loading spell index for spellchecker: perDict
   [junit4]   2> 1359074 INFO  (searcherExecutor-4095-thread-1) [    ] o.a.s.c.SolrCore
[collection1] Registered new searcher Searcher@134d2d86[collection1] main{ExitableDirectoryReader(UninvertingDirectoryReader())}
   [junit4]   2> 1359075 INFO  (coreLoadExecutor-4094-thread-1) [    ] o.a.s.u.UpdateLog
Took 1.0ms to seed version buckets with highest version 1535935422761271296
   [junit4]   2> 1359075 INFO  (coreLoadExecutor-4094-thread-1) [    ] o.a.s.c.CoreContainer
registering core: collection1
   [junit4]   2> 1359075 INFO  (SUITE-SolrPluginUtilsTest-seed#[729B9C1F23267150]-worker)
[    ] o.a.s.SolrTestCaseJ4 ####initCore end
   [junit4]   2> 1359077 INFO  (TEST-SolrPluginUtilsTest.testPartialEscape-seed#[729B9C1F23267150])
[    ] o.a.s.SolrTestCaseJ4 ###Starting testPartialEscape
   [junit4]   2> 1359077 INFO  (TEST-SolrPluginUtilsTest.testPartialEscape-seed#[729B9C1F23267150])
[    ] o.a.s.SolrTestCaseJ4 ###Ending testPartialEscape
   [junit4]   2> 1359077 INFO  (TEST-SolrPluginUtilsTest.testMinShouldMatchCalculator-seed#[729B9C1F23267150])
[    ] o.a.s.SolrTestCaseJ4 ###Starting testMinShouldMatchCalculator
   [junit4]   2> 1359078 INFO  (TEST-SolrPluginUtilsTest.testMinShouldMatchCalculator-seed#[729B9C1F23267150])
[    ] o.a.s.SolrTestCaseJ4 ###Ending testMinShouldMatchCalculator
   [junit4]   2> 1359079 INFO  (TEST-SolrPluginUtilsTest.testStripIllegalOperators-seed#[729B9C1F23267150])
[    ] o.a.s.SolrTestCaseJ4 ###Starting testStripIllegalOperators
   [junit4]   2> 1359079 INFO  (TEST-SolrPluginUtilsTest.testStripIllegalOperators-seed#[729B9C1F23267150])
[    ] o.a.s.SolrTestCaseJ4 ###Ending testStripIllegalOperators
   [junit4]   2> 1359080 INFO  (TEST-SolrPluginUtilsTest.testMinShouldMatchAutoRelax-seed#[729B9C1F23267150])
[    ] o.a.s.SolrTestCaseJ4 ###Starting testMinShouldMatchAutoRelax
   [junit4]   2> 1359080 INFO  (TEST-SolrPluginUtilsTest.testMinShouldMatchAutoRelax-seed#[729B9C1F23267150])
[    ] o.a.s.SolrTestCaseJ4 ###Ending testMinShouldMatchAutoRelax
   [junit4]   2> 1359081 INFO  (TEST-SolrPluginUtilsTest.testDisjunctionMaxQueryParser-seed#[729B9C1F23267150])
[    ] o.a.s.SolrTestCaseJ4 ###Starting testDisjunctionMaxQueryParser
   [junit4]   2> 1359082 INFO  (TEST-SolrPluginUtilsTest.testDisjunctionMaxQueryParser-seed#[729B9C1F23267150])
[    ] o.a.s.SolrTestCaseJ4 ###Ending testDisjunctionMaxQueryParser
   [junit4]   2> 1359083 INFO  (TEST-SolrPluginUtilsTest.testStripUnbalancedQuotes-seed#[729B9C1F23267150])
[    ] o.a.s.SolrTestCaseJ4 ###Starting testStripUnbalancedQuotes
   [junit4]   2> 1359083 INFO  (TEST-SolrPluginUtilsTest.testStripUnbalancedQuotes-seed#[729B9C1F23267150])
[    ] o.a.s.SolrTestCaseJ4 ###Ending testStripUnbalancedQuotes
   [junit4]   2> 1359084 INFO  (TEST-SolrPluginUtilsTest.testParseFieldBoosts-seed#[729B9C1F23267150])
[    ] o.a.s.SolrTestCaseJ4 ###Starting testParseFieldBoosts
   [junit4]   2> 1359084 INFO  (TEST-SolrPluginUtilsTest.testParseFieldBoosts-seed#[729B9C1F23267150])
[    ] o.a.s.SolrTestCaseJ4 ###Ending testParseFieldBoosts
   [junit4]   2> 1359084 INFO  (TEST-SolrPluginUtilsTest.testDocListConversion-seed#[729B9C1F23267150])
[    ] o.a.s.SolrTestCaseJ4 ###Starting testDocListConversion
   [junit4]   2> 1359085 INFO  (TEST-SolrPluginUtilsTest.testDocListConversion-seed#[729B9C1F23267150])
[    ] o.a.s.u.p.LogUpdateProcessorFactory [collection1]  webapp=null path=null params={}{add=[3234
(1535935422773854208)]} 0 0
   [junit4]   2> 1359087 INFO  (TEST-SolrPluginUtilsTest.testDocListConversion-seed#[729B9C1F23267150])
[    ] o.a.s.u.p.LogUpdateProcessorFactory [collection1]  webapp=null path=null params={}{add=[3235
(1535935422774902784)]} 0 0
   [junit4]   2> 1359087 INFO  (TEST-SolrPluginUtilsTest.testDocListConversion-seed#[729B9C1F23267150])
[    ] o.a.s.u.p.LogUpdateProcessorFactory [collection1]  webapp=null path=null params={}{add=[3236
(1535935422775951360)]} 0 0
   [junit4]   2> 1359087 INFO  (TEST-SolrPluginUtilsTest.testDocListConversion-seed#[729B9C1F23267150])
[    ] o.a.s.u.DirectUpdateHandler2 start commit{,optimize=false,openSearcher=true,waitSearcher=true,expungeDeletes=false,softCommit=false,prepareCommit=false}
   [junit4]   2> 1359088 INFO  (TEST-SolrPluginUtilsTest.testDocListConversion-seed#[729B9C1F23267150])
[    ] o.a.s.c.SolrDeletionPolicy SolrDeletionPolicy.onCommit: commits: num=2
   [junit4]   2> 	commit{dir=MockDirectoryWrapper(RAMDirectory@392efb33 lockFactory=org.apache.lucene.store.SingleInstanceLockFactory@4a47a49d),segFN=segments_1,generation=1}
   [junit4]   2> 	commit{dir=MockDirectoryWrapper(RAMDirectory@392efb33 lockFactory=org.apache.lucene.store.SingleInstanceLockFactory@4a47a49d),segFN=segments_2,generation=2}
   [junit4]   2> 1359088 INFO  (TEST-SolrPluginUtilsTest.testDocListConversion-seed#[729B9C1F23267150])
[    ] o.a.s.c.SolrDeletionPolicy newest commit generation = 2
   [junit4]   2> 1359089 INFO  (TEST-SolrPluginUtilsTest.testDocListConversion-seed#[729B9C1F23267150])
[    ] o.a.s.s.SolrIndexSearcher Opening [Searcher@6100d96a[collection1] main]
   [junit4]   2> 1359089 INFO  (TEST-SolrPluginUtilsTest.testDocListConversion-seed#[729B9C1F23267150])
[    ] o.a.s.u.DirectUpdateHandler2 end_commit_flush
   [junit4]   2> 1359090 INFO  (searcherExecutor-4095-thread-1) [    ] o.a.s.c.SolrCore
[collection1] Registered new searcher Searcher@6100d96a[collection1] main{ExitableDirectoryReader(UninvertingDirectoryReader(Uninverting(_0(7.0.0):C3)))}
   [junit4]   2> 1359090 INFO  (TEST-SolrPluginUtilsTest.testDocListConversion-seed#[729B9C1F23267150])
[    ] o.a.s.u.p.LogUpdateProcessorFactory [collection1]  webapp=null path=null params={}{commit=}
0 2
   [junit4]   2> 1359091 INFO  (TEST-SolrPluginUtilsTest.testDocListConversion-seed#[729B9C1F23267150])
[    ] o.a.s.SolrTestCaseJ4 ###Ending testDocListConversion
   [junit4]   2> 1359092 INFO  (TEST-SolrPluginUtilsTest.testInvokeSetters-seed#[729B9C1F23267150])
[    ] o.a.s.SolrTestCaseJ4 ###Starting testInvokeSetters
   [junit4]   2> 1359092 INFO  (TEST-SolrPluginUtilsTest.testInvokeSetters-seed#[729B9C1F23267150])
[    ] o.a.s.SolrTestCaseJ4 ###Ending testInvokeSetters
   [junit4]   2> NOTE: reproduce with: ant test  -Dtestcase=SolrPluginUtilsTest -Dtests.method=testInvokeSetters
-Dtests.seed=729B9C1F23267150 -Dtests.multiplier=3 -Dtests.slow=true -Dtests.locale=ses -Dtests.timezone=Canada/Yukon
-Dtests.asserts=true -Dtests.file.encoding=US-ASCII
   [junit4] ERROR   0.00s J1 | SolrPluginUtilsTest.testInvokeSetters <<<
   [junit4]    > Throwable #1: java.lang.IllegalArgumentException: argument type mismatch
   [junit4]    > 	at __randomizedtesting.SeedInfo.seed([729B9C1F23267150:1B84371FD61013FB]:0)
   [junit4]    > 	at jdk.internal.reflect.NativeMethodAccessorImpl.invoke0(java.base@9-ea/Native
Method)
   [junit4]    > 	at jdk.internal.reflect.NativeMethodAccessorImpl.invoke(java.base@9-ea/NativeMethodAccessorImpl.java:62)
   [junit4]    > 	at jdk.internal.reflect.DelegatingMethodAccessorImpl.invoke(java.base@9-ea/DelegatingMethodAccessorImpl.java:43)
   [junit4]    > 	at org.apache.solr.util.SolrPluginUtils.invokeSetters(SolrPluginUtils.java:1071)
   [junit4]    > 	at org.apache.solr.util.SolrPluginUtilsTest.implTestInvokeSetters(SolrPluginUtilsTest.java:482)
   [junit4]    > 	at org.apache.solr.util.SolrPluginUtilsTest.testInvokeSetters(SolrPluginUtilsTest.java:474)
   [junit4]    > 	at jdk.internal.reflect.NativeMethodAccessorImpl.invoke0(java.base@9-ea/Native
Method)
   [junit4]    > 	at jdk.internal.reflect.NativeMethodAccessorImpl.invoke(java.base@9-ea/NativeMethodAccessorImpl.java:62)
   [junit4]    > 	at jdk.internal.reflect.DelegatingMethodAccessorImpl.invoke(java.base@9-ea/DelegatingMethodAccessorImpl.java:43)
   [junit4]    > 	at java.lang.Thread.run(java.base@9-ea/Thread.java:843)
   [junit4]   2> 1359094 INFO  (SUITE-SolrPluginUtilsTest-seed#[729B9C1F23267150]-worker)
[    ] o.a.s.SolrTestCaseJ4 ###deleteCore
   [junit4]   2> 1359094 INFO  (SUITE-SolrPluginUtilsTest-seed#[729B9C1F23267150]-worker)
[    ] o.a.s.c.CoreContainer Shutting down CoreContainer instance=1089571910
   [junit4]   2> 1359094 INFO  (coreCloseExecutor-4100-thread-1) [    ] o.a.s.c.SolrCore
[collection1]  CLOSING SolrCore org.apache.solr.core.SolrCore@7ef77def
   [junit4]   2> 1359094 INFO  (coreCloseExecutor-4100-thread-1) [    ] o.a.s.u.DirectUpdateHandler2
closing DirectUpdateHandler2{commits=1,autocommits=0,soft autocommits=0,optimizes=0,rollbacks=0,expungeDeletes=0,docsPending=0,adds=0,deletesById=0,deletesByQuery=0,errors=0,cumulative_adds=3,cumulative_deletesById=0,cumulative_deletesByQuery=0,cumulative_errors=0,transaction_logs_total_size=251,transaction_logs_total_number=1}
   [junit4]   2> 1359094 INFO  (coreCloseExecutor-4100-thread-1) [    ] o.a.s.u.SolrCoreState
Closing SolrCoreState
   [junit4]   2> 1359094 INFO  (coreCloseExecutor-4100-thread-1) [    ] o.a.s.u.DefaultSolrCoreState
SolrCoreState ref count has reached 0 - closing IndexWriter
   [junit4]   2> 1359094 INFO  (coreCloseExecutor-4100-thread-1) [    ] o.a.s.u.DefaultSolrCoreState
closing IndexWriter with IndexWriterCloser
   [junit4]   2> 1359094 INFO  (coreCloseExecutor-4100-thread-1) [    ] o.a.s.c.SolrCore
[collection1] Closing main searcher on request.
   [junit4]   2> 1359099 INFO  (coreCloseExecutor-4100-thread-1) [    ] o.a.s.c.CachingDirectoryFactory
Closing MockDirectoryFactory - 2 directories currently being tracked
   [junit4]   2> 1359099 INFO  (coreCloseExecutor-4100-thread-1) [    ] o.a.s.c.CachingDirectoryFactory
looking to close /home/jenkins/workspace/Lucene-Solr-master-Linux/solr/build/solr-core/test/J1/temp/solr.util.SolrPluginUtilsTest_729B9C1F23267150-001/init-core-data-001/index
[CachedDir<<refCount=0;path=/home/jenkins/workspace/Lucene-Solr-master-Linux/solr/build/solr-core/test/J1/temp/solr.util.SolrPluginUtilsTest_729B9C1F23267150-001/init-core-data-001/index;done=false>>]
   [junit4]   2> 1359100 INFO  (coreCloseExecutor-4100-thread-1) [    ] o.a.s.c.CachingDirectoryFactory
Closing directory, CoreContainer#isShutdown=true
   [junit4]   2> 1359100 INFO  (coreCloseExecutor-4100-thread-1) [    ] o.a.s.c.CachingDirectoryFactory
Closing directory: /home/jenkins/workspace/Lucene-Solr-master-Linux/solr/build/solr-core/test/J1/temp/solr.util.SolrPluginUtilsTest_729B9C1F23267150-001/init-core-data-001/index
   [junit4]   2> 1359100 INFO  (coreCloseExecutor-4100-thread-1) [    ] o.a.s.c.CachingDirectoryFactory
looking to close /home/jenkins/workspace/Lucene-Solr-master-Linux/solr/build/solr-core/test/J1/temp/solr.util.SolrPluginUtilsTest_729B9C1F23267150-001/init-core-data-001
[CachedDir<<refCount=0;path=/home/jenkins/workspace/Lucene-Solr-master-Linux/solr/build/solr-core/test/J1/temp/solr.util.SolrPluginUtilsTest_729B9C1F23267150-001/init-core-data-001;done=false>>]
   [junit4]   2> 1359100 INFO  (coreCloseExecutor-4100-thread-1) [    ] o.a.s.c.CachingDirectoryFactory
Closing directory, CoreContainer#isShutdown=true
   [junit4]   2> 1359100 INFO  (coreCloseExecutor-4100-thread-1) [    ] o.a.s.c.CachingDirectoryFactory
Closing directory: /home/jenkins/workspace/Lucene-Solr-master-Linux/solr/build/solr-core/test/J1/temp/solr.util.SolrPluginUtilsTest_729B9C1F23267150-001/init-core-data-001
   [junit4]   2> NOTE: leaving temporary files on disk at: /home/jenkins/workspace/Lucene-Solr-master-Linux/solr/build/solr-core/test/J1/temp/solr.util.SolrPluginUtilsTest_729B9C1F23267150-001
   [junit4]   2> NOTE: test params are: codec=FastCompressingStoredFields(storedFieldsFormat=CompressingStoredFieldsFormat(compressionMode=FAST,
chunkSize=8808, maxDocsPerChunk=927, blockSize=4), termVectorsFormat=CompressingTermVectorsFormat(compressionMode=FAST,
chunkSize=8808, blockSize=4)), sim=RandomSimilarity(queryNorm=true,coord=crazy): {}, locale=ses,
timezone=Canada/Yukon
   [junit4]   2> NOTE: Linux 4.4.0-21-generic amd64/Oracle Corporation 9-ea (64-bit)/cpus=12,threads=1,free=178004328,total=536870912
   [junit4]   2> NOTE: All tests run in this JVM: [TestDocBasedVersionConstraints, TestSlowCompositeReaderWrapper,
ChaosMonkeyNothingIsSafeTest, TestSolrXml, BlockCacheTest, TestRestoreCore, TestRuleBasedAuthorizationPlugin,
BasicFunctionalityTest, TestSolrConfigHandlerConcurrent, TestSolrCLIRunExample, DistributedFacetPivotLargeTest,
TestStressVersions, TestFastLRUCache, DistributedQueueTest, ClassificationUpdateProcessorFactoryTest,
TestSchemaManager, SpatialFilterTest, WordBreakSolrSpellCheckerTest, DistributedQueryComponentOptimizationTest,
TestComplexPhraseQParserPlugin, TestCollectionAPI, HdfsChaosMonkeyNothingIsSafeTest, TestSubQueryTransformer,
SpellingQueryConverterTest, TestBinaryResponseWriter, TestMinMaxOnMultiValuedField, SpellCheckComponentTest,
LeaderInitiatedRecoveryOnShardRestartTest, CdcrReplicationHandlerTest, CSVRequestHandlerTest,
ConjunctionSolrSpellCheckerTest, TestFieldCache, TestDefaultSearchFieldResource, ShardRoutingTest,
VMParamsZkACLAndCredentialsProvidersTest, SimplePostToolTest, ClusterStateUpdateTest, TestSolrFieldCacheMBean,
LoggingHandlerTest, TestFieldCollectionResource, BlockJoinFacetSimpleTest, OutOfBoxZkACLAndCredentialsProvidersTest,
TestFiltering, IgnoreCommitOptimizeUpdateProcessorFactoryTest, TestCodecSupport, TestNumericTerms64,
RecoveryAfterSoftCommitTest, DistributedFacetPivotSmallTest, FileUtilsTest, DirectSolrSpellCheckerTest,
ZkStateWriterTest, MoreLikeThisHandlerTest, CustomCollectionTest, TestConfigReload, BigEndianAscendingWordSerializerTest,
TestFieldCacheWithThreads, TestFileDictionaryLookup, TestSolrCoreProperties, NotRequiredUniqueKeyTest,
SharedFSAutoReplicaFailoverUtilsTest, TestSimpleTrackingShardHandler, TimeZoneUtilsTest, TermVectorComponentTest,
SortByFunctionTest, DistributedIntervalFacetingTest, RulesTest, TestHashPartitioner, TestRandomRequestDistribution,
TestTrieFacet, HttpPartitionTest, TestScoreJoinQPScore, HdfsDirectoryTest, TestFieldCacheSort,
TestDistributedGrouping, HdfsNNFailoverTest, TestSchemaSimilarityResource, SpellPossibilityIteratorTest,
TestSimpleQParserPlugin, IndexBasedSpellCheckerTest, TestQueryUtils, TestAddFieldRealTimeGet,
BJQParserTest, TestFilteredDocIdSet, TestDocumentBuilder, SegmentsInfoRequestHandlerTest,
HighlighterTest, TestConfigSetsAPIZkFailure, SimpleMLTQParserTest, TestDFRSimilarityFactory,
TestRecoveryHdfs, VersionInfoTest, ConvertedLegacyTest, TestLeaderInitiatedRecoveryThread,
TestManagedResource, SoftAutoCommitTest, ZkControllerTest, TestRequestForwarding, DeleteReplicaTest,
AliasIntegrationTest, HdfsTlogReplayBufferedWhileIndexingTest, TestRandomFaceting, ZkSolrClientTest,
ShardRoutingCustomTest, DistributedSpellCheckComponentTest, TestCoreContainer, SimpleFacetsTest,
SolrCoreTest, SolrCmdDistributorTest, QueryElevationComponentTest, TestFunctionQuery, TestBadConfig,
ShowFileRequestHandlerTest, SolrIndexSplitterTest, SuggesterFSTTest, SuggesterTSTTest, SuggesterWFSTTest,
NoCacheHeaderTest, TestUpdate, TestWordDelimiterFilterFactory, StatelessScriptUpdateProcessorFactoryTest,
TestSurroundQueryParser, PrimitiveFieldTypeTest, XmlUpdateRequestHandlerTest, PathHierarchyTokenizerFactoryTest,
FastVectorHighlighterTest, SolrPluginUtilsTest]
   [junit4] Completed [378/611 (1!)] on J1 in 0.61s, 9 tests, 1 error <<< FAILURES!

[...truncated 757 lines...]
BUILD FAILED
/home/jenkins/workspace/Lucene-Solr-master-Linux/build.xml:740: The following error occurred
while executing this line:
/home/jenkins/workspace/Lucene-Solr-master-Linux/build.xml:684: The following error occurred
while executing this line:
/home/jenkins/workspace/Lucene-Solr-master-Linux/build.xml:59: The following error occurred
while executing this line:
/home/jenkins/workspace/Lucene-Solr-master-Linux/solr/build.xml:233: The following error occurred
while executing this line:
/home/jenkins/workspace/Lucene-Solr-master-Linux/solr/common-build.xml:531: The following
error occurred while executing this line:
/home/jenkins/workspace/Lucene-Solr-master-Linux/lucene/common-build.xml:1427: The following
error occurred while executing this line:
/home/jenkins/workspace/Lucene-Solr-master-Linux/lucene/common-build.xml:984: There were test
failures: 611 suites (10 ignored), 2558 tests, 1 error, 118 ignored (72 assumptions) [seed:
729B9C1F23267150]

Total time: 58 minutes 3 seconds
Build step 'Invoke Ant' marked build as failure
Archiving artifacts
[WARNINGS] Skipping publisher since build result is FAILURE
Recording test results
Email was triggered for: Failure - Any
Sending email for trigger: Failure - Any



Mime
View raw message