lucene-dev mailing list archives

Site index · List index
Message view « Date » · « Thread »
Top « Date » · « Thread »
From Apache Jenkins Server <jenk...@builds.apache.org>
Subject [JENKINS] Lucene-Solr-Tests-master - Build # 1222 - Failure
Date Mon, 20 Jun 2016 21:10:51 GMT
Build: https://builds.apache.org/job/Lucene-Solr-Tests-master/1222/

2 tests failed.
FAILED:  org.apache.lucene.codecs.asserting.TestAssertingDocValuesFormat.testGCDCompression

Error Message:
Test abandoned because suite timeout was reached.

Stack Trace:
java.lang.Exception: Test abandoned because suite timeout was reached.
	at __randomizedtesting.SeedInfo.seed([55AC07C517E060A2]:0)


FAILED:  junit.framework.TestSuite.org.apache.lucene.codecs.asserting.TestAssertingDocValuesFormat

Error Message:
Suite timeout exceeded (>= 7200000 msec).

Stack Trace:
java.lang.Exception: Suite timeout exceeded (>= 7200000 msec).
	at __randomizedtesting.SeedInfo.seed([55AC07C517E060A2]:0)




Build Log:
[...truncated 2043 lines...]
   [junit4] Suite: org.apache.lucene.codecs.asserting.TestAssertingDocValuesFormat
   [junit4]   2> NOTE: reproduce with: ant test  -Dtestcase=TestAssertingDocValuesFormat
-Dtests.method=testGCDCompression -Dtests.seed=55AC07C517E060A2 -Dtests.multiplier=2 -Dtests.slow=true
-Dtests.locale=bg-BG -Dtests.timezone=Pacific/Auckland -Dtests.asserts=true -Dtests.file.encoding=ISO-8859-1
   [junit4] ERROR   7165s J0 | TestAssertingDocValuesFormat.testGCDCompression <<<
   [junit4]    > Throwable #1: java.lang.Exception: Test abandoned because suite timeout
was reached.
   [junit4]    > 	at __randomizedtesting.SeedInfo.seed([55AC07C517E060A2]:0)
   [junit4]   2> NOTE: leaving temporary files on disk at: /x1/jenkins/jenkins-slave/workspace/Lucene-Solr-Tests-master/lucene/build/test-framework/test/J0/temp/lucene.codecs.asserting.TestAssertingDocValuesFormat_55AC07C517E060A2-001
   [junit4]   2> NOTE: test params are: codec=Asserting(Lucene62): {}, docValues:{}, maxPointsInLeafNode=995,
maxMBSortInHeap=5.2801274883535285, sim=RandomSimilarity(queryNorm=true,coord=no): {fieldname=DFR
I(ne)L1}, locale=bg-BG, timezone=Pacific/Auckland
   [junit4]   2> NOTE: Linux 3.13.0-85-generic amd64/Oracle Corporation 1.8.0_74 (64-bit)/cpus=4,threads=1,free=145324248,total=351797248
   [junit4]   2> NOTE: All tests run in this JVM: [TestAssertingTermVectorsFormat, ThrowInUncaught,
TestBaseExplanationTestCase, TestGroupFiltering, TestDisableFsyncFS, TestMockAnalyzer, Nested2,
Nested, TestMockCharFilter, TestAssertingDocValuesFormat]
   [junit4]   2> NOTE: reproduce with: ant test  -Dtestcase=TestAssertingDocValuesFormat
-Dtests.seed=55AC07C517E060A2 -Dtests.multiplier=2 -Dtests.slow=true -Dtests.locale=bg-BG
-Dtests.timezone=Pacific/Auckland -Dtests.asserts=true -Dtests.file.encoding=ISO-8859-1
   [junit4] ERROR   0.00s J0 | TestAssertingDocValuesFormat (suite) <<<
   [junit4]    > Throwable #1: java.lang.Exception: Suite timeout exceeded (>= 7200000
msec).
   [junit4]    > 	at __randomizedtesting.SeedInfo.seed([55AC07C517E060A2]:0)
   [junit4] Completed [41/41 (1!)] on J0 in 7220.13s, 43 tests, 2 errors <<< FAILURES!

[...truncated 12 lines...]
BUILD FAILED
/x1/jenkins/jenkins-slave/workspace/Lucene-Solr-Tests-master/build.xml:740: The following
error occurred while executing this line:
/x1/jenkins/jenkins-slave/workspace/Lucene-Solr-Tests-master/build.xml:684: The following
error occurred while executing this line:
/x1/jenkins/jenkins-slave/workspace/Lucene-Solr-Tests-master/build.xml:59: The following error
occurred while executing this line:
/x1/jenkins/jenkins-slave/workspace/Lucene-Solr-Tests-master/lucene/build.xml:470: The following
error occurred while executing this line:
/x1/jenkins/jenkins-slave/workspace/Lucene-Solr-Tests-master/lucene/common-build.xml:1427:
The following error occurred while executing this line:
/x1/jenkins/jenkins-slave/workspace/Lucene-Solr-Tests-master/lucene/common-build.xml:984:
There were test failures: 41 suites (1 ignored), 407 tests, 1 suite-level error, 1 error,
18 ignored (12 assumptions) [seed: 55AC07C517E060A2]

Total time: 131 minutes 58 seconds
Build step 'Invoke Ant' marked build as failure
Archiving artifacts
Recording test results
Email was triggered for: Failure - Any
Sending email for trigger: Failure - Any




Mime
View raw message