lucene-dev mailing list archives

Site index · List index
Message view « Date » · « Thread »
Top « Date » · « Thread »
From Apache Jenkins Server <jenk...@builds.apache.org>
Subject [JENKINS] Lucene-Solr-NightlyTests-6.x - Build # 87 - Still Failing
Date Wed, 08 Jun 2016 10:12:29 GMT
Build: https://builds.apache.org/job/Lucene-Solr-NightlyTests-6.x/87/

3 tests failed.
FAILED:  org.apache.solr.cloud.CollectionsAPIDistributedZkTest.test

Error Message:
Captured an uncaught exception in thread: Thread[id=207586, name=collection1, state=RUNNABLE, group=TGRP-CollectionsAPIDistributedZkTest]

Stack Trace:
com.carrotsearch.randomizedtesting.UncaughtExceptionError: Captured an uncaught exception in thread: Thread[id=207586, name=collection1, state=RUNNABLE, group=TGRP-CollectionsAPIDistributedZkTest]
Caused by: org.apache.solr.client.solrj.impl.HttpSolrClient$RemoteSolrException: Error from server at https://127.0.0.1:43784/z: collection already exists: awholynewstresscollection_collection1_3
	at __randomizedtesting.SeedInfo.seed([92B1F4F0A1883F9]:0)
	at org.apache.solr.client.solrj.impl.HttpSolrClient.executeMethod(HttpSolrClient.java:590)
	at org.apache.solr.client.solrj.impl.HttpSolrClient.request(HttpSolrClient.java:259)
	at org.apache.solr.client.solrj.impl.HttpSolrClient.request(HttpSolrClient.java:248)
	at org.apache.solr.client.solrj.impl.LBHttpSolrClient.doRequest(LBHttpSolrClient.java:404)
	at org.apache.solr.client.solrj.impl.LBHttpSolrClient.request(LBHttpSolrClient.java:357)
	at org.apache.solr.client.solrj.impl.CloudSolrClient.sendRequest(CloudSolrClient.java:1228)
	at org.apache.solr.client.solrj.impl.CloudSolrClient.requestWithRetryOnStaleState(CloudSolrClient.java:998)
	at org.apache.solr.client.solrj.impl.CloudSolrClient.request(CloudSolrClient.java:934)
	at org.apache.solr.client.solrj.SolrClient.request(SolrClient.java:1219)
	at org.apache.solr.cloud.AbstractFullDistribZkTestBase.createCollection(AbstractFullDistribZkTestBase.java:1599)
	at org.apache.solr.cloud.AbstractFullDistribZkTestBase.createCollection(AbstractFullDistribZkTestBase.java:1620)
	at org.apache.solr.cloud.CollectionsAPIDistributedZkTest$1CollectionThread.run(CollectionsAPIDistributedZkTest.java:987)


FAILED:  org.apache.solr.cloud.hdfs.HdfsCollectionsAPIDistributedZkTest.test

Error Message:
Captured an uncaught exception in thread: Thread[id=200747, name=collection5, state=RUNNABLE, group=TGRP-HdfsCollectionsAPIDistributedZkTest]

Stack Trace:
com.carrotsearch.randomizedtesting.UncaughtExceptionError: Captured an uncaught exception in thread: Thread[id=200747, name=collection5, state=RUNNABLE, group=TGRP-HdfsCollectionsAPIDistributedZkTest]
Caused by: org.apache.solr.client.solrj.impl.HttpSolrClient$RemoteSolrException: Error from server at https://127.0.0.1:35922/gqx/tw: Could not find collection : awholynewstresscollection_collection5_6
	at __randomizedtesting.SeedInfo.seed([92B1F4F0A1883F9]:0)
	at org.apache.solr.client.solrj.impl.HttpSolrClient.executeMethod(HttpSolrClient.java:590)
	at org.apache.solr.client.solrj.impl.HttpSolrClient.request(HttpSolrClient.java:259)
	at org.apache.solr.client.solrj.impl.HttpSolrClient.request(HttpSolrClient.java:248)
	at org.apache.solr.client.solrj.impl.LBHttpSolrClient.doRequest(LBHttpSolrClient.java:404)
	at org.apache.solr.client.solrj.impl.LBHttpSolrClient.request(LBHttpSolrClient.java:357)
	at org.apache.solr.client.solrj.impl.CloudSolrClient.sendRequest(CloudSolrClient.java:1228)
	at org.apache.solr.client.solrj.impl.CloudSolrClient.requestWithRetryOnStaleState(CloudSolrClient.java:998)
	at org.apache.solr.client.solrj.impl.CloudSolrClient.request(CloudSolrClient.java:934)
	at org.apache.solr.client.solrj.SolrClient.request(SolrClient.java:1219)
	at org.apache.solr.cloud.CollectionsAPIDistributedZkTest$1CollectionThread.run(CollectionsAPIDistributedZkTest.java:994)


FAILED:  junit.framework.TestSuite.org.apache.solr.handler.TestReplicationHandler

Error Message:
ObjectTracker found 1 object(s) that were not released!!! [NRTCachingDirectory]

Stack Trace:
java.lang.AssertionError: ObjectTracker found 1 object(s) that were not released!!! [NRTCachingDirectory]
	at __randomizedtesting.SeedInfo.seed([92B1F4F0A1883F9]:0)
	at org.junit.Assert.fail(Assert.java:93)
	at org.junit.Assert.assertTrue(Assert.java:43)
	at org.junit.Assert.assertNull(Assert.java:551)
	at org.apache.solr.SolrTestCaseJ4.teardownTestCases(SolrTestCaseJ4.java:257)
	at sun.reflect.NativeMethodAccessorImpl.invoke0(Native Method)
	at sun.reflect.NativeMethodAccessorImpl.invoke(NativeMethodAccessorImpl.java:62)
	at sun.reflect.DelegatingMethodAccessorImpl.invoke(DelegatingMethodAccessorImpl.java:43)
	at java.lang.reflect.Method.invoke(Method.java:498)
	at com.carrotsearch.randomizedtesting.RandomizedRunner.invoke(RandomizedRunner.java:1764)
	at com.carrotsearch.randomizedtesting.RandomizedRunner$7.evaluate(RandomizedRunner.java:834)
	at com.carrotsearch.randomizedtesting.rules.StatementAdapter.evaluate(StatementAdapter.java:36)
	at com.carrotsearch.randomizedtesting.rules.SystemPropertiesRestoreRule$1.evaluate(SystemPropertiesRestoreRule.java:57)
	at org.apache.lucene.util.AbstractBeforeAfterRule$1.evaluate(AbstractBeforeAfterRule.java:45)
	at com.carrotsearch.randomizedtesting.rules.StatementAdapter.evaluate(StatementAdapter.java:36)
	at org.apache.lucene.util.TestRuleStoreClassName$1.evaluate(TestRuleStoreClassName.java:41)
	at com.carrotsearch.randomizedtesting.rules.NoShadowingOrOverridesOnMethodsRule$1.evaluate(NoShadowingOrOverridesOnMethodsRule.java:40)
	at com.carrotsearch.randomizedtesting.rules.NoShadowingOrOverridesOnMethodsRule$1.evaluate(NoShadowingOrOverridesOnMethodsRule.java:40)
	at com.carrotsearch.randomizedtesting.rules.StatementAdapter.evaluate(StatementAdapter.java:36)
	at com.carrotsearch.randomizedtesting.rules.StatementAdapter.evaluate(StatementAdapter.java:36)
	at com.carrotsearch.randomizedtesting.rules.StatementAdapter.evaluate(StatementAdapter.java:36)
	at org.apache.lucene.util.TestRuleAssertionsRequired$1.evaluate(TestRuleAssertionsRequired.java:53)
	at org.apache.lucene.util.TestRuleMarkFailure$1.evaluate(TestRuleMarkFailure.java:47)
	at org.apache.lucene.util.TestRuleIgnoreAfterMaxFailures$1.evaluate(TestRuleIgnoreAfterMaxFailures.java:64)
	at org.apache.lucene.util.TestRuleIgnoreTestSuites$1.evaluate(TestRuleIgnoreTestSuites.java:54)
	at com.carrotsearch.randomizedtesting.rules.StatementAdapter.evaluate(StatementAdapter.java:36)
	at com.carrotsearch.randomizedtesting.ThreadLeakControl$StatementRunner.run(ThreadLeakControl.java:367)
	at java.lang.Thread.run(Thread.java:745)




Build Log:
[...truncated 11951 lines...]
   [junit4] Suite: org.apache.solr.handler.TestReplicationHandler
   [junit4]   2> Creating dataDir: /x1/jenkins/jenkins-slave/workspace/Lucene-Solr-NightlyTests-6.x/solr/build/solr-core/test/J0/temp/solr.handler.TestReplicationHandler_92B1F4F0A1883F9-001/init-core-data-001
   [junit4]   2> 2172069 INFO  (SUITE-TestReplicationHandler-seed#[92B1F4F0A1883F9]-worker) [    ] o.a.s.SolrTestCaseJ4 Randomized ssl (false) and clientAuth (false) via: @org.apache.solr.SolrTestCaseJ4$SuppressSSL(bugUrl=None)
   [junit4]   2> 2172070 INFO  (TEST-TestReplicationHandler.testRateLimitedReplication-seed#[92B1F4F0A1883F9]) [    ] o.a.s.SolrTestCaseJ4 ###Starting testRateLimitedReplication
   [junit4]   2> 2172071 INFO  (TEST-TestReplicationHandler.testRateLimitedReplication-seed#[92B1F4F0A1883F9]) [    ] o.a.s.SolrTestCaseJ4 Writing core.properties file to /x1/jenkins/jenkins-slave/workspace/Lucene-Solr-NightlyTests-6.x/solr/build/solr-core/test/J0/temp/solr.handler.TestReplicationHandler_92B1F4F0A1883F9-001/solr-instance-001/collection1
   [junit4]   2> 2172073 INFO  (TEST-TestReplicationHandler.testRateLimitedReplication-seed#[92B1F4F0A1883F9]) [    ] o.e.j.s.Server jetty-9.3.8.v20160314
   [junit4]   2> 2172124 INFO  (TEST-TestReplicationHandler.testRateLimitedReplication-seed#[92B1F4F0A1883F9]) [    ] o.e.j.s.h.ContextHandler Started o.e.j.s.ServletContextHandler@5516df3c{/solr,null,AVAILABLE}
   [junit4]   2> 2172124 INFO  (TEST-TestReplicationHandler.testRateLimitedReplication-seed#[92B1F4F0A1883F9]) [    ] o.e.j.s.ServerConnector Started ServerConnector@49a7696e{HTTP/1.1,[http/1.1]}{127.0.0.1:36434}
   [junit4]   2> 2172124 INFO  (TEST-TestReplicationHandler.testRateLimitedReplication-seed#[92B1F4F0A1883F9]) [    ] o.e.j.s.Server Started @2175452ms
   [junit4]   2> 2172124 INFO  (TEST-TestReplicationHandler.testRateLimitedReplication-seed#[92B1F4F0A1883F9]) [    ] o.a.s.c.s.e.JettySolrRunner Jetty properties: {solr.data.dir=/x1/jenkins/jenkins-slave/workspace/Lucene-Solr-NightlyTests-6.x/solr/build/solr-core/test/J0/temp/solr.handler.TestReplicationHandler_92B1F4F0A1883F9-001/solr-instance-001/collection1/data, hostContext=/solr, hostPort=36434}
   [junit4]   2> 2172124 INFO  (TEST-TestReplicationHandler.testRateLimitedReplication-seed#[92B1F4F0A1883F9]) [    ] o.a.s.s.SolrDispatchFilter SolrDispatchFilter.init(): sun.misc.Launcher$AppClassLoader@73d16e93
   [junit4]   2> 2172124 INFO  (TEST-TestReplicationHandler.testRateLimitedReplication-seed#[92B1F4F0A1883F9]) [    ] o.a.s.c.SolrResourceLoader new SolrResourceLoader for directory: '/x1/jenkins/jenkins-slave/workspace/Lucene-Solr-NightlyTests-6.x/solr/build/solr-core/test/J0/temp/solr.handler.TestReplicationHandler_92B1F4F0A1883F9-001/solr-instance-001'
   [junit4]   2> 2172124 INFO  (TEST-TestReplicationHandler.testRateLimitedReplication-seed#[92B1F4F0A1883F9]) [    ] o.a.s.c.SolrResourceLoader JNDI not configured for solr (NoInitialContextEx)
   [junit4]   2> 2172125 INFO  (TEST-TestReplicationHandler.testRateLimitedReplication-seed#[92B1F4F0A1883F9]) [    ] o.a.s.c.SolrResourceLoader solr home defaulted to 'solr/' (could not find system property or JNDI)
   [junit4]   2> 2172125 INFO  (TEST-TestReplicationHandler.testRateLimitedReplication-seed#[92B1F4F0A1883F9]) [    ] o.a.s.c.SolrXmlConfig Loading container configuration from /x1/jenkins/jenkins-slave/workspace/Lucene-Solr-NightlyTests-6.x/solr/build/solr-core/test/J0/temp/solr.handler.TestReplicationHandler_92B1F4F0A1883F9-001/solr-instance-001/solr.xml
   [junit4]   2> 2172128 INFO  (TEST-TestReplicationHandler.testRateLimitedReplication-seed#[92B1F4F0A1883F9]) [    ] o.a.s.c.CorePropertiesLocator Config-defined core root directory: /x1/jenkins/jenkins-slave/workspace/Lucene-Solr-NightlyTests-6.x/solr/build/solr-core/test/J0/temp/solr.handler.TestReplicationHandler_92B1F4F0A1883F9-001/solr-instance-001/.
   [junit4]   2> 2172128 INFO  (TEST-TestReplicationHandler.testRateLimitedReplication-seed#[92B1F4F0A1883F9]) [    ] o.a.s.c.CoreContainer New CoreContainer 1948168292
   [junit4]   2> 2172128 INFO  (TEST-TestReplicationHandler.testRateLimitedReplication-seed#[92B1F4F0A1883F9]) [    ] o.a.s.c.CoreContainer Loading cores into CoreContainer [instanceDir=/x1/jenkins/jenkins-slave/workspace/Lucene-Solr-NightlyTests-6.x/solr/build/solr-core/test/J0/temp/solr.handler.TestReplicationHandler_92B1F4F0A1883F9-001/solr-instance-001]
   [junit4]   2> 2172128 WARN  (TEST-TestReplicationHandler.testRateLimitedReplication-seed#[92B1F4F0A1883F9]) [    ] o.a.s.c.CoreContainer Couldn't add files from /x1/jenkins/jenkins-slave/workspace/Lucene-Solr-NightlyTests-6.x/solr/build/solr-core/test/J0/temp/solr.handler.TestReplicationHandler_92B1F4F0A1883F9-001/solr-instance-001/lib to classpath: /x1/jenkins/jenkins-slave/workspace/Lucene-Solr-NightlyTests-6.x/solr/build/solr-core/test/J0/temp/solr.handler.TestReplicationHandler_92B1F4F0A1883F9-001/solr-instance-001/lib
   [junit4]   2> 2172128 INFO  (TEST-TestReplicationHandler.testRateLimitedReplication-seed#[92B1F4F0A1883F9]) [    ] o.a.s.h.c.HttpShardHandlerFactory created with socketTimeout : 90000,urlScheme : ,connTimeout : 15000,maxConnectionsPerHost : 20,maxConnections : 10000,corePoolSize : 0,maximumPoolSize : 2147483647,maxThreadIdleTime : 5,sizeOfQueue : -1,fairnessPolicy : false,useRetries : false,
   [junit4]   2> 2172129 INFO  (TEST-TestReplicationHandler.testRateLimitedReplication-seed#[92B1F4F0A1883F9]) [    ] o.a.s.u.UpdateShardHandler Creating UpdateShardHandler HTTP client with params: socketTimeout=340000&connTimeout=45000&retry=true
   [junit4]   2> 2172129 INFO  (TEST-TestReplicationHandler.testRateLimitedReplication-seed#[92B1F4F0A1883F9]) [    ] o.a.s.l.LogWatcher SLF4J impl is org.slf4j.impl.Log4jLoggerFactory
   [junit4]   2> 2172129 INFO  (TEST-TestReplicationHandler.testRateLimitedReplication-seed#[92B1F4F0A1883F9]) [    ] o.a.s.l.LogWatcher Registering Log Listener [Log4j (org.slf4j.impl.Log4jLoggerFactory)]
   [junit4]   2> 2172130 INFO  (TEST-TestReplicationHandler.testRateLimitedReplication-seed#[92B1F4F0A1883F9]) [    ] o.a.s.c.CoreContainer Security conf doesn't exist. Skipping setup for authorization module.
   [junit4]   2> 2172130 INFO  (TEST-TestReplicationHandler.testRateLimitedReplication-seed#[92B1F4F0A1883F9]) [    ] o.a.s.c.CoreContainer No authentication plugin used.
   [junit4]   2> 2172135 INFO  (TEST-TestReplicationHandler.testRateLimitedReplication-seed#[92B1F4F0A1883F9]) [    ] o.a.s.c.CorePropertiesLocator Looking for core definitions underneath /x1/jenkins/jenkins-slave/workspace/Lucene-Solr-NightlyTests-6.x/solr/build/solr-core/test/J0/temp/solr.handler.TestReplicationHandler_92B1F4F0A1883F9-001/solr-instance-001/.
   [junit4]   2> 2172136 INFO  (TEST-TestReplicationHandler.testRateLimitedReplication-seed#[92B1F4F0A1883F9]) [    ] o.a.s.c.CoreDescriptor Created CoreDescriptor: {name=collection1, config=solrconfig.xml, loadOnStartup=true, schema=schema.xml, configSetProperties=configsetprops.json, transient=false, dataDir=data/}
   [junit4]   2> 2172136 INFO  (TEST-TestReplicationHandler.testRateLimitedReplication-seed#[92B1F4F0A1883F9]) [    ] o.a.s.c.CorePropertiesLocator Found core collection1 in /x1/jenkins/jenkins-slave/workspace/Lucene-Solr-NightlyTests-6.x/solr/build/solr-core/test/J0/temp/solr.handler.TestReplicationHandler_92B1F4F0A1883F9-001/solr-instance-001/./collection1
   [junit4]   2> 2172136 INFO  (TEST-TestReplicationHandler.testRateLimitedReplication-seed#[92B1F4F0A1883F9]) [    ] o.a.s.c.CorePropertiesLocator Found 1 core definitions
   [junit4]   2> 2172151 INFO  (TEST-TestReplicationHandler.testRateLimitedReplication-seed#[92B1F4F0A1883F9]) [    ] o.a.s.s.SolrDispatchFilter user.dir=/x1/jenkins/jenkins-slave/workspace/Lucene-Solr-NightlyTests-6.x/solr/build/solr-core/test/J0
   [junit4]   2> 2172151 INFO  (TEST-TestReplicationHandler.testRateLimitedReplication-seed#[92B1F4F0A1883F9]) [    ] o.a.s.s.SolrDispatchFilter SolrDispatchFilter.init() done
   [junit4]   2> 2172151 INFO  (coreLoadExecutor-8972-thread-1) [    ] o.a.s.c.SolrResourceLoader new SolrResourceLoader for directory: '/x1/jenkins/jenkins-slave/workspace/Lucene-Solr-NightlyTests-6.x/solr/build/solr-core/test/J0/temp/solr.handler.TestReplicationHandler_92B1F4F0A1883F9-001/solr-instance-001/collection1'
   [junit4]   2> 2172159 INFO  (coreLoadExecutor-8972-thread-1) [    ] o.a.s.c.SolrResourceLoader JNDI not configured for solr (NoInitialContextEx)
   [junit4]   2> 2172159 INFO  (coreLoadExecutor-8972-thread-1) [    ] o.a.s.c.SolrResourceLoader solr home defaulted to 'solr/' (could not find system property or JNDI)
   [junit4]   2> 2172163 INFO  (coreLoadExecutor-8972-thread-1) [    ] o.a.s.c.SolrConfig current version of requestparams : -1
   [junit4]   2> 2172165 WARN  (coreLoadExecutor-8972-thread-1) [    ] o.a.s.c.Config Beginning with Solr 5.5, <mergePolicy> is deprecated, use <mergePolicyFactory> instead.
   [junit4]   2> 2172166 INFO  (coreLoadExecutor-8972-thread-1) [    ] o.a.s.c.SolrConfig Using Lucene MatchVersion: 6.1.0
   [junit4]   2> 2172170 INFO  (coreLoadExecutor-8972-thread-1) [    ] o.a.s.c.SolrConfig Loaded SolrConfig: solrconfig.xml
   [junit4]   2> 2172172 INFO  (coreLoadExecutor-8972-thread-1) [    ] o.a.s.s.IndexSchema [collection1] Schema name=test
   [junit4]   2> 2172174 INFO  (coreLoadExecutor-8972-thread-1) [    ] o.a.s.s.IndexSchema unique key field: id
   [junit4]   2> 2172178 INFO  (coreLoadExecutor-8972-thread-1) [    ] o.a.s.c.ConfigSetProperties Did not find ConfigSet properties, assuming default properties: Can't find resource 'configsetprops.json' in classpath or '/x1/jenkins/jenkins-slave/workspace/Lucene-Solr-NightlyTests-6.x/solr/build/solr-core/test/J0/temp/solr.handler.TestReplicationHandler_92B1F4F0A1883F9-001/solr-instance-001/collection1'
   [junit4]   2> 2172178 INFO  (coreLoadExecutor-8972-thread-1) [    ] o.a.s.c.CoreContainer Creating SolrCore 'collection1' using configuration from instancedir /x1/jenkins/jenkins-slave/workspace/Lucene-Solr-NightlyTests-6.x/solr/build/solr-core/test/J0/temp/solr.handler.TestReplicationHandler_92B1F4F0A1883F9-001/solr-instance-001/./collection1
   [junit4]   2> 2172178 INFO  (coreLoadExecutor-8972-thread-1) [    x:collection1] o.a.s.c.SolrCore org.apache.solr.core.MockDirectoryFactory
   [junit4]   2> 2172178 INFO  (coreLoadExecutor-8972-thread-1) [    x:collection1] o.a.s.c.SolrCore [[collection1] ] Opening new SolrCore at [/x1/jenkins/jenkins-slave/workspace/Lucene-Solr-NightlyTests-6.x/solr/build/solr-core/test/J0/temp/solr.handler.TestReplicationHandler_92B1F4F0A1883F9-001/solr-instance-001/collection1], dataDir=[/x1/jenkins/jenkins-slave/workspace/Lucene-Solr-NightlyTests-6.x/solr/build/solr-core/test/J0/temp/solr.handler.TestReplicationHandler_92B1F4F0A1883F9-001/solr-instance-001/./collection1/data/]
   [junit4]   2> 2172178 INFO  (coreLoadExecutor-8972-thread-1) [    x:collection1] o.a.s.c.SolrCore JMX monitoring not detected for core: collection1
   [junit4]   2> 2172179 INFO  (coreLoadExecutor-8972-thread-1) [    x:collection1] o.a.s.c.CachingDirectoryFactory return new directory for /x1/jenkins/jenkins-slave/workspace/Lucene-Solr-NightlyTests-6.x/solr/build/solr-core/test/J0/temp/solr.handler.TestReplicationHandler_92B1F4F0A1883F9-001/solr-instance-001/./collection1/data
   [junit4]   2> 2172179 INFO  (coreLoadExecutor-8972-thread-1) [    x:collection1] o.a.s.c.SolrCore New index directory detected: old=null new=/x1/jenkins/jenkins-slave/workspace/Lucene-Solr-NightlyTests-6.x/solr/build/solr-core/test/J0/temp/solr.handler.TestReplicationHandler_92B1F4F0A1883F9-001/solr-instance-001/./collection1/data/index/
   [junit4]   2> 2172179 WARN  (coreLoadExecutor-8972-thread-1) [    x:collection1] o.a.s.c.SolrCore [collection1] Solr index directory '/x1/jenkins/jenkins-slave/workspace/Lucene-Solr-NightlyTests-6.x/solr/build/solr-core/test/J0/temp/solr.handler.TestReplicationHandler_92B1F4F0A1883F9-001/solr-instance-001/./collection1/data/index' doesn't exist. Creating new index...
   [junit4]   2> 2172179 INFO  (coreLoadExecutor-8972-thread-1) [    x:collection1] o.a.s.c.CachingDirectoryFactory return new directory for /x1/jenkins/jenkins-slave/workspace/Lucene-Solr-NightlyTests-6.x/solr/build/solr-core/test/J0/temp/solr.handler.TestReplicationHandler_92B1F4F0A1883F9-001/solr-instance-001/./collection1/data/index
   [junit4]   2> 2172179 INFO  (coreLoadExecutor-8972-thread-1) [    x:collection1] o.a.s.u.RandomMergePolicy RandomMergePolicy wrapping class org.apache.lucene.index.TieredMergePolicy: [TieredMergePolicy: maxMergeAtOnce=15, maxMergeAtOnceExplicit=18, maxMergedSegmentMB=2.4765625, floorSegmentMB=0.4873046875, forceMergeDeletesPctAllowed=1.4738899718476983, segmentsPerTier=11.0, maxCFSSegmentSizeMB=8.796093022207999E12, noCFSRatio=0.3471450276784183
   [junit4]   2> 2172180 INFO  (coreLoadExecutor-8972-thread-1) [    x:collection1] o.a.s.c.SolrDeletionPolicy SolrDeletionPolicy.onCommit: commits: num=1
   [junit4]   2> 	commit{dir=MockDirectoryWrapper(RAMDirectory@3f6e4784 lockFactory=org.apache.lucene.store.SingleInstanceLockFactory@63b964cc),segFN=segments_1,generation=1}
   [junit4]   2> 2172180 INFO  (coreLoadExecutor-8972-thread-1) [    x:collection1] o.a.s.c.SolrDeletionPolicy newest commit generation = 1
   [junit4]   2> 2172181 INFO  (coreLoadExecutor-8972-thread-1) [    x:collection1] o.a.s.c.SolrCore no updateRequestProcessorChain defined as default, creating implicit default
   [junit4]   2> 2172182 INFO  (coreLoadExecutor-8972-thread-1) [    x:collection1] o.a.s.h.l.XMLLoader xsltCacheLifetimeSeconds=60
   [junit4]   2> 2172182 INFO  (coreLoadExecutor-8972-thread-1) [    x:collection1] o.a.s.h.l.XMLLoader xsltCacheLifetimeSeconds=60
   [junit4]   2> 2172182 INFO  (coreLoadExecutor-8972-thread-1) [    x:collection1] o.a.s.h.l.XMLLoader xsltCacheLifetimeSeconds=60
   [junit4]   2> 2172183 INFO  (coreLoadExecutor-8972-thread-1) [    x:collection1] o.a.s.h.l.XMLLoader xsltCacheLifetimeSeconds=60
   [junit4]   2> 2172183 INFO  (coreLoadExecutor-8972-thread-1) [    x:collection1] o.a.s.c.PluginBag requestHandler : 'lazy' created with startup=lazy 
   [junit4]   2> 2172183 INFO  (coreLoadExecutor-8972-thread-1) [    x:collection1] o.a.s.c.RequestHandlers Registered paths: /admin/mbeans,standard,lazy,/update/json/docs,/admin/luke,/export,/get,/admin/properties,/update/json,/admin/threads,/update/csv,/sql,/graph,/admin/segments,/admin/system,/replication,defaults,/config,/stream,/schema,/admin/plugins,/admin/logging,/admin/ping,/update,/admin/file
   [junit4]   2> 2172184 INFO  (coreLoadExecutor-8972-thread-1) [    x:collection1] o.a.s.c.SolrCore Using default statsCache cache: org.apache.solr.search.stats.LocalStatsCache
   [junit4]   2> 2172184 INFO  (OldIndexDirectoryCleanupThreadForCore-collection1) [    x:collection1] o.a.s.c.SolrCore Looking for old index directories to cleanup for core collection1 in /x1/jenkins/jenkins-slave/workspace/Lucene-Solr-NightlyTests-6.x/solr/build/solr-core/test/J0/temp/solr.handler.TestReplicationHandler_92B1F4F0A1883F9-001/solr-instance-001/./collection1/data/
   [junit4]   2> 2172184 INFO  (coreLoadExecutor-8972-thread-1) [    x:collection1] o.a.s.u.CommitTracker Hard AutoCommit: disabled
   [junit4]   2> 2172184 INFO  (coreLoadExecutor-8972-thread-1) [    x:collection1] o.a.s.u.CommitTracker Soft AutoCommit: disabled
   [junit4]   2> 2172184 INFO  (coreLoadExecutor-8972-thread-1) [    x:collection1] o.a.s.u.RandomMergePolicy RandomMergePolicy wrapping class org.apache.lucene.index.TieredMergePolicy: [TieredMergePolicy: maxMergeAtOnce=31, maxMergeAtOnceExplicit=28, maxMergedSegmentMB=42.39453125, floorSegmentMB=1.134765625, forceMergeDeletesPctAllowed=7.635362651178266, segmentsPerTier=23.0, maxCFSSegmentSizeMB=8.796093022207999E12, noCFSRatio=0.578289210885186
   [junit4]   2> 2172184 INFO  (coreLoadExecutor-8972-thread-1) [    x:collection1] o.a.s.c.SolrDeletionPolicy SolrDeletionPolicy.onInit: commits: num=1
   [junit4]   2> 	commit{dir=MockDirectoryWrapper(RAMDirectory@3f6e4784 lockFactory=org.apache.lucene.store.SingleInstanceLockFactory@63b964cc),segFN=segments_1,generation=1}
   [junit4]   2> 2172184 INFO  (coreLoadExecutor-8972-thread-1) [    x:collection1] o.a.s.c.SolrDeletionPolicy newest commit generation = 1
   [junit4]   2> 2172184 INFO  (coreLoadExecutor-8972-thread-1) [    x:collection1] o.a.s.s.SolrIndexSearcher Opening [Searcher@314cb1a3[collection1] main]
   [junit4]   2> 2172185 INFO  (coreLoadExecutor-8972-thread-1) [    x:collection1] o.a.s.r.ManagedResourceStorage File-based storage initialized to use dir: /x1/jenkins/jenkins-slave/workspace/Lucene-Solr-NightlyTests-6.x/solr/build/solr-core/test/J0/temp/solr.handler.TestReplicationHandler_92B1F4F0A1883F9-001/solr-instance-001/collection1/conf
   [junit4]   2> 2172185 INFO  (coreLoadExecutor-8972-thread-1) [    x:collection1] o.a.s.r.RestManager Initializing RestManager with initArgs: {storageDir=/x1/jenkins/jenkins-slave/workspace/Lucene-Solr-NightlyTests-6.x/solr/build/solr-core/test/J0/temp/solr.handler.TestReplicationHandler_92B1F4F0A1883F9-001/solr-instance-001/collection1/conf}
   [junit4]   2> 2172185 INFO  (coreLoadExecutor-8972-thread-1) [    x:collection1] o.a.s.r.ManagedResourceStorage Reading _rest_managed.json using file:dir=/x1/jenkins/jenkins-slave/workspace/Lucene-Solr-NightlyTests-6.x/solr/build/solr-core/test/J0/temp/solr.handler.TestReplicationHandler_92B1F4F0A1883F9-001/solr-instance-001/collection1/conf
   [junit4]   2> 2172185 INFO  (coreLoadExecutor-8972-thread-1) [    x:collection1] o.a.s.r.RestManager Initializing 0 registered ManagedResources
   [junit4]   2> 2172185 INFO  (coreLoadExecutor-8972-thread-1) [    x:collection1] o.a.s.h.ReplicationHandler Replication enabled for following config files: schema.xml,xslt/dummy.xsl
   [junit4]   2> 2172185 INFO  (coreLoadExecutor-8972-thread-1) [    x:collection1] o.a.s.h.ReplicationHandler Commits will be reserved for  10000
   [junit4]   2> 2172185 INFO  (coreLoadExecutor-8972-thread-1) [    x:collection1] o.a.s.c.CoreContainer registering core: collection1
   [junit4]   2> 2172186 INFO  (searcherExecutor-8973-thread-1-processing-x:collection1) [    x:collection1] o.a.s.c.SolrCore [collection1] Registered new searcher Searcher@314cb1a3[collection1] main{ExitableDirectoryReader(UninvertingDirectoryReader())}
   [junit4]   2> 2172652 INFO  (TEST-TestReplicationHandler.testRateLimitedReplication-seed#[92B1F4F0A1883F9]) [    ] o.a.s.SolrTestCaseJ4 Writing core.properties file to /x1/jenkins/jenkins-slave/workspace/Lucene-Solr-NightlyTests-6.x/solr/build/solr-core/test/J0/temp/solr.handler.TestReplicationHandler_92B1F4F0A1883F9-001/solr-instance-002/collection1
   [junit4]   2> 2172654 INFO  (TEST-TestReplicationHandler.testRateLimitedReplication-seed#[92B1F4F0A1883F9]) [    ] o.e.j.s.Server jetty-9.3.8.v20160314
   [junit4]   2> 2172681 INFO  (TEST-TestReplicationHandler.testRateLimitedReplication-seed#[92B1F4F0A1883F9]) [    ] o.e.j.s.h.ContextHandler Started o.e.j.s.ServletContextHandler@c1781f2{/solr,null,AVAILABLE}
   [junit4]   2> 2172681 INFO  (TEST-TestReplicationHandler.testRateLimitedReplication-seed#[92B1F4F0A1883F9]) [    ] o.e.j.s.ServerConnector Started ServerConnector@334c342d{HTTP/1.1,[http/1.1]}{127.0.0.1:53747}
   [junit4]   2> 2172681 INFO  (TEST-TestReplicationHandler.testRateLimitedReplication-seed#[92B1F4F0A1883F9]) [    ] o.e.j.s.Server Started @2176009ms
   [junit4]   2> 2172681 INFO  (TEST-TestReplicationHandler.testRateLimitedReplication-seed#[92B1F4F0A1883F9]) [    ] o.a.s.c.s.e.JettySolrRunner Jetty properties: {solr.data.dir=/x1/jenkins/jenkins-slave/workspace/Lucene-Solr-NightlyTests-6.x/solr/build/solr-core/test/J0/temp/solr.handler.TestReplicationHandler_92B1F4F0A1883F9-001/solr-instance-002/collection1/data, hostContext=/solr, hostPort=53747}
   [junit4]   2> 2172681 INFO  (TEST-TestReplicationHandler.testRateLimitedReplication-seed#[92B1F4F0A1883F9]) [    ] o.a.s.s.SolrDispatchFilter SolrDispatchFilter.init(): sun.misc.Launcher$AppClassLoader@73d16e93
   [junit4]   2> 2172681 INFO  (TEST-TestReplicationHandler.testRateLimitedReplication-seed#[92B1F4F0A1883F9]) [    ] o.a.s.c.SolrResourceLoader new SolrResourceLoader for directory: '/x1/jenkins/jenkins-slave/workspace/Lucene-Solr-NightlyTests-6.x/solr/build/solr-core/test/J0/temp/solr.handler.TestReplicationHandler_92B1F4F0A1883F9-001/solr-instance-002'
   [junit4]   2> 2172681 INFO  (TEST-TestReplicationHandler.testRateLimitedReplication-seed#[92B1F4F0A1883F9]) [    ] o.a.s.c.SolrResourceLoader JNDI not configured for solr (NoInitialContextEx)
   [junit4]   2> 2172681 INFO  (TEST-TestReplicationHandler.testRateLimitedReplication-seed#[92B1F4F0A1883F9]) [    ] o.a.s.c.SolrResourceLoader solr home defaulted to 'solr/' (could not find system property or JNDI)
   [junit4]   2> 2172682 INFO  (TEST-TestReplicationHandler.testRateLimitedReplication-seed#[92B1F4F0A1883F9]) [    ] o.a.s.c.SolrXmlConfig Loading container configuration from /x1/jenkins/jenkins-slave/workspace/Lucene-Solr-NightlyTests-6.x/solr/build/solr-core/test/J0/temp/solr.handler.TestReplicationHandler_92B1F4F0A1883F9-001/solr-instance-002/solr.xml
   [junit4]   2> 2172687 INFO  (TEST-TestReplicationHandler.testRateLimitedReplication-seed#[92B1F4F0A1883F9]) [    ] o.a.s.c.CorePropertiesLocator Config-defined core root directory: /x1/jenkins/jenkins-slave/workspace/Lucene-Solr-NightlyTests-6.x/solr/build/solr-core/test/J0/temp/solr.handler.TestReplicationHandler_92B1F4F0A1883F9-001/solr-instance-002/.
   [junit4]   2> 2172687 INFO  (TEST-TestReplicationHandler.testRateLimitedReplication-seed#[92B1F4F0A1883F9]) [    ] o.a.s.c.CoreContainer New CoreContainer 771937308
   [junit4]   2> 2172687 INFO  (TEST-TestReplicationHandler.testRateLimitedReplication-seed#[92B1F4F0A1883F9]) [    ] o.a.s.c.CoreContainer Loading cores into CoreContainer [instanceDir=/x1/jenkins/jenkins-slave/workspace/Lucene-Solr-NightlyTests-6.x/solr/build/solr-core/test/J0/temp/solr.handler.TestReplicationHandler_92B1F4F0A1883F9-001/solr-instance-002]
   [junit4]   2> 2172687 WARN  (TEST-TestReplicationHandler.testRateLimitedReplication-seed#[92B1F4F0A1883F9]) [    ] o.a.s.c.CoreContainer Couldn't add files from /x1/jenkins/jenkins-slave/workspace/Lucene-Solr-NightlyTests-6.x/solr/build/solr-core/test/J0/temp/solr.handler.TestReplicationHandler_92B1F4F0A1883F9-001/solr-instance-002/lib to classpath: /x1/jenkins/jenkins-slave/workspace/Lucene-Solr-NightlyTests-6.x/solr/build/solr-core/test/J0/temp/solr.handler.TestReplicationHandler_92B1F4F0A1883F9-001/solr-instance-002/lib
   [junit4]   2> 2172694 INFO  (TEST-TestReplicationHandler.testRateLimitedReplication-seed#[92B1F4F0A1883F9]) [    ] o.a.s.h.c.HttpShardHandlerFactory created with socketTimeout : 90000,urlScheme : ,connTimeout : 15000,maxConnectionsPerHost : 20,maxConnections : 10000,corePoolSize : 0,maximumPoolSize : 2147483647,maxThreadIdleTime : 5,sizeOfQueue : -1,fairnessPolicy : false,useRetries : false,
   [junit4]   2> 2172694 INFO  (TEST-TestReplicationHandler.testRateLimitedReplication-seed#[92B1F4F0A1883F9]) [    ] o.a.s.u.UpdateShardHandler Creating UpdateShardHandler HTTP client with params: socketTimeout=340000&connTimeout=45000&retry=true
   [junit4]   2> 2172695 INFO  (TEST-TestReplicationHandler.testRateLimitedReplication-seed#[92B1F4F0A1883F9]) [    ] o.a.s.l.LogWatcher SLF4J impl is org.slf4j.impl.Log4jLoggerFactory
   [junit4]   2> 2172695 INFO  (TEST-TestReplicationHandler.testRateLimitedReplication-seed#[92B1F4F0A1883F9]) [    ] o.a.s.l.LogWatcher Registering Log Listener [Log4j (org.slf4j.impl.Log4jLoggerFactory)]
   [junit4]   2> 2172695 INFO  (TEST-TestReplicationHandler.testRateLimitedReplication-seed#[92B1F4F0A1883F9]) [    ] o.a.s.c.CoreContainer Security conf doesn't exist. Skipping setup for authorization module.
   [junit4]   2> 2172695 INFO  (TEST-TestReplicationHandler.testRateLimitedReplication-seed#[92B1F4F0A1883F9]) [    ] o.a.s.c.CoreContainer No authentication plugin used.
   [junit4]   2> 2172698 INFO  (TEST-TestReplicationHandler.testRateLimitedReplication-seed#[92B1F4F0A1883F9]) [    ] o.a.s.c.CorePropertiesLocator Looking for core definitions underneath /x1/jenkins/jenkins-slave/workspace/Lucene-Solr-NightlyTests-6.x/solr/build/solr-core/test/J0/temp/solr.handler.TestReplicationHandler_92B1F4F0A1883F9-001/solr-instance-002/.
   [junit4]   2> 2172699 INFO  (TEST-TestReplicationHandler.testRateLimitedReplication-seed#[92B1F4F0A1883F9]) [    ] o.a.s.c.CoreDescriptor Created CoreDescriptor: {name=collection1, config=solrconfig.xml, loadOnStartup=true, schema=schema.xml, configSetProperties=configsetprops.json, transient=false, dataDir=data/}
   [junit4]   2> 2172699 INFO  (TEST-TestReplicationHandler.testRateLimitedReplication-seed#[92B1F4F0A1883F9]) [    ] o.a.s.c.CorePropertiesLocator Found core collection1 in /x1/jenkins/jenkins-slave/workspace/Lucene-Solr-NightlyTests-6.x/solr/build/solr-core/test/J0/temp/solr.handler.TestReplicationHandler_92B1F4F0A1883F9-001/solr-instance-002/./collection1
   [junit4]   2> 2172699 INFO  (TEST-TestReplicationHandler.testRateLimitedReplication-seed#[92B1F4F0A1883F9]) [    ] o.a.s.c.CorePropertiesLocator Found 1 core definitions
   [junit4]   2> 2172706 INFO  (coreLoadExecutor-8982-thread-1) [    ] o.a.s.c.SolrResourceLoader new SolrResourceLoader for directory: '/x1/jenkins/jenkins-slave/workspace/Lucene-Solr-NightlyTests-6.x/solr/build/solr-core/test/J0/temp/solr.handler.TestReplicationHandler_92B1F4F0A1883F9-001/solr-instance-002/collection1'
   [junit4]   2> 2172706 INFO  (TEST-TestReplicationHandler.testRateLimitedReplication-seed#[92B1F4F0A1883F9]) [    ] o.a.s.s.SolrDispatchFilter user.dir=/x1/jenkins/jenkins-slave/workspace/Lucene-Solr-NightlyTests-6.x/solr/build/solr-core/test/J0
   [junit4]   2> 2172720 INFO  (coreLoadExecutor-8982-thread-1) [    ] o.a.s.c.SolrResourceLoader JNDI not configured for solr (NoInitialContextEx)
   [junit4]   2> 2172720 INFO  (TEST-TestReplicationHandler.testRateLimitedReplication-seed#[92B1F4F0A1883F9]) [    ] o.a.s.s.SolrDispatchFilter SolrDispatchFilter.init() done
   [junit4]   2> 2172720 INFO  (coreLoadExecutor-8982-thread-1) [    ] o.a.s.c.SolrResourceLoader solr home defaulted to 'solr/' (could not find system property or JNDI)
   [junit4]   2> 2172724 INFO  (coreLoadExecutor-8982-thread-1) [    ] o.a.s.c.SolrConfig current version of requestparams : -1
   [junit4]   2> 2172726 WARN  (coreLoadExecutor-8982-thread-1) [    ] o.a.s.c.Config Beginning with Solr 5.5, <mergePolicy> is deprecated, use <mergePolicyFactory> instead.
   [junit4]   2> 2172726 INFO  (coreLoadExecutor-8982-thread-1) [    ] o.a.s.c.SolrConfig Using Lucene MatchVersion: 6.1.0
   [junit4]   2> 2172731 INFO  (coreLoadExecutor-8982-thread-1) [    ] o.a.s.c.SolrConfig Loaded SolrConfig: solrconfig.xml
   [junit4]   2> 2172732 INFO  (coreLoadExecutor-8982-thread-1) [    ] o.a.s.s.IndexSchema [collection1] Schema name=test
   [junit4]   2> 2172734 INFO  (coreLoadExecutor-8982-thread-1) [    ] o.a.s.s.IndexSchema unique key field: id
   [junit4]   2> 2172734 INFO  (coreLoadExecutor-8982-thread-1) [    ] o.a.s.c.ConfigSetProperties Did not find ConfigSet properties, assuming default properties: Can't find resource 'configsetprops.json' in classpath or '/x1/jenkins/jenkins-slave/workspace/Lucene-Solr-NightlyTests-6.x/solr/build/solr-core/test/J0/temp/solr.handler.TestReplicationHandler_92B1F4F0A1883F9-001/solr-instance-002/collection1'
   [junit4]   2> 2172734 INFO  (coreLoadExecutor-8982-thread-1) [    ] o.a.s.c.CoreContainer Creating SolrCore 'collection1' using configuration from instancedir /x1/jenkins/jenkins-slave/workspace/Lucene-Solr-NightlyTests-6.x/solr/build/solr-core/test/J0/temp/solr.handler.TestReplicationHandler_92B1F4F0A1883F9-001/solr-instance-002/./collection1
   [junit4]   2> 2172734 INFO  (coreLoadExecutor-8982-thread-1) [    x:collection1] o.a.s.c.SolrCore org.apache.solr.core.MockDirectoryFactory
   [junit4]   2> 2172735 INFO  (coreLoadExecutor-8982-thread-1) [    x:collection1] o.a.s.c.SolrCore [[collection1] ] Opening new SolrCore at [/x1/jenkins/jenkins-slave/workspace/Lucene-Solr-NightlyTests-6.x/solr/build/solr-core/test/J0/temp/solr.handler.TestReplicationHandler_92B1F4F0A1883F9-001/solr-instance-002/collection1], dataDir=[/x1/jenkins/jenkins-slave/workspace/Lucene-Solr-NightlyTests-6.x/solr/build/solr-core/test/J0/temp/solr.handler.TestReplicationHandler_92B1F4F0A1883F9-001/solr-instance-002/./collection1/data/]
   [junit4]   2> 2172735 INFO  (coreLoadExecutor-8982-thread-1) [    x:collection1] o.a.s.c.SolrCore JMX monitoring not detected for core: collection1
   [junit4]   2> 2172735 INFO  (coreLoadExecutor-8982-thread-1) [    x:collection1] o.a.s.c.CachingDirectoryFactory return new directory for /x1/jenkins/jenkins-slave/workspace/Lucene-Solr-NightlyTests-6.x/solr/build/solr-core/test/J0/temp/solr.handler.TestReplicationHandler_92B1F4F0A1883F9-001/solr-instance-002/./collection1/data
   [junit4]   2> 2172735 INFO  (coreLoadExecutor-8982-thread-1) [    x:collection1] o.a.s.c.SolrCore New index directory detected: old=null new=/x1/jenkins/jenkins-slave/workspace/Lucene-Solr-NightlyTests-6.x/solr/build/solr-core/test/J0/temp/solr.handler.TestReplicationHandler_92B1F4F0A1883F9-001/solr-instance-002/./collection1/data/index/
   [junit4]   2> 2172735 WARN  (coreLoadExecutor-8982-thread-1) [    x:collection1] o.a.s.c.SolrCore [collection1] Solr index directory '/x1/jenkins/jenkins-slave/workspace/Lucene-Solr-NightlyTests-6.x/solr/build/solr-core/test/J0/temp/solr.handler.TestReplicationHandler_92B1F4F0A1883F9-001/solr-instance-002/./collection1/data/index' doesn't exist. Creating new index...
   [junit4]   2> 2172736 INFO  (coreLoadExecutor-8982-thread-1) [    x:collection1] o.a.s.c.CachingDirectoryFactory return new directory for /x1/jenkins/jenkins-slave/workspace/Lucene-Solr-NightlyTests-6.x/solr/build/solr-core/test/J0/temp/solr.handler.TestReplicationHandler_92B1F4F0A1883F9-001/solr-instance-002/./collection1/data/index
   [junit4]   2> 2172736 INFO  (coreLoadExecutor-8982-thread-1) [    x:collection1] o.a.s.u.RandomMergePolicy RandomMergePolicy wrapping class org.apache.lucene.index.TieredMergePolicy: [TieredMergePolicy: maxMergeAtOnce=15, maxMergeAtOnceExplicit=18, maxMergedSegmentMB=2.4765625, floorSegmentMB=0.4873046875, forceMergeDeletesPctAllowed=1.4738899718476983, segmentsPerTier=11.0, maxCFSSegmentSizeMB=8.796093022207999E12, noCFSRatio=0.3471450276784183
   [junit4]   2> 2172736 INFO  (coreLoadExecutor-8982-thread-1) [    x:collection1] o.a.s.c.SolrDeletionPolicy SolrDeletionPolicy.onCommit: commits: num=1
   [junit4]   2> 	commit{dir=MockDirectoryWrapper(RAMDirectory@634f72c2 lockFactory=org.apache.lucene.store.SingleInstanceLockFactory@5132cfa4),segFN=segments_1,generation=1}
   [junit4]   2> 2172736 INFO  (coreLoadExecutor-8982-thread-1) [    x:collection1] o.a.s.c.SolrDeletionPolicy newest commit generation = 1
   [junit4]   2> 2172737 INFO  (coreLoadExecutor-8982-thread-1) [    x:collection1] o.a.s.c.SolrCore no updateRequestProcessorChain defined as default, creating implicit default
   [junit4]   2> 2172738 INFO  (coreLoadExecutor-8982-thread-1) [    x:collection1] o.a.s.h.l.XMLLoader xsltCacheLifetimeSeconds=60
   [junit4]   2> 2172738 INFO  (coreLoadExecutor-8982-thread-1) [    x:collection1] o.a.s.h.l.XMLLoader xsltCacheLifetimeSeconds=60
   [junit4]   2> 2172738 INFO  (coreLoadExecutor-8982-thread-1) [    x:collection1] o.a.s.h.l.XMLLoader xsltCacheLifetimeSeconds=60
   [junit4]   2> 2172739 INFO  (coreLoadExecutor-8982-thread-1) [    x:collection1] o.a.s.h.l.XMLLoader xsltCacheLifetimeSeconds=60
   [junit4]   2> 2172739 INFO  (coreLoadExecutor-8982-thread-1) [    x:collection1] o.a.s.c.PluginBag requestHandler : 'lazy' created with startup=lazy 
   [junit4]   2> 2172739 INFO  (coreLoadExecutor-8982-thread-1) [    x:collection1] o.a.s.c.RequestHandlers Registered paths: /admin/mbeans,standard,lazy,/update/json/docs,/admin/luke,/export,/get,/admin/properties,/update/json,/admin/threads,/update/csv,/sql,/graph,/admin/segments,/admin/system,/replication,defaults,/config,/stream,/schema,/admin/plugins,/admin/logging,/admin/ping,/update,/admin/file
   [junit4]   2> 2172739 INFO  (coreLoadExecutor-8982-thread-1) [    x:collection1] o.a.s.c.SolrCore Using default statsCache cache: org.apache.solr.search.stats.LocalStatsCache
   [junit4]   2> 2172740 INFO  (OldIndexDirectoryCleanupThreadForCore-collection1) [    x:collection1] o.a.s.c.SolrCore Looking for old index directories to cleanup for core collection1 in /x1/jenkins/jenkins-slave/workspace/Lucene-Solr-NightlyTests-6.x/solr/build/solr-core/test/J0/temp/solr.handler.TestReplicationHandler_92B1F4F0A1883F9-001/solr-instance-002/./collection1/data/
   [junit4]   2> 2172740 INFO  (coreLoadExecutor-8982-thread-1) [    x:collection1] o.a.s.u.CommitTracker Hard AutoCommit: disabled
   [junit4]   2> 2172740 INFO  (coreLoadExecutor-8982-thread-1) [    x:collection1] o.a.s.u.CommitTracker Soft AutoCommit: disabled
   [junit4]   2> 2172740 INFO  (coreLoadExecutor-8982-thread-1) [    x:collection1] o.a.s.u.RandomMergePolicy RandomMergePolicy wrapping class org.apache.lucene.index.TieredMergePolicy: [TieredMergePolicy: maxMergeAtOnce=31, maxMergeAtOnceExplicit=28, maxMergedSegmentMB=42.39453125, floorSegmentMB=1.134765625, forceMergeDeletesPctAllowed=7.635362651178266, segmentsPerTier=23.0, maxCFSSegmentSizeMB=8.796093022207999E12, noCFSRatio=0.578289210885186
   [junit4]   2> 2172740 INFO  (coreLoadExecutor-8982-thread-1) [    x:collection1] o.a.s.c.SolrDeletionPolicy SolrDeletionPolicy.onInit: commits: num=1
   [junit4]   2> 	commit{dir=MockDirectoryWrapper(RAMDirectory@634f72c2 lockFactory=org.apache.lucene.store.SingleInstanceLockFactory@5132cfa4),segFN=segments_1,generation=1}
   [junit4]   2> 2172740 INFO  (coreLoadExecutor-8982-thread-1) [    x:collection1] o.a.s.c.SolrDeletionPolicy newest commit generation = 1
   [junit4]   2> 2172740 INFO  (coreLoadExecutor-8982-thread-1) [    x:collection1] o.a.s.s.SolrIndexSearcher Opening [Searcher@2ad9ecf9[collection1] main]
   [junit4]   2> 2172740 INFO  (coreLoadExecutor-8982-thread-1) [    x:collection1] o.a.s.r.ManagedResourceStorage File-based storage initialized to use dir: /x1/jenkins/jenkins-slave/workspace/Lucene-Solr-NightlyTests-6.x/solr/build/solr-core/test/J0/temp/solr.handler.TestReplicationHandler_92B1F4F0A1883F9-001/solr-instance-002/collection1/conf
   [junit4]   2> 2172740 INFO  (coreLoadExecutor-8982-thread-1) [    x:collection1] o.a.s.r.RestManager Initializing RestManager with initArgs: {storageDir=/x1/jenkins/jenkins-slave/workspace/Lucene-Solr-NightlyTests-6.x/solr/build/solr-core/test/J0/temp/solr.handler.TestReplicationHandler_92B1F4F0A1883F9-001/solr-instance-002/collection1/conf}
   [junit4]   2> 2172740 INFO  (coreLoadExecutor-8982-thread-1) [    x:collection1] o.a.s.r.ManagedResourceStorage Reading _rest_managed.json using file:dir=/x1/jenkins/jenkins-slave/workspace/Lucene-Solr-NightlyTests-6.x/solr/build/solr-core/test/J0/temp/solr.handler.TestReplicationHandler_92B1F4F0A1883F9-001/solr-instance-002/collection1/conf
   [junit4]   2> 2172741 INFO  (coreLoadExecutor-8982-thread-1) [    x:collection1] o.a.s.r.RestManager Initializing 0 registered ManagedResources
   [junit4]   2> 2172753 INFO  (coreLoadExecutor-8982-thread-1) [    x:collection1] o.a.s.h.ReplicationHandler Poll scheduled at an interval of 1000ms
   [junit4]   2> 2172753 INFO  (coreLoadExecutor-8982-thread-1) [    x:collection1] o.a.s.c.CoreContainer registering core: collection1
   [junit4]   2> 2172753 INFO  (searcherExecutor-8983-thread-1-processing-x:collection1) [    x:collection1] o.a.s.c.SolrCore [collection1] Registered new searcher Searcher@2ad9ecf9[collection1] main{ExitableDirectoryReader(UninvertingDirectoryReader())}
   [junit4]   2> 2173234 INFO  (qtp958668892-146340) [    x:collection1] o.a.s.u.DirectUpdateHandler2 [collection1] REMOVING ALL DOCUMENTS FROM INDEX
   [junit4]   2> 2173234 INFO  (qtp958668892-146340) [    x:collection1] o.a.s.u.p.LogUpdateProcessorFactory [collection1]  webapp=/solr path=/update params={wt=javabin&version=2}{deleteByQuery=*:*} 0 0
   [junit4]   2> 2173236 INFO  (qtp1816935042-146357) [    x:collection1] o.a.s.u.DirectUpdateHandler2 [collection1] REMOVING ALL DOCUMENTS FROM INDEX
   [junit4]   2> 2173236 INFO  (qtp1816935042-146357) [    x:collection1] o.a.s.u.p.LogUpdateProcessorFactory [collection1]  webapp=/solr path=/update params={wt=javabin&version=2}{deleteByQuery=*:*} 0 0
   [junit4]   2> 2173237 INFO  (qtp958668892-146340) [    x:collection1] o.a.s.u.DirectUpdateHandler2 start commit{,optimize=false,openSearcher=true,waitSearcher=true,expungeDeletes=false,softCommit=false,prepareCommit=false}
   [junit4]   2> 2173238 INFO  (qtp958668892-146340) [    x:collection1] o.a.s.c.SolrDeletionPolicy SolrDeletionPolicy.onCommit: commits: num=2
   [junit4]   2> 	commit{dir=MockDirectoryWrapper(RAMDirectory@3f6e4784 lockFactory=org.apache.lucene.store.SingleInstanceLockFactory@63b964cc),segFN=segments_1,generation=1}
   [junit4]   2> 	commit{dir=MockDirectoryWrapper(RAMDirectory@3f6e4784 lockFactory=org.apache.lucene.store.SingleInstanceLockFactory@63b964cc),segFN=segments_2,generation=2}
   [junit4]   2> 2173239 INFO  (qtp958668892-146340) [    x:collection1] o.a.s.c.SolrDeletionPolicy newest commit generation = 2
   [junit4]   2> 2173239 INFO  (qtp958668892-146340) [    x:collection1] o.a.s.s.SolrIndexSearcher Opening [Searcher@426761ea[collection1] main]
   [junit4]   2> 2173239 INFO  (qtp958668892-146340) [    x:collection1] o.a.s.u.DirectUpdateHandler2 end_commit_flush
   [junit4]   2> 2173239 INFO  (searcherExecutor-8973-thread-1-processing-x:collection1) [    x:collection1] o.a.s.c.SolrCore [collection1] Registered new searcher Searcher@426761ea[collection1] main{ExitableDirectoryReader(UninvertingDirectoryReader())}
   [junit4]   2> 2173239 INFO  (qtp958668892-146340) [    x:collection1] o.a.s.u.p.LogUpdateProcessorFactory [collection1]  webapp=/solr path=/update params={waitSearcher=true&commit=true&softCommit=false&wt=javabin&version=2}{commit=} 0 1
   [junit4]   2> 2173240 INFO  (qtp1816935042-146357) [    x:collection1] o.a.s.u.DirectUpdateHandler2 start commit{,optimize=false,openSearcher=true,waitSearcher=true,expungeDeletes=false,softCommit=false,prepareCommit=false}
   [junit4]   2> 2173241 INFO  (qtp1816935042-146357) [    x:collection1] o.a.s.c.SolrDeletionPolicy SolrDeletionPolicy.onCommit: commits: num=2
   [junit4]   2> 	commit{dir=MockDirectoryWrapper(RAMDirectory@634f72c2 lockFactory=org.apache.lucene.store.SingleInstanceLockFactory@5132cfa4),segFN=segments_1,generation=1}
   [junit4]   2> 	commit{dir=MockDirectoryWrapper(RAMDirectory@634f72c2 lockFactory=org.apache.lucene.store.SingleInstanceLockFactory@5132cfa4),segFN=segments_2,generation=2}
   [junit4]   2> 2173241 INFO  (qtp1816935042-146357) [    x:collection1] o.a.s.c.SolrDeletionPolicy newest commit generation = 2
   [junit4]   2> 2173241 INFO  (qtp1816935042-146357) [    x:collection1] o.a.s.s.SolrIndexSearcher Opening [Searcher@61b4c39d[collection1] main]
   [junit4]   2> 2173241 INFO  (qtp1816935042-146357) [    x:collection1] o.a.s.u.DirectUpdateHandler2 end_commit_flush
   [junit4]   2> 2173241 INFO  (searcherExecutor-8983-thread-1-processing-x:collection1) [    x:collection1] o.a.s.c.SolrCore [collection1] Registered new searcher Searcher@61b4c39d[collection1] main{ExitableDirectoryReader(UninvertingDirectoryReader())}
   [junit4]   2> 2173241 INFO  (qtp1816935042-146357) [    x:collection1] o.a.s.u.p.LogUpdateProcessorFactory [collection1]  webapp=/solr path=/update params={waitSearcher=true&commit=true&softCommit=false&wt=javabin&version=2}{commit=} 0 0
   [junit4]   2> 2173243 INFO  (TEST-TestReplicationHandler.testRateLimitedReplication-seed#[92B1F4F0A1883F9]) [    ] o.e.j.s.ServerConnector Stopped ServerConnector@49a7696e{HTTP/1.1,[http/1.1]}{127.0.0.1:0}
   [junit4]   2> 2173243 INFO  (TEST-TestReplicationHandler.testRateLimitedReplication-seed#[92B1F4F0A1883F9]) [    ] o.a.s.c.CoreContainer Shutting down CoreContainer instance=1948168292
   [junit4]   2> 2173249 INFO  (coreCloseExecutor-8988-thread-1) [    x:collection1] o.a.s.c.SolrCore [collection1]  CLOSING SolrCore org.apache.solr.core.SolrCore@33596483
   [junit4]   2> 2173249 INFO  (coreCloseExecutor-8988-thread-1) [    x:collection1] o.a.s.u.DirectUpdateHandler2 closing DirectUpdateHandler2{commits=1,autocommits=0,soft autocommits=0,optimizes=0,rollbacks=0,expungeDeletes=0,docsPending=0,adds=0,deletesById=0,deletesByQuery=0,errors=0,cumulative_adds=0,cumulative_deletesById=0,cumulative_deletesByQuery=1,cumulative_errors=0}
   [junit4]   2> 2173250 INFO  (coreCloseExecutor-8988-thread-1) [    x:collection1] o.a.s.u.SolrCoreState Closing SolrCoreState
   [junit4]   2> 2173250 INFO  (coreCloseExecutor-8988-thread-1) [    x:collection1] o.a.s.u.DefaultSolrCoreState SolrCoreState ref count has reached 0 - closing IndexWriter
   [junit4]   2> 2173250 INFO  (coreCloseExecutor-8988-thread-1) [    x:collection1] o.a.s.u.DefaultSolrCoreState closing IndexWriter with IndexWriterCloser
   [junit4]   2> 2173286 INFO  (coreCloseExecutor-8988-thread-1) [    x:collection1] o.a.s.c.SolrCore [collection1] Closing main searcher on request.
   [junit4]   2> 2173287 INFO  (coreCloseExecutor-8988-thread-1) [    x:collection1] o.a.s.c.CachingDirectoryFactory Closing MockDirectoryFactory - 2 directories currently being tracked
   [junit4]   2> 2173287 INFO  (coreCloseExecutor-8988-thread-1) [    x:collection1] o.a.s.c.CachingDirectoryFactory looking to close /x1/jenkins/jenkins-slave/workspace/Lucene-Solr-NightlyTests-6.x/solr/build/solr-core/test/J0/temp/solr.handler.TestReplicationHandler_92B1F4F0A1883F9-001/solr-instance-001/./collection1/data [CachedDir<<refCount=0;path=/x1/jenkins/jenkins-slave/workspace/Lucene-Solr-NightlyTests-6.x/solr/build/solr-core/test/J0/temp/solr.handler.TestReplicationHandler_92B1F4F0A1883F9-001/solr-instance-001/./collection1/data;done=false>>]
   [junit4]   2> 2173287 INFO  (coreCloseExecutor-8988-thread-1) [    x:collection1] o.a.s.c.CachingDirectoryFactory Closing directory, CoreContainer#isShutdown=true
   [junit4]   2> 2173290 INFO  (coreCloseExecutor-8988-thread-1) [    x:collection1] o.a.s.c.CachingDirectoryFactory Closing directory: /x1/jenkins/jenkins-slave/workspace/Lucene-Solr-NightlyTests-6.x/solr/build/solr-core/test/J0/temp/solr.handler.TestReplicationHandler_92B1F4F0A1883F9-001/solr-instance-001/./collection1/data
   [junit4]   2> 2173290 INFO  (coreCloseExecutor-8988-thread-1) [    x:collection1] o.a.s.c.CachingDirectoryFactory looking to close /x1/jenkins/jenkins-slave/workspace/Lucene-Solr-NightlyTests-6.x/solr/build/solr-core/test/J0/temp/solr.handler.TestReplicationHandler_92B1F4F0A1883F9-001/solr-instance-001/./collection1/data/index [CachedDir<<refCount=0;path=/x1/jenkins/jenkins-slave/workspace/Lucene-Solr-NightlyTests-6.x/solr/build/solr-core/test/J0/temp/solr.handler.TestReplicationHandler_92B1F4F0A1883F9-001/solr-instance-001/./collection1/data/index;done=false>>]
   [junit4]   2> 2173290 INFO  (coreCloseExecutor-8988-thread-1) [    x:collection1] o.a.s.c.CachingDirectoryFactory Closing directory, CoreContainer#isShutdown=true
   [junit4]   2> 2173290 INFO  (coreCloseExecutor-8988-thread-1) [    x:collection1] o.a.s.c.CachingDirectoryFactory Closing directory: /x1/jenkins/jenkins-slave/workspace/Lucene-Solr-NightlyTests-6.x/solr/build/solr-core/test/J0/temp/solr.handler.TestReplicationHandler_92B1F4F0A1883F9-001/solr-instance-001/./collection1/data/index
   [junit4]   2> 2173293 INFO  (TEST-TestReplicationHandler.testRateLimitedReplication-seed#[92B1F4F0A1883F9]) [    ] o.e.j.s.h.ContextHandler Stopped o.e.j.s.ServletContextHandler@5516df3c{/solr,null,UNAVAILABLE}
   [junit4]   2> 2173295 INFO  (TEST-TestReplicationHandler.testRateLimitedReplication-seed#[92B1F4F0A1883F9]) [    ] o.e.j.s.ServerConnector Stopped ServerConnector@334c342d{HTTP/1.1,[http/1.1]}{127.0.0.1:0}
   [junit4]   2> 2173295 INFO  (TEST-TestReplicationHandler.testRateLimitedReplication-seed#[92B1F4F0A1883F9]) [    ] o.a.s.c.CoreContainer Shutting down CoreContainer instance=771937308
   [junit4]   2> 2173299 INFO  (coreCloseExecutor-8990-thread-1) [    x:collection1] o.a.s.c.SolrCore [collection1]  CLOSING SolrCore org.apache.solr.core.SolrCore@64e347af
   [junit4]   2> 2173316 INFO  (coreCloseExecutor-8990-thread-1) [    x:collection1] o.a.s.u.DirectUpdateHandler2 closing DirectUpdateHandler2{commits=1,autocommits=0,soft autocommits=0,optimizes=0,rollbacks=0,expungeDeletes=0,docsPending=0,adds=0,deletesById=0,deletesByQuery=0,errors=0,cumulative_adds=0,cumulative_deletesById=0,cumulative_deletesByQuery=1,cumulative_errors=0}
   [junit4]   2> 2173316 INFO  (coreCloseExecutor-8990-thread-1) [    x:collection1] o.a.s.u.SolrCoreState Closing SolrCoreState
   [junit4]   2> 2173316 INFO  (coreCloseExecutor-8990-thread-1) [    x:collection1] o.a.s.u.DefaultSolrCoreState SolrCoreState ref count has reached 0 - closing IndexWriter
   [junit4]   2> 2173316 INFO  (coreCloseExecutor-8990-thread-1) [    x:collection1] o.a.s.u.DefaultSolrCoreState closing IndexWriter with IndexWriterCloser
   [junit4]   2> 2173335 INFO  (coreCloseExecutor-8990-thread-1) [    x:collection1] o.a.s.c.SolrCore [collection1] Closing main searcher on request.
   [junit4]   2> 2173335 INFO  (coreCloseExecutor-8990-thread-1) [    x:collection1] o.a.s.c.CachingDirectoryFactory Closing MockDirectoryFactory - 2 directories currently being tracked
   [junit4]   2> 2173335 INFO  (coreCloseExecutor-8990-thread-1) [    x:collection1] o.a.s.c.CachingDirectoryFactory looking to close /x1/jenkins/jenkins-slave/workspace/Lucene-Solr-NightlyTests-6.x/solr/build/solr-core/test/J0/temp/solr.handler.TestReplicationHandler_92B1F4F0A1883F9-001/solr-instance-002/./collection1/data [CachedDir<<refCount=0;path=/x1/jenkins/jenkins-slave/workspace/Lucene-Solr-NightlyTests-6.x/solr/build/solr-core/test/J0/temp/solr.handler.TestReplicationHandler_92B1F4F0A1883F9-001/solr-instance-002/./collection1/data;done=false>>]
   [junit4]   2> 2173335 INFO  (coreCloseExecutor-8990-thread-1) [    x:collection1] o.a.s.c.CachingDirectoryFactory Closing directory, CoreContainer#isShutdown=true
   [junit4]   2> 2173335 INFO  (coreCloseExecutor-8990-thread-1) [    x:collection1] o.a.s.c.CachingDirectoryFactory Closing directory: /x1/jenkins/jenkins-slave/workspace/Lucene-Solr-NightlyTests-6.x/solr/build/solr-core/test/J0/temp/solr.handler.TestReplicationHandler_92B1F4F0A1883F9-001/solr-instance-002/./collection1/data
   [junit4]   2> 2173335 INFO  (coreCloseExecutor-8990-thread-1) [    x:collection1] o.a.s.c.CachingDirectoryFactory looking to close /x1/jenkins/jenkins-slave/workspace/Lucene-Solr-NightlyTests-6.x/solr/build/solr-core/test/J0/temp/solr.handler.TestReplicationHandler_92B1F4F0A1883F9-001/solr-instance-002/./collection1/data/index [CachedDir<<refCount=0;path=/x1/jenkins/jenkins-slave/workspace/Lucene-Solr-NightlyTests-6.x/solr/build/solr-core/test/J0/temp/solr.handler.TestReplicationHandler_92B1F4F0A1883F9-001/solr-instance-002/./collection1/data/index;done=false>>]
   [junit4]   2> 2173335 INFO  (coreCloseExecutor-8990-thread-1) [    x:collection1] o.a.s.c.CachingDirectoryFactory Closing directory, CoreContainer#isShutdown=true
   [junit4]   2> 2173335 INFO  (coreCloseExecutor-8990-thread-1) [    x:collection1] o.a.s.c.CachingDirectoryFactory Closing directory: /x1/jenkins/jenkins-slave/workspace/Lucene-Solr-NightlyTests-6.x/solr/build/solr-core/test/J0/temp/solr.handler.TestReplicationHandler_92B1F4F0A1883F9-001/solr-instance-002/./collection1/data/index
   [junit4]   2> 2173338 INFO  (TEST-TestReplicationHandler.testRateLimitedReplication-seed#[92B1F4F0A1883F9]) [    ] o.e.j.s.h.ContextHandler Stopped o.e.j.s.ServletContextHandler@c1781f2{/solr,null,UNAVAILABLE}
   [junit4]   2> 2173340 INFO  (TEST-TestReplicationHandler.testRateLimitedReplication-seed#[92B1F4F0A1883F9]) [    ] o.e.j.s.Server jetty-9.3.8.v20160314
   [junit4]   2> 2173370 INFO  (TEST-TestReplicationHandler.testRateLimitedReplication-seed#[92B1F4F0A1883F9]) [    ] o.e.j.s.h.ContextHandler Started o.e.j.s.ServletContextHandler@253f86d8{/solr,null,AVAILABLE}
   [junit4]   2> 2173370 INFO  (TEST-TestReplicationHandler.testRateLimitedReplication-seed#[92B1F4F0A1883F9]) [    ] o.e.j.s.ServerConnector Started ServerConnector@195af9f6{HTTP/1.1,[http/1.1]}{127.0.0.1:37298}
   [junit4]   2> 2173479 INFO  (TEST-TestReplicationHandler.testRateLimitedReplication-seed#[92B1F4F0A1883F9]) [    ] o.e.j.s.Server Started @2176807ms
   [junit4]   2> 2173480 INFO  (TEST-TestReplicationHandler.testRateLimitedReplication-seed#[92B1F4F0A1883F9]) [    ] o.a.s.c.s.e.JettySolrRunner Jetty properties: {solr.data.dir=/x1/jenkins/jenkins-slave/workspace/Lucene-Solr-NightlyTests-6.x/solr/build/solr-core/test/J0/temp/solr.handler.TestReplicationHandler_92B1F4F0A1883F9-001/solr-instance-001/collection1/data, hostContext=/solr, hostPort=37298}
   [junit4]   2> 2173480 INFO  (TEST-TestReplicationHandler.testRateLimitedReplication-seed#[92B1F4F0A1883F9]) [    ] o.a.s.s.SolrDispatchFilter SolrDispatchFilter.init(): sun.misc.Launcher$AppClassLoader@73d16e93
   [junit4]   2> 2173480 INFO  (TEST-TestReplicationHandler.testRateLimitedReplication-seed#[92B1F4F0A1883F9]) [    ] o.a.s.c.SolrResourceLoader new SolrResourceLoader for directory: '/x1/jenkins/jenkins-slave/workspace/Lucene-Solr-NightlyTests-6.x/solr/build/solr-core/test/J0/temp/solr.handler.TestReplicationHandler_92B1F4F0A1883F9-001/solr-instance-001'
   [junit4]   2> 2173480 INFO  (TEST-TestReplicationHandler.testRateLimitedReplication-seed#[92B1F4F0A1883F9]) [    ] o.a.s.c.SolrResourceLoader JNDI not configured for solr (NoInitialContextEx)
   [junit4]   2> 2173480 INFO  (TEST-TestReplicationHandler.testRateLimitedReplication-seed#[92B1F4F0A1883F9]) [    ] o.a.s.c.SolrResourceLoader solr home defaulted to 'solr/' (could not find system property or JNDI)
   [junit4]   2> 2173481 INFO  (TEST-TestReplicationHandler.testRateLimitedReplication-seed#[92B1F4F0A1883F9]) [    ] o.a.s.c.SolrXmlConfig Loading container configuration from /x1/jenkins/jenkins-slave/workspace/Lucene-Solr-NightlyTests-6.x/solr/build/solr-core/test/J0/temp/solr.handler.TestReplicationHandler_92B1F4F0A1883F9-001/solr-instance-001/solr.xml
   [junit4]   2> 2173485 INFO  (TEST-TestReplicationHandler.testRateLimitedReplication-seed#[92B1F4F0A1883F9]) [    ] o.a.s.c.CorePropertiesLocator Config-defined core root directory: /x1/jenkins/jenkins-slave/workspace/Lucene-Solr-NightlyTests-6.x/solr/build/solr-core/test/J0/temp/solr.handler.TestReplicationHandler_92B1F4F0A1883F9-001/solr-instance-001/.
   [junit4]   2> 2173485 INFO  (TEST-TestReplicationHandler.testRateLimitedReplication-seed#[92B1F4F0A1883F9]) [    ] o.a.s.c.CoreContainer New CoreContainer 910869039
   [junit4]   2> 2173485 INFO  (TEST-TestReplicationHandler.testRateLimitedReplication-seed#[92B1F4F0A1883F9]) [    ] o.a.s.c.CoreContainer Loading cores into CoreContainer [instanceDir=/x1/jenkins/jenkins-slave/workspace/Lucene-Solr-NightlyTests-6.x/solr/build/solr-core/test/J0/temp/solr.handler.TestReplicationHandler_92B1F4F0A1883F9-001/solr-instance-001]
   [junit4]   2> 2173486 WARN  (TEST-TestReplicationHandler.testRateLimitedReplication-seed#[92B1F4F0A1883F9]) [    ] o.a.s.c.CoreContainer Couldn't add files from /x1/jenkins/jenkins-slave/workspace/Lucene-Solr-NightlyTests-6.x/solr/build/solr-core/test/J0/temp/solr.handler.TestReplicationHandler_92B1F4F0A1883F9-001/solr-instance-001/lib to classpath: /x1/jenkins/jenkins-slave/workspace/Lucene-Solr-NightlyTests-6.x/solr/build/solr-core/test/J0/temp/solr.handler.TestReplicationHandler_92B1F4F0A1883F9-001/solr-instance-001/lib
   [junit4]   2> 2173487 INFO  (TEST-TestReplicationHandler.testRateLimitedReplication-seed#[92B1F4F0A1883F9]) [    ] o.a.s.h.c.HttpShardHandlerFactory created with socketTimeout : 90000,urlScheme : ,connTimeout : 15000,maxConnectionsPerHost : 20,maxConnections : 10000,corePoolSize : 0,maximumPoolSize : 2147483647,maxThreadIdleTime : 5,sizeOfQueue : -1,fairnessPolicy : false,useRetries : false,
   [junit4]   2> 2173488 INFO  (TEST-TestReplicationHandler.testRateLimitedReplication-seed#[92B1F4F0A1883F9]) [    ] o.a.s.u.UpdateShardHandler Creating UpdateShardHandler HTTP client with params: socketTimeout=340000&connTimeout=45000&retry=true
   [junit4]   2> 2173488 INFO  (TEST-TestReplicationHandler.testRateLimitedReplication-seed#[92B1F4F0A1883F9]) [    ] o.a.s.l.LogWatcher SLF4J impl is org.slf4j.impl.Log4jLoggerFactory
   [junit4]   2> 2173488 INFO  (TEST-TestReplicationHandler.testRateLimitedReplication-seed#[92B1F4F0A1883F9]) [    ] o.a.s.l.LogWatcher Registering Log Listener [Log4j (org.slf4j.impl.Log4jLoggerFactory)]
   [junit4]   2> 2173488 INFO  (TEST-TestReplicationHandler.testRateLimitedReplication-seed#[92B1F4F0A1883F9]) [    ] o.a.s.c.CoreContainer Security conf doesn't exist. Skipping setup for authorization module.
   [junit4]   2> 2173488 INFO  (TEST-TestReplicationHandler.testRateLimitedReplication-seed#[92B1F4F0A1883F9]) [    ] o.a.s.c.CoreContainer No authentication plugin used.
   [junit4]   2> 2173489 INFO  (TEST-TestReplicationHandler.testRateLimitedReplication-seed#[92B1F4F0A1883F9]) [    ] o.a.s.c.CorePropertiesLocator Looking for core definitions underneath /x1/jenkins/jenkins-slave/workspace/Lucene-Solr-NightlyTests-6.x/solr/build/solr-core/test/J0/temp/solr.handler.TestReplicationHandler_92B1F4F0A1883F9-001/solr-instance-001/.
   [junit4]   2> 2173490 INFO  (TEST-TestReplicationHandler.testRateLimitedReplication-seed#[92B1F4F0A1883F9]) [    ] o.a.s.c.CoreDescriptor Created CoreDescriptor: {name=collection1, config=solrconfig.xml, loadOnStartup=true, schema=schema.xml, configSetProperties=configsetprops.json, transient=false, dataDir=data/}
   [junit4]   2> 2173490 INFO  (TEST-TestReplicationHandler.testRateLimitedReplication-seed#[92B1F4F0A1883F9]) [    ] o.a.s.c.CorePropertiesLocator Found core collection1 in /x1/jenkins/jenkins-slave/workspace/Lucene-Solr-NightlyTests-6.x/solr/build/solr-core/test/J0/temp/solr.handler.TestReplicationHandler_92B1F4F0A1883F9-001/solr-instance-001/./collection1
   [junit4]   2> 2173490 INFO  (TEST-TestReplicationHandler.testRateLimitedReplication-seed#[92B1F4F0A1883F9]) [    ] o.a.s.c.CorePropertiesLocator Found 1 core definitions
   [junit4]   2> 2173490 INFO  (coreLoadExecutor-8997-thread-1) [    ] o.a.s.c.SolrResourceLoader new SolrResourceLoader for directory: '/x1/jenkins/jenkins-slave/workspace/Lucene-Solr-NightlyTests-6.x/solr/build/solr-core/test/J0/temp/solr.handler.TestReplicationHandler_92B1F4F0A1883F9-001/solr-instance-001/collection1'
   [junit4]   2> 2173498 INFO  (coreLoadExecutor-8997-thread-1) [    ] o.a.s.c.SolrResourceLoader JNDI not configured for solr (NoInitialContextEx)
   [junit4]   2> 2173498 INFO  (coreLoadExecutor-8997-thread-1) [    ] o.a.s.c.SolrResourceLoader solr home defaulted to 'solr/' (could not find system property or JNDI)
   [junit4]   2> 2173491 INFO  (TEST-TestReplicationHandler.testRateLimitedReplication-seed#[92B1F4F0A1883F9]) [    ] o.a.s.s.SolrDispatchFilter user.dir=/x1/jenkins/jenkins-slave/workspace/Lucene-Solr-NightlyTests-6.x/solr/build/solr-core/test/J0
   [junit4]   2> 2173500 INFO  (TEST-TestReplicationHandler.testRateLimitedReplication-seed#[92B1F4F0A1883F9]) [    ] o.a.s.s.SolrDispatchFilter SolrDispatchFilter.init() done
   [junit4]   2> 2173501 INFO  (coreLoadExecutor-8997-thread-1) [    ] o.a.s.c.SolrConfig current version of requestparams : -1
   [junit4]   2> 2173503 WARN  (coreLoadExecutor-8997-thread-1) [    ] o.a.s.c.Config Beginning with Solr 5.5, <mergePolicy> is deprecated, use <mergePolicyFactory> instead.
   [junit4]   2> 2173504 INFO  (coreLoadExecutor-8997-thread-1) [    ] o.a.s.c.SolrConfig Using Lucene MatchVersion: 6.1.0
   [junit4]   2> 2173542 INFO  (coreLoadExecutor-8997-thread-1) [    ] o.a.s.c.SolrConfig Loaded SolrConfig: solrconfig.xml
   [junit4]   2> 2173543 INFO  (coreLoadExecutor-8997-thread-1) [    ] o.a.s.s.IndexSchema [collection1] Schema name=test
   [junit4]   2> 2173545 INFO  (coreLoadExecutor-8997-thread-1) [    ] o.a.s.s.IndexSchema unique key field: id
   [junit4]   2> 2173545 INFO  (coreLoadExecutor-8997-thread-1) [    ] o.a.s.c.ConfigSetProperties Did not find ConfigSet properties, assuming default properties: Can't find resource 'configsetprops.json' in classpath or '/x1/jenkins/jenkins-slave/workspace/Lucene-Solr-NightlyTests-6.x/solr/build/solr-core/test/J0/temp/solr.handler.TestReplicationHandler_92B1F4F0A1883F9-001/solr-instance-001/collection1'
   [junit4]   2> 2173546 INFO  (coreLoadExecutor-8997-thread-1) [    ] o.a.s.c.CoreContainer Creating SolrCore 'collection1' using configuration from instancedir /x1/jenkins/jenkins-slave/workspace/Lucene-Solr-NightlyTests-6.x/solr/build/solr-core/test/J0/temp/solr.handler.TestReplicationHandler_92B1F4F0A1883F9-001/solr-instance-001/./collection1
   [junit4]   2> 2173546 INFO  (coreLoadExecutor-8997-thread-1) [    x:collection1] o.a.s.c.SolrCore solr.StandardDirectoryFactory
   [junit4]   2> 2173546 INFO  (coreLoadExecutor-8997-thread-1) [    x:collection1] o.a.s.c.SolrCore [[collection1] ] Opening new SolrCore at [/x1/jenkins/jenkins-slave/workspace/Lucene-Solr-NightlyTests-6.x/solr/build/solr-core/test/J0/temp/solr.handler.TestReplicationHandler_92B1F4F0A1883F9-001/solr-instance-001/collection1], dataDir=[/x1/jenkins/jenkins-slave/workspace/Lucene-Solr-NightlyTests-6.x/solr/build/solr-core/test/J0/temp/solr.handler.TestReplicationHandler_92B1F4F0A1883F9-001/solr-instance-001/./collection1/data/]
   [junit4]   2> 2173546 INFO  (coreLoadExecutor-8997-thread-1) [    x:collection1] o.a.s.c.SolrCore JMX monitoring not detected for core: collection1
   [junit4]   2> 2173546 INFO  (coreLoadExecutor-8997-thread-1) [    x:collection1] o.a.s.c.CachingDirectoryFactory return new directory for /x1/jenkins/jenkins-slave/workspace/Lucene-Solr-NightlyTests-6.x/solr/build/solr-core/test/J0/temp/solr.handler.TestReplicationHandler_92B1F4F0A1883F9-001/solr-instance-001/collection1/data
   [junit4]   2> 2173546 INFO  (coreLoadExecutor-8997-thread-1) [    x:collection1] o.a.s.c.SolrCore New index directory detected: old=null new=/x1/jenkins/jenkins-slave/workspace/Lucene-Solr-NightlyTests-6.x/solr/build/solr-core/test/J0/temp/solr.handler.TestReplicationHandler_92B1F4F0A1883F9-001/solr-instance-001/./collection1/data/index/
   [junit4]   2> 2173546 WARN  (coreLoadExecutor-8997-thread-1) [    x:collection1] o.a.s.c.SolrCore [collection1] Solr index directory '/x1/jenkins/jenkins-slave/workspace/Lucene-Solr-NightlyTests-6.x/solr/build/solr-core/test/J0/temp/solr.handler.TestReplicationHandler_92B1F4F0A1883F9-001/solr-instance-001/./collection1/data/index' doesn't exist. Creating new index...
   [junit4]   2> 2173547 INFO  (coreLoadExecutor-8997-thread-1) [    x:collection1] o.a.s.c.CachingDirectoryFactory return new directory for /x1/jenkins/jenkins-slave/workspace/Lucene-Solr-NightlyTests-6.x/solr/build/solr-core/test/J0/temp/solr.handler.TestReplicationHandler_92B1F4F0A1883F9-001/solr-instance-001/collection1/data/index
   [junit4]   2> 2173547 INFO  (coreLoadExecutor-8997-thread-1) [    x:collection1] o.a.s.u.RandomMergePolicy RandomMergePolicy wrapping class org.apache.lucene.index.MockRandomMergePolicy: org.apache.lucene.index.MockRandomMergePolicy@4487adf8
   [junit4]   2> 2173551 INFO  (coreLoadExecutor-8997-thread-1) [    x:collection1] o.a.s.c.SolrDeletionPolicy SolrDeletionPolicy.onCommit: commits: num=1
   [junit4]   2> 	commit{dir=/x1/jenkins/jenkins-slave/workspace/Lucene-Solr-NightlyTests-6.x/solr/build/solr-core/test/J0/temp/solr.handler.TestReplicationHandler_92B1F4F0A1883F9-001/solr-instance-001/collection1/data/index,segFN=segments_1,generation=1}
   [junit4]   2> 2173551 INFO  (coreLoadExecutor-8997-thread-1) [    x:collection1] o.a.s.c.SolrDeletionPolicy newest commit generation = 1
   [junit4]   2> 2173553 INFO  (OldIndexDirectoryCleanupThreadForCore-collection1) [    x:collection1] o.a.s.c.SolrCore Looking for old index directories to cleanup for core collection1 in /x1/jenkins/jenkins-slave/workspace/Lucene-Solr-NightlyTests-6.x/solr/build/solr-core/test/J0/temp/solr.handler.TestReplicationHandler_92B1F4F0A1883F9-001/solr-instance-001/./collection1/data/
   [junit4]   2> 2173554 INFO  (coreLoadExecutor-8997-thread-1) [    x:collection1] o.a.s.c.SolrCore no updateRequestProcessorChain defined as default, creating implicit default
   [junit4]   2> 2173555 INFO  (coreLoadExecutor-8997-thread-1) [    x:collection1] o.a.s.h.l.XMLLoader xsltCacheLifetimeSeconds=60
   [junit4]   2> 2173555 INFO  (coreLoadExecutor-8997-thread-1) [    x:collection1] o.a.s.h.l.XMLLoader xsltCacheLifetimeSeconds=60
   [junit4]   2> 2173556 INFO  (coreLoadExecutor-8997-thread-1) [    x:collection1] o.a.s.h.l.XMLLoader xsltCacheLifetimeSeconds=60
   [junit4]   2> 2173556 INFO  (coreLoadExecutor-8997-thread-1) [    x:collection1] o.a.s.h.l.XMLLoader xsltCacheLifetimeSeconds=60
   [junit4]   2> 2173557 INFO  (coreLoadExecutor-8997-thread-1) [    x:collection1] o.a.s.c.PluginBag requestHandler : 'lazy' created with startup=lazy 
   [junit4]   2> 2173557 INFO  (coreLoadExecutor-8997-thread-1) [    x:collection1] o.a.s.c.RequestHandlers Registered paths: /admin/mbeans,standard,lazy,/update/json/docs,/admin/luke,/export,/get,/admin/properties,/update/json,/admin/threads,/update/csv,/sql,/graph,/admin/segments,/admin/system,/replication,defaults,/config,/stream,/schema,/admin/plugins,/admin/logging,/admin/ping,/update,/admin/file
   [junit4]   2> 2173557 INFO  (coreLoadExecutor-8997-thread-1) [    x:collection1] o.a.s.c.SolrCore Using default statsCache cache: org.apache.solr.search.stats.LocalStatsCache
   [junit4]   2> 2173557 INFO  (coreLoadExecutor-8997-thread-1) [    x:collection1] o.a.s.u.CommitTracker Hard AutoCommit: disabled
   [junit4]   2> 2173557 INFO  (coreLoadExecutor-8997-thread-1) [    x:collection1] o.a.s.u.CommitTracker Soft AutoCommit: disabled
   [junit4]   2> 2173557 INFO  (coreLoadExecutor-8997-thread-1) [    x:collection1] o.a.s.u.RandomMergePolicy RandomMergePolicy wrapping class org.apache.lucene.index.LogByteSizeMergePolicy: [LogByteSizeMergePolicy: minMergeSize=1677721, mergeFactor=35, maxMergeSize=2147483648, maxMergeSizeForForcedMerge=9223372036854775807, calibrateSizeByDeletes=false, maxMergeDocs=2147483647, maxCFSSegmentSizeMB=8.796093022207999E12, noCFSRatio=1.0]
   [junit4]   2> 2173557 INFO  (coreLoadExecutor-8997-thread-1) [    x:collection1] o.a.s.c.SolrDeletionPolicy SolrDeletionPolicy.onInit: commits: num=1
   [junit4]   2> 	commit{dir=/x1/jenkins/jenkins-slave/workspace/Lucene-Solr-NightlyTests-6.x/solr/build/solr-core/test/J0/temp/solr.handler.TestReplicationHandler_92B1F4F0A1883F9-001/solr-instance-001/collection1/data/index,segFN=segments_1,generation=1}
   [junit4]   2> 2173557 INFO  (coreLoadExecutor-8997-thread-1) [    x:collection1] o.a.s.c.SolrDeletionPolicy newest commit generation = 1
   [junit4]   2> 2173557 INFO  (coreLoadExecutor-8997-thread-1) [    x:collection1] o.a.s.s.SolrIndexSearcher Opening [Searcher@8ee86ea[collection1] main]
   [junit4]   2> 2173558 INFO  (coreLoadExecutor-8997-thread-1) [    x:collection1] o.a.s.r.ManagedResourceStorage File-based storage initialized to use dir: /x1/jenkins/jenkins-slave/workspace/Lucene-Solr-NightlyTests-6.x/solr/build/solr-core/test/J0/temp/solr.handler.TestReplicationHandler_92B1F4F0A1883F9-001/solr-instance-001/collection1/conf
   [junit4]   2> 2173558 INFO  (coreLoadExecutor-8997-thread-1) [    x:collection1] o.a.s.r.RestManager Initializing RestManager with initArgs: {storageDir=/x1/jenkins/jenkins-slave/workspace/Lucene-Solr-NightlyTests-6.x/solr/build/solr-core/test/J0/temp/solr.handler.TestReplicationHandler_92B1F4F0A1883F9-001/solr-instance-001/collection1/conf}
   [junit4]   2> 2173558 INFO  (coreLoadExecutor-8997-thread-1) [    x:collection1] o.a.s.r.ManagedResourceStorage Reading _rest_managed.json using file:dir=/x1/jenkins/jenkins-slave/workspace/Lucene-Solr-NightlyTests-6.x/solr/build/solr-core/test/J0/temp/solr.handler.TestReplicationHandler_92B1F4F0A1883F9-001/solr-instance-001/collection1/conf
   [junit4]   2> 2173558 INFO  (coreLoadExecutor-8997-thread-1) [    x:collection1] o.a.s.r.RestManager Initializing 0 registered ManagedResources
   [junit4]   2> 2173558 INFO  (coreLoadExecutor-8997-thread-1) [    x:collection1] o.a.s.h.ReplicationHandler Commits will be reserved for  10000
   [junit4]   2> 2173558 INFO  (coreLoadExecutor-8997-thread-1) [    x:collection1] o.a.s.c.CoreContainer registering core: collection1
   [junit4]   2> 2173558 INFO  (searcherExecutor-8998-thread-1-processing-x:collection1) [    x:collection1] o.a.s.c.SolrCore [collection1] Registered new searcher Searcher@8ee86ea[collection1] main{ExitableDirectoryReader(UninvertingDirectoryReader())}
   [junit4]   2> 2174033 INFO  (qtp741555312-146379) [    x:collection1] o.a.s.u.p.LogUpdateProcessorFactory [collection1]  webapp=/solr path=/update params={wt=javabin&version=2}{add=[0]} 0 0
   [junit4]   2> 2174035 INFO  (qtp741555312-146379) [    x:collection1] o.a.s.u.p.LogUpdateProcessorFactory [collection1]  webapp=/solr path=/update params={wt=javabin&version=2}{add=[1]} 0 0
   [junit4]   2> 2174037 INFO  (qtp741555312-146379) [    x:collection1] o.a.s.u.p.LogUpdateProcessorFactory [collection1]  webapp=/solr path=/update params={wt=javabin&version=2}{add=[2]} 0 0
   [junit4]   2> 2174039 INFO  (qtp741555312-146379) [    x:collection1] o.a.s.u.p.LogUpdateProcessorFactory [collection1]  webapp=/solr path=/update params={wt=javabin&version=2}{add=[3]} 0 0
   [junit4]   2> 2174041 INFO  (qtp741555312-146379) [    x:collection1] o.a.s.u.p.LogUpdateProcessorFactory [collection1]  webapp=/solr path=/update params={wt=javabin&version=2}{add=[4]} 0 0
   [junit4]   2> 2174044 INFO  (qtp741555312-146379) [    x:collection1] o.a.s.u.p.LogUpdateProcessorFactory [collection1]  webapp=/solr path=/update params={wt=javabin&version=2}{add=[5]} 0 0
   [junit4]   2> 2174048 INFO  (qtp741555312-146379) [    x:collection1] o.a.s.u.p.LogUpdateProcessorFactory [collection1]  webapp=/solr path=/update params={wt=javabin&version=2}{add=[6]} 0 0
   [junit4]   2> 2174052 INFO  (qtp741555312-146379) [    x:collection1] o.a.s.u.p.LogUpdateProcessorFactory [collection1]  webapp=/solr path=/update params={wt=javabin&version=2}{add=[7]} 0 0
   [junit4]   2> 2174054 INFO  (qtp741555312-146379) [    x:collection1] o.a.s.u.p.LogUpdateProcessorFactory [collection1]  webapp=/solr path=/update params={wt=javabin&version=2}{add=[8]} 0 0
   [junit4]   2> 2174056 INFO  (qtp741555312-146379) [    x:collection1] o.a.s.u.p.LogUpdateProcessorFactory [collection1]  webapp=/solr path=/update params={wt=javabin&version=2}{add=[9]} 0 0
   [junit4]   2> 2174059 INFO  (qtp741555312-146379) [    x:collection1] o.a.s.u.p.LogUpdateProcessorFactory [collection1]  webapp=/solr path=/update params={wt=javabin&version=2}{add=[10]} 0 0
   [junit4]   2> 2174060 INFO  (qtp741555312-146380) [    x:collection1] o.a.s.u.p.LogUpdateProcessorFactory [collection1]  webapp=/solr path=/update params={wt=javabin&version=2}{add=[11]} 0 0
   [junit4]   2> 2174063 INFO  (qtp741555312-146380) [    x:collection1] o.a.s.u.p.LogUpdateProcessorFactory [collection1]  webapp=/solr path=/update params={wt=javabin&version=2}{add=[12]} 0 0
   [junit4]   2> 2174065 INFO  (qtp741555312-146382) [    x:collection1] o.a.s.u.p.LogUpdateProcessorFactory [collection1]  webapp=/solr path=/update params={wt=javabin&version=2}{add=[13]} 0 0
   [junit4]   2> 2174069 INFO  (qtp741555312-146382) [    x:collection1] o.a.s.u.p.LogUpdateProcessorFactory [collection1]  webapp=/solr path=/update params={wt=javabin&version=2}{add=[14]} 0 0
   [junit4]   2> 2174071 INFO  (qtp741555312-146376) [    x:collection1] o.a.s.u.p.LogUpdateProcessorFactory [collection1]  webapp=/solr path=/update params={wt=javabin&version=2}{add=[15]} 0 0
   [junit4]   2> 2174074 INFO  (qtp741555312-146376) [    x:collection1] o.a.s.u.p.LogUpdateProcessorFactory [collection1]  webapp=/solr path=/update params={wt=javabin&version=2}{add=[16]} 0 0
   [junit4]   2> 2174076 INFO  (qtp741555312-146376) [    x:collection1] o.a.s.u.p.LogUpdateProcessorFactory [collection1]  webapp=/solr path=/update params={wt=javabin&version=2}{add=[17]} 0 0
   [junit4]   2> 2174077 INFO  (qtp741555312-146376) [    x:collection1] o.a.s.u.p.LogUpdateProcessorFactory [collection1]  webapp=/solr path=/update params={wt=javabin&version=2}{add=[18]} 0 0
   [junit4]   2> 2174079 INFO  (qtp741555312-146376) [    x:collection1] o.a.s.u.p.LogUpdateProcessorFactory [collection1]  webapp=/solr path=/update params={wt=javabin&version=2}{add=[19]} 0 0
   [junit4]   2> 2174081 INFO  (qtp741555312-146376) [    x:collection1] o.a.s.u.p.LogUpdateProcessorFactory [collection1]  webapp=/solr path=/update params={wt=javabin&version=2}{add=[20]} 0 0
   [junit4]   2> 2174085 INFO  (qtp741555312-146376) [    x:collection1] o.a.s.u.p.LogUpdateProcessorFactory [collection1]  webapp=/solr path=/update params={wt=javabin&version=2}{add=[21]} 0 0
   [junit4]   2> 2174089 INFO  (qtp741555312-146376) [    x:collection1] o.a.s.u.p.LogUpdateProcessorFactory [collection1]  webapp=/solr path=/update params={wt=javabin&version=2}{add=[22]} 0 0
   [junit4]   2> 2174091 INFO  (qtp741555312-146376) [    x:collection1] o.a.s.u.p.LogUpdateProcessorFactory [collection1]  webapp=/solr path=/update params={wt=javabin&version=2}{add=[23]} 0 0
   [junit4]   2> 2174092 INFO  (qtp741555312-146376) [    x:collection1] o.a.s.u.p.LogUpdateProcessorFactory [collection1]  webapp=/solr path=/update params={wt=javabin&version=2}{add=[24]} 0 0
   [junit4]   2> 2174094 INFO  (qtp741555312-146376) [    x:collection1] o.a.s.u.p.LogUpdateProcessorFactory [collection1]  webapp=/solr path=/update params={wt=javabin&version=2}{add=[25]} 0 0
   [junit4]   2> 2174096 INFO  (qtp741555312-146376) [    x:collection1] o.a.s.u.p.LogUpdateProcessorFactory [collection1]  webapp=/solr path=/update params={wt=javabin&version=2}{add=[26]} 0 0
   [junit4]   2> 2174099 INFO  (qtp741555312-146376) [    x:collection1] o.a.s.u.p.LogUpdateProcessorFactory [collection1]  webapp=/solr path=/update params={wt=javabin&version=2}{add=[27]} 0 0
   [junit4]   2> 2174100 INFO  (qtp741555312-146376) [    x:collection1] o.a.s.u.p.LogUpdateProcessorFactory [collection1]  webapp=/solr path=/update params={wt=javabin&version=2}{add=[28]} 0 0
   [junit4]   2> 2174102 INFO  (qtp741555312-146376) [    x:collection1] o.a.s.u.p.LogUpdateProcessorFactory [collection1]  webapp=/solr path=/update params={wt=javabin&version=2}{add=[29]} 0 0
   [junit4]   2> 2174103 INFO  (qtp741555312-146376) [    x:collection1] o.a.s.u.p.LogUpdateProcessorFactory [collection1]  webapp=/solr path=/update params={wt=javabin&version=2}{add=[30]} 0 0
   [junit4]   2> 2174105 INFO  (qtp741555312-146376) [    x:collection1] o.a.s.u.p.LogUpdateProcessorFactory [collection1]  webapp=/solr path=/update params={wt=javabin&version=2}{add=[31]} 0 0
   [junit4]   2> 2174106 INFO  (qtp741555312-146376) [    x:collection1] o.a.s.u.p.LogUpdateProcessorFactory [collection1]  webapp=/solr path=/update params={wt=javabin&version=2}{add=[32]} 0 0
   [junit4]   2> 2174108 INFO  (qtp741555312-146376) [    x:collection1] o.a.s.u.p.LogUpdateProcessorFactory [collection1]  webapp=/solr path=/update params={wt=javabin&version=2}{add=[33]} 0 0
   [junit4]   2> 2174110 INFO  (qtp741555312-146376) [    x:collection1] o.a.s.u.p.LogUpdateProcessorFactory [collection1]  webapp=/solr path=/update params={wt=javabin&version=2}{add=[34]} 0 0
   [junit4]   2> 2174111 INFO  (qtp741555312-146376) [    x:collection1] o.a.s.u.p.LogUpdateProcessorFactory [collection1]  webapp=/solr path=/update params={wt=javabin&version=2}{add=[35]} 0 0
   [junit4]   2> 2174113 INFO  (qtp741555312-146376) [    x:collection1] o.a.s.u.p.LogUpdateProcessorFactory [collection1]  webapp=/solr path=/update params={wt=javabin&version=2}{add=[36]} 0 0
   [junit4]   2> 2174114 INFO  (qtp741555312-146376) [    x:collection1] o.a.s.u.p.LogUpdateProcessorFactory [collection1]  webapp=/solr path=/update params={wt=javabin&version=2}{add=[37]} 0 0
   [junit4]   2> 2174116 INFO  (qtp741555312-146376) [    x:collection1] o.a.s.u.p.LogUpdateProcessorFactory [collection1]  webapp=/solr path=/update params={wt=javabin&version=2}{add=[38]} 0 0
   [junit4]   2> 2174118 INFO  (qtp741555312-146376) [    x:collection1] o.a.s.u.p.LogUpdateProcessorFactory [collection1]  webapp=/solr path=/update params={wt=javabin&version=2}{add=[39]} 0 0
   [junit4]   2> 2174119 INFO  (qtp741555312-146376) [    x:collection1] o.a.s.u.p.LogUpdateProcessorFactory [collection1]  webapp=/solr path=/update params={wt=javabin&version=2}{add=[40]} 0 0
   [junit4]   2> 2174121 INFO  (qtp741555312-146376) [    x:collection1] o.a.s.u.p.LogUpdateProcessorFactory [collection1]  webapp=/solr path=/update params={wt=javabin&version=2}{add=[41]} 0 0
   [junit4]   2> 2174122 INFO  (qtp741555312-146376) [    x:collection1] o.a.s.u.p.LogUpdateProcessorFactory [collection1]  webapp=/solr path=/update params={wt=javabin&version=2}{add=[42]} 0 0
   [junit4]   2> 2174124 INFO  (qtp741555312-146376) [    x:collection1] o.a.s.u.p.LogUpdateProcessorFactory [collection1]  webapp=/solr path=/update params={wt=javabin&version=2}{add=[43]} 0 0
   [junit4]   2> 2174126 INFO  (qtp741555312-146376) [    x:collection1] o.a.s.u.p.LogUpdateProcessorFactory [collection1]  webapp=/solr path=/update params={wt=javabin&version=2}{add=[44]} 0 0
   [junit4]   2> 2174127 INFO  (qtp741555312-146376) [    x:collection1] o.a.s.u.p.LogUpdateProcessorFactory [collection1]  webapp=/solr path=/update params={wt=javabin&version=2}{add=[45]} 0 0
   [junit4]   2> 2174129 INFO  (qtp741555312-146376) [    x:collection1] o.a.s.u.p.LogUpdateProcessorFactory [collection1]  webapp=/solr path=/update params={wt=javabin&version=2}{add=[46]} 0 0
   [junit4]   2> 2174132 INFO  (qtp741555312-146381) [    x:collection1] o.a.s.u.p.LogUpdateProcessorFactory [collection1]  webapp=/solr path=/update params={wt=javabin&version=2}{add=[47]} 0 0
   [junit4]   2> 2174134 INFO  (qtp741555312-146381) [    x:collection1] o.a.s.u.p.LogUpdateProcessorFactory [collection1]  webapp=/solr path=/update params={wt=javabin&version=2}{add=[48]} 0 0
   [junit4]   2> 2174136 INFO  (qtp741555312-146381) [    x:collection1] o.a.s.u.p.LogUpdateProcessorFactory [collection1]  webapp=/solr path=/update params={wt=javabin&version=2}{add=[49]} 0 0
   [junit4]   2> 2174138 INFO  (qtp741555312-146381) [    x:collection1] o.a.s.u.p.LogUpdateProcessorFactory [collection1]  webapp=/solr path=/update params={wt=javabin&version=2}{add=[50]} 0 0
   [junit4]   2> 2174141 INFO  (qtp741555312-146381) [    x:collection1] o.a.s.u.p.LogUpdateProcessorFactory [collection1]  webapp=/solr path=/update params={wt=javabin&version=2}{add=[51]} 0 0
   [junit4]   2> 2174142 INFO  (qtp741555312-146381) [    x:collection1] o.a.s.u.p.LogUpdateProcessorFactory [collection1]  webapp=/solr path=/update params={wt=javabin&version=2}{add=[52]} 0 0
   [junit4]   2> 2174145 INFO  (qtp741555312-146381) [    x:collection1] o.a.s.u.p.LogUpdateProcessorFactory [collection1]  webapp=/solr path=/update params={wt=javabin&version=2}{add=[53]} 0 0
   [junit4]   2> 2174150 INFO  (qtp741555312-146381) [    x:collection1] o.a.s.u.p.LogUpdateProcessorFactory [collection1]  webapp=/solr path=/update params={wt=javabin&version=2}{add=[54]} 0 0
   [junit4]   2> 2174152 INFO  (qtp741555312-146381) [    x:collection1] o.a.s.u.p.LogUpdateProcessorFactory [collection1]  webapp=/solr path=/update params={wt=javabin&version=2}{add=[55]} 0 0
   [junit4]   2> 2174154 INFO  (qtp741555312-146381) [    x:collection1] o.a.s.u.p.LogUpdateProcessorFactory [collection1]  webapp=/solr path=/update params={wt=javabin&version=2}{add=[56]} 0 0
   [junit4]   2> 2174156 INFO  (qtp741555312-146381) [    x:collection1] o.a.s.u.p.LogUpdateProcessorFactory [collection1]  webapp=/solr path=/update params={wt=javabin&version=2}{add=[57]} 0 0
   [junit4]   2> 2174158 INFO  (qtp741555312-146381) [    x:collection1] o.a.s.u.p.LogUpdateProcessorFactory [collection1]  webapp=/solr path=/update params={wt=javabin&version=2}{add=[58]} 0 0
   [junit4]   2> 2174160 INFO  (qtp741555312-146381) [    x:collection1] o.a.s.u.p.LogUpdateProcessorFactory [collection1]  webapp=/solr path=/update params={wt=javabin&version=2}{add=[59]} 0 0
   [junit4]   2> 2174162 INFO  (qtp741555312-146381) [    x:collection1] o.a.s.u.p.LogUpdateProcessorFactory [collection1]  webapp=/solr path=/update params={wt=javabin&version=2}{add=[60]} 0 0
   [junit4]   2> 2174163 INFO  (qtp741555312-146381) [    x:collection1] o.a.s.u.p.LogUpdateProcessorFactory [collection1]  webapp=/solr path=/update params={wt=javabin&version=2}{add=[61]} 0 0
   [junit4]   2> 2174165 INFO  (qtp741555312-146381) [    x:collection1] o.a.s.u.DirectUpdateHandler2 start commit{,optimize=false,openSearcher=true,waitSearcher=true,expungeDeletes=false,softCommit=false,prepareCommit=false}
   [junit4]   2> 2174226 INFO  (qtp741555312-146381) [    x:collection1] o.a.s.c.SolrDeletionPolicy SolrDeletionPolicy.onCommit: commits: num=2
   [junit4]   2> 	commit{dir=/x1/jenkins/jenkins-slave/workspace/Lucene-Solr-NightlyTests-6.x/solr/build/solr-core/test/J0/temp/solr.handler.TestReplicationHandler_92B1F4F0A1883F9-001/solr-instance-001/collection1/data/index,segFN=segments_1,generation=1}
   [junit4]   2> 	commit{dir=/x1/jenkins/jenkins-slave/workspace/Lucene-Solr-NightlyTests-6.x/solr/build/solr-core/test/J0/temp/solr.handler.TestReplicationHandler_92B1F4F0A1883F9-001/solr-instance-001/collection1/data/index,segFN=segments_2,generation=2}
   [junit4]   2> 2174227 INFO  (qtp741555312-146381) [    x:collection1] o.a.s.c.SolrDeletionPolicy newest commit generation = 2
   [junit4]   2> 2174229 INFO  (qtp741555312-146381) [    x:collection1] o.a.s.s.SolrIndexSearcher Opening [Searcher@4d3b80a4[collection1] main]
   [junit4]   2> 2174229 INFO  (qtp741555312-146381) [    x:collection1] o.a.s.u.DirectUpdateHandler2 end_commit_flush
   [junit4]   2> 2174229 INFO  (searcherExecutor-8998-thread-1-processing-x:collection1) [    x:collection1] o.a.s.c.SolrCore [collection1] Registered new searcher Searcher@4d3b80a4[collection1] main{ExitableDirectoryReader(UninvertingDirectoryReader(Uninverting(_0(6.1.0):C62)))}
   [junit4]   2> 2174229 INFO  (qtp741555312-146381) [    x:collection1] o.a.s.u.p.LogUpdateProcessorFactory [collection1]  webapp=/solr path=/update params={waitSearcher=true&commit=true&softCommit=false&wt=javabin&version=2}{commit=} 0 64
   [junit4]   2> 2174230 INFO  (TEST-TestReplicationHandler.testRateLimitedReplication-seed#[92B1F4F0A1883F9]) [    ] o.e.j.s.ServerConnector Stopped ServerConnector@195af9f6{HTTP/1.1,[http/1.1]}{127.0.0.1:0}
   [junit4]   2> 2174230 INFO  (TEST-TestReplicationHandler.testRateLimitedReplication-seed#[92B1F4F0A1883F9]) [    ] o.a.s.c.CoreContainer Shutting down CoreContainer instance=910869039
   [junit4]   2> 2174232 INFO  (coreCloseExecutor-9002-thread-1) [    x:collection1] o.a.s.c.SolrCore [collection1]  CLOSING SolrCore org.apache.solr.core.SolrCore@6db91a6a
   [junit4]   2> 2174232 INFO  (coreCloseExecutor-9002-thread-1) [    x:collection1] o.a.s.u.DirectUpdateHandler2 closing DirectUpdateHandler2{commits=1,autocommits=0,soft autocommits=0,optimizes=0,rollbacks=0,expungeDeletes=0,docsPending=0,adds=0,deletesById=0,deletesByQuery=0,errors=0,cumulative_adds=62,cumulative_deletesById=0,cumulative_deletesByQuery=0,cumulative_errors=0}
   [junit4]   2> 2174233 INFO  (coreCloseExecutor-9002-thread-1) [    x:collection1] o.a.s.u.SolrCoreState Closing SolrCoreState
   [junit4]   2> 2174233 INFO  (coreCloseExecutor-9002-thread-1) [    x:collection1] o.a.s.u.DefaultSolrCoreState SolrCoreState ref count has reached 0 - closing IndexWriter
   [junit4]   2> 2174233 INFO  (coreCloseExecutor-9002-thread-1) [    x:collection1] o.a.s.u.DefaultSolrCoreState closing IndexWriter with IndexWriterCloser
   [junit4]   2> 2174234 INFO  (coreCloseExecutor-9002-thread-1) [    x:collection1] o.a.s.c.SolrCore [collection1] Closing main searcher on request.
   [junit4]   2> 2174234 INFO  (coreCloseExecutor-9002-thread-1) [    x:collection1] o.a.s.c.CachingDirectoryFactory Closing StandardDirectoryFactory - 2 directories currently being tracked
   [junit4]   2> 2174234 INFO  (coreCloseExecutor-9002-thread-1) [    x:collection1] o.a.s.c.CachingDirectoryFactory looking to close /x1/jenkins/jenkins-slave/workspace/Lucene-Solr-NightlyTests-6.x/solr/build/solr-core/test/J0/temp/solr.handler.TestReplicationHandler_92B1F4F0A1883F9-001/solr-instance-001/collection1/data/index [CachedDir<<refCount=0;path=/x1/jenkins/jenkins-slave/workspace/Lucene-Solr-NightlyTests-6.x/solr/build/solr-core/test/J0/temp/solr.handler.TestReplicationHandler_92B1F4F0A1883F9-001/solr-instance-001/collection1/data/index;done=false>>]
   [junit4]   2> 2174235 INFO  (coreCloseExecutor-9002-thread-1) [    x:collection1] o.a.s.c.CachingDirectoryFactory Closing directory, CoreContainer#isShutdown=true
   [junit4]   2> 2174235 INFO  (coreCloseExecutor-9002-thread-1) [    x:collection1] o.a.s.c.CachingDirectoryFactory Closing directory: /x1/jenkins/jenkins-slave/workspace/Lucene-Solr-NightlyTests-6.x/solr/build/solr-core/test/J0/temp/solr.handler.TestReplicationHandler_92B1F4F0A1883F9-001/solr-instance-001/collection1/data/index
   [junit4]   2> 2174235 INFO  (coreCloseExecutor-9002-thread-1) [    x:collection1] o.a.s.c.CachingDirectoryFactory looking to close /x1/jenkins/jenkins-slave/workspace/Lucene-Solr-NightlyTests-6.x/solr/build/solr-core/test/J0/temp/solr.handler.TestReplicationHandler_92B1F4F0A1883F9-001/solr-instance-001/collection1/data [CachedDir<<refCount=0;path=/x1/jenkins/jenkins-slave/workspace/Lucene-Solr-NightlyTests-6.x/solr/build/solr-core/test/J0/temp/solr.handler.TestReplicationHandler_92B1F4F0A1883F9-001/solr-instance-001/collection1/data;done=false>>]
   [junit4]   2> 2174235 INFO  (coreCloseExecutor-9002-thread-1) [    x:collection1] o.a.s.c.CachingDirectoryFactory Closing directory, CoreContainer#isShutdown=true
   [junit4]   2> 2174235 INFO  (coreCloseExecutor-9002-thread-1) [    x:collection1] o.a.s.c.CachingDirectoryFactory Closing directory: /x1/jenkins/jenkins-slave/workspace/Lucene-Solr-NightlyTests-6.x/solr/build/solr-core/test/J0/temp/solr.handler.TestReplicationHandler_92B1F4F0A1883F9-001/solr-instance-001/collection1/data
   [junit4]   2> 2174235 INFO  (TEST-TestReplicationHandler.testRateLimitedReplication-seed#[92B1F4F0A1883F9]) [    ] o.e.j.s.h.ContextHandler Stopped o.e.j.s.ServletContextHandler@253f86d8{/solr,null,UNAVAILABLE}
   [junit4]   2> 2174237 INFO  (TEST-TestReplicationHandler.testRateLimitedReplication-seed#[92B1F4F0A1883F9]) [    ] o.e.j.s.Server jetty-9.3.8.v20160314
   [junit4]   2> 2174245 INFO  (TEST-TestReplicationHandler.testRateLimitedReplication-seed#[92B1F4F0A1883F9]) [    ] o.e.j.s.h.ContextHandler Started o.e.j.s.ServletContextHandler@66654eac{/solr,null,AVAILABLE}
   [junit4]   2> 2174246 INFO  (TEST-TestReplicationHandler.testRateLimitedReplication-seed#[92B1F4F0A1883F9]) [    ] o.e.j.s.ServerConnector Started ServerConnector@7ecbc5c5{HTTP/1.1,[http/1.1]}{127.0.0.1:49345}
   [junit4]   2> 2174246 INFO  (TEST-Te

[...truncated too long message...]

d([92B1F4F0A1883F9]:0)
   [junit4]    > 	at org.apache.solr.client.solrj.impl.HttpSolrClient.executeMethod(HttpSolrClient.java:590)
   [junit4]    > 	at org.apache.solr.client.solrj.impl.HttpSolrClient.request(HttpSolrClient.java:259)
   [junit4]    > 	at org.apache.solr.client.solrj.impl.HttpSolrClient.request(HttpSolrClient.java:248)
   [junit4]    > 	at org.apache.solr.client.solrj.impl.LBHttpSolrClient.doRequest(LBHttpSolrClient.java:404)
   [junit4]    > 	at org.apache.solr.client.solrj.impl.LBHttpSolrClient.request(LBHttpSolrClient.java:357)
   [junit4]    > 	at org.apache.solr.client.solrj.impl.CloudSolrClient.sendRequest(CloudSolrClient.java:1228)
   [junit4]    > 	at org.apache.solr.client.solrj.impl.CloudSolrClient.requestWithRetryOnStaleState(CloudSolrClient.java:998)
   [junit4]    > 	at org.apache.solr.client.solrj.impl.CloudSolrClient.request(CloudSolrClient.java:934)
   [junit4]    > 	at org.apache.solr.client.solrj.SolrClient.request(SolrClient.java:1219)
   [junit4]    > 	at org.apache.solr.cloud.AbstractFullDistribZkTestBase.createCollection(AbstractFullDistribZkTestBase.java:1599)
   [junit4]    > 	at org.apache.solr.cloud.AbstractFullDistribZkTestBase.createCollection(AbstractFullDistribZkTestBase.java:1620)
   [junit4]    > 	at org.apache.solr.cloud.CollectionsAPIDistributedZkTest$1CollectionThread.run(CollectionsAPIDistributedZkTest.java:987)Throwable #4: com.carrotsearch.randomizedtesting.UncaughtExceptionError: Captured an uncaught exception in thread: Thread[id=207587, name=collection2, state=RUNNABLE, group=TGRP-CollectionsAPIDistributedZkTest]
   [junit4]    > Caused by: org.apache.solr.client.solrj.impl.HttpSolrClient$RemoteSolrException: Error from server at https://127.0.0.1:43784/z: collection already exists: awholynewstresscollection_collection2_3
   [junit4]    > 	at __randomizedtesting.SeedInfo.seed([92B1F4F0A1883F9]:0)
   [junit4]    > 	at org.apache.solr.client.solrj.impl.HttpSolrClient.executeMethod(HttpSolrClient.java:590)
   [junit4]    > 	at org.apache.solr.client.solrj.impl.HttpSolrClient.request(HttpSolrClient.java:259)
   [junit4]    > 	at org.apache.solr.client.solrj.impl.HttpSolrClient.request(HttpSolrClient.java:248)
   [junit4]    > 	at org.apache.solr.client.solrj.impl.LBHttpSolrClient.doRequest(LBHttpSolrClient.java:404)
   [junit4]    > 	at org.apache.solr.client.solrj.impl.LBHttpSolrClient.request(LBHttpSolrClient.java:357)
   [junit4]    > 	at org.apache.solr.client.solrj.impl.CloudSolrClient.sendRequest(CloudSolrClient.java:1228)
   [junit4]    > 	at org.apache.solr.client.solrj.impl.CloudSolrClient.requestWithRetryOnStaleState(CloudSolrClient.java:998)
   [junit4]    > 	at org.apache.solr.client.solrj.impl.CloudSolrClient.request(CloudSolrClient.java:934)
   [junit4]    > 	at org.apache.solr.client.solrj.SolrClient.request(SolrClient.java:1219)
   [junit4]    > 	at org.apache.solr.cloud.AbstractFullDistribZkTestBase.createCollection(AbstractFullDistribZkTestBase.java:1599)
   [junit4]    > 	at org.apache.solr.cloud.AbstractFullDistribZkTestBase.createCollection(AbstractFullDistribZkTestBase.java:1620)
   [junit4]    > 	at org.apache.solr.cloud.CollectionsAPIDistributedZkTest$1CollectionThread.run(CollectionsAPIDistributedZkTest.java:987)Throwable #5: com.carrotsearch.randomizedtesting.UncaughtExceptionError: Captured an uncaught exception in thread: Thread[id=207589, name=collection4, state=RUNNABLE, group=TGRP-CollectionsAPIDistributedZkTest]
   [junit4]    > Caused by: org.apache.solr.client.solrj.impl.HttpSolrClient$RemoteSolrException: Error from server at https://127.0.0.1:43784/z: collection already exists: awholynewstresscollection_collection4_3
   [junit4]    > 	at __randomizedtesting.SeedInfo.seed([92B1F4F0A1883F9]:0)
   [junit4]    > 	at org.apache.solr.client.solrj.impl.HttpSolrClient.executeMethod(HttpSolrClient.java:590)
   [junit4]    > 	at org.apache.solr.client.solrj.impl.HttpSolrClient.request(HttpSolrClient.java:259)
   [junit4]    > 	at org.apache.solr.client.solrj.impl.HttpSolrClient.request(HttpSolrClient.java:248)
   [junit4]    > 	at org.apache.solr.client.solrj.impl.LBHttpSolrClient.doRequest(LBHttpSolrClient.java:404)
   [junit4]    > 	at org.apache.solr.client.solrj.impl.LBHttpSolrClient.request(LBHttpSolrClient.java:357)
   [junit4]    > 	at org.apache.solr.client.solrj.impl.CloudSolrClient.sendRequest(CloudSolrClient.java:1228)
   [junit4]    > 	at org.apache.solr.client.solrj.impl.CloudSolrClient.requestWithRetryOnStaleState(CloudSolrClient.java:998)
   [junit4]    > 	at org.apache.solr.client.solrj.impl.CloudSolrClient.request(CloudSolrClient.java:934)
   [junit4]    > 	at org.apache.solr.client.solrj.SolrClient.request(SolrClient.java:1219)
   [junit4]    > 	at org.apache.solr.cloud.AbstractFullDistribZkTestBase.createCollection(AbstractFullDistribZkTestBase.java:1599)
   [junit4]    > 	at org.apache.solr.cloud.AbstractFullDistribZkTestBase.createCollection(AbstractFullDistribZkTestBase.java:1620)
   [junit4]    > 	at org.apache.solr.cloud.CollectionsAPIDistributedZkTest$1CollectionThread.run(CollectionsAPIDistributedZkTest.java:987)
   [junit4]   2> 3544620 INFO  (SUITE-CollectionsAPIDistributedZkTest-seed#[92B1F4F0A1883F9]-worker) [    ] o.a.s.SolrTestCaseJ4 ###deleteCore
   [junit4]   2> NOTE: leaving temporary files on disk at: /x1/jenkins/jenkins-slave/workspace/Lucene-Solr-NightlyTests-6.x/solr/build/solr-core/test/J1/temp/solr.cloud.CollectionsAPIDistributedZkTest_92B1F4F0A1883F9-001
   [junit4]   2> Jun 08, 2016 9:37:22 AM com.carrotsearch.randomizedtesting.ThreadLeakControl checkThreadLeaks
   [junit4]   2> WARNING: Will linger awaiting termination of 1 leaked thread(s).
   [junit4]   2> NOTE: test params are: codec=Asserting(Lucene60): {other_tl1=Lucene50(blocksize=128), range_facet_l_dv=PostingsFormat(name=LuceneVarGapFixedInterval), _version_=Lucene50(blocksize=128), multiDefault=PostingsFormat(name=MockRandom), a_t=PostingsFormat(name=MockRandom), intDefault=Lucene50(blocksize=128), a_i1=PostingsFormat(name=MockRandom), id=PostingsFormat(name=LuceneVarGapFixedInterval), range_facet_i_dv=PostingsFormat(name=MockRandom), text=FSTOrd50, range_facet_l=PostingsFormat(name=MockRandom), timestamp=PostingsFormat(name=MockRandom)}, docValues:{range_facet_l_dv=DocValuesFormat(name=Lucene54), range_facet_i_dv=DocValuesFormat(name=Lucene54), timestamp=DocValuesFormat(name=Lucene54)}, maxPointsInLeafNode=1111, maxMBSortInHeap=7.005035895146953, sim=ClassicSimilarity, locale=fr-CH, timezone=Africa/Djibouti
   [junit4]   2> NOTE: Linux 3.13.0-85-generic amd64/Oracle Corporation 1.8.0_74 (64-bit)/cpus=4,threads=1,free=97793360,total=482869248
   [junit4]   2> NOTE: All tests run in this JVM: [DocumentBuilderTest, BlockJoinFacetRandomTest, TestConfigSets, ZkStateReaderTest, ShardRoutingTest, SolrInfoMBeanTest, TestPerFieldSimilarityWithDefaultOverride, TestGeoJSONResponseWriter, TestDistribIDF, SimplePostToolTest, TestHashQParserPlugin, TestRestManager, CollectionsAPIAsyncDistributedZkTest, LoggingHandlerTest, OpenExchangeRatesOrgProviderTest, DistributedIntervalFacetingTest, TestConfigOverlay, TestBM25SimilarityFactory, DistributedFacetPivotSmallAdvancedTest, ClusterStateUpdateTest, TestReRankQParserPlugin, TestSolrCoreProperties, TestJsonFacets, TestFieldTypeCollectionResource, DeleteReplicaTest, TestDocumentBuilder, HttpPartitionTest, ShardRoutingCustomTest, TestUpdate, UniqFieldsUpdateProcessorFactoryTest, TestOnReconnectListenerSupport, ExitableDirectoryReaderTest, CollectionReloadTest, TriLevelCompositeIdRoutingTest, TestAnalyzeInfixSuggestions, HdfsThreadLeakTest, TestCursorMarkWithoutUniqueKey, TestChildDocTransformer, SaslZkACLProviderTest, TestSystemIdResolver, CursorMarkTest, TestCollapseQParserPlugin, TestWordDelimiterFilterFactory, TestSolrConfigHandlerCloud, DistributedQueryComponentCustomSortTest, TestMiniSolrCloudClusterBase, HdfsBasicDistributedZkTest, TestReplicaProperties, ZkCLITest, ZkSolrClientTest, SecurityConfHandlerTest, OpenCloseCoreStressTest, ZkControllerTest, TestStressUserVersions, TestFreeTextSuggestions, TestQuerySenderListener, SuggestComponentTest, AddSchemaFieldsUpdateProcessorFactoryTest, SchemaVersionSpecificBehaviorTest, LeaderInitiatedRecoveryOnShardRestartTest, TestQuerySenderNoQuery, AliasIntegrationTest, HdfsCollectionsAPIDistributedZkTest, CoreAdminRequestStatusTest, TestSearcherReuse, TestUseDocValuesAsStored2, TestCopyFieldCollectionResource, TestBinaryResponseWriter, SpatialFilterTest, CollectionsAPIDistributedZkTest]
   [junit4] Completed [417/613 (3!)] on J1 in 619.61s, 1 test, 1 error <<< FAILURES!

[...truncated 657 lines...]
BUILD FAILED
/x1/jenkins/jenkins-slave/workspace/Lucene-Solr-NightlyTests-6.x/build.xml:747: The following error occurred while executing this line:
/x1/jenkins/jenkins-slave/workspace/Lucene-Solr-NightlyTests-6.x/build.xml:684: The following error occurred while executing this line:
/x1/jenkins/jenkins-slave/workspace/Lucene-Solr-NightlyTests-6.x/build.xml:59: The following error occurred while executing this line:
/x1/jenkins/jenkins-slave/workspace/Lucene-Solr-NightlyTests-6.x/solr/build.xml:233: The following error occurred while executing this line:
/x1/jenkins/jenkins-slave/workspace/Lucene-Solr-NightlyTests-6.x/solr/common-build.xml:531: The following error occurred while executing this line:
/x1/jenkins/jenkins-slave/workspace/Lucene-Solr-NightlyTests-6.x/lucene/common-build.xml:1427: The following error occurred while executing this line:
/x1/jenkins/jenkins-slave/workspace/Lucene-Solr-NightlyTests-6.x/lucene/common-build.xml:984: There were test failures: 613 suites (10 ignored), 2567 tests, 1 suite-level error, 2 errors, 33 ignored (18 assumptions) [seed: 92B1F4F0A1883F9]

Total time: 252 minutes 1 second
Build step 'Invoke Ant' marked build as failure
Archiving artifacts
No prior successful build to compare, so performing full copy of artifacts
Recording test results
Email was triggered for: Failure - Any
Sending email for trigger: Failure - Any




Mime
View raw message