lucene-dev mailing list archives

Site index · List index
Message view « Date » · « Thread »
Top « Date » · « Thread »
From Policeman Jenkins Server <jenk...@thetaphi.de>
Subject [JENKINS] Lucene-Solr-6.x-Linux (64bit/jdk1.8.0_92) - Build # 930 - Still Failing!
Date Mon, 20 Jun 2016 17:55:13 GMT
Build: http://jenkins.thetaphi.de/job/Lucene-Solr-6.x-Linux/930/
Java: 64bit/jdk1.8.0_92 -XX:-UseCompressedOops -XX:+UseSerialGC

1 tests failed.
FAILED:  org.apache.solr.handler.TestReqParamsAPI.test

Error Message:
Could not get expected value  'CY val' for path 'params/c' full output: {   "responseHeader":{     "status":0,     "QTime":0},   "params":{     "a":"A val",     "b":"B val",     "wt":"json",     "useParams":""},   "context":{     "webapp":"/mdvf",     "path":"/dump1",     "httpMethod":"GET"}},  from server:  https://127.0.0.1:45478/mdvf/collection1

Stack Trace:
java.lang.AssertionError: Could not get expected value  'CY val' for path 'params/c' full output: {
  "responseHeader":{
    "status":0,
    "QTime":0},
  "params":{
    "a":"A val",
    "b":"B val",
    "wt":"json",
    "useParams":""},
  "context":{
    "webapp":"/mdvf",
    "path":"/dump1",
    "httpMethod":"GET"}},  from server:  https://127.0.0.1:45478/mdvf/collection1
	at __randomizedtesting.SeedInfo.seed([9563B5A726C8A8BA:1D378A7D8834C542]:0)
	at org.junit.Assert.fail(Assert.java:93)
	at org.junit.Assert.assertTrue(Assert.java:43)
	at org.apache.solr.core.TestSolrConfigHandler.testForResponseElement(TestSolrConfigHandler.java:481)
	at org.apache.solr.handler.TestReqParamsAPI.testReqParams(TestReqParamsAPI.java:171)
	at org.apache.solr.handler.TestReqParamsAPI.test(TestReqParamsAPI.java:61)
	at sun.reflect.NativeMethodAccessorImpl.invoke0(Native Method)
	at sun.reflect.NativeMethodAccessorImpl.invoke(NativeMethodAccessorImpl.java:62)
	at sun.reflect.DelegatingMethodAccessorImpl.invoke(DelegatingMethodAccessorImpl.java:43)
	at java.lang.reflect.Method.invoke(Method.java:498)
	at com.carrotsearch.randomizedtesting.RandomizedRunner.invoke(RandomizedRunner.java:1764)
	at com.carrotsearch.randomizedtesting.RandomizedRunner$8.evaluate(RandomizedRunner.java:871)
	at com.carrotsearch.randomizedtesting.RandomizedRunner$9.evaluate(RandomizedRunner.java:907)
	at com.carrotsearch.randomizedtesting.RandomizedRunner$10.evaluate(RandomizedRunner.java:921)
	at org.apache.solr.BaseDistributedSearchTestCase$ShardsRepeatRule$ShardsFixedStatement.callStatement(BaseDistributedSearchTestCase.java:992)
	at org.apache.solr.BaseDistributedSearchTestCase$ShardsRepeatRule$ShardsStatement.evaluate(BaseDistributedSearchTestCase.java:967)
	at com.carrotsearch.randomizedtesting.rules.SystemPropertiesRestoreRule$1.evaluate(SystemPropertiesRestoreRule.java:57)
	at org.apache.lucene.util.TestRuleSetupTeardownChained$1.evaluate(TestRuleSetupTeardownChained.java:49)
	at org.apache.lucene.util.AbstractBeforeAfterRule$1.evaluate(AbstractBeforeAfterRule.java:45)
	at org.apache.lucene.util.TestRuleThreadAndTestName$1.evaluate(TestRuleThreadAndTestName.java:48)
	at org.apache.lucene.util.TestRuleIgnoreAfterMaxFailures$1.evaluate(TestRuleIgnoreAfterMaxFailures.java:64)
	at org.apache.lucene.util.TestRuleMarkFailure$1.evaluate(TestRuleMarkFailure.java:47)
	at com.carrotsearch.randomizedtesting.rules.StatementAdapter.evaluate(StatementAdapter.java:36)
	at com.carrotsearch.randomizedtesting.ThreadLeakControl$StatementRunner.run(ThreadLeakControl.java:367)
	at com.carrotsearch.randomizedtesting.ThreadLeakControl.forkTimeoutingTask(ThreadLeakControl.java:809)
	at com.carrotsearch.randomizedtesting.ThreadLeakControl$3.evaluate(ThreadLeakControl.java:460)
	at com.carrotsearch.randomizedtesting.RandomizedRunner.runSingleTest(RandomizedRunner.java:880)
	at com.carrotsearch.randomizedtesting.RandomizedRunner$5.evaluate(RandomizedRunner.java:781)
	at com.carrotsearch.randomizedtesting.RandomizedRunner$6.evaluate(RandomizedRunner.java:816)
	at com.carrotsearch.randomizedtesting.RandomizedRunner$7.evaluate(RandomizedRunner.java:827)
	at com.carrotsearch.randomizedtesting.rules.StatementAdapter.evaluate(StatementAdapter.java:36)
	at com.carrotsearch.randomizedtesting.rules.SystemPropertiesRestoreRule$1.evaluate(SystemPropertiesRestoreRule.java:57)
	at org.apache.lucene.util.AbstractBeforeAfterRule$1.evaluate(AbstractBeforeAfterRule.java:45)
	at com.carrotsearch.randomizedtesting.rules.StatementAdapter.evaluate(StatementAdapter.java:36)
	at org.apache.lucene.util.TestRuleStoreClassName$1.evaluate(TestRuleStoreClassName.java:41)
	at com.carrotsearch.randomizedtesting.rules.NoShadowingOrOverridesOnMethodsRule$1.evaluate(NoShadowingOrOverridesOnMethodsRule.java:40)
	at com.carrotsearch.randomizedtesting.rules.NoShadowingOrOverridesOnMethodsRule$1.evaluate(NoShadowingOrOverridesOnMethodsRule.java:40)
	at com.carrotsearch.randomizedtesting.rules.StatementAdapter.evaluate(StatementAdapter.java:36)
	at com.carrotsearch.randomizedtesting.rules.StatementAdapter.evaluate(StatementAdapter.java:36)
	at com.carrotsearch.randomizedtesting.rules.StatementAdapter.evaluate(StatementAdapter.java:36)
	at org.apache.lucene.util.TestRuleAssertionsRequired$1.evaluate(TestRuleAssertionsRequired.java:53)
	at org.apache.lucene.util.TestRuleMarkFailure$1.evaluate(TestRuleMarkFailure.java:47)
	at org.apache.lucene.util.TestRuleIgnoreAfterMaxFailures$1.evaluate(TestRuleIgnoreAfterMaxFailures.java:64)
	at org.apache.lucene.util.TestRuleIgnoreTestSuites$1.evaluate(TestRuleIgnoreTestSuites.java:54)
	at com.carrotsearch.randomizedtesting.rules.StatementAdapter.evaluate(StatementAdapter.java:36)
	at com.carrotsearch.randomizedtesting.ThreadLeakControl$StatementRunner.run(ThreadLeakControl.java:367)
	at java.lang.Thread.run(Thread.java:745)




Build Log:
[...truncated 12153 lines...]
   [junit4] Suite: org.apache.solr.handler.TestReqParamsAPI
   [junit4]   2> Creating dataDir: /home/jenkins/workspace/Lucene-Solr-6.x-Linux/solr/build/solr-core/test/J2/temp/solr.handler.TestReqParamsAPI_9563B5A726C8A8BA-001/init-core-data-001
   [junit4]   2> 1985524 INFO  (SUITE-TestReqParamsAPI-seed#[9563B5A726C8A8BA]-worker) [    ] o.a.s.SolrTestCaseJ4 Randomized ssl (true) and clientAuth (false) via: @org.apache.solr.util.RandomizeSSL(reason=, ssl=NaN, value=NaN, clientAuth=NaN)
   [junit4]   2> 1985524 INFO  (SUITE-TestReqParamsAPI-seed#[9563B5A726C8A8BA]-worker) [    ] o.a.s.BaseDistributedSearchTestCase Setting hostContext system property: /mdvf/
   [junit4]   2> 1985526 INFO  (TEST-TestReqParamsAPI.test-seed#[9563B5A726C8A8BA]) [    ] o.a.s.c.ZkTestServer STARTING ZK TEST SERVER
   [junit4]   2> 1985526 INFO  (Thread-4652) [    ] o.a.s.c.ZkTestServer client port:0.0.0.0/0.0.0.0:0
   [junit4]   2> 1985526 INFO  (Thread-4652) [    ] o.a.s.c.ZkTestServer Starting server
   [junit4]   2> 1985626 INFO  (TEST-TestReqParamsAPI.test-seed#[9563B5A726C8A8BA]) [    ] o.a.s.c.ZkTestServer start zk server on port:34259
   [junit4]   2> 1985626 INFO  (TEST-TestReqParamsAPI.test-seed#[9563B5A726C8A8BA]) [    ] o.a.s.c.c.SolrZkClient Using default ZkCredentialsProvider
   [junit4]   2> 1985626 INFO  (TEST-TestReqParamsAPI.test-seed#[9563B5A726C8A8BA]) [    ] o.a.s.c.c.ConnectionManager Waiting for client to connect to ZooKeeper
   [junit4]   2> 1985628 INFO  (zkCallback-24202-thread-1) [    ] o.a.s.c.c.ConnectionManager Watcher org.apache.solr.common.cloud.ConnectionManager@592aa0ad name:ZooKeeperConnection Watcher:127.0.0.1:34259 got event WatchedEvent state:SyncConnected type:None path:null path:null type:None
   [junit4]   2> 1985628 INFO  (TEST-TestReqParamsAPI.test-seed#[9563B5A726C8A8BA]) [    ] o.a.s.c.c.ConnectionManager Client is connected to ZooKeeper
   [junit4]   2> 1985628 INFO  (TEST-TestReqParamsAPI.test-seed#[9563B5A726C8A8BA]) [    ] o.a.s.c.c.SolrZkClient Using default ZkACLProvider
   [junit4]   2> 1985628 INFO  (TEST-TestReqParamsAPI.test-seed#[9563B5A726C8A8BA]) [    ] o.a.s.c.c.SolrZkClient makePath: /solr
   [junit4]   2> 1985629 INFO  (TEST-TestReqParamsAPI.test-seed#[9563B5A726C8A8BA]) [    ] o.a.s.c.c.SolrZkClient Using default ZkCredentialsProvider
   [junit4]   2> 1985629 INFO  (TEST-TestReqParamsAPI.test-seed#[9563B5A726C8A8BA]) [    ] o.a.s.c.c.ConnectionManager Waiting for client to connect to ZooKeeper
   [junit4]   2> 1985630 INFO  (zkCallback-24203-thread-1) [    ] o.a.s.c.c.ConnectionManager Watcher org.apache.solr.common.cloud.ConnectionManager@3d7cba46 name:ZooKeeperConnection Watcher:127.0.0.1:34259/solr got event WatchedEvent state:SyncConnected type:None path:null path:null type:None
   [junit4]   2> 1985630 INFO  (TEST-TestReqParamsAPI.test-seed#[9563B5A726C8A8BA]) [    ] o.a.s.c.c.ConnectionManager Client is connected to ZooKeeper
   [junit4]   2> 1985630 INFO  (TEST-TestReqParamsAPI.test-seed#[9563B5A726C8A8BA]) [    ] o.a.s.c.c.SolrZkClient Using default ZkACLProvider
   [junit4]   2> 1985630 INFO  (TEST-TestReqParamsAPI.test-seed#[9563B5A726C8A8BA]) [    ] o.a.s.c.c.SolrZkClient makePath: /collections/collection1
   [junit4]   2> 1985631 INFO  (TEST-TestReqParamsAPI.test-seed#[9563B5A726C8A8BA]) [    ] o.a.s.c.c.SolrZkClient makePath: /collections/collection1/shards
   [junit4]   2> 1985632 INFO  (TEST-TestReqParamsAPI.test-seed#[9563B5A726C8A8BA]) [    ] o.a.s.c.c.SolrZkClient makePath: /collections/control_collection
   [junit4]   2> 1985632 INFO  (TEST-TestReqParamsAPI.test-seed#[9563B5A726C8A8BA]) [    ] o.a.s.c.c.SolrZkClient makePath: /collections/control_collection/shards
   [junit4]   2> 1985633 INFO  (TEST-TestReqParamsAPI.test-seed#[9563B5A726C8A8BA]) [    ] o.a.s.c.AbstractZkTestCase put /home/jenkins/workspace/Lucene-Solr-6.x-Linux/solr/core/src/test-files/solr/collection1/conf/solrconfig-tlog.xml to /configs/conf1/solrconfig.xml
   [junit4]   2> 1985633 INFO  (TEST-TestReqParamsAPI.test-seed#[9563B5A726C8A8BA]) [    ] o.a.s.c.c.SolrZkClient makePath: /configs/conf1/solrconfig.xml
   [junit4]   2> 1985634 INFO  (TEST-TestReqParamsAPI.test-seed#[9563B5A726C8A8BA]) [    ] o.a.s.c.AbstractZkTestCase put /home/jenkins/workspace/Lucene-Solr-6.x-Linux/solr/core/src/test-files/solr/collection1/conf/schema.xml to /configs/conf1/schema.xml
   [junit4]   2> 1985635 INFO  (TEST-TestReqParamsAPI.test-seed#[9563B5A726C8A8BA]) [    ] o.a.s.c.c.SolrZkClient makePath: /configs/conf1/schema.xml
   [junit4]   2> 1985636 INFO  (TEST-TestReqParamsAPI.test-seed#[9563B5A726C8A8BA]) [    ] o.a.s.c.AbstractZkTestCase put /home/jenkins/workspace/Lucene-Solr-6.x-Linux/solr/core/src/test-files/solr/collection1/conf/solrconfig.snippet.randomindexconfig.xml to /configs/conf1/solrconfig.snippet.randomindexconfig.xml
   [junit4]   2> 1985636 INFO  (TEST-TestReqParamsAPI.test-seed#[9563B5A726C8A8BA]) [    ] o.a.s.c.c.SolrZkClient makePath: /configs/conf1/solrconfig.snippet.randomindexconfig.xml
   [junit4]   2> 1985637 INFO  (TEST-TestReqParamsAPI.test-seed#[9563B5A726C8A8BA]) [    ] o.a.s.c.AbstractZkTestCase put /home/jenkins/workspace/Lucene-Solr-6.x-Linux/solr/core/src/test-files/solr/collection1/conf/stopwords.txt to /configs/conf1/stopwords.txt
   [junit4]   2> 1985637 INFO  (TEST-TestReqParamsAPI.test-seed#[9563B5A726C8A8BA]) [    ] o.a.s.c.c.SolrZkClient makePath: /configs/conf1/stopwords.txt
   [junit4]   2> 1985637 INFO  (TEST-TestReqParamsAPI.test-seed#[9563B5A726C8A8BA]) [    ] o.a.s.c.AbstractZkTestCase put /home/jenkins/workspace/Lucene-Solr-6.x-Linux/solr/core/src/test-files/solr/collection1/conf/protwords.txt to /configs/conf1/protwords.txt
   [junit4]   2> 1985637 INFO  (TEST-TestReqParamsAPI.test-seed#[9563B5A726C8A8BA]) [    ] o.a.s.c.c.SolrZkClient makePath: /configs/conf1/protwords.txt
   [junit4]   2> 1985638 INFO  (TEST-TestReqParamsAPI.test-seed#[9563B5A726C8A8BA]) [    ] o.a.s.c.AbstractZkTestCase put /home/jenkins/workspace/Lucene-Solr-6.x-Linux/solr/core/src/test-files/solr/collection1/conf/currency.xml to /configs/conf1/currency.xml
   [junit4]   2> 1985638 INFO  (TEST-TestReqParamsAPI.test-seed#[9563B5A726C8A8BA]) [    ] o.a.s.c.c.SolrZkClient makePath: /configs/conf1/currency.xml
   [junit4]   2> 1985638 INFO  (TEST-TestReqParamsAPI.test-seed#[9563B5A726C8A8BA]) [    ] o.a.s.c.AbstractZkTestCase put /home/jenkins/workspace/Lucene-Solr-6.x-Linux/solr/core/src/test-files/solr/collection1/conf/enumsConfig.xml to /configs/conf1/enumsConfig.xml
   [junit4]   2> 1985639 INFO  (TEST-TestReqParamsAPI.test-seed#[9563B5A726C8A8BA]) [    ] o.a.s.c.c.SolrZkClient makePath: /configs/conf1/enumsConfig.xml
   [junit4]   2> 1985639 INFO  (TEST-TestReqParamsAPI.test-seed#[9563B5A726C8A8BA]) [    ] o.a.s.c.AbstractZkTestCase put /home/jenkins/workspace/Lucene-Solr-6.x-Linux/solr/core/src/test-files/solr/collection1/conf/open-exchange-rates.json to /configs/conf1/open-exchange-rates.json
   [junit4]   2> 1985639 INFO  (TEST-TestReqParamsAPI.test-seed#[9563B5A726C8A8BA]) [    ] o.a.s.c.c.SolrZkClient makePath: /configs/conf1/open-exchange-rates.json
   [junit4]   2> 1985640 INFO  (TEST-TestReqParamsAPI.test-seed#[9563B5A726C8A8BA]) [    ] o.a.s.c.AbstractZkTestCase put /home/jenkins/workspace/Lucene-Solr-6.x-Linux/solr/core/src/test-files/solr/collection1/conf/mapping-ISOLatin1Accent.txt to /configs/conf1/mapping-ISOLatin1Accent.txt
   [junit4]   2> 1985640 INFO  (TEST-TestReqParamsAPI.test-seed#[9563B5A726C8A8BA]) [    ] o.a.s.c.c.SolrZkClient makePath: /configs/conf1/mapping-ISOLatin1Accent.txt
   [junit4]   2> 1985641 INFO  (TEST-TestReqParamsAPI.test-seed#[9563B5A726C8A8BA]) [    ] o.a.s.c.AbstractZkTestCase put /home/jenkins/workspace/Lucene-Solr-6.x-Linux/solr/core/src/test-files/solr/collection1/conf/old_synonyms.txt to /configs/conf1/old_synonyms.txt
   [junit4]   2> 1985641 INFO  (TEST-TestReqParamsAPI.test-seed#[9563B5A726C8A8BA]) [    ] o.a.s.c.c.SolrZkClient makePath: /configs/conf1/old_synonyms.txt
   [junit4]   2> 1985641 INFO  (TEST-TestReqParamsAPI.test-seed#[9563B5A726C8A8BA]) [    ] o.a.s.c.AbstractZkTestCase put /home/jenkins/workspace/Lucene-Solr-6.x-Linux/solr/core/src/test-files/solr/collection1/conf/synonyms.txt to /configs/conf1/synonyms.txt
   [junit4]   2> 1985642 INFO  (TEST-TestReqParamsAPI.test-seed#[9563B5A726C8A8BA]) [    ] o.a.s.c.c.SolrZkClient makePath: /configs/conf1/synonyms.txt
   [junit4]   2> 1985642 INFO  (TEST-TestReqParamsAPI.test-seed#[9563B5A726C8A8BA]) [    ] o.a.s.c.c.SolrZkClient Using default ZkCredentialsProvider
   [junit4]   2> 1985643 INFO  (TEST-TestReqParamsAPI.test-seed#[9563B5A726C8A8BA]) [    ] o.a.s.c.c.ConnectionManager Waiting for client to connect to ZooKeeper
   [junit4]   2> 1985643 INFO  (zkCallback-24205-thread-1) [    ] o.a.s.c.c.ConnectionManager Watcher org.apache.solr.common.cloud.ConnectionManager@42dd47c name:ZooKeeperConnection Watcher:127.0.0.1:34259/solr got event WatchedEvent state:SyncConnected type:None path:null path:null type:None
   [junit4]   2> 1985643 INFO  (TEST-TestReqParamsAPI.test-seed#[9563B5A726C8A8BA]) [    ] o.a.s.c.c.ConnectionManager Client is connected to ZooKeeper
   [junit4]   2> 1985643 INFO  (TEST-TestReqParamsAPI.test-seed#[9563B5A726C8A8BA]) [    ] o.a.s.c.c.SolrZkClient Using default ZkACLProvider
   [junit4]   2> 1985730 INFO  (TEST-TestReqParamsAPI.test-seed#[9563B5A726C8A8BA]) [    ] o.a.s.SolrTestCaseJ4 Writing core.properties file to /home/jenkins/workspace/Lucene-Solr-6.x-Linux/solr/build/solr-core/test/J2/temp/solr.handler.TestReqParamsAPI_9563B5A726C8A8BA-001/control-001/cores/collection1
   [junit4]   2> 1985734 INFO  (TEST-TestReqParamsAPI.test-seed#[9563B5A726C8A8BA]) [    ] o.e.j.s.Server jetty-9.3.8.v20160314
   [junit4]   2> 1985735 INFO  (TEST-TestReqParamsAPI.test-seed#[9563B5A726C8A8BA]) [    ] o.e.j.s.h.ContextHandler Started o.e.j.s.ServletContextHandler@2e4844c0{/mdvf,null,AVAILABLE}
   [junit4]   2> 1985739 INFO  (TEST-TestReqParamsAPI.test-seed#[9563B5A726C8A8BA]) [    ] o.e.j.s.ServerConnector Started ServerConnector@68ab606b{SSL,[ssl, http/1.1]}{127.0.0.1:38650}
   [junit4]   2> 1985739 INFO  (TEST-TestReqParamsAPI.test-seed#[9563B5A726C8A8BA]) [    ] o.e.j.s.Server Started @1987446ms
   [junit4]   2> 1985739 INFO  (TEST-TestReqParamsAPI.test-seed#[9563B5A726C8A8BA]) [    ] o.a.s.c.s.e.JettySolrRunner Jetty properties: {solr.data.dir=/home/jenkins/workspace/Lucene-Solr-6.x-Linux/solr/build/solr-core/test/J2/temp/solr.handler.TestReqParamsAPI_9563B5A726C8A8BA-001/tempDir-001/control/data, hostContext=/mdvf, hostPort=38650, coreRootDirectory=/home/jenkins/workspace/Lucene-Solr-6.x-Linux/solr/build/solr-core/test/J2/../../../../../../../../../home/jenkins/workspace/Lucene-Solr-6.x-Linux/solr/build/solr-core/test/J2/temp/solr.handler.TestReqParamsAPI_9563B5A726C8A8BA-001/control-001/cores}
   [junit4]   2> 1985740 INFO  (TEST-TestReqParamsAPI.test-seed#[9563B5A726C8A8BA]) [    ] o.a.s.s.SolrDispatchFilter SolrDispatchFilter.init(): sun.misc.Launcher$AppClassLoader@73d16e93
   [junit4]   2> 1985740 INFO  (TEST-TestReqParamsAPI.test-seed#[9563B5A726C8A8BA]) [    ] o.a.s.c.SolrResourceLoader new SolrResourceLoader for directory: '/home/jenkins/workspace/Lucene-Solr-6.x-Linux/solr/build/solr-core/test/J2/temp/solr.handler.TestReqParamsAPI_9563B5A726C8A8BA-001/control-001'
   [junit4]   2> 1985740 INFO  (TEST-TestReqParamsAPI.test-seed#[9563B5A726C8A8BA]) [    ] o.a.s.c.SolrResourceLoader JNDI not configured for solr (NoInitialContextEx)
   [junit4]   2> 1985740 INFO  (TEST-TestReqParamsAPI.test-seed#[9563B5A726C8A8BA]) [    ] o.a.s.c.SolrResourceLoader solr home defaulted to 'solr/' (could not find system property or JNDI)
   [junit4]   2> 1985740 INFO  (TEST-TestReqParamsAPI.test-seed#[9563B5A726C8A8BA]) [    ] o.a.s.c.c.SolrZkClient Using default ZkCredentialsProvider
   [junit4]   2> 1985752 INFO  (TEST-TestReqParamsAPI.test-seed#[9563B5A726C8A8BA]) [    ] o.a.s.c.c.ConnectionManager Waiting for client to connect to ZooKeeper
   [junit4]   2> 1985752 INFO  (zkCallback-24206-thread-1) [    ] o.a.s.c.c.ConnectionManager Watcher org.apache.solr.common.cloud.ConnectionManager@6c7f2467 name:ZooKeeperConnection Watcher:127.0.0.1:34259/solr got event WatchedEvent state:SyncConnected type:None path:null path:null type:None
   [junit4]   2> 1985752 INFO  (TEST-TestReqParamsAPI.test-seed#[9563B5A726C8A8BA]) [    ] o.a.s.c.c.ConnectionManager Client is connected to ZooKeeper
   [junit4]   2> 1985752 INFO  (TEST-TestReqParamsAPI.test-seed#[9563B5A726C8A8BA]) [    ] o.a.s.c.c.SolrZkClient Using default ZkACLProvider
   [junit4]   2> 1985753 INFO  (TEST-TestReqParamsAPI.test-seed#[9563B5A726C8A8BA]) [    ] o.a.s.s.SolrDispatchFilter Loading solr.xml from SolrHome (not found in ZooKeeper)
   [junit4]   2> 1985753 INFO  (TEST-TestReqParamsAPI.test-seed#[9563B5A726C8A8BA]) [    ] o.a.s.c.SolrXmlConfig Loading container configuration from /home/jenkins/workspace/Lucene-Solr-6.x-Linux/solr/build/solr-core/test/J2/temp/solr.handler.TestReqParamsAPI_9563B5A726C8A8BA-001/control-001/solr.xml
   [junit4]   2> 1985757 INFO  (TEST-TestReqParamsAPI.test-seed#[9563B5A726C8A8BA]) [    ] o.a.s.c.CorePropertiesLocator Config-defined core root directory: /home/jenkins/workspace/Lucene-Solr-6.x-Linux/solr/build/solr-core/test/J2/../../../../../../../../../home/jenkins/workspace/Lucene-Solr-6.x-Linux/solr/build/solr-core/test/J2/temp/solr.handler.TestReqParamsAPI_9563B5A726C8A8BA-001/control-001/cores
   [junit4]   2> 1985757 INFO  (TEST-TestReqParamsAPI.test-seed#[9563B5A726C8A8BA]) [    ] o.a.s.c.CoreContainer New CoreContainer 766997713
   [junit4]   2> 1985757 INFO  (TEST-TestReqParamsAPI.test-seed#[9563B5A726C8A8BA]) [    ] o.a.s.c.CoreContainer Loading cores into CoreContainer [instanceDir=/home/jenkins/workspace/Lucene-Solr-6.x-Linux/solr/build/solr-core/test/J2/temp/solr.handler.TestReqParamsAPI_9563B5A726C8A8BA-001/control-001]
   [junit4]   2> 1985758 WARN  (TEST-TestReqParamsAPI.test-seed#[9563B5A726C8A8BA]) [    ] o.a.s.c.CoreContainer Couldn't add files from /home/jenkins/workspace/Lucene-Solr-6.x-Linux/solr/build/solr-core/test/J2/temp/solr.handler.TestReqParamsAPI_9563B5A726C8A8BA-001/control-001/lib to classpath: /home/jenkins/workspace/Lucene-Solr-6.x-Linux/solr/build/solr-core/test/J2/temp/solr.handler.TestReqParamsAPI_9563B5A726C8A8BA-001/control-001/lib
   [junit4]   2> 1985758 INFO  (TEST-TestReqParamsAPI.test-seed#[9563B5A726C8A8BA]) [    ] o.a.s.h.c.HttpShardHandlerFactory created with socketTimeout : 90000,urlScheme : ,connTimeout : 15000,maxConnectionsPerHost : 20,maxConnections : 10000,corePoolSize : 0,maximumPoolSize : 2147483647,maxThreadIdleTime : 5,sizeOfQueue : -1,fairnessPolicy : false,useRetries : false,
   [junit4]   2> 1985759 INFO  (TEST-TestReqParamsAPI.test-seed#[9563B5A726C8A8BA]) [    ] o.a.s.u.UpdateShardHandler Creating UpdateShardHandler HTTP client with params: socketTimeout=340000&connTimeout=45000&retry=true
   [junit4]   2> 1985759 INFO  (TEST-TestReqParamsAPI.test-seed#[9563B5A726C8A8BA]) [    ] o.a.s.l.LogWatcher SLF4J impl is org.slf4j.impl.Log4jLoggerFactory
   [junit4]   2> 1985759 INFO  (TEST-TestReqParamsAPI.test-seed#[9563B5A726C8A8BA]) [    ] o.a.s.l.LogWatcher Registering Log Listener [Log4j (org.slf4j.impl.Log4jLoggerFactory)]
   [junit4]   2> 1985759 INFO  (TEST-TestReqParamsAPI.test-seed#[9563B5A726C8A8BA]) [    ] o.a.s.c.ZkContainer Zookeeper client=127.0.0.1:34259/solr
   [junit4]   2> 1985759 INFO  (TEST-TestReqParamsAPI.test-seed#[9563B5A726C8A8BA]) [    ] o.a.s.c.ZkController zkHost includes chroot
   [junit4]   2> 1985759 INFO  (TEST-TestReqParamsAPI.test-seed#[9563B5A726C8A8BA]) [    ] o.a.s.c.c.SolrZkClient Using default ZkCredentialsProvider
   [junit4]   2> 1985760 INFO  (TEST-TestReqParamsAPI.test-seed#[9563B5A726C8A8BA]) [    ] o.a.s.c.c.ConnectionManager Waiting for client to connect to ZooKeeper
   [junit4]   2> 1985760 INFO  (zkCallback-24209-thread-1) [    ] o.a.s.c.c.ConnectionManager Watcher org.apache.solr.common.cloud.ConnectionManager@e105b15 name:ZooKeeperConnection Watcher:127.0.0.1:34259 got event WatchedEvent state:SyncConnected type:None path:null path:null type:None
   [junit4]   2> 1985760 INFO  (TEST-TestReqParamsAPI.test-seed#[9563B5A726C8A8BA]) [    ] o.a.s.c.c.ConnectionManager Client is connected to ZooKeeper
   [junit4]   2> 1985760 INFO  (TEST-TestReqParamsAPI.test-seed#[9563B5A726C8A8BA]) [    ] o.a.s.c.c.SolrZkClient Using default ZkACLProvider
   [junit4]   2> 1985761 INFO  (TEST-TestReqParamsAPI.test-seed#[9563B5A726C8A8BA]) [n:127.0.0.1:38650_mdvf    ] o.a.s.c.ZkController Added new OnReconnect listener org.apache.solr.cloud.ZkController$$Lambda$47/1597562505@3ff49f52
   [junit4]   2> 1985761 INFO  (TEST-TestReqParamsAPI.test-seed#[9563B5A726C8A8BA]) [n:127.0.0.1:38650_mdvf    ] o.a.s.c.c.ConnectionManager Waiting for client to connect to ZooKeeper
   [junit4]   2> 1985761 INFO  (zkCallback-24210-thread-1-processing-n:127.0.0.1:38650_mdvf) [n:127.0.0.1:38650_mdvf    ] o.a.s.c.c.ConnectionManager Watcher org.apache.solr.common.cloud.ConnectionManager@4ddf0540 name:ZooKeeperConnection Watcher:127.0.0.1:34259/solr got event WatchedEvent state:SyncConnected type:None path:null path:null type:None
   [junit4]   2> 1985762 INFO  (TEST-TestReqParamsAPI.test-seed#[9563B5A726C8A8BA]) [n:127.0.0.1:38650_mdvf    ] o.a.s.c.c.ConnectionManager Client is connected to ZooKeeper
   [junit4]   2> 1985762 INFO  (TEST-TestReqParamsAPI.test-seed#[9563B5A726C8A8BA]) [n:127.0.0.1:38650_mdvf    ] o.a.s.c.c.SolrZkClient makePath: /overseer/queue
   [junit4]   2> 1985763 INFO  (TEST-TestReqParamsAPI.test-seed#[9563B5A726C8A8BA]) [n:127.0.0.1:38650_mdvf    ] o.a.s.c.c.SolrZkClient makePath: /overseer/collection-queue-work
   [junit4]   2> 1985764 INFO  (TEST-TestReqParamsAPI.test-seed#[9563B5A726C8A8BA]) [n:127.0.0.1:38650_mdvf    ] o.a.s.c.c.SolrZkClient makePath: /overseer/collection-map-running
   [junit4]   2> 1985765 INFO  (TEST-TestReqParamsAPI.test-seed#[9563B5A726C8A8BA]) [n:127.0.0.1:38650_mdvf    ] o.a.s.c.c.SolrZkClient makePath: /overseer/collection-map-completed
   [junit4]   2> 1985775 INFO  (TEST-TestReqParamsAPI.test-seed#[9563B5A726C8A8BA]) [n:127.0.0.1:38650_mdvf    ] o.a.s.c.c.SolrZkClient makePath: /overseer/collection-map-failure
   [junit4]   2> 1985776 INFO  (TEST-TestReqParamsAPI.test-seed#[9563B5A726C8A8BA]) [n:127.0.0.1:38650_mdvf    ] o.a.s.c.c.SolrZkClient makePath: /live_nodes
   [junit4]   2> 1985777 INFO  (TEST-TestReqParamsAPI.test-seed#[9563B5A726C8A8BA]) [n:127.0.0.1:38650_mdvf    ] o.a.s.c.c.SolrZkClient makePath: /aliases.json
   [junit4]   2> 1985778 INFO  (TEST-TestReqParamsAPI.test-seed#[9563B5A726C8A8BA]) [n:127.0.0.1:38650_mdvf    ] o.a.s.c.c.SolrZkClient makePath: /clusterstate.json
   [junit4]   2> 1985780 INFO  (TEST-TestReqParamsAPI.test-seed#[9563B5A726C8A8BA]) [n:127.0.0.1:38650_mdvf    ] o.a.s.c.c.SolrZkClient makePath: /security.json
   [junit4]   2> 1985780 INFO  (TEST-TestReqParamsAPI.test-seed#[9563B5A726C8A8BA]) [n:127.0.0.1:38650_mdvf    ] o.a.s.c.c.ZkStateReader Updating cluster state from ZooKeeper... 
   [junit4]   2> 1985780 INFO  (TEST-TestReqParamsAPI.test-seed#[9563B5A726C8A8BA]) [n:127.0.0.1:38650_mdvf    ] o.a.s.c.c.ZkStateReader Loaded cluster properties: {urlScheme=https}
   [junit4]   2> 1985781 INFO  (TEST-TestReqParamsAPI.test-seed#[9563B5A726C8A8BA]) [n:127.0.0.1:38650_mdvf    ] o.a.s.c.c.ZkStateReader Updated live nodes from ZooKeeper... (0) -> (0)
   [junit4]   2> 1985782 INFO  (TEST-TestReqParamsAPI.test-seed#[9563B5A726C8A8BA]) [n:127.0.0.1:38650_mdvf    ] o.a.s.c.c.SolrZkClient makePath: /overseer_elect
   [junit4]   2> 1985782 INFO  (TEST-TestReqParamsAPI.test-seed#[9563B5A726C8A8BA]) [n:127.0.0.1:38650_mdvf    ] o.a.s.c.c.SolrZkClient makePath: /overseer_elect/election
   [junit4]   2> 1985782 INFO  (TEST-TestReqParamsAPI.test-seed#[9563B5A726C8A8BA]) [n:127.0.0.1:38650_mdvf    ] o.a.s.c.Overseer Overseer (id=null) closing
   [junit4]   2> 1985783 INFO  (TEST-TestReqParamsAPI.test-seed#[9563B5A726C8A8BA]) [n:127.0.0.1:38650_mdvf    ] o.a.s.c.LeaderElector Joined leadership election with path: /overseer_elect/election/96104944565485573-127.0.0.1:38650_mdvf-n_0000000000
   [junit4]   2> 1985783 INFO  (TEST-TestReqParamsAPI.test-seed#[9563B5A726C8A8BA]) [n:127.0.0.1:38650_mdvf    ] o.a.s.c.OverseerElectionContext I am going to be the leader 127.0.0.1:38650_mdvf
   [junit4]   2> 1985783 INFO  (TEST-TestReqParamsAPI.test-seed#[9563B5A726C8A8BA]) [n:127.0.0.1:38650_mdvf    ] o.a.s.c.c.SolrZkClient makePath: /overseer_elect/leader
   [junit4]   2> 1985784 INFO  (TEST-TestReqParamsAPI.test-seed#[9563B5A726C8A8BA]) [n:127.0.0.1:38650_mdvf    ] o.a.s.c.Overseer Overseer (id=96104944565485573-127.0.0.1:38650_mdvf-n_0000000000) starting
   [junit4]   2> 1985784 INFO  (TEST-TestReqParamsAPI.test-seed#[9563B5A726C8A8BA]) [n:127.0.0.1:38650_mdvf    ] o.a.s.c.c.SolrZkClient makePath: /overseer/queue-work
   [junit4]   2> 1985787 INFO  (TEST-TestReqParamsAPI.test-seed#[9563B5A726C8A8BA]) [n:127.0.0.1:38650_mdvf    ] o.a.s.c.OverseerAutoReplicaFailoverThread Starting OverseerAutoReplicaFailoverThread autoReplicaFailoverWorkLoopDelay=10000 autoReplicaFailoverWaitAfterExpiration=30000 autoReplicaFailoverBadNodeExpiration=60000
   [junit4]   2> 1985787 INFO  (OverseerCollectionConfigSetProcessor-96104944565485573-127.0.0.1:38650_mdvf-n_0000000000) [n:127.0.0.1:38650_mdvf    ] o.a.s.c.OverseerTaskProcessor Process current queue of overseer operations
   [junit4]   2> 1985787 INFO  (OverseerStateUpdate-96104944565485573-127.0.0.1:38650_mdvf-n_0000000000) [n:127.0.0.1:38650_mdvf    ] o.a.s.c.Overseer Starting to work on the main queue
   [junit4]   2> 1985787 INFO  (TEST-TestReqParamsAPI.test-seed#[9563B5A726C8A8BA]) [n:127.0.0.1:38650_mdvf    ] o.a.s.c.ZkController Register node as live in ZooKeeper:/live_nodes/127.0.0.1:38650_mdvf
   [junit4]   2> 1985788 INFO  (TEST-TestReqParamsAPI.test-seed#[9563B5A726C8A8BA]) [n:127.0.0.1:38650_mdvf    ] o.a.s.c.c.SolrZkClient makePath: /live_nodes/127.0.0.1:38650_mdvf
   [junit4]   2> 1985788 INFO  (OverseerStateUpdate-96104944565485573-127.0.0.1:38650_mdvf-n_0000000000) [n:127.0.0.1:38650_mdvf    ] o.a.s.c.c.ZkStateReader Updated live nodes from ZooKeeper... (0) -> (0)
   [junit4]   2> 1985789 INFO  (zkCallback-24210-thread-1-processing-n:127.0.0.1:38650_mdvf) [n:127.0.0.1:38650_mdvf    ] o.a.s.c.c.ZkStateReader A live node change: [WatchedEvent state:SyncConnected type:NodeChildrenChanged path:/live_nodes], has occurred - updating... (live nodes size: [0])
   [junit4]   2> 1985789 INFO  (zkCallback-24210-thread-1-processing-n:127.0.0.1:38650_mdvf) [n:127.0.0.1:38650_mdvf    ] o.a.s.c.c.ZkStateReader Updated live nodes from ZooKeeper... (0) -> (1)
   [junit4]   2> 1985801 INFO  (TEST-TestReqParamsAPI.test-seed#[9563B5A726C8A8BA]) [n:127.0.0.1:38650_mdvf    ] o.a.s.c.CoreContainer Security conf doesn't exist. Skipping setup for authorization module.
   [junit4]   2> 1985802 INFO  (TEST-TestReqParamsAPI.test-seed#[9563B5A726C8A8BA]) [n:127.0.0.1:38650_mdvf    ] o.a.s.c.CoreContainer No authentication plugin used.
   [junit4]   2> 1985802 INFO  (TEST-TestReqParamsAPI.test-seed#[9563B5A726C8A8BA]) [n:127.0.0.1:38650_mdvf    ] o.a.s.c.CorePropertiesLocator Looking for core definitions underneath /home/jenkins/workspace/Lucene-Solr-6.x-Linux/solr/build/solr-core/test/J2/../../../../../../../../../home/jenkins/workspace/Lucene-Solr-6.x-Linux/solr/build/solr-core/test/J2/temp/solr.handler.TestReqParamsAPI_9563B5A726C8A8BA-001/control-001/cores
   [junit4]   2> 1985805 INFO  (TEST-TestReqParamsAPI.test-seed#[9563B5A726C8A8BA]) [n:127.0.0.1:38650_mdvf    ] o.a.s.c.CoreDescriptor Created CoreDescriptor: {name=collection1, config=solrconfig.xml, transient=false, schema=schema.xml, loadOnStartup=true, configSetProperties=configsetprops.json, collection=control_collection, coreNodeName=, dataDir=data/, shard=}
   [junit4]   2> 1985805 INFO  (TEST-TestReqParamsAPI.test-seed#[9563B5A726C8A8BA]) [n:127.0.0.1:38650_mdvf    ] o.a.s.c.CorePropertiesLocator Found core collection1 in /home/jenkins/workspace/Lucene-Solr-6.x-Linux/solr/build/solr-core/test/J2/../../../../../../../../../home/jenkins/workspace/Lucene-Solr-6.x-Linux/solr/build/solr-core/test/J2/temp/solr.handler.TestReqParamsAPI_9563B5A726C8A8BA-001/control-001/cores/collection1
   [junit4]   2> 1985805 INFO  (TEST-TestReqParamsAPI.test-seed#[9563B5A726C8A8BA]) [n:127.0.0.1:38650_mdvf    ] o.a.s.c.CorePropertiesLocator Found 1 core definitions
   [junit4]   2> 1985808 INFO  (coreLoadExecutor-10181-thread-1-processing-n:127.0.0.1:38650_mdvf) [n:127.0.0.1:38650_mdvf c:control_collection   x:collection1] o.a.s.c.ZkController publishing state=down
   [junit4]   2> 1985808 INFO  (coreLoadExecutor-10181-thread-1-processing-n:127.0.0.1:38650_mdvf) [n:127.0.0.1:38650_mdvf c:control_collection   x:collection1] o.a.s.c.ZkController numShards not found on descriptor - reading it from system property
   [junit4]   2> 1985808 INFO  (TEST-TestReqParamsAPI.test-seed#[9563B5A726C8A8BA]) [n:127.0.0.1:38650_mdvf    ] o.a.s.s.SolrDispatchFilter user.dir=/home/jenkins/workspace/Lucene-Solr-6.x-Linux/solr/build/solr-core/test/J2
   [junit4]   2> 1985808 INFO  (TEST-TestReqParamsAPI.test-seed#[9563B5A726C8A8BA]) [n:127.0.0.1:38650_mdvf    ] o.a.s.s.SolrDispatchFilter SolrDispatchFilter.init() done
   [junit4]   2> 1985809 INFO  (coreLoadExecutor-10181-thread-1-processing-n:127.0.0.1:38650_mdvf) [n:127.0.0.1:38650_mdvf c:control_collection   x:collection1] o.a.s.c.ZkController Collection control_collection not visible yet, but flagging it so a watch is registered when it becomes visible
   [junit4]   2> 1985809 INFO  (OverseerStateUpdate-96104944565485573-127.0.0.1:38650_mdvf-n_0000000000) [n:127.0.0.1:38650_mdvf    ] o.a.s.c.Overseer processMessage: queueSize: 1, message = {
   [junit4]   2>   "core":"collection1",
   [junit4]   2>   "roles":null,
   [junit4]   2>   "base_url":"https://127.0.0.1:38650/mdvf",
   [junit4]   2>   "node_name":"127.0.0.1:38650_mdvf",
   [junit4]   2>   "numShards":"1",
   [junit4]   2>   "state":"down",
   [junit4]   2>   "shard":null,
   [junit4]   2>   "collection":"control_collection",
   [junit4]   2>   "operation":"state"} current state version: 0
   [junit4]   2> 1985809 INFO  (OverseerStateUpdate-96104944565485573-127.0.0.1:38650_mdvf-n_0000000000) [n:127.0.0.1:38650_mdvf    ] o.a.s.c.o.ReplicaMutator Update state numShards=1 message={
   [junit4]   2>   "core":"collection1",
   [junit4]   2>   "roles":null,
   [junit4]   2>   "base_url":"https://127.0.0.1:38650/mdvf",
   [junit4]   2>   "node_name":"127.0.0.1:38650_mdvf",
   [junit4]   2>   "numShards":"1",
   [junit4]   2>   "state":"down",
   [junit4]   2>   "shard":null,
   [junit4]   2>   "collection":"control_collection",
   [junit4]   2>   "operation":"state"}
   [junit4]   2> 1985809 INFO  (coreLoadExecutor-10181-thread-1-processing-n:127.0.0.1:38650_mdvf) [n:127.0.0.1:38650_mdvf c:control_collection   x:collection1] o.a.s.c.c.ZkStateReader Deleting data for [control_collection]
   [junit4]   2> 1985810 INFO  (OverseerStateUpdate-96104944565485573-127.0.0.1:38650_mdvf-n_0000000000) [n:127.0.0.1:38650_mdvf    ] o.a.s.c.o.ClusterStateMutator building a new cName: control_collection
   [junit4]   2> 1985810 INFO  (OverseerStateUpdate-96104944565485573-127.0.0.1:38650_mdvf-n_0000000000) [n:127.0.0.1:38650_mdvf    ] o.a.s.c.o.ReplicaMutator Assigning new node to shard shard=shard1
   [junit4]   2> 1985810 INFO  (coreLoadExecutor-10181-thread-1-processing-n:127.0.0.1:38650_mdvf) [n:127.0.0.1:38650_mdvf c:control_collection   x:collection1] o.a.s.c.ZkController look for our core node name
   [junit4]   2> 1985811 INFO  (zkCallback-24210-thread-1-processing-n:127.0.0.1:38650_mdvf) [n:127.0.0.1:38650_mdvf    ] o.a.s.c.c.ZkStateReader A cluster state change: [WatchedEvent state:SyncConnected type:NodeDataChanged path:/clusterstate.json], has occurred - updating... (live nodes size: [1])
   [junit4]   2> 1986810 INFO  (coreLoadExecutor-10181-thread-1-processing-n:127.0.0.1:38650_mdvf) [n:127.0.0.1:38650_mdvf c:control_collection   x:collection1] o.a.s.c.ZkController waiting to find shard id in clusterstate for collection1
   [junit4]   2> 1986811 INFO  (coreLoadExecutor-10181-thread-1-processing-n:127.0.0.1:38650_mdvf) [n:127.0.0.1:38650_mdvf c:control_collection   x:collection1] o.a.s.c.ZkController Check for collection zkNode:control_collection
   [junit4]   2> 1986811 INFO  (coreLoadExecutor-10181-thread-1-processing-n:127.0.0.1:38650_mdvf) [n:127.0.0.1:38650_mdvf c:control_collection   x:collection1] o.a.s.c.ZkController Collection zkNode exists
   [junit4]   2> 1986811 INFO  (coreLoadExecutor-10181-thread-1-processing-n:127.0.0.1:38650_mdvf) [n:127.0.0.1:38650_mdvf c:control_collection   x:collection1] o.a.s.c.c.ZkStateReader Load collection config from: [/collections/control_collection]
   [junit4]   2> 1986812 INFO  (coreLoadExecutor-10181-thread-1-processing-n:127.0.0.1:38650_mdvf) [n:127.0.0.1:38650_mdvf c:control_collection   x:collection1] o.a.s.c.c.ZkStateReader path=[/collections/control_collection] [configName]=[conf1] specified config exists in ZooKeeper
   [junit4]   2> 1986812 INFO  (coreLoadExecutor-10181-thread-1-processing-n:127.0.0.1:38650_mdvf) [n:127.0.0.1:38650_mdvf c:control_collection   x:collection1] o.a.s.c.SolrResourceLoader new SolrResourceLoader for directory: '/home/jenkins/workspace/Lucene-Solr-6.x-Linux/solr/build/solr-core/test/J2/temp/solr.handler.TestReqParamsAPI_9563B5A726C8A8BA-001/control-001/cores/collection1'
   [junit4]   2> 1986812 INFO  (coreLoadExecutor-10181-thread-1-processing-n:127.0.0.1:38650_mdvf) [n:127.0.0.1:38650_mdvf c:control_collection   x:collection1] o.a.s.c.SolrResourceLoader JNDI not configured for solr (NoInitialContextEx)
   [junit4]   2> 1986812 INFO  (coreLoadExecutor-10181-thread-1-processing-n:127.0.0.1:38650_mdvf) [n:127.0.0.1:38650_mdvf c:control_collection   x:collection1] o.a.s.c.SolrResourceLoader solr home defaulted to 'solr/' (could not find system property or JNDI)
   [junit4]   2> 1986813 INFO  (coreLoadExecutor-10181-thread-1-processing-n:127.0.0.1:38650_mdvf) [n:127.0.0.1:38650_mdvf c:control_collection   x:collection1] o.a.s.c.Config loaded config solrconfig.xml with version 0 
   [junit4]   2> 1986826 INFO  (coreLoadExecutor-10181-thread-1-processing-n:127.0.0.1:38650_mdvf) [n:127.0.0.1:38650_mdvf c:control_collection   x:collection1] o.a.s.c.SolrConfig current version of requestparams : -1
   [junit4]   2> 1986829 INFO  (coreLoadExecutor-10181-thread-1-processing-n:127.0.0.1:38650_mdvf) [n:127.0.0.1:38650_mdvf c:control_collection   x:collection1] o.a.s.c.SolrConfig Using Lucene MatchVersion: 6.2.0
   [junit4]   2> 1986837 INFO  (coreLoadExecutor-10181-thread-1-processing-n:127.0.0.1:38650_mdvf) [n:127.0.0.1:38650_mdvf c:control_collection   x:collection1] o.a.s.c.SolrConfig Loaded SolrConfig: solrconfig.xml
   [junit4]   2> 1986841 INFO  (coreLoadExecutor-10181-thread-1-processing-n:127.0.0.1:38650_mdvf) [n:127.0.0.1:38650_mdvf c:control_collection   x:collection1] o.a.s.s.IndexSchema [collection1] Schema name=test
   [junit4]   2> 1986935 INFO  (coreLoadExecutor-10181-thread-1-processing-n:127.0.0.1:38650_mdvf) [n:127.0.0.1:38650_mdvf c:control_collection   x:collection1] o.a.s.s.OpenExchangeRatesOrgProvider Initialized with rates=open-exchange-rates.json, refreshInterval=1440.
   [junit4]   2> 1986939 INFO  (coreLoadExecutor-10181-thread-1-processing-n:127.0.0.1:38650_mdvf) [n:127.0.0.1:38650_mdvf c:control_collection   x:collection1] o.a.s.s.IndexSchema default search field in schema is text
   [junit4]   2> 1986940 INFO  (coreLoadExecutor-10181-thread-1-processing-n:127.0.0.1:38650_mdvf) [n:127.0.0.1:38650_mdvf c:control_collection   x:collection1] o.a.s.s.IndexSchema unique key field: id
   [junit4]   2> 1986945 INFO  (coreLoadExecutor-10181-thread-1-processing-n:127.0.0.1:38650_mdvf) [n:127.0.0.1:38650_mdvf c:control_collection   x:collection1] o.a.s.s.FileExchangeRateProvider Reloading exchange rates from file currency.xml
   [junit4]   2> 1986947 INFO  (coreLoadExecutor-10181-thread-1-processing-n:127.0.0.1:38650_mdvf) [n:127.0.0.1:38650_mdvf c:control_collection   x:collection1] o.a.s.s.FileExchangeRateProvider Reloading exchange rates from file currency.xml
   [junit4]   2> 1986948 INFO  (coreLoadExecutor-10181-thread-1-processing-n:127.0.0.1:38650_mdvf) [n:127.0.0.1:38650_mdvf c:control_collection   x:collection1] o.a.s.s.OpenExchangeRatesOrgProvider Reloading exchange rates from open-exchange-rates.json
   [junit4]   2> 1986948 INFO  (coreLoadExecutor-10181-thread-1-processing-n:127.0.0.1:38650_mdvf) [n:127.0.0.1:38650_mdvf c:control_collection   x:collection1] o.a.s.s.OpenExchangeRatesOrgProvider Reloading exchange rates from open-exchange-rates.json
   [junit4]   2> 1986949 INFO  (coreLoadExecutor-10181-thread-1-processing-n:127.0.0.1:38650_mdvf) [n:127.0.0.1:38650_mdvf c:control_collection   x:collection1] o.a.s.c.ConfigSetProperties Did not find ConfigSet properties, assuming default properties: Can't find resource 'configsetprops.json' in classpath or '/configs/conf1', cwd=/home/jenkins/workspace/Lucene-Solr-6.x-Linux/solr/build/solr-core/test/J2
   [junit4]   2> 1986949 INFO  (coreLoadExecutor-10181-thread-1-processing-n:127.0.0.1:38650_mdvf) [n:127.0.0.1:38650_mdvf c:control_collection   x:collection1] o.a.s.c.CoreContainer Creating SolrCore 'collection1' using configuration from collection control_collection
   [junit4]   2> 1986949 INFO  (coreLoadExecutor-10181-thread-1-processing-n:127.0.0.1:38650_mdvf) [n:127.0.0.1:38650_mdvf c:control_collection s:shard1 r:core_node1 x:collection1] o.a.s.c.SolrCore org.apache.solr.core.MockDirectoryFactory
   [junit4]   2> 1986949 INFO  (coreLoadExecutor-10181-thread-1-processing-n:127.0.0.1:38650_mdvf) [n:127.0.0.1:38650_mdvf c:control_collection s:shard1 r:core_node1 x:collection1] o.a.s.c.SolrCore [[collection1] ] Opening new SolrCore at [/home/jenkins/workspace/Lucene-Solr-6.x-Linux/solr/build/solr-core/test/J2/temp/solr.handler.TestReqParamsAPI_9563B5A726C8A8BA-001/control-001/cores/collection1], dataDir=[/home/jenkins/workspace/Lucene-Solr-6.x-Linux/solr/build/solr-core/test/J2/../../../../../../../../../home/jenkins/workspace/Lucene-Solr-6.x-Linux/solr/build/solr-core/test/J2/temp/solr.handler.TestReqParamsAPI_9563B5A726C8A8BA-001/control-001/cores/collection1/data/]
   [junit4]   2> 1986949 INFO  (coreLoadExecutor-10181-thread-1-processing-n:127.0.0.1:38650_mdvf) [n:127.0.0.1:38650_mdvf c:control_collection s:shard1 r:core_node1 x:collection1] o.a.s.c.JmxMonitoredMap JMX monitoring is enabled. Adding Solr mbeans to JMX Server: com.sun.jmx.mbeanserver.JmxMBeanServer@12749046
   [junit4]   2> 1986950 INFO  (coreLoadExecutor-10181-thread-1-processing-n:127.0.0.1:38650_mdvf) [n:127.0.0.1:38650_mdvf c:control_collection s:shard1 r:core_node1 x:collection1] o.a.s.c.CachingDirectoryFactory return new directory for /home/jenkins/workspace/Lucene-Solr-6.x-Linux/solr/build/solr-core/test/J2/../../../../../../../../../home/jenkins/workspace/Lucene-Solr-6.x-Linux/solr/build/solr-core/test/J2/temp/solr.handler.TestReqParamsAPI_9563B5A726C8A8BA-001/control-001/cores/collection1/data
   [junit4]   2> 1986950 INFO  (coreLoadExecutor-10181-thread-1-processing-n:127.0.0.1:38650_mdvf) [n:127.0.0.1:38650_mdvf c:control_collection s:shard1 r:core_node1 x:collection1] o.a.s.c.SolrCore New index directory detected: old=null new=/home/jenkins/workspace/Lucene-Solr-6.x-Linux/solr/build/solr-core/test/J2/../../../../../../../../../home/jenkins/workspace/Lucene-Solr-6.x-Linux/solr/build/solr-core/test/J2/temp/solr.handler.TestReqParamsAPI_9563B5A726C8A8BA-001/control-001/cores/collection1/data/index/
   [junit4]   2> 1986950 WARN  (coreLoadExecutor-10181-thread-1-processing-n:127.0.0.1:38650_mdvf) [n:127.0.0.1:38650_mdvf c:control_collection s:shard1 r:core_node1 x:collection1] o.a.s.c.SolrCore [collection1] Solr index directory '/home/jenkins/workspace/Lucene-Solr-6.x-Linux/solr/build/solr-core/test/J2/../../../../../../../../../home/jenkins/workspace/Lucene-Solr-6.x-Linux/solr/build/solr-core/test/J2/temp/solr.handler.TestReqParamsAPI_9563B5A726C8A8BA-001/control-001/cores/collection1/data/index' doesn't exist. Creating new index...
   [junit4]   2> 1986950 INFO  (coreLoadExecutor-10181-thread-1-processing-n:127.0.0.1:38650_mdvf) [n:127.0.0.1:38650_mdvf c:control_collection s:shard1 r:core_node1 x:collection1] o.a.s.c.CachingDirectoryFactory return new directory for /home/jenkins/workspace/Lucene-Solr-6.x-Linux/solr/build/solr-core/test/J2/../../../../../../../../../home/jenkins/workspace/Lucene-Solr-6.x-Linux/solr/build/solr-core/test/J2/temp/solr.handler.TestReqParamsAPI_9563B5A726C8A8BA-001/control-001/cores/collection1/data/index
   [junit4]   2> 1986950 INFO  (coreLoadExecutor-10181-thread-1-processing-n:127.0.0.1:38650_mdvf) [n:127.0.0.1:38650_mdvf c:control_collection s:shard1 r:core_node1 x:collection1] o.a.s.u.RandomMergePolicy RandomMergePolicy wrapping class org.apache.lucene.index.LogByteSizeMergePolicy: [LogByteSizeMergePolicy: minMergeSize=1677721, mergeFactor=13, maxMergeSize=2147483648, maxMergeSizeForForcedMerge=9223372036854775807, calibrateSizeByDeletes=false, maxMergeDocs=2147483647, maxCFSSegmentSizeMB=8.796093022207999E12, noCFSRatio=0.7732117878960328]
   [junit4]   2> 1986950 INFO  (coreLoadExecutor-10181-thread-1-processing-n:127.0.0.1:38650_mdvf) [n:127.0.0.1:38650_mdvf c:control_collection s:shard1 r:core_node1 x:collection1] o.a.s.c.SolrDeletionPolicy SolrDeletionPolicy.onCommit: commits: num=1
   [junit4]   2> 	commit{dir=MockDirectoryWrapper(RAMDirectory@574fb3ca lockFactory=org.apache.lucene.store.SingleInstanceLockFactory@17d047af),segFN=segments_1,generation=1}
   [junit4]   2> 1986951 INFO  (coreLoadExecutor-10181-thread-1-processing-n:127.0.0.1:38650_mdvf) [n:127.0.0.1:38650_mdvf c:control_collection s:shard1 r:core_node1 x:collection1] o.a.s.c.SolrDeletionPolicy newest commit generation = 1
   [junit4]   2> 1986951 INFO  (OldIndexDirectoryCleanupThreadForCore-collection1) [n:127.0.0.1:38650_mdvf c:control_collection s:shard1 r:core_node1 x:collection1] o.a.s.c.SolrCore Looking for old index directories to cleanup for core collection1 in /home/jenkins/workspace/Lucene-Solr-6.x-Linux/solr/build/solr-core/test/J2/../../../../../../../../../home/jenkins/workspace/Lucene-Solr-6.x-Linux/solr/build/solr-core/test/J2/temp/solr.handler.TestReqParamsAPI_9563B5A726C8A8BA-001/control-001/cores/collection1/data/
   [junit4]   2> 1986951 WARN  (OldIndexDirectoryCleanupThreadForCore-collection1) [n:127.0.0.1:38650_mdvf c:control_collection s:shard1 r:core_node1 x:collection1] o.a.s.c.DirectoryFactory /home/jenkins/workspace/Lucene-Solr-6.x-Linux/solr/build/solr-core/test/J2/../../../../../../../../../home/jenkins/workspace/Lucene-Solr-6.x-Linux/solr/build/solr-core/test/J2/temp/solr.handler.TestReqParamsAPI_9563B5A726C8A8BA-001/control-001/cores/collection1/data/ does not point to a valid data directory; skipping clean-up of old index directories.
   [junit4]   2> 1986952 INFO  (coreLoadExecutor-10181-thread-1-processing-n:127.0.0.1:38650_mdvf) [n:127.0.0.1:38650_mdvf c:control_collection s:shard1 r:core_node1 x:collection1] o.a.s.u.p.UpdateRequestProcessorChain creating updateRequestProcessorChain "nodistrib"
   [junit4]   2> 1986952 INFO  (coreLoadExecutor-10181-thread-1-processing-n:127.0.0.1:38650_mdvf) [n:127.0.0.1:38650_mdvf c:control_collection s:shard1 r:core_node1 x:collection1] o.a.s.u.p.UpdateRequestProcessorChain creating updateRequestProcessorChain "dedupe"
   [junit4]   2> 1986952 INFO  (coreLoadExecutor-10181-thread-1-processing-n:127.0.0.1:38650_mdvf) [n:127.0.0.1:38650_mdvf c:control_collection s:shard1 r:core_node1 x:collection1] o.a.s.u.p.UpdateRequestProcessorChain inserting DistributedUpdateProcessorFactory into updateRequestProcessorChain "dedupe"
   [junit4]   2> 1986952 INFO  (coreLoadExecutor-10181-thread-1-processing-n:127.0.0.1:38650_mdvf) [n:127.0.0.1:38650_mdvf c:control_collection s:shard1 r:core_node1 x:collection1] o.a.s.u.p.UpdateRequestProcessorChain creating updateRequestProcessorChain "stored_sig"
   [junit4]   2> 1986953 INFO  (coreLoadExecutor-10181-thread-1-processing-n:127.0.0.1:38650_mdvf) [n:127.0.0.1:38650_mdvf c:control_collection s:shard1 r:core_node1 x:collection1] o.a.s.u.p.UpdateRequestProcessorChain inserting DistributedUpdateProcessorFactory into updateRequestProcessorChain "stored_sig"
   [junit4]   2> 1986953 INFO  (coreLoadExecutor-10181-thread-1-processing-n:127.0.0.1:38650_mdvf) [n:127.0.0.1:38650_mdvf c:control_collection s:shard1 r:core_node1 x:collection1] o.a.s.u.p.UpdateRequestProcessorChain creating updateRequestProcessorChain "distrib-dup-test-chain-explicit"
   [junit4]   2> 1986953 INFO  (coreLoadExecutor-10181-thread-1-processing-n:127.0.0.1:38650_mdvf) [n:127.0.0.1:38650_mdvf c:control_collection s:shard1 r:core_node1 x:collection1] o.a.s.u.p.UpdateRequestProcessorChain creating updateRequestProcessorChain "distrib-dup-test-chain-implicit"
   [junit4]   2> 1986953 INFO  (coreLoadExecutor-10181-thread-1-processing-n:127.0.0.1:38650_mdvf) [n:127.0.0.1:38650_mdvf c:control_collection s:shard1 r:core_node1 x:collection1] o.a.s.u.p.UpdateRequestProcessorChain inserting DistributedUpdateProcessorFactory into updateRequestProcessorChain "distrib-dup-test-chain-implicit"
   [junit4]   2> 1986953 INFO  (coreLoadExecutor-10181-thread-1-processing-n:127.0.0.1:38650_mdvf) [n:127.0.0.1:38650_mdvf c:control_collection s:shard1 r:core_node1 x:collection1] o.a.s.c.SolrCore no updateRequestProcessorChain defined as default, creating implicit default
   [junit4]   2> 1986953 WARN  (coreLoadExecutor-10181-thread-1-processing-n:127.0.0.1:38650_mdvf) [n:127.0.0.1:38650_mdvf c:control_collection s:shard1 r:core_node1 x:collection1] o.a.s.c.RequestHandlers INVALID paramSet a in requestHandler {type = requestHandler,name = /dump,class = DumpRequestHandler,args = {defaults={a=A,b=B}}}
   [junit4]   2> 1986954 INFO  (coreLoadExecutor-10181-thread-1-processing-n:127.0.0.1:38650_mdvf) [n:127.0.0.1:38650_mdvf c:control_collection s:shard1 r:core_node1 x:collection1] o.a.s.h.l.XMLLoader xsltCacheLifetimeSeconds=60
   [junit4]   2> 1986955 INFO  (coreLoadExecutor-10181-thread-1-processing-n:127.0.0.1:38650_mdvf) [n:127.0.0.1:38650_mdvf c:control_collection s:shard1 r:core_node1 x:collection1] o.a.s.h.l.XMLLoader xsltCacheLifetimeSeconds=60
   [junit4]   2> 1986956 INFO  (coreLoadExecutor-10181-thread-1-processing-n:127.0.0.1:38650_mdvf) [n:127.0.0.1:38650_mdvf c:control_collection s:shard1 r:core_node1 x:collection1] o.a.s.h.l.XMLLoader xsltCacheLifetimeSeconds=60
   [junit4]   2> 1986956 INFO  (coreLoadExecutor-10181-thread-1-processing-n:127.0.0.1:38650_mdvf) [n:127.0.0.1:38650_mdvf c:control_collection s:shard1 r:core_node1 x:collection1] o.a.s.h.l.XMLLoader xsltCacheLifetimeSeconds=60
   [junit4]   2> 1986958 INFO  (coreLoadExecutor-10181-thread-1-processing-n:127.0.0.1:38650_mdvf) [n:127.0.0.1:38650_mdvf c:control_collection s:shard1 r:core_node1 x:collection1] o.a.s.c.RequestHandlers Registered paths: /admin/mbeans,standard,/update/json/docs,/admin/luke,/export,/get,/admin/properties,/update/json,/admin/threads,/dump,/update/csv,/sql,/graph,/admin/segments,/admin/system,/replication,/config,/stream,/schema,/admin/plugins,/admin/logging,/admin/ping,/update,/admin/file
   [junit4]   2> 1986958 INFO  (coreLoadExecutor-10181-thread-1-processing-n:127.0.0.1:38650_mdvf) [n:127.0.0.1:38650_mdvf c:control_collection s:shard1 r:core_node1 x:collection1] o.a.s.c.SolrCore Using default statsCache cache: org.apache.solr.search.stats.LocalStatsCache
   [junit4]   2> 1986958 INFO  (coreLoadExecutor-10181-thread-1-processing-n:127.0.0.1:38650_mdvf) [n:127.0.0.1:38650_mdvf c:control_collection s:shard1 r:core_node1 x:collection1] o.a.s.u.UpdateHandler Using UpdateLog implementation: org.apache.solr.update.UpdateLog
   [junit4]   2> 1986958 INFO  (coreLoadExecutor-10181-thread-1-processing-n:127.0.0.1:38650_mdvf) [n:127.0.0.1:38650_mdvf c:control_collection s:shard1 r:core_node1 x:collection1] o.a.s.u.UpdateLog Initializing UpdateLog: dataDir= defaultSyncLevel=FLUSH numRecordsToKeep=100 maxNumLogsToKeep=10 numVersionBuckets=65536
   [junit4]   2> 1986959 INFO  (coreLoadExecutor-10181-thread-1-processing-n:127.0.0.1:38650_mdvf) [n:127.0.0.1:38650_mdvf c:control_collection s:shard1 r:core_node1 x:collection1] o.a.s.u.CommitTracker Hard AutoCommit: disabled
   [junit4]   2> 1986959 INFO  (coreLoadExecutor-10181-thread-1-processing-n:127.0.0.1:38650_mdvf) [n:127.0.0.1:38650_mdvf c:control_collection s:shard1 r:core_node1 x:collection1] o.a.s.u.CommitTracker Soft AutoCommit: disabled
   [junit4]   2> 1986959 INFO  (coreLoadExecutor-10181-thread-1-processing-n:127.0.0.1:38650_mdvf) [n:127.0.0.1:38650_mdvf c:control_collection s:shard1 r:core_node1 x:collection1] o.a.s.u.RandomMergePolicy RandomMergePolicy wrapping class org.apache.lucene.index.LogByteSizeMergePolicy: [LogByteSizeMergePolicy: minMergeSize=1677721, mergeFactor=40, maxMergeSize=2147483648, maxMergeSizeForForcedMerge=9223372036854775807, calibrateSizeByDeletes=false, maxMergeDocs=2147483647, maxCFSSegmentSizeMB=1.841796875, noCFSRatio=0.34200451515855235]
   [junit4]   2> 1986960 INFO  (coreLoadExecutor-10181-thread-1-processing-n:127.0.0.1:38650_mdvf) [n:127.0.0.1:38650_mdvf c:control_collection s:shard1 r:core_node1 x:collection1] o.a.s.c.SolrDeletionPolicy SolrDeletionPolicy.onInit: commits: num=1
   [junit4]   2> 	commit{dir=MockDirectoryWrapper(RAMDirectory@574fb3ca lockFactory=org.apache.lucene.store.SingleInstanceLockFactory@17d047af),segFN=segments_1,generation=1}
   [junit4]   2> 1986960 INFO  (coreLoadExecutor-10181-thread-1-processing-n:127.0.0.1:38650_mdvf) [n:127.0.0.1:38650_mdvf c:control_collection s:shard1 r:core_node1 x:collection1] o.a.s.c.SolrDeletionPolicy newest commit generation = 1
   [junit4]   2> 1986960 INFO  (coreLoadExecutor-10181-thread-1-processing-n:127.0.0.1:38650_mdvf) [n:127.0.0.1:38650_mdvf c:control_collection s:shard1 r:core_node1 x:collection1] o.a.s.s.SolrIndexSearcher Opening [Searcher@259b94c4[collection1] main]
   [junit4]   2> 1986960 INFO  (coreLoadExecutor-10181-thread-1-processing-n:127.0.0.1:38650_mdvf) [n:127.0.0.1:38650_mdvf c:control_collection s:shard1 r:core_node1 x:collection1] o.a.s.c.c.ZkStateReader Load collection config from: [/collections/control_collection]
   [junit4]   2> 1986960 INFO  (coreLoadExecutor-10181-thread-1-processing-n:127.0.0.1:38650_mdvf) [n:127.0.0.1:38650_mdvf c:control_collection s:shard1 r:core_node1 x:collection1] o.a.s.c.c.ZkStateReader path=[/collections/control_collection] [configName]=[conf1] specified config exists in ZooKeeper
   [junit4]   2> 1986960 INFO  (coreLoadExecutor-10181-thread-1-processing-n:127.0.0.1:38650_mdvf) [n:127.0.0.1:38650_mdvf c:control_collection s:shard1 r:core_node1 x:collection1] o.a.s.r.ManagedResourceStorage Setting up ZooKeeper-based storage for the RestManager with znodeBase: /configs/conf1
   [junit4]   2> 1986960 INFO  (coreLoadExecutor-10181-thread-1-processing-n:127.0.0.1:38650_mdvf) [n:127.0.0.1:38650_mdvf c:control_collection s:shard1 r:core_node1 x:collection1] o.a.s.r.ManagedResourceStorage Configured ZooKeeperStorageIO with znodeBase: /configs/conf1
   [junit4]   2> 1986960 INFO  (coreLoadExecutor-10181-thread-1-processing-n:127.0.0.1:38650_mdvf) [n:127.0.0.1:38650_mdvf c:control_collection s:shard1 r:core_node1 x:collection1] o.a.s.r.RestManager Initializing RestManager with initArgs: {}
   [junit4]   2> 1986961 INFO  (coreLoadExecutor-10181-thread-1-processing-n:127.0.0.1:38650_mdvf) [n:127.0.0.1:38650_mdvf c:control_collection s:shard1 r:core_node1 x:collection1] o.a.s.r.ManagedResourceStorage Reading _rest_managed.json using ZooKeeperStorageIO:path=/configs/conf1
   [junit4]   2> 1986961 INFO  (coreLoadExecutor-10181-thread-1-processing-n:127.0.0.1:38650_mdvf) [n:127.0.0.1:38650_mdvf c:control_collection s:shard1 r:core_node1 x:collection1] o.a.s.r.ManagedResourceStorage No data found for znode /configs/conf1/_rest_managed.json
   [junit4]   2> 1986961 INFO  (coreLoadExecutor-10181-thread-1-processing-n:127.0.0.1:38650_mdvf) [n:127.0.0.1:38650_mdvf c:control_collection s:shard1 r:core_node1 x:collection1] o.a.s.r.ManagedResourceStorage Loaded null at path _rest_managed.json using ZooKeeperStorageIO:path=/configs/conf1
   [junit4]   2> 1986961 INFO  (coreLoadExecutor-10181-thread-1-processing-n:127.0.0.1:38650_mdvf) [n:127.0.0.1:38650_mdvf c:control_collection s:shard1 r:core_node1 x:collection1] o.a.s.r.RestManager Initializing 0 registered ManagedResources
   [junit4]   2> 1986961 INFO  (coreLoadExecutor-10181-thread-1-processing-n:127.0.0.1:38650_mdvf) [n:127.0.0.1:38650_mdvf c:control_collection s:shard1 r:core_node1 x:collection1] o.a.s.h.ReplicationHandler Commits will be reserved for  10000
   [junit4]   2> 1986962 INFO  (searcherExecutor-10182-thread-1-processing-n:127.0.0.1:38650_mdvf x:collection1 s:shard1 c:control_collection r:core_node1) [n:127.0.0.1:38650_mdvf c:control_collection s:shard1 r:core_node1 x:collection1] o.a.s.c.SolrCore [collection1] Registered new searcher Searcher@259b94c4[collection1] main{ExitableDirectoryReader(UninvertingDirectoryReader())}
   [junit4]   2> 1986962 INFO  (coreLoadExecutor-10181-thread-1-processing-n:127.0.0.1:38650_mdvf) [n:127.0.0.1:38650_mdvf c:control_collection s:shard1 r:core_node1 x:collection1] o.a.s.u.UpdateLog Looking up max value of version field to seed version buckets
   [junit4]   2> 1986962 INFO  (coreLoadExecutor-10181-thread-1-processing-n:127.0.0.1:38650_mdvf) [n:127.0.0.1:38650_mdvf c:control_collection s:shard1 r:core_node1 x:collection1] o.a.s.u.VersionInfo Refreshing highest value of _version_ for 65536 version buckets from index
   [junit4]   2> 1986962 INFO  (coreLoadExecutor-10181-thread-1-processing-n:127.0.0.1:38650_mdvf) [n:127.0.0.1:38650_mdvf c:control_collection s:shard1 r:core_node1 x:collection1] o.a.s.u.VersionInfo No terms found for _version_, cannot seed version bucket highest value from index
   [junit4]   2> 1986962 INFO  (coreLoadExecutor-10181-thread-1-processing-n:127.0.0.1:38650_mdvf) [n:127.0.0.1:38650_mdvf c:control_collection s:shard1 r:core_node1 x:collection1] o.a.s.u.UpdateLog Could not find max version in index or recent updates, using new clock 1537679114552475648
   [junit4]   2> 1986964 INFO  (coreLoadExecutor-10181-thread-1-processing-n:127.0.0.1:38650_mdvf) [n:127.0.0.1:38650_mdvf c:control_collection s:shard1 r:core_node1 x:collection1] o.a.s.u.UpdateLog Took 1.0ms to seed version buckets with highest version 1537679114552475648
   [junit4]   2> 1986964 INFO  (coreLoadExecutor-10181-thread-1-processing-n:127.0.0.1:38650_mdvf) [n:127.0.0.1:38650_mdvf c:control_collection s:shard1 r:core_node1 x:collection1] o.a.s.c.ZkController watch zkdir /configs/conf1
   [junit4]   2> 1986964 INFO  (coreLoadExecutor-10181-thread-1-processing-n:127.0.0.1:38650_mdvf) [n:127.0.0.1:38650_mdvf c:control_collection s:shard1 r:core_node1 x:collection1] o.a.s.c.CoreContainer registering core: collection1
   [junit4]   2> 1986964 INFO  (coreZkRegister-10175-thread-1-processing-n:127.0.0.1:38650_mdvf x:collection1 s:shard1 c:control_collection r:core_node1) [n:127.0.0.1:38650_mdvf c:control_collection s:shard1 r:core_node1 x:collection1] o.a.s.c.ZkController Register replica - core:collection1 address:https://127.0.0.1:38650/mdvf collection:control_collection shard:shard1
   [junit4]   2> 1986965 INFO  (coreZkRegister-10175-thread-1-processing-n:127.0.0.1:38650_mdvf x:collection1 s:shard1 c:control_collection r:core_node1) [n:127.0.0.1:38650_mdvf c:control_collection s:shard1 r:core_node1 x:collection1] o.a.s.c.c.SolrZkClient makePath: /collections/control_collection/leader_elect/shard1/election
   [junit4]   2> 1986966 INFO  (coreZkRegister-10175-thread-1-processing-n:127.0.0.1:38650_mdvf x:collection1 s:shard1 c:control_collection r:core_node1) [n:127.0.0.1:38650_mdvf c:control_collection s:shard1 r:core_node1 x:collection1] o.a.s.c.LeaderElector Joined leadership election with path: /collections/control_collection/leader_elect/shard1/election/96104944565485573-core_node1-n_0000000000
   [junit4]   2> 1986966 INFO  (coreZkRegister-10175-thread-1-processing-n:127.0.0.1:38650_mdvf x:collection1 s:shard1 c:control_collection r:core_node1) [n:127.0.0.1:38650_mdvf c:control_collection s:shard1 r:core_node1 x:collection1] o.a.s.c.ShardLeaderElectionContext Running the leader process for shard=shard1 and weAreReplacement=false and leaderVoteWait=10000
   [junit4]   2> 1986966 INFO  (coreZkRegister-10175-thread-1-processing-n:127.0.0.1:38650_mdvf x:collection1 s:shard1 c:control_collection r:core_node1) [n:127.0.0.1:38650_mdvf c:control_collection s:shard1 r:core_node1 x:collection1] o.a.s.c.ShardLeaderElectionContext Enough replicas found to continue.
   [junit4]   2> 1986967 INFO  (coreZkRegister-10175-thread-1-processing-n:127.0.0.1:38650_mdvf x:collection1 s:shard1 c:control_collection r:core_node1) [n:127.0.0.1:38650_mdvf c:control_collection s:shard1 r:core_node1 x:collection1] o.a.s.c.ShardLeaderElectionContext I may be the new leader - try and sync
   [junit4]   2> 1986967 INFO  (coreZkRegister-10175-thread-1-processing-n:127.0.0.1:38650_mdvf x:collection1 s:shard1 c:control_collection r:core_node1) [n:127.0.0.1:38650_mdvf c:control_collection s:shard1 r:core_node1 x:collection1] o.a.s.c.SyncStrategy Sync replicas to https://127.0.0.1:38650/mdvf/collection1/
   [junit4]   2> 1986967 INFO  (coreZkRegister-10175-thread-1-processing-n:127.0.0.1:38650_mdvf x:collection1 s:shard1 c:control_collection r:core_node1) [n:127.0.0.1:38650_mdvf c:control_collection s:shard1 r:core_node1 x:collection1] o.a.s.c.SyncStrategy Sync Success - now sync replicas to me
   [junit4]   2> 1986967 INFO  (OverseerStateUpdate-96104944565485573-127.0.0.1:38650_mdvf-n_0000000000) [n:127.0.0.1:38650_mdvf    ] o.a.s.c.Overseer processMessage: queueSize: 1, message = {
   [junit4]   2>   "operation":"leader",
   [junit4]   2>   "shard":"shard1",
   [junit4]   2>   "collection":"control_collection"} current state version: 1
   [junit4]   2> 1986967 INFO  (coreZkRegister-10175-thread-1-processing-n:127.0.0.1:38650_mdvf x:collection1 s:shard1 c:control_collection r:core_node1) [n:127.0.0.1:38650_mdvf c:control_collection s:shard1 r:core_node1 x:collection1] o.a.s.c.SyncStrategy https://127.0.0.1:38650/mdvf/collection1/ has no replicas
   [junit4]   2> 1986968 INFO  (coreZkRegister-10175-thread-1-processing-n:127.0.0.1:38650_mdvf x:collection1 s:shard1 c:control_collection r:core_node1) [n:127.0.0.1:38650_mdvf c:control_collection s:shard1 r:core_node1 x:collection1] o.a.s.c.c.SolrZkClient makePath: /collections/control_collection/leaders/shard1
   [junit4]   2> 1986968 INFO  (coreZkRegister-10175-thread-1-processing-n:127.0.0.1:38650_mdvf x:collection1 s:shard1 c:control_collection r:core_node1) [n:127.0.0.1:38650_mdvf c:control_collection s:shard1 r:core_node1 x:collection1] o.a.s.c.ShardLeaderElectionContextBase Creating leader registration node /collections/control_collection/leaders/shard1/leader after winning as /collections/control_collection/leader_elect/shard1/election/96104944565485573-core_node1-n_0000000000
   [junit4]   2> 1986969 INFO  (coreZkRegister-10175-thread-1-processing-n:127.0.0.1:38650_mdvf x:collection1 s:shard1 c:control_collection r:core_node1) [n:127.0.0.1:38650_mdvf c:control_collection s:shard1 r:core_node1 x:collection1] o.a.s.c.ShardLeaderElectionContext I am the new leader: https://127.0.0.1:38650/mdvf/collection1/ shard1
   [junit4]   2> 1986969 INFO  (OverseerStateUpdate-96104944565485573-127.0.0.1:38650_mdvf-n_0000000000) [n:127.0.0.1:38650_mdvf    ] o.a.s.c.Overseer processMessage: queueSize: 1, message = {
   [junit4]   2>   "operation":"leader",
   [junit4]   2>   "shard":"shard1",
   [junit4]   2>   "collection":"control_collection",
   [junit4]   2>   "base_url":"https://127.0.0.1:38650/mdvf",
   [junit4]   2>   "core":"collection1",
   [junit4]   2>   "state":"active"} current state version: 1
   [junit4]   2> 1987070 INFO  (zkCallback-24210-thread-1-processing-n:127.0.0.1:38650_mdvf) [n:127.0.0.1:38650_mdvf    ] o.a.s.c.c.ZkStateReader A cluster state change: [WatchedEvent state:SyncConnected type:NodeDataChanged path:/clusterstate.json], has occurred - updating... (live nodes size: [1])
   [junit4]   2> 1987120 INFO  (coreZkRegister-10175-thread-1-processing-n:127.0.0.1:38650_mdvf x:collection1 s:shard1 c:control_collection r:core_node1) [n:127.0.0.1:38650_mdvf c:control_collection s:shard1 r:core_node1 x:collection1] o.a.s.c.ZkController We are https://127.0.0.1:38650/mdvf/collection1/ and leader is https://127.0.0.1:38650/mdvf/collection1/
   [junit4]   2> 1987120 INFO  (coreZkRegister-10175-thread-1-processing-n:127.0.0.1:38650_mdvf x:collection1 s:shard1 c:control_collection r:core_node1) [n:127.0.0.1:38650_mdvf c:control_collection s:shard1 r:core_node1 x:collection1] o.a.s.c.ZkController No LogReplay needed for core=collection1 baseURL=https://127.0.0.1:38650/mdvf
   [junit4]   2> 1987120 INFO  (coreZkRegister-10175-thread-1-processing-n:127.0.0.1:38650_mdvf x:collection1 s:shard1 c:control_collection r:core_node1) [n:127.0.0.1:38650_mdvf c:control_collection s:shard1 r:core_node1 x:collection1] o.a.s.c.ZkController I am the leader, no recovery necessary
   [junit4]   2> 1987120 INFO  (coreZkRegister-10175-thread-1-processing-n:127.0.0.1:38650_mdvf x:collection1 s:shard1 c:control_collection r:core_node1) [n:127.0.0.1:38650_mdvf c:control_collection s:shard1 r:core_node1 x:collection1] o.a.s.c.ZkController publishing state=active
   [junit4]   2> 1987120 INFO  (coreZkRegister-10175-thread-1-processing-n:127.0.0.1:38650_mdvf x:collection1 s:shard1 c:control_collection r:core_node1) [n:127.0.0.1:38650_mdvf c:control_collection s:shard1 r:core_node1 x:collection1] o.a.s.c.ZkController numShards not found on descriptor - reading it from system property
   [junit4]   2> 1987121 INFO  (OverseerStateUpdate-96104944565485573-127.0.0.1:38650_mdvf-n_0000000000) [n:127.0.0.1:38650_mdvf    ] o.a.s.c.Overseer processMessage: queueSize: 1, message = {
   [junit4]   2>   "core":"collection1",
   [junit4]   2>   "core_node_name":"core_node1",
   [junit4]   2>   "roles":null,
   [junit4]   2>   "base_url":"https://127.0.0.1:38650/mdvf",
   [junit4]   2>   "node_name":"127.0.0.1:38650_mdvf",
   [junit4]   2>   "numShards":"1",
   [junit4]   2>   "state":"active",
   [junit4]   2>   "shard":"shard1",
   [junit4]   2>   "collection":"control_collection",
   [junit4]   2>   "operation":"state"} current state version: 2
   [junit4]   2> 1987121 INFO  (OverseerStateUpdate-96104944565485573-127.0.0.1:38650_mdvf-n_0000000000) [n:127.0.0.1:38650_mdvf    ] o.a.s.c.o.ReplicaMutator Update state numShards=1 message={
   [junit4]   2>   "core":"collection1",
   [junit4]   2>   "core_node_name":"core_node1",
   [junit4]   2>   "roles":null,
   [junit4]   2>   "base_url":"https://127.0.0.1:38650/mdvf",
   [junit4]   2>   "node_name":"127.0.0.1:38650_mdvf",
   [junit4]   2>   "numShards":"1",
   [junit4]   2>   "state":"active",
   [junit4]   2>   "shard":"shard1",
   [junit4]   2>   "collection":"control_collection",
   [junit4]   2>   "operation":"state"}
   [junit4]   2> 1987222 INFO  (zkCallback-24210-thread-1-processing-n:127.0.0.1:38650_mdvf) [n:127.0.0.1:38650_mdvf    ] o.a.s.c.c.ZkStateReader A cluster state change: [WatchedEvent state:SyncConnected type:NodeDataChanged path:/clusterstate.json], has occurred - updating... (live nodes size: [1])
   [junit4]   2> 1987310 INFO  (TEST-TestReqParamsAPI.test-seed#[9563B5A726C8A8BA]) [    ] o.a.s.c.c.SolrZkClient Using default ZkCredentialsProvider
   [junit4]   2> 1987310 INFO  (TEST-TestReqParamsAPI.test-seed#[9563B5A726C8A8BA]) [    ] o.a.s.c.c.ConnectionManager Waiting for client to connect to ZooKeeper
   [junit4]   2> 1987310 INFO  (zkCallback-24214-thread-1) [    ] o.a.s.c.c.ConnectionManager Watcher org.apache.solr.common.cloud.ConnectionManager@332c0bab name:ZooKeeperConnection Watcher:127.0.0.1:34259/solr got event WatchedEvent state:SyncConnected type:None path:null path:null type:None
   [junit4]   2> 1987311 INFO  (TEST-TestReqParamsAPI.test-seed#[9563B5A726C8A8BA]) [    ] o.a.s.c.c.ConnectionManager Client is connected to ZooKeeper
   [junit4]   2> 1987311 INFO  (TEST-TestReqParamsAPI.test-seed#[9563B5A726C8A8BA]) [    ] o.a.s.c.c.SolrZkClient Using default ZkACLProvider
   [junit4]   2> 1987311 INFO  (TEST-TestReqParamsAPI.test-seed#[9563B5A726C8A8BA]) [    ] o.a.s.c.c.ZkStateReader Updating cluster state from ZooKeeper... 
   [junit4]   2> 1987311 INFO  (TEST-TestReqParamsAPI.test-seed#[9563B5A726C8A8BA]) [    ] o.a.s.c.c.ZkStateReader Loaded cluster properties: {urlScheme=https}
   [junit4]   2> 1987311 INFO  (TEST-TestReqParamsAPI.test-seed#[9563B5A726C8A8BA]) [    ] o.a.s.c.c.ZkStateReader Updated live nodes from ZooKeeper... (0) -> (1)
   [junit4]   2> 1987312 INFO  (TEST-TestReqParamsAPI.test-seed#[9563B5A726C8A8BA]) [    ] o.a.s.c.ChaosMonkey monkey: init - expire sessions:false cause connection loss:false
   [junit4]   2> 1987368 INFO  (TEST-TestReqParamsAPI.test-seed#[9563B5A726C8A8BA]) [    ] o.a.s.SolrTestCaseJ4 Writing core.properties file to /home/jenkins/workspace/Lucene-Solr-6.x-Linux/solr/build/solr-core/test/J2/temp/solr.handler.TestReqParamsAPI_9563B5A726C8A8BA-001/shard-1-001/cores/collection1
   [junit4]   2> 1987369 INFO  (TEST-TestReqParamsAPI.test-seed#[9563B5A726C8A8BA]) [    ] o.a.s.c.AbstractFullDistribZkTestBase create jetty 1 in directory /home/jenkins/workspace/Lucene-Solr-6.x-Linux/solr/build/solr-core/test/J2/temp/solr.handler.TestReqParamsAPI_9563B5A726C8A8BA-001/shard-1-001
   [junit4]   2> 1987370 INFO  (TEST-TestReqParamsAPI.test-seed#[9563B5A726C8A8BA]) [    ] o.e.j.s.Server jetty-9.3.8.v20160314
   [junit4]   2> 1987371 INFO  (TEST-TestReqParamsAPI.test-seed#[9563B5A726C8A8BA]) [    ] o.e.j.s.h.ContextHandler Started o.e.j.s.ServletContextHandler@725913b4{/mdvf,null,AVAILABLE}
   [junit4]   2> 1987372 INFO  (TEST-TestReqParamsAPI.test-seed#[9563B5A726C8A8BA]) [    ] o.e.j.s.ServerConnector Started ServerConnector@274011f9{SSL,[ssl, http/1.1]}{127.0.0.1:45478}
   [junit4]   2> 1987373 INFO  (TEST-TestReqParamsAPI.test-seed#[9563B5A726C8A8BA]) [    ] o.e.j.s.Server Started @1989079ms
   [junit4]   2> 1987373 INFO  (TEST-TestReqParamsAPI.test-seed#[9563B5A726C8A8BA]) [    ] o.a.s.c.s.e.JettySolrRunner Jetty properties: {solr.data.dir=/home/jenkins/workspace/Lucene-Solr-6.x-Linux/solr/build/solr-core/test/J2/temp/solr.handler.TestReqParamsAPI_9563B5A726C8A8BA-001/tempDir-001/jetty1, solrconfig=solrconfig.xml, hostContext=/mdvf, hostPort=45478, coreRootDirectory=/home/jenkins/workspace/Lucene-Solr-6.x-Linux/solr/build/solr-core/test/J2/../../../../../../../../../home/jenkins/workspace/Lucene-Solr-6.x-Linux/solr/build/solr-core/test/J2/temp/solr.handler.TestReqParamsAPI_9563B5A726C8A8BA-001/shard-1-001/cores}
   [junit4]   2> 1987373 INFO  (TEST-TestReqParamsAPI.test-seed#[9563B5A726C8A8BA]) [    ] o.a.s.s.SolrDispatchFilter SolrDispatchFilter.init(): sun.misc.Launcher$AppClassLoader@73d16e93
   [junit4]   2> 1987373 INFO  (TEST-TestReqParamsAPI.test-seed#[9563B5A726C8A8BA]) [    ] o.a.s.c.SolrResourceLoader new SolrResourceLoader for directory: '/home/jenkins/workspace/Lucene-Solr-6.x-Linux/solr/build/solr-core/test/J2/temp/solr.handler.TestReqParamsAPI_9563B5A726C8A8BA-001/shard-1-001'
   [junit4]   2> 1987373 INFO  (TEST-TestReqParamsAPI.test-seed#[9563B5A726C8A8BA]) [    ] o.a.s.c.SolrResourceLoader JNDI not configured for solr (NoInitialContextEx)
   [junit4]   2> 1987373 INFO  (TEST-TestReqParamsAPI.test-seed#[9563B5A726C8A8BA]) [    ] o.a.s.c.SolrResourceLoader solr home defaulted to 'solr/' (could not find system property or JNDI)
   [junit4]   2> 1987373 INFO  (TEST-TestReqParamsAPI.test-seed#[9563B5A726C8A8BA]) [    ] o.a.s.c.c.SolrZkClient Using default ZkCredentialsProvider
   [junit4]   2> 1987374 INFO  (TEST-TestReqParamsAPI.test-seed#[9563B5A726C8A8BA]) [    ] o.a.s.c.c.ConnectionManager Waiting for client to connect to ZooKeeper
   [junit4]   2> 1987374 INFO  (zkCallback-24215-thread-1) [    ] o.a.s.c.c.ConnectionManager Watcher org.apache.solr.common.cloud.ConnectionManager@55cb7797 name:ZooKeeperConnection Watcher:127.0.0.1:34259/solr got event WatchedEvent state:SyncConnected type:None path:null path:null type:None
   [junit4]   2> 1987374 INFO  (TEST-TestReqParamsAPI.test-seed#[9563B5A726C8A8BA]) [    ] o.a.s.c.c.ConnectionManager Client is connected to ZooKeeper
   [junit4]   2> 1987374 INFO  (TEST-TestReqParamsAPI.test-seed#[9563B5A726C8A8BA]) [    ] o.a.s.c.c.SolrZkClient Using default ZkACLProvider
   [junit4]   2> 1987375 INFO  (TEST-TestReqParamsAPI.test-seed#[9563B5A726C8A8BA]) [    ] o.a.s.s.SolrDispatchFilter Loading solr.xml from SolrHome (not found in ZooKeeper)
   [junit4]   2> 1987375 INFO  (TEST-TestReqParamsAPI.test-seed#[9563B5A726C8A8BA]) [    ] o.a.s.c.SolrXmlConfig Loading container configuration from /home/jenkins/workspace/Lucene-Solr-6.x-Linux/solr/build/solr-core/test/J2/temp/solr.handler.TestReqParamsAPI_9563B5A726C8A8BA-001/shard-1-001/solr.xml
   [junit4]   2> 1987391 INFO  (TEST-TestReqParamsAPI.test-seed#[9563B5A726C8A8BA]) [    ] o.a.s.c.CorePropertiesLocator Config-defined core root directory: /home/jenkins/workspace/Lucene-Solr-6.x-Linux/solr/build/solr-core/test/J2/../../../../../../../../../home/jenkins/workspace/Lucene-Solr-6.x-Linux/solr/build/solr-core/test/J2/temp/solr.handler.TestReqParamsAPI_9563B5A726C8A8BA-001/shard-1-001/cores
   [junit4]   2> 1987391 INFO  (TEST-TestReqParamsAPI.test-seed#[9563B5A726C8A8BA]) [    ] o.a.s.c.CoreContainer New CoreContainer 424792809
   [junit4]   2> 1987391 INFO  (TEST-TestReqParamsAPI.test-seed#[9563B5A726C8A8BA]) [    ] o.a.s.c.CoreContainer Loading cores into CoreContainer [instanceDir=/home/jenkins/workspace/Lucene-Solr-6.x-Linux/solr/build/solr-core/test/J2/temp/solr.handler.TestReqParamsAPI_9563B5A726C8A8BA-001/shard-1-001]
   [junit4]   2> 1987392 WARN  (TEST-TestReqParamsAPI.test-seed#[9563B5A726C8A8BA]) [    ] o.a.s.c.CoreContainer Couldn't add files from /home/jenkins/workspace/Lucene-Solr-6.x-Linux/solr/build/solr-core/test/J2/temp/solr.handler.TestReqParamsAPI_9563B5A726C8A8BA-001/shard-1-001/lib to classpath: /home/jenkins/workspace/Lucene-Solr-6.x-Linux/solr/build/solr-core/test/J2/temp/solr.handler.TestReqParamsAPI_9563B5A726C8A8BA-001/shard-1-001/lib
   [junit4]   2> 1987392 INFO  (TEST-TestReqParamsAPI.test-seed#[9563B5A726C8A8BA]) [    ] o.a.s.h.c.HttpShardHandlerFactory created with socketTimeout : 90000,urlScheme : ,connTimeout : 15000,maxConnectionsPerHost : 20,maxConnections : 10000,corePoolSize : 0,maximumPoolSize : 2147483647,maxThreadIdleTime : 5,sizeOfQueue : -1,fairnessPolicy : false,useRetries : false,
   [junit4]   2> 1987393 INFO  (TEST-TestReqParamsAPI.test-seed#[9563B5A726C8A8BA]) [    ] o.a.s.u.UpdateShardHandler Creating UpdateShardHandler HTTP client with params: socketTimeout=340000&connTimeout=45000&retry=true
   [junit4]   2> 1987393 INFO  (TEST-TestReqParamsAPI.test-seed#[9563B5A726C8A8BA]) [    ] o.a.s.l.LogWatcher SLF4J impl is org.slf4j.impl.Log4jLoggerFactory
   [junit4]   2> 1987393 INFO  (TEST-TestReqParamsAPI.test-seed#[9563B5A726C8A8BA]) [    ] o.a.s.l.LogWatcher Registering Log Listener [Log4j (org.slf4j.impl.Log4jLoggerFactory)]
   [junit4]   2> 1987393 INFO  (TEST-TestReqParamsAPI.test-seed#[9563B5A726C8A8BA]) [    ] o.a.s.c.ZkContainer Zookeeper client=127.0.0.1:34259/solr
   [junit4]   2> 1987393 INFO  (TEST-TestReqParamsAPI.test-seed#[9563B5A726C8A8BA]) [    ] o.a.s.c.ZkController zkHost includes chroot
   [junit4]   2> 1987393 INFO  (TEST-TestReqParamsAPI.test-seed#[9563B5A726C8A8BA]) [    ] o.a.s.c.c.SolrZkClient Using default ZkCredentialsProvider
   [junit4]   2> 1987393 INFO  (TEST-TestReqParamsAPI.test-seed#[9563B5A726C8A8BA]) [    ] o.a.s.c.c.ConnectionManager Waiting for client to connect to ZooKeeper
   [junit4]   2> 1987394 INFO  (zkCallback-24218-thread-1) [    ] o.a.s.c.c.ConnectionManager Watcher org.apache.solr.common.cloud.ConnectionManager@7c464ad9 name:ZooKeeperConnection Watcher:127.0.0.1:34259 got event WatchedEvent state:SyncConnected type:None path:null path:null type:None
   [junit4]   2> 1987394 INFO  (TEST-TestReqParamsAPI.test-seed#[9563B5A726C8A8BA]) [    ] o.a.s.c.c.ConnectionManager Client is connected to ZooKeeper
   [junit4]   2> 1987394 INFO  (TEST-TestReqParamsAPI.test-seed#[9563B5A726C8A8BA]) [    ] o.a.s.c.c.SolrZkClient Using default ZkACLProvider
   [junit4]   2> 1987395 INFO  (TEST-TestReqParamsAPI.test-seed#[9563B5A726C8A8BA]) [n:127.0.0.1:45478_mdvf    ] o.a.s.c.ZkController Added new OnReconnect listener org.apache.solr.cloud.ZkController$$Lambda$47/1597562505@5dcc2267
   [junit4]   2> 1987395 INFO  (TEST-TestReqParamsAPI.test-seed#[9563B5A726C8A8BA]) [n:127.0.0.1:45478_mdvf    ] o.a.s.c.c.ConnectionManager Waiting for client to connect to ZooKeeper
   [junit4]   2> 1987396 INFO  (zkCallback-24219-thread-1-processing-n:127.0.0.1:45478_mdvf) [n:127.0.0.1:45478_mdvf    ] o.a.s.c.c.ConnectionManager Watcher org.apache.solr.common.cloud.ConnectionManager@6008f415 name:ZooKeeperConnection Watcher:127.0.0.1:34259/solr got event WatchedEvent state:SyncConnected type:None path:null path:null type:None
   [junit4]   2> 1987396 INFO  (TEST-TestReqParamsAPI.test-seed#[9563B5A726C8A8BA]) [n:127.0.0.1:45478_mdvf    ] o.a.s.c.c.ConnectionManager Client is connected to ZooKeeper
   [junit4]   2> 1987398 INFO  (TEST-TestReqParamsAPI.test-seed#[9563B5A726C8A8BA]) [n:127.0.0.1:45478_mdvf    ] o.a.s.c.c.ZkStateReader Updating cluster state from ZooKeeper... 
   [junit4]   2> 1987398 INFO  (TEST-TestReqParamsAPI.test-seed#[9563B5A726C8A8BA]) [n:127.0.0.1:45478_mdvf    ] o.a.s.c.c.ZkStateReader Loaded cluster properties: {urlScheme=https}
   [junit4]   2> 1987398 INFO  (TEST-TestReqParamsAPI.test-seed#[9563B5A726C8A8BA]) [n:127.0.0.1:45478_mdvf    ] o.a.s.c.c.ZkStateReader Updated live nodes from ZooKeeper... (0) -> (1)
   [junit4]   2> 1987400 INFO  (TEST-TestReqParamsAPI.test-seed#[9563B5A726C8A8BA]) [n:127.0.0.1:45478_mdvf    ] o.a.s.c.Overseer Overseer (id=null) closing
   [junit4]   2> 1987401 INFO  (TEST-TestReqParamsAPI.test-seed#[9563B5A726C8A8BA]) [n:127.0.0.1:45478_mdvf    ] o.a.s.c.LeaderElector Joined leadership election with path: /overseer_elect/election/96104944565485577-127.0.0.1:45478_mdvf-n_0000000001
   [junit4]   2> 1987401 INFO  (TEST-TestReqParamsAPI.test-seed#[9563B5A726C8A8BA]) [n:127.0.0.1:45478_mdvf    ] o.a.s.c.LeaderElector Watching path /overseer_elect/election/96104944565485573-127.0.0.1:38650_mdvf-n_0000000000 to know if I could be the leader
   [junit4]   2> 1987401 INFO  (TEST-TestReqParamsAPI.test-seed#[9563B5A726C8A8BA]) [n:127.0.0.1:45478_mdvf    ] o.a.s.c.ZkController Publish node=127.0.0.1:45478_mdvf as DOWN
   [junit4]   2> 1987402 INFO  (OverseerStateUpdate-96104944565485573-127.0.0.1:38650_mdvf-n_0000000000) [n:127.0.0.1:38650_mdvf    ] o.a.s.c.Overseer processMessage: queueSize: 1, message = {
   [junit4]   2>   "operation":"downnode",
   [junit4]   2>   "node_name":"127.0.0.1:45478_mdvf"} current state version: 3
   [junit4]   2> 1987402 INFO  (OverseerStateUpdate-96104944565485573-127.0.0.1:38650_mdvf-n_0000000000) [n:127.0.0.1:38650_mdvf    ] o.a.s.c.o.NodeMutator DownNode state invoked for node: 127.0.0.1:45478_mdvf
   [junit4]   2> 1987503 INFO  (zkCallback-24214-thread-1) [    ] o.a.s.c.c.ZkStateReader A cluster state change: [WatchedEvent state:SyncConnected type:NodeDataChanged path:/clusterstate.json], has occurred - updating... (live nodes size: [1])
   [junit4]   2> 1987503 INFO  (zkCallback-24210-thread-2-processing-n:127.0.0.1:38650_mdvf) [n:127.0.0.1:38650_mdvf    ] o.a.s.c.c.ZkStateReader A cluster state change: [WatchedEvent state:SyncConnected type:NodeDataChanged path:/clusterstate.json], has occurred - updating... (live nodes size: [1])
   [junit4]   2> 1987503 INFO  (zkCallback-24219-thread-1-processing-n:127.0.0.1:45478_mdvf) [n:127.0.0.1:45478_mdvf    ] o.a.s.c.c.ZkStateReader A cluster state change: [WatchedEvent state:SyncConnected type:NodeDataChanged path:/clusterstate.json], has occurred - updating... (live nodes size: [1])
   [junit4]   2> 1988402 INFO  (TEST-TestReqParamsAPI.test-seed#[9563B5A726C8A8BA]) [n:127.0.0.1:45478_mdvf    ] o.a.s.c.ZkController Register node as live in ZooKeeper:/live_nodes/127.0.0.1:45478_mdvf
   [junit4]   2> 1988403 INFO  (TEST-TestReqParamsAPI.test-seed#[9563B5A726C8A8BA]) [n:127.0.0.1:45478_mdvf    ] o.a.s.c.c.SolrZkClient makePath: /live_nodes/127.0.0.1:45478_mdvf
   [junit4]   2> 1988403 INFO  (zkCallback-24219-thread-1-processing-n:127.0.0.1:45478_mdvf) [n:127.0.0.1:45478_mdvf    ] o.a.s.c.c.ZkStateReader A live node change: [WatchedEvent state:SyncConnected type:NodeChildrenChanged path:/live_nodes], has occurred - updating... (live nodes size: [1])
   [junit4]   2> 1988403 INFO  (zkCallback-24210-thread-2-processing-n:127.0.0.1:38650_mdvf) [n:127.0.0.1:38650_mdvf    ] o.a.s.c.c.ZkStateReader A live node change: [WatchedEvent state:SyncConnected type:NodeChildrenChanged path:/live_nodes], has occurred - updating... (live nodes size: [1])
   [junit4]   2> 1988403 INFO  (zkCallback-24214-thread-1) [    ] o.a.s.c.c.ZkStateReader A live node change: [WatchedEvent state:SyncConnected type:NodeChildrenChanged path:/live_nodes], has occurred - updating... (live nodes size: [1])
   [junit4]   2> 1988403 INFO  (zkCallback-24219-thread-1-processing-n:127.0.0.1:45478_mdvf) [n:127.0.0.1:45478_mdvf    ] o.a.s.c.c.ZkStateReader Updated live nodes from ZooKeeper... (1) -> (2)
   [junit4]   2> 1988403 INFO  (zkCallback-24210-thread-2-processing-n:127.0.0.1:38650_mdvf) [n:127.0.0.1:38650_mdvf    ] o.a.s.c.c.ZkStateReader Updated live nodes from ZooKeeper... (1) -> (2)
   [junit4]   2> 1988403 INFO  (zkCallback-24214-thread-1) [    ] o.a.s.c.c.ZkStateReader Updated live nodes from ZooKeeper... (1) -> (2)
   [junit4]   2> 1988413 INFO  (TEST-TestReqParamsAPI.test-seed#[9563B5A726C8A8BA]) [n:127.0.0.1:45478_mdvf    ] o.a.s.c.CoreContainer Security conf doesn't exist. Skipping setup for authorization module.
   [junit4]   2> 1988413 INFO  (TEST-TestReqParamsAPI.test-seed#[9563B5A726C8A8BA]) [n:127.0.0.1:45478_mdvf    ] o.a.s.c.CoreContainer No authentication plugin used.
   [junit4]   2> 1988413 INFO  (TEST-TestReqParamsAPI.test-seed#[9563B5A726C8A8BA]) [n:127.0.0.1:45478_mdvf    ] o.a.s.c.CorePropertiesLocator Looking for core definitions underneath /home/jenkins/workspace/Lucene-Solr-6.x-Linux/solr/build/solr-core/test/J2/../../../../../../../../../home/jenkins/workspace/Lucene-Solr-6.x-Linux/solr/build/solr-core/test/J2/temp/solr.handler.TestReqParamsAPI_9563B5A726C8A8BA-001/shard-1-001/cores
   [junit4]   2> 1988414 INFO  (TEST-TestReqParamsAPI.test-seed#[9563B5A726C8A8BA]) [n:127.0.0.1:45478_mdvf    ] o.a.s.c.CoreDescriptor Created CoreDescriptor: {name=collection1, config=solrconfig.xml, transient=false, schema=schema.xml, loadOnStartup=true, configSetProperties=configsetprops.json, collection=collection1, coreNodeName=, dataDir=data/, shard=}
   [junit4]   2> 1988414 INFO  (TEST-TestReqParamsAPI.test-seed#[9563B5A726C8A8BA]) [n:127.0.0.1:45478_mdvf    ] o.a.s.c.CorePropertiesLocator Found core collection1 in /home/jenkins/workspace/Lucene-Solr-6.x-Linux/solr/build/solr-core/test/J2/../../../../../../../../../home/jenkins/workspace/Lucene-Solr-6.x-Linux/solr/build/solr-core/test/J2/temp/solr.handler.TestReqParamsAPI_9563B5A726C8A8BA-001/shard-1-001/cores/collection1
   [junit4]   2> 1988414 INFO  (TEST-TestReqParamsAPI.test-seed#[9563B5A726C8A8BA]) [n:127.0.0.1:45478_mdvf    ] o.a.s.c.CorePropertiesLocator Found 1 core definitions
   [junit4]   2> 1988414 INFO  (coreLoadExecutor-10192-thread-1-processing-n:127.0.0.1:45478_mdvf) [n:127.0.0.1:45478_mdvf c:collection1   x:collection1] o.a.s.c.ZkController publishing state=down
   [junit4]   2> 1988415 INFO  (coreLoadExecutor-10192-thread-1-processing-n:127.0.0.1:45478_mdvf) [n:127.0.0.1:45478_mdvf c:collection1   x:collection1] o.a.s.c.ZkController numShards not found on descriptor - reading it from system property
   [junit4]   2> 1988414 INFO  (TEST-TestReqParamsAPI.test-seed#[9563B5A726C8A8BA]) [n:127.0.0.1:45478_mdvf    ] o.a.s.s.SolrDispatchFilter user.dir=/home/jenkins/workspace/Lucene-Solr-6.x-Linux/solr/build/solr-core/test/J2
   [junit4]   2> 1988415 INFO  (TEST-TestReqParamsAPI.test-seed#[9563B5A726C8A8BA]) [n:127.0.0.1:45478_mdvf    ] o.a.s.s.SolrDispatchFilter SolrDispatchFilter.init() done
   [junit4]   2> 1988415 INFO  (coreLoadExecutor-10192-thread-1-processing-n:127.0.0.1:45478_mdvf) [n:127.0.0.1:45478_mdvf c:collection1   x:collection1] o.a.s.c.ZkController Collection collection1 not visible yet, but flagging it so a watch is registered when it becomes visible
   [junit4]   2> 1988415 INFO  (OverseerStateUpdate-96104944565485573-127.0.0.1:38650_mdvf-n_0000000000) [n:127.0.0.1:38650_mdvf    ] o.a.s.c.Overseer processMessage: queueSize: 1, message = {
   [junit4]   2>   "core":"collection1",
   [junit4]   2>   "roles":null,
   [junit4]   2>   "base_url":"https://127.0.0.1:45478/mdvf",
   [junit4]   2>   "node_name":"127.0.0.1:45478_mdvf",
   [junit4]   2>   "numShards":"2",
   [junit4]   2>   "state":"down",
   [junit4]   2>   "shard":null,
   [junit4]   2>   "collection":"collection1",
   [junit4]   2>   "operation":"state"} current state version: 4
   [junit4]   2> 1988415 INFO  (coreLoadExecutor-10192-thread-1-processing-n:127.0.0.1:45478_mdvf) [n:127.0.0.1:45478_mdvf c:collection1   x:collection1] o.a.s.c.c.ZkStateReader Deleting data for [collection1]
   [junit4]   2> 1988415 INFO  (OverseerStateUpdate-96104944565485573-127.0.0.1:38650_mdvf-n_0000000000) [n:127.0.0.1:38650_mdvf    ] o.a.s.c.o.ReplicaMutator Update state numShards=2 message={
   [junit4]   2>   "core":"collection1",
   [junit4]   2>   "roles":null,
   [junit4]   2>   "base_url":"https://127.0.0.1:45478/mdvf",
   [junit4]   2>   "node_name":"127.0.0.1:45478_mdvf",
   [junit4]   2>   "numShards":"2",
   [junit4]   2>   "state":"down",
   [junit4]   2>   "shard":null,
   [junit4]   2>   "collection":"collection1",
   [junit4]   2>   "operation":"state"}
   [junit4]   2> 1988415 INFO  (OverseerStateUpdate-96104944565485573-127.0.0.1:38650_mdvf-n_0000000000) [n:127.0.0.1:38650_mdvf    ] o.a.s.c.o.ClusterStateMutator building a new cName: collection1
   [junit4]   2> 1988416 INFO  (coreLoadExecutor-10192-thread-1-processing-n:127.0.0.1:45478_mdvf) [n:127.0.0.1:45478_mdvf c:collection1   x:collection1] o.a.s.c.ZkController look for our core node name
   [junit4]   2> 1988416 INFO  (OverseerStateUpdate-96104944565485573-127.0.0.1:38650_mdvf-n_0000000000) [n:127.0.0.1:38650_mdvf    ] o.a.s.c.o.ReplicaMutator Assigning new node to shard shard=shard2
   [junit4]   2> 1988517 INFO  (zkCallback-24210-thread-1-processing-n:127.0.0.1:38650_mdvf) [n:127.0.0.1:38650_mdvf    ] o.a.s.c.c.ZkStateReader A cluster state change: [WatchedEvent state:SyncConnected type:NodeDataChanged path:/clusterstate.json], has occurred - updating... (live nodes size: [2])
   [junit4]   2> 1988517 INFO  (zkCallback-24219-thread-1-processing-n:127.0.0.1:45478_mdvf) [n:127.0.0.1:45478_mdvf    ] o.a.s.c.c.ZkStateReader A cluster state change: [WatchedEvent state:SyncConnected type:NodeDataChanged path:/clusterstate.json], has occurred - updating... (live nodes size: [2])
   [junit4]   2> 1988517 INFO  (zkCallback-24214-thread-1) [    ] o.a.s.c.c.ZkStateReader A cluster state change: [WatchedEvent state:SyncConnected type:NodeDataChanged path:/clusterstate.json], has occurred - updating... (live nodes size: [2])
   [junit4]   2> 1989416 INFO  (coreLoadExecutor-10192-thread-1-processing-n:127.0.0.1:45478_mdvf) [n:127.0.0.1:45478_mdvf c:collection1   x:collection1] o.a.s.c.ZkController waiting to find shard id in clusterstate for collection1
   [junit4]   2> 1989416 INFO  (coreLoadExecutor-10192-thread-1-processing-n:127.0.0.1:45478_mdvf) [n:127.0.0.1:45478_mdvf c:collection1   x:collection1] o.a.s.c.ZkController Check for collection zkNode:collection1
   [junit4]   2> 1989416 INFO  (coreLoadExecutor-10192-thread-1-processing-n:127.0.0.1:45478_mdvf) [n:127.0.0.1:45478_mdvf c:collection1   x:collection1] o.a.s.c.ZkController Collection zkNode exists
   [junit4]   2> 1989416 INFO  (coreLoadExecutor-10192-thread-1-processing-n:127.0.0.1:45478_mdvf) [n:127.0.0.1:45478_mdvf c:collection1   x:collection1] o.a.s.c.c.ZkStateReader Load collection config from: [/collections/collection1]
   [junit4]   2> 1989416 INFO  (coreLoadExecutor-10192-thread-1-processing-n:127.0.0.1:45478_mdvf) [n:127.0.0.1:45478_mdvf c:collection1   x:collection1] o.a.s.c.c.ZkStateReader path=[/collections/collection1] [configName]=[conf1] specified config exists in ZooKeeper
   [junit4]   2> 1989417 INFO  (coreLoadExecutor-10192-thread-1-processing-n:127.0.0.1:45478_mdvf) [n:127.0.0.1:45478_mdvf c:collection1   x:collection1] o.a.s.c.SolrResourceLoader new SolrResourceLoader for directory: '/home/jenkins/workspace/Lucene-Solr-6.x-Linux/solr/build/solr-core/test/J2/temp/solr.handler.TestReqParamsAPI_9563B5A726C8A8BA-001/shard-1-001/cores/collection1'
   [junit4]   2> 1989417 INFO  (coreLoadExecutor-10192-thread-1-processing-n:127.0.0.1:45478_mdvf) [n:127.0.0.1:45478_mdvf c:collection1   x:collection1] o.a.s.c.SolrResourceLoader JNDI not configured for solr (NoInitialContextEx)
   [junit4]   2> 1989417 INFO  (coreLoadExecutor-10192-thread-1-processing-n:127.0.0.1:45478_mdvf) [n:127.0.0.1:45478_mdvf c:collection1   x:collection1] o.a.s.c.SolrResourceLoader solr home defaulted to 'solr/' (could not find system property or JNDI)
   [junit4]   2> 1989417 INFO  (coreLoadExecutor-10192-thread-1-processing-n:127.0.0.1:45478_mdvf) [n:127.0.0.1:45478_mdvf c:collection1   x:collection1] o.a.s.c.Config loaded config solrconfig.xml with version 0 
   [junit4]   2> 1989420 INFO  (coreLoadExecutor-10192-thread-1-processing-n:127.0.0.1:45478_mdvf) [n:127.0.0.1:45478_mdvf c:collection1   x:collection1] o.a.s.c.SolrConfig current version of requestparams : -1
   [junit4]   2> 1989424 INFO  (coreLoadExecutor-10192-thread-1-processing-n:127.0.0.1:45478_mdvf) [n:127.0.0.1:45478_mdvf c:collection1   x:collection1] o.a.s.c.SolrConfig Using Lucene MatchVersion: 6.2.0
   [junit4]   2> 1989432 INFO  (coreLoadExecutor-10192-thread-1-processing-n:127.0.0.1:45478_mdvf) [n:127.0.0.1:45478_mdvf c:collection1   x:collection1] o.a.s.c.SolrConfig Loaded SolrConfig: solrconfig.xml
   [junit4]   2> 1989435 INFO  (coreLoadExecutor-10192-thread-1-processing-n:127.0.0.1:45478_mdvf) [n:127.0.0.1:45478_mdvf c:collection1   x:collection1] o.a.s.s.IndexSchema [collection1] Schema name=test
   [junit4]   2> 1989518 INFO  (coreLoadExecutor-10192-thread-1-processing-n:127.0.0.1:45478_mdvf) [n:127.0.0.1:45478_mdvf c:collection1   x:collection1] o.a.s.s.OpenExchangeRatesOrgProvider Initialized with rates=open-exchange-rates.json, refreshInterval=1440.
   [junit4]   2> 1989521 INFO  (coreLoadExecutor-10192-thread-1-processing-n:127.0.0.1:45478_mdvf) [n:127.0.0.1:45478_mdvf c:collection1   x:collection1] o.a.s.s.IndexSchema default search field in schema is text
   [junit4]   2> 1989522 INFO  (coreLoadExecutor-10192-thread-1-processing-n:127.0.0.1:45478_mdvf) [n:127.0.0.1:45478_mdvf c:collection1   x:collection1] o.a.s.s.IndexSchema unique key field: id
   [junit4]   2> 1989526 INFO  (coreLoadExecutor-10192-thread-1-processing-n:127.0.0.1:45478_mdvf) [n:127.0.0.1:45478_mdvf c:collection1   x:collection1] o.a.s.s.FileExchangeRateProvider Reloading exchange rates from file currency.xml
   [junit4]   2> 1989527 INFO  (coreLoadExecutor-10192-thread-1-processing-n:127.0.0.1:45478_mdvf) [n:127.0.0.1:45478_mdvf c:collection1   x:collection1] o.a.s.s.FileExchangeRateProvider Reloading exchange rates from file currency.xml
   [junit4]   2> 1989528 INFO  (coreLoadExecutor-10192-thread-1-processing-n:127.0.0.1:45478_mdvf) [n:127.0.0.1:45478_mdvf c:collection1   x:collection1] o.a.s.s.OpenExchangeRatesOrgProvider Reloading exchange rates from open-exchange-rates.json
   [junit4]   2> 1989528 INFO  (coreLoadExecutor-10192-thread-1-processing-n:127.0.0.1:45478_mdvf) [n:127.0.0.1:45478_mdvf c:collection1   x:collection1] o.a.s.s.OpenExchangeR

[...truncated too long message...]

r.cloud.LeaderElector.runIamLeaderProcess(LeaderElector.java:170)
   [junit4]   2> 	at org.apache.solr.cloud.LeaderElector.checkIfIamLeader(LeaderElector.java:135)
   [junit4]   2> 	at org.apache.solr.cloud.LeaderElector.access$200(LeaderElector.java:56)
   [junit4]   2> 	at org.apache.solr.cloud.LeaderElector$ElectionWatcher.process(LeaderElector.java:348)
   [junit4]   2> 	at org.apache.solr.common.cloud.SolrZkClient$3.lambda$process$0(SolrZkClient.java:265)
   [junit4]   2> 	at java.util.concurrent.Executors$RunnableAdapter.call(Executors.java:511)
   [junit4]   2> 	at java.util.concurrent.FutureTask.run(FutureTask.java:266)
   [junit4]   2> 	at org.apache.solr.common.util.ExecutorUtil$MDCAwareThreadPoolExecutor.lambda$execute$0(ExecutorUtil.java:229)
   [junit4]   2> 	at java.util.concurrent.ThreadPoolExecutor.runWorker(ThreadPoolExecutor.java:1142)
   [junit4]   2> 	at java.util.concurrent.ThreadPoolExecutor$Worker.run(ThreadPoolExecutor.java:617)
   [junit4]   2> 	at java.lang.Thread.run(Thread.java:745)
   [junit4]   2> 2008824 INFO  (TEST-TestReqParamsAPI.test-seed#[9563B5A726C8A8BA]) [    ] o.e.j.s.ServerConnector Stopped ServerConnector@2fd62736{SSL,[ssl, http/1.1]}{127.0.0.1:0}
   [junit4]   2> 2008825 INFO  (TEST-TestReqParamsAPI.test-seed#[9563B5A726C8A8BA]) [    ] o.e.j.s.h.ContextHandler Stopped o.e.j.s.ServletContextHandler@2ce5d32d{/mdvf,null,UNAVAILABLE}
   [junit4]   2> 2008825 INFO  (TEST-TestReqParamsAPI.test-seed#[9563B5A726C8A8BA]) [    ] o.a.s.c.ZkTestServer connecting to 127.0.0.1:34259 34259
   [junit4]   2> 2008839 INFO  (Thread-4652) [    ] o.a.s.c.ZkTestServer connecting to 127.0.0.1:34259 34259
   [junit4]   2> 2008840 WARN  (Thread-4652) [    ] o.a.s.c.ZkTestServer Watch limit violations: 
   [junit4]   2> Maximum concurrent create/delete watches above limit:
   [junit4]   2> 
   [junit4]   2> 	25	/solr/configs/conf1
   [junit4]   2> 	6	/solr/aliases.json
   [junit4]   2> 	5	/solr/security.json
   [junit4]   2> 	4	/solr/collections/collection1/state.json
   [junit4]   2> 
   [junit4]   2> Maximum concurrent data watches above limit:
   [junit4]   2> 
   [junit4]   2> 	6	/solr/clusterstate.json
   [junit4]   2> 	6	/solr/clusterprops.json
   [junit4]   2> 
   [junit4]   2> Maximum concurrent children watches above limit:
   [junit4]   2> 
   [junit4]   2> 	24	/solr/overseer/queue
   [junit4]   2> 	22	/solr/overseer/collection-queue-work
   [junit4]   2> 	6	/solr/live_nodes
   [junit4]   2> 	6	/solr/collections
   [junit4]   2> 	3	/solr/overseer/queue-work
   [junit4]   2> 
   [junit4]   2> NOTE: reproduce with: ant test  -Dtestcase=TestReqParamsAPI -Dtests.method=test -Dtests.seed=9563B5A726C8A8BA -Dtests.multiplier=3 -Dtests.slow=true -Dtests.locale=ro-RO -Dtests.timezone=Africa/Maputo -Dtests.asserts=true -Dtests.file.encoding=UTF-8
   [junit4] FAILURE 23.3s J2 | TestReqParamsAPI.test <<<
   [junit4]    > Throwable #1: java.lang.AssertionError: Could not get expected value  'CY val' for path 'params/c' full output: {
   [junit4]    >   "responseHeader":{
   [junit4]    >     "status":0,
   [junit4]    >     "QTime":0},
   [junit4]    >   "params":{
   [junit4]    >     "a":"A val",
   [junit4]    >     "b":"B val",
   [junit4]    >     "wt":"json",
   [junit4]    >     "useParams":""},
   [junit4]    >   "context":{
   [junit4]    >     "webapp":"/mdvf",
   [junit4]    >     "path":"/dump1",
   [junit4]    >     "httpMethod":"GET"}},  from server:  https://127.0.0.1:45478/mdvf/collection1
   [junit4]    > 	at __randomizedtesting.SeedInfo.seed([9563B5A726C8A8BA:1D378A7D8834C542]:0)
   [junit4]    > 	at org.apache.solr.core.TestSolrConfigHandler.testForResponseElement(TestSolrConfigHandler.java:481)
   [junit4]    > 	at org.apache.solr.handler.TestReqParamsAPI.testReqParams(TestReqParamsAPI.java:171)
   [junit4]    > 	at org.apache.solr.handler.TestReqParamsAPI.test(TestReqParamsAPI.java:61)
   [junit4]    > 	at org.apache.solr.BaseDistributedSearchTestCase$ShardsRepeatRule$ShardsFixedStatement.callStatement(BaseDistributedSearchTestCase.java:992)
   [junit4]    > 	at org.apache.solr.BaseDistributedSearchTestCase$ShardsRepeatRule$ShardsStatement.evaluate(BaseDistributedSearchTestCase.java:967)
   [junit4]    > 	at java.lang.Thread.run(Thread.java:745)
   [junit4]   2> 2008844 INFO  (SUITE-TestReqParamsAPI-seed#[9563B5A726C8A8BA]-worker) [    ] o.a.s.SolrTestCaseJ4 ###deleteCore
   [junit4]   2> NOTE: leaving temporary files on disk at: /home/jenkins/workspace/Lucene-Solr-6.x-Linux/solr/build/solr-core/test/J2/temp/solr.handler.TestReqParamsAPI_9563B5A726C8A8BA-001
   [junit4]   2> Jun 20, 2016 5:51:40 PM com.carrotsearch.randomizedtesting.ThreadLeakControl checkThreadLeaks
   [junit4]   2> WARNING: Will linger awaiting termination of 1 leaked thread(s).
   [junit4]   2> NOTE: test params are: codec=Asserting(Lucene62): {}, docValues:{}, maxPointsInLeafNode=1155, maxMBSortInHeap=6.007598600118122, sim=ClassicSimilarity, locale=ro-RO, timezone=Africa/Maputo
   [junit4]   2> NOTE: Linux 4.4.0-24-generic amd64/Oracle Corporation 1.8.0_92 (64-bit)/cpus=12,threads=1,free=197182128,total=518979584
   [junit4]   2> NOTE: All tests run in this JVM: [LukeRequestHandlerTest, TestConfigReload, TestFieldTypeCollectionResource, BasicDistributedZk2Test, TestExactStatsCache, CurrencyFieldXmlFileTest, DirectUpdateHandlerTest, AutoCommitTest, TestAuthenticationFramework, TestJettySolrRunner, TestReload, TestSolrIndexConfig, CollectionStateFormat2Test, TestDocBasedVersionConstraints, TestUtils, TestCSVResponseWriter, TestIndexingPerformance, TestLockTree, PrimitiveFieldTypeTest, TestDistributedStatsComponentCardinality, TestSmileRequest, OverriddenZkACLAndCredentialsProvidersTest, TestTolerantUpdateProcessorRandomCloud, TestWriterPerf, TestRecovery, TestCopyFieldCollectionResource, TestConfigSetsAPI, FieldMutatingUpdateProcessorTest, TestRequestForwarding, TestSolrJ, TestStressReorder, FieldAnalysisRequestHandlerTest, TestElisionMultitermQuery, BinaryUpdateRequestHandlerTest, BlockCacheTest, MigrateRouteKeyTest, TestSubQueryTransformerDistrib, TestExtendedDismaxParser, DistribDocExpirationUpdateProcessorTest, SolrTestCaseJ4Test, HdfsDirectoryFactoryTest, BaseCdcrDistributedZkTest, TestUniqueKeyFieldResource, DateRangeFieldTest, TestShortCircuitedRequests, HighlighterConfigTest, DebugComponentTest, TestCharFilters, GraphQueryTest, ClusterStateTest, TestPHPSerializedResponseWriter, TestSolrCLIRunExample, TestSuggestSpellingConverter, HdfsNNFailoverTest, UnloadDistributedZkTest, TestFastWriter, TestJsonRequest, XmlUpdateRequestHandlerTest, TestRawTransformer, FullSolrCloudDistribCmdsTest, ShowFileRequestHandlerTest, DistributedVersionInfoTest, TestPerFieldSimilarity, TestChildDocTransformer, TestExclusionRuleCollectionAccess, TestClassicSimilarityFactory, TestSweetSpotSimilarityFactory, TestIntervalFaceting, TestRuleBasedAuthorizationPlugin, StatelessScriptUpdateProcessorFactoryTest, DateMathParserTest, TestOverriddenPrefixQueryForCustomFieldType, TestShardHandlerFactory, OverseerTest, TestStandardQParsers, TestSchemaResource, LeaderFailoverAfterPartitionTest, RulesTest, TestSolrXml, TestSort, TestDynamicLoading, FullHLLTest, RegexBoostProcessorTest, TestZkChroot, CoreMergeIndexesAdminHandlerTest, HdfsRestartWhileUpdatingTest, TestGeoJSONResponseWriter, HdfsTlogReplayBufferedWhileIndexingTest, TestFieldCacheSort, TestFileDictionaryLookup, PKIAuthenticationIntegrationTest, SuggesterTest, HdfsDirectoryTest, ClassificationUpdateProcessorFactoryTest, CollectionsAPISolrJTest, TestPerFieldSimilarityClassic, DirectSolrConnectionTest, SpellCheckComponentTest, BasicFunctionalityTest, TestLazyCores, TestIndexSearcher, DistributedQueryElevationComponentTest, TestCoreDiscovery, AnalysisAfterCoreReloadTest, SignatureUpdateProcessorFactoryTest, SpellCheckCollatorTest, SuggesterFSTTest, SolrRequestParserTest, DocValuesTest, QueryParsingTest, JsonLoaderTest, TestLFUCache, TestDistributedMissingSort, TestSimpleTrackingShardHandler, TestEmbeddedSolrServerConstructors, AssignTest, CdcrRequestHandlerTest, CleanupOldIndexTest, DistribCursorPagingTest, LeaderInitiatedRecoveryOnCommitTest, OutOfBoxZkACLAndCredentialsProvidersTest, OverseerCollectionConfigSetProcessorTest, OverseerRolesTest, RecoveryAfterSoftCommitTest, ReplicationFactorTest, RestartWhileUpdatingTest, RollingRestartTest, SharedFSAutoReplicaFailoverTest, SharedFSAutoReplicaFailoverUtilsTest, SimpleCollectionCreateDeleteTest, TestCloudInspectUtil, TestConfigSetsAPIZkFailure, TestCryptoKeys, TestMiniSolrCloudClusterSSL, TestSSLRandomization, TestSolrCloudWithKerberosAlt, TestStressLiveNodes, ZkStateWriterTest, CachingDirectoryFactoryTest, TestReqParamsAPI]
   [junit4] Completed [507/615 (1!)] on J2 in 24.09s, 1 test, 1 failure <<< FAILURES!

[...truncated 378 lines...]
BUILD FAILED
/home/jenkins/workspace/Lucene-Solr-6.x-Linux/build.xml:740: The following error occurred while executing this line:
/home/jenkins/workspace/Lucene-Solr-6.x-Linux/build.xml:684: The following error occurred while executing this line:
/home/jenkins/workspace/Lucene-Solr-6.x-Linux/build.xml:59: The following error occurred while executing this line:
/home/jenkins/workspace/Lucene-Solr-6.x-Linux/solr/build.xml:233: The following error occurred while executing this line:
/home/jenkins/workspace/Lucene-Solr-6.x-Linux/solr/common-build.xml:530: The following error occurred while executing this line:
/home/jenkins/workspace/Lucene-Solr-6.x-Linux/lucene/common-build.xml:1427: The following error occurred while executing this line:
/home/jenkins/workspace/Lucene-Solr-6.x-Linux/lucene/common-build.xml:984: There were test failures: 615 suites (10 ignored), 2591 tests, 1 failure, 116 ignored (72 assumptions) [seed: 9563B5A726C8A8BA]

Total time: 61 minutes 26 seconds
Build step 'Invoke Ant' marked build as failure
Archiving artifacts
[WARNINGS] Skipping publisher since build result is FAILURE
Recording test results
Email was triggered for: Failure - Any
Sending email for trigger: Failure - Any



Mime
View raw message