lucene-dev mailing list archives

Site index · List index
Message view « Date » · « Thread »
Top « Date » · « Thread »
From Apache Jenkins Server <jenk...@builds.apache.org>
Subject [JENKINS] Lucene-Solr-NightlyTests-6.x - Build # 84 - Still Failing
Date Sun, 05 Jun 2016 22:45:30 GMT
Build: https://builds.apache.org/job/Lucene-Solr-NightlyTests-6.x/84/

No tests ran.

Build Log:
[...truncated 11072 lines...]
   [junit4] Suite: org.apache.solr.cloud.SyncSliceTest
   [junit4]   2> Creating dataDir: /x1/jenkins/jenkins-slave/workspace/Lucene-Solr-NightlyTests-6.x/solr/build/solr-core/test/J0/temp/solr.cloud.SyncSliceTest_F2811E7501E88115-001/init-core-data-001
   [junit4]   2> 5721 INFO  (SUITE-SyncSliceTest-seed#[F2811E7501E88115]-worker) [    ] o.a.s.SolrTestCaseJ4 Randomized ssl (true) and clientAuth (true) via: @org.apache.solr.util.RandomizeSSL(reason=, ssl=NaN, value=NaN, clientAuth=NaN)
   [junit4]   2> 5732 INFO  (SUITE-SyncSliceTest-seed#[F2811E7501E88115]-worker) [    ] o.a.s.BaseDistributedSearchTestCase Setting hostContext system property: /mof/qq
   [junit4]   2> 5755 INFO  (TEST-SyncSliceTest.test-seed#[F2811E7501E88115]) [    ] o.a.s.c.ZkTestServer STARTING ZK TEST SERVER
   [junit4]   2> 5763 INFO  (Thread-4) [    ] o.a.s.c.ZkTestServer client port:0.0.0.0/0.0.0.0:0
   [junit4]   2> 5763 INFO  (Thread-4) [    ] o.a.s.c.ZkTestServer Starting server
   [junit4]   2> 5862 INFO  (TEST-SyncSliceTest.test-seed#[F2811E7501E88115]) [    ] o.a.s.c.ZkTestServer start zk server on port:47018
   [junit4]   2> 6033 INFO  (TEST-SyncSliceTest.test-seed#[F2811E7501E88115]) [    ] o.a.s.c.c.SolrZkClient Using default ZkCredentialsProvider
   [junit4]   2> 6069 INFO  (TEST-SyncSliceTest.test-seed#[F2811E7501E88115]) [    ] o.a.s.c.c.ConnectionManager Waiting for client to connect to ZooKeeper
   [junit4]   2> 6102 INFO  (zkCallback-3-thread-1) [    ] o.a.s.c.c.ConnectionManager Watcher org.apache.solr.common.cloud.ConnectionManager@1ae3360 name:ZooKeeperConnection Watcher:127.0.0.1:47018 got event WatchedEvent state:SyncConnected type:None path:null path:null type:None
   [junit4]   2> 6103 INFO  (TEST-SyncSliceTest.test-seed#[F2811E7501E88115]) [    ] o.a.s.c.c.ConnectionManager Client is connected to ZooKeeper
   [junit4]   2> 6103 INFO  (TEST-SyncSliceTest.test-seed#[F2811E7501E88115]) [    ] o.a.s.c.c.SolrZkClient Using default ZkACLProvider
   [junit4]   2> 6105 INFO  (TEST-SyncSliceTest.test-seed#[F2811E7501E88115]) [    ] o.a.s.c.c.SolrZkClient makePath: /solr
   [junit4]   2> 6124 INFO  (TEST-SyncSliceTest.test-seed#[F2811E7501E88115]) [    ] o.a.s.c.c.SolrZkClient Using default ZkCredentialsProvider
   [junit4]   2> 6124 WARN  (NIOServerCxn.Factory:0.0.0.0/0.0.0.0:0) [    ] o.a.z.s.NIOServerCnxn caught end of stream exception
   [junit4]   2> EndOfStreamException: Unable to read additional data from client sessionid 0x155229f36e90000, likely client has closed socket
   [junit4]   2> 	at org.apache.zookeeper.server.NIOServerCnxn.doIO(NIOServerCnxn.java:228)
   [junit4]   2> 	at org.apache.zookeeper.server.NIOServerCnxnFactory.run(NIOServerCnxnFactory.java:208)
   [junit4]   2> 	at java.lang.Thread.run(Thread.java:745)
   [junit4]   2> 6127 INFO  (TEST-SyncSliceTest.test-seed#[F2811E7501E88115]) [    ] o.a.s.c.c.ConnectionManager Waiting for client to connect to ZooKeeper
   [junit4]   2> 6129 INFO  (zkCallback-4-thread-1) [    ] o.a.s.c.c.ConnectionManager Watcher org.apache.solr.common.cloud.ConnectionManager@2217a79d name:ZooKeeperConnection Watcher:127.0.0.1:47018/solr got event WatchedEvent state:SyncConnected type:None path:null path:null type:None
   [junit4]   2> 6129 INFO  (TEST-SyncSliceTest.test-seed#[F2811E7501E88115]) [    ] o.a.s.c.c.ConnectionManager Client is connected to ZooKeeper
   [junit4]   2> 6129 INFO  (TEST-SyncSliceTest.test-seed#[F2811E7501E88115]) [    ] o.a.s.c.c.SolrZkClient Using default ZkACLProvider
   [junit4]   2> 6131 INFO  (TEST-SyncSliceTest.test-seed#[F2811E7501E88115]) [    ] o.a.s.c.c.SolrZkClient makePath: /collections/collection1
   [junit4]   2> 6136 INFO  (TEST-SyncSliceTest.test-seed#[F2811E7501E88115]) [    ] o.a.s.c.c.SolrZkClient makePath: /collections/collection1/shards
   [junit4]   2> 6139 INFO  (TEST-SyncSliceTest.test-seed#[F2811E7501E88115]) [    ] o.a.s.c.c.SolrZkClient makePath: /collections/control_collection
   [junit4]   2> 6141 INFO  (TEST-SyncSliceTest.test-seed#[F2811E7501E88115]) [    ] o.a.s.c.c.SolrZkClient makePath: /collections/control_collection/shards
   [junit4]   2> 6144 INFO  (TEST-SyncSliceTest.test-seed#[F2811E7501E88115]) [    ] o.a.s.c.AbstractZkTestCase put /x1/jenkins/jenkins-slave/workspace/Lucene-Solr-NightlyTests-6.x/solr/core/src/test-files/solr/collection1/conf/solrconfig-tlog.xml to /configs/conf1/solrconfig.xml
   [junit4]   2> 6149 INFO  (TEST-SyncSliceTest.test-seed#[F2811E7501E88115]) [    ] o.a.s.c.c.SolrZkClient makePath: /configs/conf1/solrconfig.xml
   [junit4]   2> 6156 INFO  (TEST-SyncSliceTest.test-seed#[F2811E7501E88115]) [    ] o.a.s.c.AbstractZkTestCase put /x1/jenkins/jenkins-slave/workspace/Lucene-Solr-NightlyTests-6.x/solr/core/src/test-files/solr/collection1/conf/schema.xml to /configs/conf1/schema.xml
   [junit4]   2> 6156 INFO  (TEST-SyncSliceTest.test-seed#[F2811E7501E88115]) [    ] o.a.s.c.c.SolrZkClient makePath: /configs/conf1/schema.xml
   [junit4]   2> 6161 INFO  (TEST-SyncSliceTest.test-seed#[F2811E7501E88115]) [    ] o.a.s.c.AbstractZkTestCase put /x1/jenkins/jenkins-slave/workspace/Lucene-Solr-NightlyTests-6.x/solr/core/src/test-files/solr/collection1/conf/solrconfig.snippet.randomindexconfig.xml to /configs/conf1/solrconfig.snippet.randomindexconfig.xml
   [junit4]   2> 6161 INFO  (TEST-SyncSliceTest.test-seed#[F2811E7501E88115]) [    ] o.a.s.c.c.SolrZkClient makePath: /configs/conf1/solrconfig.snippet.randomindexconfig.xml
   [junit4]   2> 6164 INFO  (TEST-SyncSliceTest.test-seed#[F2811E7501E88115]) [    ] o.a.s.c.AbstractZkTestCase put /x1/jenkins/jenkins-slave/workspace/Lucene-Solr-NightlyTests-6.x/solr/core/src/test-files/solr/collection1/conf/stopwords.txt to /configs/conf1/stopwords.txt
   [junit4]   2> 6165 INFO  (TEST-SyncSliceTest.test-seed#[F2811E7501E88115]) [    ] o.a.s.c.c.SolrZkClient makePath: /configs/conf1/stopwords.txt
   [junit4]   2> 6167 INFO  (TEST-SyncSliceTest.test-seed#[F2811E7501E88115]) [    ] o.a.s.c.AbstractZkTestCase put /x1/jenkins/jenkins-slave/workspace/Lucene-Solr-NightlyTests-6.x/solr/core/src/test-files/solr/collection1/conf/protwords.txt to /configs/conf1/protwords.txt
   [junit4]   2> 6167 INFO  (TEST-SyncSliceTest.test-seed#[F2811E7501E88115]) [    ] o.a.s.c.c.SolrZkClient makePath: /configs/conf1/protwords.txt
   [junit4]   2> 6170 INFO  (TEST-SyncSliceTest.test-seed#[F2811E7501E88115]) [    ] o.a.s.c.AbstractZkTestCase put /x1/jenkins/jenkins-slave/workspace/Lucene-Solr-NightlyTests-6.x/solr/core/src/test-files/solr/collection1/conf/currency.xml to /configs/conf1/currency.xml
   [junit4]   2> 6170 INFO  (TEST-SyncSliceTest.test-seed#[F2811E7501E88115]) [    ] o.a.s.c.c.SolrZkClient makePath: /configs/conf1/currency.xml
   [junit4]   2> 6173 INFO  (TEST-SyncSliceTest.test-seed#[F2811E7501E88115]) [    ] o.a.s.c.AbstractZkTestCase put /x1/jenkins/jenkins-slave/workspace/Lucene-Solr-NightlyTests-6.x/solr/core/src/test-files/solr/collection1/conf/enumsConfig.xml to /configs/conf1/enumsConfig.xml
   [junit4]   2> 6173 INFO  (TEST-SyncSliceTest.test-seed#[F2811E7501E88115]) [    ] o.a.s.c.c.SolrZkClient makePath: /configs/conf1/enumsConfig.xml
   [junit4]   2> 6175 INFO  (TEST-SyncSliceTest.test-seed#[F2811E7501E88115]) [    ] o.a.s.c.AbstractZkTestCase put /x1/jenkins/jenkins-slave/workspace/Lucene-Solr-NightlyTests-6.x/solr/core/src/test-files/solr/collection1/conf/open-exchange-rates.json to /configs/conf1/open-exchange-rates.json
   [junit4]   2> 6175 INFO  (TEST-SyncSliceTest.test-seed#[F2811E7501E88115]) [    ] o.a.s.c.c.SolrZkClient makePath: /configs/conf1/open-exchange-rates.json
   [junit4]   2> 6178 INFO  (TEST-SyncSliceTest.test-seed#[F2811E7501E88115]) [    ] o.a.s.c.AbstractZkTestCase put /x1/jenkins/jenkins-slave/workspace/Lucene-Solr-NightlyTests-6.x/solr/core/src/test-files/solr/collection1/conf/mapping-ISOLatin1Accent.txt to /configs/conf1/mapping-ISOLatin1Accent.txt
   [junit4]   2> 6178 INFO  (TEST-SyncSliceTest.test-seed#[F2811E7501E88115]) [    ] o.a.s.c.c.SolrZkClient makePath: /configs/conf1/mapping-ISOLatin1Accent.txt
   [junit4]   2> 6180 INFO  (TEST-SyncSliceTest.test-seed#[F2811E7501E88115]) [    ] o.a.s.c.AbstractZkTestCase put /x1/jenkins/jenkins-slave/workspace/Lucene-Solr-NightlyTests-6.x/solr/core/src/test-files/solr/collection1/conf/old_synonyms.txt to /configs/conf1/old_synonyms.txt
   [junit4]   2> 6180 INFO  (TEST-SyncSliceTest.test-seed#[F2811E7501E88115]) [    ] o.a.s.c.c.SolrZkClient makePath: /configs/conf1/old_synonyms.txt
   [junit4]   2> 6183 INFO  (TEST-SyncSliceTest.test-seed#[F2811E7501E88115]) [    ] o.a.s.c.AbstractZkTestCase put /x1/jenkins/jenkins-slave/workspace/Lucene-Solr-NightlyTests-6.x/solr/core/src/test-files/solr/collection1/conf/synonyms.txt to /configs/conf1/synonyms.txt
   [junit4]   2> 6183 INFO  (TEST-SyncSliceTest.test-seed#[F2811E7501E88115]) [    ] o.a.s.c.c.SolrZkClient makePath: /configs/conf1/synonyms.txt
   [junit4]   2> 6189 INFO  (TEST-SyncSliceTest.test-seed#[F2811E7501E88115]) [    ] o.a.s.c.c.SolrZkClient Using default ZkCredentialsProvider
   [junit4]   2> 6190 INFO  (TEST-SyncSliceTest.test-seed#[F2811E7501E88115]) [    ] o.a.s.c.c.ConnectionManager Waiting for client to connect to ZooKeeper
   [junit4]   2> 6191 INFO  (zkCallback-6-thread-1) [    ] o.a.s.c.c.ConnectionManager Watcher org.apache.solr.common.cloud.ConnectionManager@56f64ce name:ZooKeeperConnection Watcher:127.0.0.1:47018/solr got event WatchedEvent state:SyncConnected type:None path:null path:null type:None
   [junit4]   2> 6191 INFO  (TEST-SyncSliceTest.test-seed#[F2811E7501E88115]) [    ] o.a.s.c.c.ConnectionManager Client is connected to ZooKeeper
   [junit4]   2> 6192 INFO  (TEST-SyncSliceTest.test-seed#[F2811E7501E88115]) [    ] o.a.s.c.c.SolrZkClient Using default ZkACLProvider
   [junit4]   2> 6272 INFO  (TEST-SyncSliceTest.test-seed#[F2811E7501E88115]) [    ] o.a.s.SolrTestCaseJ4 Writing core.properties file to /x1/jenkins/jenkins-slave/workspace/Lucene-Solr-NightlyTests-6.x/solr/build/solr-core/test/J0/temp/solr.cloud.SyncSliceTest_F2811E7501E88115-001/control-001/cores/collection1
   [junit4]   2> 6442 INFO  (TEST-SyncSliceTest.test-seed#[F2811E7501E88115]) [    ] o.e.j.s.Server jetty-9.3.8.v20160314
   [junit4]   2> 6471 INFO  (TEST-SyncSliceTest.test-seed#[F2811E7501E88115]) [    ] o.e.j.s.h.ContextHandler Started o.e.j.s.ServletContextHandler@7a7f30e0{/mof/qq,null,AVAILABLE}
   [junit4]   2> 6600 INFO  (TEST-SyncSliceTest.test-seed#[F2811E7501E88115]) [    ] o.e.j.s.ServerConnector Started ServerConnector@76b8cc88{SSL,[ssl, http/1.1]}{127.0.0.1:33986}
   [junit4]   2> 6601 INFO  (TEST-SyncSliceTest.test-seed#[F2811E7501E88115]) [    ] o.e.j.s.Server Started @9557ms
   [junit4]   2> 6601 INFO  (TEST-SyncSliceTest.test-seed#[F2811E7501E88115]) [    ] o.a.s.c.s.e.JettySolrRunner Jetty properties: {solr.data.dir=/x1/jenkins/jenkins-slave/workspace/Lucene-Solr-NightlyTests-6.x/solr/build/solr-core/test/J0/temp/solr.cloud.SyncSliceTest_F2811E7501E88115-001/tempDir-001/control/data, hostContext=/mof/qq, hostPort=33986, coreRootDirectory=/x1/jenkins/jenkins-slave/workspace/Lucene-Solr-NightlyTests-6.x/solr/build/solr-core/test/J0/temp/solr.cloud.SyncSliceTest_F2811E7501E88115-001/control-001/cores}
   [junit4]   2> 6610 INFO  (TEST-SyncSliceTest.test-seed#[F2811E7501E88115]) [    ] o.a.s.s.SolrDispatchFilter SolrDispatchFilter.init(): sun.misc.Launcher$AppClassLoader@73d16e93
   [junit4]   2> 6610 INFO  (TEST-SyncSliceTest.test-seed#[F2811E7501E88115]) [    ] o.a.s.c.SolrResourceLoader new SolrResourceLoader for directory: '/x1/jenkins/jenkins-slave/workspace/Lucene-Solr-NightlyTests-6.x/solr/build/solr-core/test/J0/temp/solr.cloud.SyncSliceTest_F2811E7501E88115-001/control-001'
   [junit4]   2> 6611 INFO  (TEST-SyncSliceTest.test-seed#[F2811E7501E88115]) [    ] o.a.s.c.SolrResourceLoader JNDI not configured for solr (NoInitialContextEx)
   [junit4]   2> 6611 INFO  (TEST-SyncSliceTest.test-seed#[F2811E7501E88115]) [    ] o.a.s.c.SolrResourceLoader solr home defaulted to 'solr/' (could not find system property or JNDI)
   [junit4]   2> 6611 INFO  (TEST-SyncSliceTest.test-seed#[F2811E7501E88115]) [    ] o.a.s.c.c.SolrZkClient Using default ZkCredentialsProvider
   [junit4]   2> 6625 INFO  (TEST-SyncSliceTest.test-seed#[F2811E7501E88115]) [    ] o.a.s.c.c.ConnectionManager Waiting for client to connect to ZooKeeper
   [junit4]   2> 6631 INFO  (zkCallback-7-thread-1) [    ] o.a.s.c.c.ConnectionManager Watcher org.apache.solr.common.cloud.ConnectionManager@9a72d54 name:ZooKeeperConnection Watcher:127.0.0.1:47018/solr got event WatchedEvent state:SyncConnected type:None path:null path:null type:None
   [junit4]   2> 6631 INFO  (TEST-SyncSliceTest.test-seed#[F2811E7501E88115]) [    ] o.a.s.c.c.ConnectionManager Client is connected to ZooKeeper
   [junit4]   2> 6631 INFO  (TEST-SyncSliceTest.test-seed#[F2811E7501E88115]) [    ] o.a.s.c.c.SolrZkClient Using default ZkACLProvider
   [junit4]   2> 6634 INFO  (TEST-SyncSliceTest.test-seed#[F2811E7501E88115]) [    ] o.a.s.s.SolrDispatchFilter Loading solr.xml from SolrHome (not found in ZooKeeper)
   [junit4]   2> 6635 INFO  (TEST-SyncSliceTest.test-seed#[F2811E7501E88115]) [    ] o.a.s.c.SolrXmlConfig Loading container configuration from /x1/jenkins/jenkins-slave/workspace/Lucene-Solr-NightlyTests-6.x/solr/build/solr-core/test/J0/temp/solr.cloud.SyncSliceTest_F2811E7501E88115-001/control-001/solr.xml
   [junit4]   2> 6646 INFO  (TEST-SyncSliceTest.test-seed#[F2811E7501E88115]) [    ] o.a.s.c.CorePropertiesLocator Config-defined core root directory: /x1/jenkins/jenkins-slave/workspace/Lucene-Solr-NightlyTests-6.x/solr/build/solr-core/test/J0/temp/solr.cloud.SyncSliceTest_F2811E7501E88115-001/control-001/cores
   [junit4]   2> 6646 INFO  (TEST-SyncSliceTest.test-seed#[F2811E7501E88115]) [    ] o.a.s.c.CoreContainer New CoreContainer 1933397908
   [junit4]   2> 6646 INFO  (TEST-SyncSliceTest.test-seed#[F2811E7501E88115]) [    ] o.a.s.c.CoreContainer Loading cores into CoreContainer [instanceDir=/x1/jenkins/jenkins-slave/workspace/Lucene-Solr-NightlyTests-6.x/solr/build/solr-core/test/J0/temp/solr.cloud.SyncSliceTest_F2811E7501E88115-001/control-001]
   [junit4]   2> 6647 WARN  (TEST-SyncSliceTest.test-seed#[F2811E7501E88115]) [    ] o.a.s.c.CoreContainer Couldn't add files from /x1/jenkins/jenkins-slave/workspace/Lucene-Solr-NightlyTests-6.x/solr/build/solr-core/test/J0/temp/solr.cloud.SyncSliceTest_F2811E7501E88115-001/control-001/lib to classpath: /x1/jenkins/jenkins-slave/workspace/Lucene-Solr-NightlyTests-6.x/solr/build/solr-core/test/J0/temp/solr.cloud.SyncSliceTest_F2811E7501E88115-001/control-001/lib
   [junit4]   2> 6654 INFO  (TEST-SyncSliceTest.test-seed#[F2811E7501E88115]) [    ] o.a.s.h.c.HttpShardHandlerFactory created with socketTimeout : 90000,urlScheme : ,connTimeout : 15000,maxConnectionsPerHost : 20,maxConnections : 10000,corePoolSize : 0,maximumPoolSize : 2147483647,maxThreadIdleTime : 5,sizeOfQueue : -1,fairnessPolicy : false,useRetries : false,
   [junit4]   2> 6655 INFO  (TEST-SyncSliceTest.test-seed#[F2811E7501E88115]) [    ] o.a.s.u.UpdateShardHandler Creating UpdateShardHandler HTTP client with params: socketTimeout=340000&connTimeout=45000&retry=true
   [junit4]   2> 6656 INFO  (TEST-SyncSliceTest.test-seed#[F2811E7501E88115]) [    ] o.a.s.l.LogWatcher SLF4J impl is org.slf4j.impl.Log4jLoggerFactory
   [junit4]   2> 6656 INFO  (TEST-SyncSliceTest.test-seed#[F2811E7501E88115]) [    ] o.a.s.l.LogWatcher Registering Log Listener [Log4j (org.slf4j.impl.Log4jLoggerFactory)]
   [junit4]   2> 6656 INFO  (TEST-SyncSliceTest.test-seed#[F2811E7501E88115]) [    ] o.a.s.c.ZkContainer Zookeeper client=127.0.0.1:47018/solr
   [junit4]   2> 6666 INFO  (TEST-SyncSliceTest.test-seed#[F2811E7501E88115]) [    ] o.a.s.c.ZkController zkHost includes chroot
   [junit4]   2> 6666 INFO  (TEST-SyncSliceTest.test-seed#[F2811E7501E88115]) [    ] o.a.s.c.c.SolrZkClient Using default ZkCredentialsProvider
   [junit4]   2> 6667 INFO  (TEST-SyncSliceTest.test-seed#[F2811E7501E88115]) [    ] o.a.s.c.c.ConnectionManager Waiting for client to connect to ZooKeeper
   [junit4]   2> 6672 INFO  (zkCallback-10-thread-1) [    ] o.a.s.c.c.ConnectionManager Watcher org.apache.solr.common.cloud.ConnectionManager@4327d56 name:ZooKeeperConnection Watcher:127.0.0.1:47018 got event WatchedEvent state:SyncConnected type:None path:null path:null type:None
   [junit4]   2> 6673 INFO  (TEST-SyncSliceTest.test-seed#[F2811E7501E88115]) [    ] o.a.s.c.c.ConnectionManager Client is connected to ZooKeeper
   [junit4]   2> 6673 INFO  (TEST-SyncSliceTest.test-seed#[F2811E7501E88115]) [    ] o.a.s.c.c.SolrZkClient Using default ZkACLProvider
   [junit4]   2> 6679 INFO  (TEST-SyncSliceTest.test-seed#[F2811E7501E88115]) [n:127.0.0.1:33986_mof%2Fqq    ] o.a.s.c.ZkController Added new OnReconnect listener org.apache.solr.cloud.ZkController$$Lambda$33/115359872@4e44629d
   [junit4]   2> 6681 INFO  (TEST-SyncSliceTest.test-seed#[F2811E7501E88115]) [n:127.0.0.1:33986_mof%2Fqq    ] o.a.s.c.c.ConnectionManager Waiting for client to connect to ZooKeeper
   [junit4]   2> 6687 INFO  (zkCallback-11-thread-1-processing-n:127.0.0.1:33986_mof%2Fqq) [n:127.0.0.1:33986_mof%2Fqq    ] o.a.s.c.c.ConnectionManager Watcher org.apache.solr.common.cloud.ConnectionManager@1dcf5907 name:ZooKeeperConnection Watcher:127.0.0.1:47018/solr got event WatchedEvent state:SyncConnected type:None path:null path:null type:None
   [junit4]   2> 6690 INFO  (TEST-SyncSliceTest.test-seed#[F2811E7501E88115]) [n:127.0.0.1:33986_mof%2Fqq    ] o.a.s.c.c.ConnectionManager Client is connected to ZooKeeper
   [junit4]   2> 6695 INFO  (TEST-SyncSliceTest.test-seed#[F2811E7501E88115]) [n:127.0.0.1:33986_mof%2Fqq    ] o.a.s.c.c.SolrZkClient makePath: /overseer/queue
   [junit4]   2> 6700 INFO  (TEST-SyncSliceTest.test-seed#[F2811E7501E88115]) [n:127.0.0.1:33986_mof%2Fqq    ] o.a.s.c.c.SolrZkClient makePath: /overseer/collection-queue-work
   [junit4]   2> 6703 INFO  (TEST-SyncSliceTest.test-seed#[F2811E7501E88115]) [n:127.0.0.1:33986_mof%2Fqq    ] o.a.s.c.c.SolrZkClient makePath: /overseer/collection-map-running
   [junit4]   2> 6706 INFO  (TEST-SyncSliceTest.test-seed#[F2811E7501E88115]) [n:127.0.0.1:33986_mof%2Fqq    ] o.a.s.c.c.SolrZkClient makePath: /overseer/collection-map-completed
   [junit4]   2> 6711 INFO  (TEST-SyncSliceTest.test-seed#[F2811E7501E88115]) [n:127.0.0.1:33986_mof%2Fqq    ] o.a.s.c.c.SolrZkClient makePath: /overseer/collection-map-failure
   [junit4]   2> 6714 INFO  (TEST-SyncSliceTest.test-seed#[F2811E7501E88115]) [n:127.0.0.1:33986_mof%2Fqq    ] o.a.s.c.c.SolrZkClient makePath: /live_nodes
   [junit4]   2> 6715 INFO  (TEST-SyncSliceTest.test-seed#[F2811E7501E88115]) [n:127.0.0.1:33986_mof%2Fqq    ] o.a.s.c.c.SolrZkClient makePath: /aliases.json
   [junit4]   2> 6717 INFO  (TEST-SyncSliceTest.test-seed#[F2811E7501E88115]) [n:127.0.0.1:33986_mof%2Fqq    ] o.a.s.c.c.SolrZkClient makePath: /clusterstate.json
   [junit4]   2> 6718 INFO  (TEST-SyncSliceTest.test-seed#[F2811E7501E88115]) [n:127.0.0.1:33986_mof%2Fqq    ] o.a.s.c.c.SolrZkClient makePath: /security.json
   [junit4]   2> 6719 INFO  (TEST-SyncSliceTest.test-seed#[F2811E7501E88115]) [n:127.0.0.1:33986_mof%2Fqq    ] o.a.s.c.c.ZkStateReader Updating cluster state from ZooKeeper... 
   [junit4]   2> 6722 INFO  (TEST-SyncSliceTest.test-seed#[F2811E7501E88115]) [n:127.0.0.1:33986_mof%2Fqq    ] o.a.s.c.c.ZkStateReader Loaded cluster properties: {urlScheme=https}
   [junit4]   2> 6727 INFO  (TEST-SyncSliceTest.test-seed#[F2811E7501E88115]) [n:127.0.0.1:33986_mof%2Fqq    ] o.a.s.c.c.ZkStateReader Updated live nodes from ZooKeeper... (0) -> (0)
   [junit4]   2> 6740 INFO  (TEST-SyncSliceTest.test-seed#[F2811E7501E88115]) [n:127.0.0.1:33986_mof%2Fqq    ] o.a.s.c.c.SolrZkClient makePath: /overseer_elect
   [junit4]   2> 6741 INFO  (TEST-SyncSliceTest.test-seed#[F2811E7501E88115]) [n:127.0.0.1:33986_mof%2Fqq    ] o.a.s.c.c.SolrZkClient makePath: /overseer_elect/election
   [junit4]   2> 6745 INFO  (TEST-SyncSliceTest.test-seed#[F2811E7501E88115]) [n:127.0.0.1:33986_mof%2Fqq    ] o.a.s.c.Overseer Overseer (id=null) closing
   [junit4]   2> 6748 INFO  (TEST-SyncSliceTest.test-seed#[F2811E7501E88115]) [n:127.0.0.1:33986_mof%2Fqq    ] o.a.s.c.LeaderElector Joined leadership election with path: /overseer_elect/election/96021034274717701-127.0.0.1:33986_mof%2Fqq-n_0000000000
   [junit4]   2> 6750 INFO  (TEST-SyncSliceTest.test-seed#[F2811E7501E88115]) [n:127.0.0.1:33986_mof%2Fqq    ] o.a.s.c.OverseerElectionContext I am going to be the leader 127.0.0.1:33986_mof%2Fqq
   [junit4]   2> 6750 INFO  (TEST-SyncSliceTest.test-seed#[F2811E7501E88115]) [n:127.0.0.1:33986_mof%2Fqq    ] o.a.s.c.c.SolrZkClient makePath: /overseer_elect/leader
   [junit4]   2> 6753 INFO  (TEST-SyncSliceTest.test-seed#[F2811E7501E88115]) [n:127.0.0.1:33986_mof%2Fqq    ] o.a.s.c.Overseer Overseer (id=96021034274717701-127.0.0.1:33986_mof%2Fqq-n_0000000000) starting
   [junit4]   2> 6761 INFO  (TEST-SyncSliceTest.test-seed#[F2811E7501E88115]) [n:127.0.0.1:33986_mof%2Fqq    ] o.a.s.c.c.SolrZkClient makePath: /overseer/queue-work
   [junit4]   2> 6875 INFO  (TEST-SyncSliceTest.test-seed#[F2811E7501E88115]) [n:127.0.0.1:33986_mof%2Fqq    ] o.a.s.c.OverseerAutoReplicaFailoverThread Starting OverseerAutoReplicaFailoverThread autoReplicaFailoverWorkLoopDelay=10000 autoReplicaFailoverWaitAfterExpiration=30000 autoReplicaFailoverBadNodeExpiration=60000
   [junit4]   2> 6975 INFO  (OverseerCollectionConfigSetProcessor-96021034274717701-127.0.0.1:33986_mof%2Fqq-n_0000000000) [n:127.0.0.1:33986_mof%2Fqq    ] o.a.s.c.OverseerTaskProcessor Process current queue of overseer operations
   [junit4]   2> 6971 INFO  (OverseerStateUpdate-96021034274717701-127.0.0.1:33986_mof%2Fqq-n_0000000000) [n:127.0.0.1:33986_mof%2Fqq    ] o.a.s.c.Overseer Starting to work on the main queue
   [junit4]   2> 6985 INFO  (OverseerStateUpdate-96021034274717701-127.0.0.1:33986_mof%2Fqq-n_0000000000) [n:127.0.0.1:33986_mof%2Fqq    ] o.a.s.c.c.ZkStateReader Updated live nodes from ZooKeeper... (0) -> (0)
   [junit4]   2> 6987 INFO  (TEST-SyncSliceTest.test-seed#[F2811E7501E88115]) [n:127.0.0.1:33986_mof%2Fqq    ] o.a.s.c.ZkController Register node as live in ZooKeeper:/live_nodes/127.0.0.1:33986_mof%2Fqq
   [junit4]   2> 6989 INFO  (TEST-SyncSliceTest.test-seed#[F2811E7501E88115]) [n:127.0.0.1:33986_mof%2Fqq    ] o.a.s.c.c.SolrZkClient makePath: /live_nodes/127.0.0.1:33986_mof%2Fqq
   [junit4]   2> 6999 INFO  (zkCallback-11-thread-1-processing-n:127.0.0.1:33986_mof%2Fqq) [n:127.0.0.1:33986_mof%2Fqq    ] o.a.s.c.c.ZkStateReader A live node change: [WatchedEvent state:SyncConnected type:NodeChildrenChanged path:/live_nodes], has occurred - updating... (live nodes size: [0])
   [junit4]   2> 7015 INFO  (zkCallback-11-thread-1-processing-n:127.0.0.1:33986_mof%2Fqq) [n:127.0.0.1:33986_mof%2Fqq    ] o.a.s.c.c.ZkStateReader Updated live nodes from ZooKeeper... (0) -> (1)
   [junit4]   2> 7097 INFO  (TEST-SyncSliceTest.test-seed#[F2811E7501E88115]) [n:127.0.0.1:33986_mof%2Fqq    ] o.a.s.c.CoreContainer Security conf doesn't exist. Skipping setup for authorization module.
   [junit4]   2> 7098 INFO  (TEST-SyncSliceTest.test-seed#[F2811E7501E88115]) [n:127.0.0.1:33986_mof%2Fqq    ] o.a.s.c.CoreContainer No authentication plugin used.
   [junit4]   2> 7100 INFO  (TEST-SyncSliceTest.test-seed#[F2811E7501E88115]) [n:127.0.0.1:33986_mof%2Fqq    ] o.a.s.c.CorePropertiesLocator Looking for core definitions underneath /x1/jenkins/jenkins-slave/workspace/Lucene-Solr-NightlyTests-6.x/solr/build/solr-core/test/J0/temp/solr.cloud.SyncSliceTest_F2811E7501E88115-001/control-001/cores
   [junit4]   2> 7103 INFO  (TEST-SyncSliceTest.test-seed#[F2811E7501E88115]) [n:127.0.0.1:33986_mof%2Fqq    ] o.a.s.c.CoreDescriptor Created CoreDescriptor: {name=collection1, config=solrconfig.xml, transient=false, schema=schema.xml, loadOnStartup=true, configSetProperties=configsetprops.json, collection=control_collection, coreNodeName=, dataDir=data/, shard=}
   [junit4]   2> 7104 INFO  (TEST-SyncSliceTest.test-seed#[F2811E7501E88115]) [n:127.0.0.1:33986_mof%2Fqq    ] o.a.s.c.CorePropertiesLocator Found core collection1 in /x1/jenkins/jenkins-slave/workspace/Lucene-Solr-NightlyTests-6.x/solr/build/solr-core/test/J0/temp/solr.cloud.SyncSliceTest_F2811E7501E88115-001/control-001/cores/collection1
   [junit4]   2> 7104 INFO  (TEST-SyncSliceTest.test-seed#[F2811E7501E88115]) [n:127.0.0.1:33986_mof%2Fqq    ] o.a.s.c.CorePropertiesLocator Found 1 core definitions
   [junit4]   2> 7135 INFO  (coreLoadExecutor-20-thread-1-processing-n:127.0.0.1:33986_mof%2Fqq) [n:127.0.0.1:33986_mof%2Fqq c:control_collection   x:collection1] o.a.s.c.ZkController publishing state=down
   [junit4]   2> 7135 INFO  (coreLoadExecutor-20-thread-1-processing-n:127.0.0.1:33986_mof%2Fqq) [n:127.0.0.1:33986_mof%2Fqq c:control_collection   x:collection1] o.a.s.c.ZkController numShards not found on descriptor - reading it from system property
   [junit4]   2> 7138 INFO  (TEST-SyncSliceTest.test-seed#[F2811E7501E88115]) [n:127.0.0.1:33986_mof%2Fqq    ] o.a.s.s.SolrDispatchFilter user.dir=/x1/jenkins/jenkins-slave/workspace/Lucene-Solr-NightlyTests-6.x/solr/build/solr-core/test/J0
   [junit4]   2> 7138 INFO  (TEST-SyncSliceTest.test-seed#[F2811E7501E88115]) [n:127.0.0.1:33986_mof%2Fqq    ] o.a.s.s.SolrDispatchFilter SolrDispatchFilter.init() done
   [junit4]   2> 7138 INFO  (coreLoadExecutor-20-thread-1-processing-n:127.0.0.1:33986_mof%2Fqq) [n:127.0.0.1:33986_mof%2Fqq c:control_collection   x:collection1] o.a.s.c.ZkController Collection control_collection not visible yet, but flagging it so a watch is registered when it becomes visible
   [junit4]   2> 7141 INFO  (OverseerStateUpdate-96021034274717701-127.0.0.1:33986_mof%2Fqq-n_0000000000) [n:127.0.0.1:33986_mof%2Fqq    ] o.a.s.c.Overseer processMessage: queueSize: 1, message = {
   [junit4]   2>   "core":"collection1",
   [junit4]   2>   "roles":null,
   [junit4]   2>   "base_url":"https://127.0.0.1:33986/mof/qq",
   [junit4]   2>   "node_name":"127.0.0.1:33986_mof%2Fqq",
   [junit4]   2>   "numShards":"1",
   [junit4]   2>   "state":"down",
   [junit4]   2>   "shard":null,
   [junit4]   2>   "collection":"control_collection",
   [junit4]   2>   "operation":"state"} current state version: 0
   [junit4]   2> 7148 INFO  (coreLoadExecutor-20-thread-1-processing-n:127.0.0.1:33986_mof%2Fqq) [n:127.0.0.1:33986_mof%2Fqq c:control_collection   x:collection1] o.a.s.c.c.ZkStateReader Deleting data for [control_collection]
   [junit4]   2> 7149 INFO  (OverseerStateUpdate-96021034274717701-127.0.0.1:33986_mof%2Fqq-n_0000000000) [n:127.0.0.1:33986_mof%2Fqq    ] o.a.s.c.o.ReplicaMutator Update state numShards=1 message={
   [junit4]   2>   "core":"collection1",
   [junit4]   2>   "roles":null,
   [junit4]   2>   "base_url":"https://127.0.0.1:33986/mof/qq",
   [junit4]   2>   "node_name":"127.0.0.1:33986_mof%2Fqq",
   [junit4]   2>   "numShards":"1",
   [junit4]   2>   "state":"down",
   [junit4]   2>   "shard":null,
   [junit4]   2>   "collection":"control_collection",
   [junit4]   2>   "operation":"state"}
   [junit4]   2> 7160 INFO  (OverseerStateUpdate-96021034274717701-127.0.0.1:33986_mof%2Fqq-n_0000000000) [n:127.0.0.1:33986_mof%2Fqq    ] o.a.s.c.o.ClusterStateMutator building a new cName: control_collection
   [junit4]   2> 7168 INFO  (coreLoadExecutor-20-thread-1-processing-n:127.0.0.1:33986_mof%2Fqq) [n:127.0.0.1:33986_mof%2Fqq c:control_collection   x:collection1] o.a.s.c.ZkController Waiting for coreNodeName for core collection1 in collection control_collection to be assigned
   [junit4]   2> 7328 INFO  (OverseerStateUpdate-96021034274717701-127.0.0.1:33986_mof%2Fqq-n_0000000000) [n:127.0.0.1:33986_mof%2Fqq    ] o.a.s.c.o.ReplicaMutator Assigning new node to shard shard=shard1
   [junit4]   2> 7375 INFO  (zkCallback-11-thread-1-processing-n:127.0.0.1:33986_mof%2Fqq) [n:127.0.0.1:33986_mof%2Fqq    ] o.a.s.c.c.ZkStateReader A cluster state change: [WatchedEvent state:SyncConnected type:NodeDataChanged path:/clusterstate.json], has occurred - updating... (live nodes size: [1])
   [junit4]   2> 307213 WARN  (TEST-SyncSliceTest.test-seed#[F2811E7501E88115]) [n:127.0.0.1:33986_mof%2Fqq    ] o.a.s.c.SolrCores Timed out waiting for SolrCores to finish loading.
   [junit4]   2> 307239 INFO  (TEST-SyncSliceTest.test-seed#[F2811E7501E88115]) [    ] o.a.s.c.s.i.CloudSolrClient Final constructed zkHost string: 127.0.0.1:47018/solr
   [junit4]   2> 307240 INFO  (TEST-SyncSliceTest.test-seed#[F2811E7501E88115]) [    ] o.a.s.c.c.SolrZkClient Using default ZkCredentialsProvider
   [junit4]   2> 307240 INFO  (TEST-SyncSliceTest.test-seed#[F2811E7501E88115]) [    ] o.a.s.c.c.ConnectionManager Waiting for client to connect to ZooKeeper
   [junit4]   2> 307250 INFO  (zkCallback-15-thread-1) [    ] o.a.s.c.c.ConnectionManager Watcher org.apache.solr.common.cloud.ConnectionManager@7c8fcf0a name:ZooKeeperConnection Watcher:127.0.0.1:47018/solr got event WatchedEvent state:SyncConnected type:None path:null path:null type:None
   [junit4]   2> 307250 INFO  (TEST-SyncSliceTest.test-seed#[F2811E7501E88115]) [    ] o.a.s.c.c.ConnectionManager Client is connected to ZooKeeper
   [junit4]   2> 307251 INFO  (TEST-SyncSliceTest.test-seed#[F2811E7501E88115]) [    ] o.a.s.c.c.SolrZkClient Using default ZkACLProvider
   [junit4]   2> 307251 INFO  (TEST-SyncSliceTest.test-seed#[F2811E7501E88115]) [    ] o.a.s.c.c.ZkStateReader Updating cluster state from ZooKeeper... 
   [junit4]   2> 307252 INFO  (TEST-SyncSliceTest.test-seed#[F2811E7501E88115]) [    ] o.a.s.c.c.ZkStateReader Loaded cluster properties: {urlScheme=https}
   [junit4]   2> 307253 INFO  (TEST-SyncSliceTest.test-seed#[F2811E7501E88115]) [    ] o.a.s.c.c.ZkStateReader Updated live nodes from ZooKeeper... (0) -> (1)
   [junit4]   2> 307261 INFO  (TEST-SyncSliceTest.test-seed#[F2811E7501E88115]) [    ] o.a.s.c.ChaosMonkey monkey: init - expire sessions:false cause connection loss:false
   [junit4]   2> 307261 INFO  (TEST-SyncSliceTest.test-seed#[F2811E7501E88115]) [    ] o.a.s.c.AbstractFullDistribZkTestBase Creating collection1 with stateFormat=2
   [junit4]   2> 307261 INFO  (TEST-SyncSliceTest.test-seed#[F2811E7501E88115]) [    ] o.a.s.c.c.SolrZkClient Using default ZkCredentialsProvider
   [junit4]   2> 307283 INFO  (TEST-SyncSliceTest.test-seed#[F2811E7501E88115]) [    ] o.a.s.c.c.ConnectionManager Waiting for client to connect to ZooKeeper
   [junit4]   2> 307311 INFO  (zkCallback-16-thread-1) [    ] o.a.s.c.c.ConnectionManager Watcher org.apache.solr.common.cloud.ConnectionManager@60647249 name:ZooKeeperConnection Watcher:127.0.0.1:47018/solr got event WatchedEvent state:SyncConnected type:None path:null path:null type:None
   [junit4]   2> 307312 INFO  (TEST-SyncSliceTest.test-seed#[F2811E7501E88115]) [    ] o.a.s.c.c.ConnectionManager Client is connected to ZooKeeper
   [junit4]   2> 307312 INFO  (TEST-SyncSliceTest.test-seed#[F2811E7501E88115]) [    ] o.a.s.c.c.SolrZkClient Using default ZkACLProvider
   [junit4]   2> 307351 INFO  (OverseerStateUpdate-96021034274717701-127.0.0.1:33986_mof%2Fqq-n_0000000000) [n:127.0.0.1:33986_mof%2Fqq    ] o.a.s.c.Overseer processMessage: queueSize: 1, message = {
   [junit4]   2>   "operation":"create",
   [junit4]   2>   "name":"collection1",
   [junit4]   2>   "numShards":"1",
   [junit4]   2>   "stateFormat":"2"} current state version: 1
   [junit4]   2> 307351 INFO  (OverseerStateUpdate-96021034274717701-127.0.0.1:33986_mof%2Fqq-n_0000000000) [n:127.0.0.1:33986_mof%2Fqq    ] o.a.s.c.o.ClusterStateMutator building a new cName: collection1
   [junit4]   2> 307352 INFO  (OverseerStateUpdate-96021034274717701-127.0.0.1:33986_mof%2Fqq-n_0000000000) [n:127.0.0.1:33986_mof%2Fqq    ] o.a.s.c.o.ZkStateWriter going to create_collection /collections/collection1/state.json
   [junit4]   2> 307529 INFO  (TEST-SyncSliceTest.test-seed#[F2811E7501E88115]) [    ] o.a.s.SolrTestCaseJ4 Writing core.properties file to /x1/jenkins/jenkins-slave/workspace/Lucene-Solr-NightlyTests-6.x/solr/build/solr-core/test/J0/temp/solr.cloud.SyncSliceTest_F2811E7501E88115-001/shard-1-001/cores/collection1
   [junit4]   2> 307530 INFO  (TEST-SyncSliceTest.test-seed#[F2811E7501E88115]) [    ] o.a.s.c.AbstractFullDistribZkTestBase create jetty 1 in directory /x1/jenkins/jenkins-slave/workspace/Lucene-Solr-NightlyTests-6.x/solr/build/solr-core/test/J0/temp/solr.cloud.SyncSliceTest_F2811E7501E88115-001/shard-1-001
   [junit4]   2> 307532 INFO  (TEST-SyncSliceTest.test-seed#[F2811E7501E88115]) [    ] o.e.j.s.Server jetty-9.3.8.v20160314
   [junit4]   2> 307534 INFO  (TEST-SyncSliceTest.test-seed#[F2811E7501E88115]) [    ] o.e.j.s.h.ContextHandler Started o.e.j.s.ServletContextHandler@61d52c92{/mof/qq,null,AVAILABLE}
   [junit4]   2> 307548 INFO  (TEST-SyncSliceTest.test-seed#[F2811E7501E88115]) [    ] o.e.j.s.ServerConnector Started ServerConnector@1be6c9{SSL,[ssl, http/1.1]}{127.0.0.1:57631}
   [junit4]   2> 307548 INFO  (TEST-SyncSliceTest.test-seed#[F2811E7501E88115]) [    ] o.e.j.s.Server Started @310504ms
   [junit4]   2> 307548 INFO  (TEST-SyncSliceTest.test-seed#[F2811E7501E88115]) [    ] o.a.s.c.s.e.JettySolrRunner Jetty properties: {solr.data.dir=/x1/jenkins/jenkins-slave/workspace/Lucene-Solr-NightlyTests-6.x/solr/build/solr-core/test/J0/temp/solr.cloud.SyncSliceTest_F2811E7501E88115-001/tempDir-001/jetty1, solrconfig=solrconfig.xml, hostContext=/mof/qq, hostPort=57631, coreRootDirectory=/x1/jenkins/jenkins-slave/workspace/Lucene-Solr-NightlyTests-6.x/solr/build/solr-core/test/J0/../../../../../../../../../../x1/jenkins/jenkins-slave/workspace/Lucene-Solr-NightlyTests-6.x/solr/build/solr-core/test/J0/temp/solr.cloud.SyncSliceTest_F2811E7501E88115-001/shard-1-001/cores}
   [junit4]   2> 307548 INFO  (TEST-SyncSliceTest.test-seed#[F2811E7501E88115]) [    ] o.a.s.s.SolrDispatchFilter SolrDispatchFilter.init(): sun.misc.Launcher$AppClassLoader@73d16e93
   [junit4]   2> 307549 INFO  (TEST-SyncSliceTest.test-seed#[F2811E7501E88115]) [    ] o.a.s.c.SolrResourceLoader new SolrResourceLoader for directory: '/x1/jenkins/jenkins-slave/workspace/Lucene-Solr-NightlyTests-6.x/solr/build/solr-core/test/J0/temp/solr.cloud.SyncSliceTest_F2811E7501E88115-001/shard-1-001'
   [junit4]   2> 307549 INFO  (TEST-SyncSliceTest.test-seed#[F2811E7501E88115]) [    ] o.a.s.c.SolrResourceLoader JNDI not configured for solr (NoInitialContextEx)
   [junit4]   2> 307549 INFO  (TEST-SyncSliceTest.test-seed#[F2811E7501E88115]) [    ] o.a.s.c.SolrResourceLoader solr home defaulted to 'solr/' (could not find system property or JNDI)
   [junit4]   2> 307549 INFO  (TEST-SyncSliceTest.test-seed#[F2811E7501E88115]) [    ] o.a.s.c.c.SolrZkClient Using default ZkCredentialsProvider
   [junit4]   2> 307559 INFO  (TEST-SyncSliceTest.test-seed#[F2811E7501E88115]) [    ] o.a.s.c.c.ConnectionManager Waiting for client to connect to ZooKeeper
   [junit4]   2> 307567 INFO  (zkCallback-17-thread-1) [    ] o.a.s.c.c.ConnectionManager Watcher org.apache.solr.common.cloud.ConnectionManager@282b9e7e name:ZooKeeperConnection Watcher:127.0.0.1:47018/solr got event WatchedEvent state:SyncConnected type:None path:null path:null type:None
   [junit4]   2> 307567 INFO  (TEST-SyncSliceTest.test-seed#[F2811E7501E88115]) [    ] o.a.s.c.c.ConnectionManager Client is connected to ZooKeeper
   [junit4]   2> 307567 INFO  (TEST-SyncSliceTest.test-seed#[F2811E7501E88115]) [    ] o.a.s.c.c.SolrZkClient Using default ZkACLProvider
   [junit4]   2> 307569 INFO  (TEST-SyncSliceTest.test-seed#[F2811E7501E88115]) [    ] o.a.s.s.SolrDispatchFilter Loading solr.xml from SolrHome (not found in ZooKeeper)
   [junit4]   2> 307569 INFO  (TEST-SyncSliceTest.test-seed#[F2811E7501E88115]) [    ] o.a.s.c.SolrXmlConfig Loading container configuration from /x1/jenkins/jenkins-slave/workspace/Lucene-Solr-NightlyTests-6.x/solr/build/solr-core/test/J0/temp/solr.cloud.SyncSliceTest_F2811E7501E88115-001/shard-1-001/solr.xml
   [junit4]   2> 307577 INFO  (TEST-SyncSliceTest.test-seed#[F2811E7501E88115]) [    ] o.a.s.c.CorePropertiesLocator Config-defined core root directory: /x1/jenkins/jenkins-slave/workspace/Lucene-Solr-NightlyTests-6.x/solr/build/solr-core/test/J0/../../../../../../../../../../x1/jenkins/jenkins-slave/workspace/Lucene-Solr-NightlyTests-6.x/solr/build/solr-core/test/J0/temp/solr.cloud.SyncSliceTest_F2811E7501E88115-001/shard-1-001/cores
   [junit4]   2> 307577 INFO  (TEST-SyncSliceTest.test-seed#[F2811E7501E88115]) [    ] o.a.s.c.CoreContainer New CoreContainer 13986300
   [junit4]   2> 307577 INFO  (TEST-SyncSliceTest.test-seed#[F2811E7501E88115]) [    ] o.a.s.c.CoreContainer Loading cores into CoreContainer [instanceDir=/x1/jenkins/jenkins-slave/workspace/Lucene-Solr-NightlyTests-6.x/solr/build/solr-core/test/J0/temp/solr.cloud.SyncSliceTest_F2811E7501E88115-001/shard-1-001]
   [junit4]   2> 307577 WARN  (TEST-SyncSliceTest.test-seed#[F2811E7501E88115]) [    ] o.a.s.c.CoreContainer Couldn't add files from /x1/jenkins/jenkins-slave/workspace/Lucene-Solr-NightlyTests-6.x/solr/build/solr-core/test/J0/temp/solr.cloud.SyncSliceTest_F2811E7501E88115-001/shard-1-001/lib to classpath: /x1/jenkins/jenkins-slave/workspace/Lucene-Solr-NightlyTests-6.x/solr/build/solr-core/test/J0/temp/solr.cloud.SyncSliceTest_F2811E7501E88115-001/shard-1-001/lib
   [junit4]   2> 307577 INFO  (TEST-SyncSliceTest.test-seed#[F2811E7501E88115]) [    ] o.a.s.h.c.HttpShardHandlerFactory created with socketTimeout : 90000,urlScheme : ,connTimeout : 15000,maxConnectionsPerHost : 20,maxConnections : 10000,corePoolSize : 0,maximumPoolSize : 2147483647,maxThreadIdleTime : 5,sizeOfQueue : -1,fairnessPolicy : false,useRetries : false,
   [junit4]   2> 307578 INFO  (TEST-SyncSliceTest.test-seed#[F2811E7501E88115]) [    ] o.a.s.u.UpdateShardHandler Creating UpdateShardHandler HTTP client with params: socketTimeout=340000&connTimeout=45000&retry=true
   [junit4]   2> 307591 INFO  (TEST-SyncSliceTest.test-seed#[F2811E7501E88115]) [    ] o.a.s.l.LogWatcher SLF4J impl is org.slf4j.impl.Log4jLoggerFactory
   [junit4]   2> 307591 INFO  (TEST-SyncSliceTest.test-seed#[F2811E7501E88115]) [    ] o.a.s.l.LogWatcher Registering Log Listener [Log4j (org.slf4j.impl.Log4jLoggerFactory)]
   [junit4]   2> 307591 INFO  (TEST-SyncSliceTest.test-seed#[F2811E7501E88115]) [    ] o.a.s.c.ZkContainer Zookeeper client=127.0.0.1:47018/solr
   [junit4]   2> 307591 INFO  (TEST-SyncSliceTest.test-seed#[F2811E7501E88115]) [    ] o.a.s.c.ZkController zkHost includes chroot
   [junit4]   2> 307591 INFO  (TEST-SyncSliceTest.test-seed#[F2811E7501E88115]) [    ] o.a.s.c.c.SolrZkClient Using default ZkCredentialsProvider
   [junit4]   2> 307601 INFO  (TEST-SyncSliceTest.test-seed#[F2811E7501E88115]) [    ] o.a.s.c.c.ConnectionManager Waiting for client to connect to ZooKeeper
   [junit4]   2> 307642 INFO  (zkCallback-20-thread-1) [    ] o.a.s.c.c.ConnectionManager Watcher org.apache.solr.common.cloud.ConnectionManager@4eafe705 name:ZooKeeperConnection Watcher:127.0.0.1:47018 got event WatchedEvent state:SyncConnected type:None path:null path:null type:None
   [junit4]   2> 307642 INFO  (TEST-SyncSliceTest.test-seed#[F2811E7501E88115]) [    ] o.a.s.c.c.ConnectionManager Client is connected to ZooKeeper
   [junit4]   2> 307643 INFO  (TEST-SyncSliceTest.test-seed#[F2811E7501E88115]) [    ] o.a.s.c.c.SolrZkClient Using default ZkACLProvider
   [junit4]   2> 307657 INFO  (TEST-SyncSliceTest.test-seed#[F2811E7501E88115]) [n:127.0.0.1:57631_mof%2Fqq    ] o.a.s.c.ZkController Added new OnReconnect listener org.apache.solr.cloud.ZkController$$Lambda$33/115359872@46b730f0
   [junit4]   2> 307662 INFO  (TEST-SyncSliceTest.test-seed#[F2811E7501E88115]) [n:127.0.0.1:57631_mof%2Fqq    ] o.a.s.c.c.ConnectionManager Waiting for client to connect to ZooKeeper
   [junit4]   2> 307684 INFO  (zkCallback-21-thread-1-processing-n:127.0.0.1:57631_mof%2Fqq) [n:127.0.0.1:57631_mof%2Fqq    ] o.a.s.c.c.ConnectionManager Watcher org.apache.solr.common.cloud.ConnectionManager@154db9c5 name:ZooKeeperConnection Watcher:127.0.0.1:47018/solr got event WatchedEvent state:SyncConnected type:None path:null path:null type:None
   [junit4]   2> 307684 INFO  (TEST-SyncSliceTest.test-seed#[F2811E7501E88115]) [n:127.0.0.1:57631_mof%2Fqq    ] o.a.s.c.c.ConnectionManager Client is connected to ZooKeeper
   [junit4]   2> 307692 INFO  (TEST-SyncSliceTest.test-seed#[F2811E7501E88115]) [n:127.0.0.1:57631_mof%2Fqq    ] o.a.s.c.c.ZkStateReader Updating cluster state from ZooKeeper... 
   [junit4]   2> 307692 INFO  (TEST-SyncSliceTest.test-seed#[F2811E7501E88115]) [n:127.0.0.1:57631_mof%2Fqq    ] o.a.s.c.c.ZkStateReader Loaded cluster properties: {urlScheme=https}
   [junit4]   2> 307693 INFO  (TEST-SyncSliceTest.test-seed#[F2811E7501E88115]) [n:127.0.0.1:57631_mof%2Fqq    ] o.a.s.c.c.ZkStateReader Updated live nodes from ZooKeeper... (0) -> (1)
   [junit4]   2> 307696 INFO  (TEST-SyncSliceTest.test-seed#[F2811E7501E88115]) [n:127.0.0.1:57631_mof%2Fqq    ] o.a.s.c.Overseer Overseer (id=null) closing
   [junit4]   2> 307697 INFO  (TEST-SyncSliceTest.test-seed#[F2811E7501E88115]) [n:127.0.0.1:57631_mof%2Fqq    ] o.a.s.c.LeaderElector Joined leadership election with path: /overseer_elect/election/96021034274717706-127.0.0.1:57631_mof%2Fqq-n_0000000001
   [junit4]   2> 307698 INFO  (TEST-SyncSliceTest.test-seed#[F2811E7501E88115]) [n:127.0.0.1:57631_mof%2Fqq    ] o.a.s.c.LeaderElector Watching path /overseer_elect/election/96021034274717701-127.0.0.1:33986_mof%2Fqq-n_0000000000 to know if I could be the leader
   [junit4]   2> 307698 INFO  (TEST-SyncSliceTest.test-seed#[F2811E7501E88115]) [n:127.0.0.1:57631_mof%2Fqq    ] o.a.s.c.ZkController Publish node=127.0.0.1:57631_mof%2Fqq as DOWN
   [junit4]   2> 307700 INFO  (OverseerStateUpdate-96021034274717701-127.0.0.1:33986_mof%2Fqq-n_0000000000) [n:127.0.0.1:33986_mof%2Fqq    ] o.a.s.c.Overseer processMessage: queueSize: 1, message = {
   [junit4]   2>   "operation":"downnode",
   [junit4]   2>   "node_name":"127.0.0.1:57631_mof%2Fqq"} current state version: 1
   [junit4]   2> 307701 INFO  (OverseerStateUpdate-96021034274717701-127.0.0.1:33986_mof%2Fqq-n_0000000000) [n:127.0.0.1:33986_mof%2Fqq    ] o.a.s.c.o.NodeMutator DownNode state invoked for node: 127.0.0.1:57631_mof%2Fqq
   [junit4]   2> 307702 INFO  (zkCallback-15-thread-1) [    ] o.a.s.c.c.ZkStateReader A cluster state change: [WatchedEvent state:SyncConnected type:NodeDataChanged path:/clusterstate.json], has occurred - updating... (live nodes size: [1])
   [junit4]   2> 307702 INFO  (zkCallback-11-thread-4-processing-n:127.0.0.1:33986_mof%2Fqq) [n:127.0.0.1:33986_mof%2Fqq    ] o.a.s.c.c.ZkStateReader A cluster state change: [WatchedEvent state:SyncConnected type:NodeDataChanged path:/clusterstate.json], has occurred - updating... (live nodes size: [1])
   [junit4]   2> 307703 INFO  (zkCallback-21-thread-1-processing-n:127.0.0.1:57631_mof%2Fqq) [n:127.0.0.1:57631_mof%2Fqq    ] o.a.s.c.c.ZkStateReader A cluster state change: [WatchedEvent state:SyncConnected type:NodeDataChanged path:/clusterstate.json], has occurred - updating... (live nodes size: [1])
   [junit4]   2> 307704 INFO  (TEST-SyncSliceTest.test-seed#[F2811E7501E88115]) [n:127.0.0.1:57631_mof%2Fqq    ] o.a.s.c.ZkController Register node as live in ZooKeeper:/live_nodes/127.0.0.1:57631_mof%2Fqq
   [junit4]   2> 307727 INFO  (TEST-SyncSliceTest.test-seed#[F2811E7501E88115]) [n:127.0.0.1:57631_mof%2Fqq    ] o.a.s.c.c.SolrZkClient makePath: /live_nodes/127.0.0.1:57631_mof%2Fqq
   [junit4]   2> 307730 INFO  (zkCallback-11-thread-4-processing-n:127.0.0.1:33986_mof%2Fqq) [n:127.0.0.1:33986_mof%2Fqq    ] o.a.s.c.c.ZkStateReader A live node change: [WatchedEvent state:SyncConnected type:NodeChildrenChanged path:/live_nodes], has occurred - updating... (live nodes size: [1])
   [junit4]   2> 307730 INFO  (zkCallback-21-thread-1-processing-n:127.0.0.1:57631_mof%2Fqq) [n:127.0.0.1:57631_mof%2Fqq    ] o.a.s.c.c.ZkStateReader A live node change: [WatchedEvent state:SyncConnected type:NodeChildrenChanged path:/live_nodes], has occurred - updating... (live nodes size: [1])
   [junit4]   2> 307730 INFO  (zkCallback-15-thread-1) [    ] o.a.s.c.c.ZkStateReader A live node change: [WatchedEvent state:SyncConnected type:NodeChildrenChanged path:/live_nodes], has occurred - updating... (live nodes size: [1])
   [junit4]   2> 307731 INFO  (zkCallback-11-thread-4-processing-n:127.0.0.1:33986_mof%2Fqq) [n:127.0.0.1:33986_mof%2Fqq    ] o.a.s.c.c.ZkStateReader Updated live nodes from ZooKeeper... (1) -> (2)
   [junit4]   2> 307733 INFO  (zkCallback-15-thread-1) [    ] o.a.s.c.c.ZkStateReader Updated live nodes from ZooKeeper... (1) -> (2)
   [junit4]   2> 307734 INFO  (zkCallback-21-thread-1-processing-n:127.0.0.1:57631_mof%2Fqq) [n:127.0.0.1:57631_mof%2Fqq    ] o.a.s.c.c.ZkStateReader Updated live nodes from ZooKeeper... (1) -> (2)
   [junit4]   2> 307745 INFO  (TEST-SyncSliceTest.test-seed#[F2811E7501E88115]) [n:127.0.0.1:57631_mof%2Fqq    ] o.a.s.c.CoreContainer Security conf doesn't exist. Skipping setup for authorization module.
   [junit4]   2> 307745 INFO  (TEST-SyncSliceTest.test-seed#[F2811E7501E88115]) [n:127.0.0.1:57631_mof%2Fqq    ] o.a.s.c.CoreContainer No authentication plugin used.
   [junit4]   2> 307745 INFO  (TEST-SyncSliceTest.test-seed#[F2811E7501E88115]) [n:127.0.0.1:57631_mof%2Fqq    ] o.a.s.c.CorePropertiesLocator Looking for core definitions underneath /x1/jenkins/jenkins-slave/workspace/Lucene-Solr-NightlyTests-6.x/solr/build/solr-core/test/J0/../../../../../../../../../../x1/jenkins/jenkins-slave/workspace/Lucene-Solr-NightlyTests-6.x/solr/build/solr-core/test/J0/temp/solr.cloud.SyncSliceTest_F2811E7501E88115-001/shard-1-001/cores
   [junit4]   2> 307746 INFO  (TEST-SyncSliceTest.test-seed#[F2811E7501E88115]) [n:127.0.0.1:57631_mof%2Fqq    ] o.a.s.c.CoreDescriptor Created CoreDescriptor: {name=collection1, config=solrconfig.xml, transient=false, schema=schema.xml, loadOnStartup=true, configSetProperties=configsetprops.json, collection=collection1, coreNodeName=, dataDir=data/, shard=}
   [junit4]   2> 307746 INFO  (TEST-SyncSliceTest.test-seed#[F2811E7501E88115]) [n:127.0.0.1:57631_mof%2Fqq    ] o.a.s.c.CorePropertiesLocator Found core collection1 in /x1/jenkins/jenkins-slave/workspace/Lucene-Solr-NightlyTests-6.x/solr/build/solr-core/test/J0/../../../../../../../../../../x1/jenkins/jenkins-slave/workspace/Lucene-Solr-NightlyTests-6.x/solr/build/solr-core/test/J0/temp/solr.cloud.SyncSliceTest_F2811E7501E88115-001/shard-1-001/cores/collection1
   [junit4]   2> 307746 INFO  (TEST-SyncSliceTest.test-seed#[F2811E7501E88115]) [n:127.0.0.1:57631_mof%2Fqq    ] o.a.s.c.CorePropertiesLocator Found 1 core definitions
   [junit4]   2> 307814 INFO  (TEST-SyncSliceTest.test-seed#[F2811E7501E88115]) [n:127.0.0.1:57631_mof%2Fqq    ] o.a.s.s.SolrDispatchFilter user.dir=/x1/jenkins/jenkins-slave/workspace/Lucene-Solr-NightlyTests-6.x/solr/build/solr-core/test/J0
   [junit4]   2> 307814 INFO  (TEST-SyncSliceTest.test-seed#[F2811E7501E88115]) [n:127.0.0.1:57631_mof%2Fqq    ] o.a.s.s.SolrDispatchFilter SolrDispatchFilter.init() done
   [junit4]   2> 307818 INFO  (coreLoadExecutor-26-thread-1-processing-n:127.0.0.1:57631_mof%2Fqq) [n:127.0.0.1:57631_mof%2Fqq c:collection1   x:collection1] o.a.s.c.ZkController publishing state=down
   [junit4]   2> 307818 INFO  (coreLoadExecutor-26-thread-1-processing-n:127.0.0.1:57631_mof%2Fqq) [n:127.0.0.1:57631_mof%2Fqq c:collection1   x:collection1] o.a.s.c.ZkController numShards not found on descriptor - reading it from system property
   [junit4]   2> 307819 INFO  (coreLoadExecutor-26-thread-1-processing-n:127.0.0.1:57631_mof%2Fqq) [n:127.0.0.1:57631_mof%2Fqq c:collection1   x:collection1] o.a.s.c.ZkController Registering watch for collection collection1
   [junit4]   2> 307819 INFO  (OverseerStateUpdate-96021034274717701-127.0.0.1:33986_mof%2Fqq-n_0000000000) [n:127.0.0.1:33986_mof%2Fqq    ] o.a.s.c.Overseer processMessage: queueSize: 1, message = {
   [junit4]   2>   "core":"collection1",
   [junit4]   2>   "roles":null,
   [junit4]   2>   "base_url":"https://127.0.0.1:57631/mof/qq",
   [junit4]   2>   "node_name":"127.0.0.1:57631_mof%2Fqq",
   [junit4]   2>   "numShards":"1",
   [junit4]   2>   "state":"down",
   [junit4]   2>   "shard":null,
   [junit4]   2>   "collection":"collection1",
   [junit4]   2>   "operation":"state"} current state version: 2
   [junit4]   2> 307820 INFO  (OverseerStateUpdate-96021034274717701-127.0.0.1:33986_mof%2Fqq-n_0000000000) [n:127.0.0.1:33986_mof%2Fqq    ] o.a.s.c.o.ReplicaMutator Update state numShards=1 message={
   [junit4]   2>   "core":"collection1",
   [junit4]   2>   "roles":null,
   [junit4]   2>   "base_url":"https://127.0.0.1:57631/mof/qq",
   [junit4]   2>   "node_name":"127.0.0.1:57631_mof%2Fqq",
   [junit4]   2>   "numShards":"1",
   [junit4]   2>   "state":"down",
   [junit4]   2>   "shard":null,
   [junit4]   2>   "collection":"collection1",
   [junit4]   2>   "operation":"state"}
   [junit4]   2> 307820 INFO  (OverseerStateUpdate-96021034274717701-127.0.0.1:33986_mof%2Fqq-n_0000000000) [n:127.0.0.1:33986_mof%2Fqq    ] o.a.s.c.o.ReplicaMutator Collection already exists with numShards=1
   [junit4]   2> 307820 INFO  (OverseerStateUpdate-96021034274717701-127.0.0.1:33986_mof%2Fqq-n_0000000000) [n:127.0.0.1:33986_mof%2Fqq    ] o.a.s.c.o.ReplicaMutator Assigning new node to shard shard=shard1
   [junit4]   2> 307820 INFO  (coreLoadExecutor-26-thread-1-processing-n:127.0.0.1:57631_mof%2Fqq) [n:127.0.0.1:57631_mof%2Fqq c:collection1   x:collection1] o.a.s.c.c.ZkStateReader Add data for [collection1] ver [0]
   [junit4]   2> 307832 INFO  (coreLoadExecutor-26-thread-1-processing-n:127.0.0.1:57631_mof%2Fqq) [n:127.0.0.1:57631_mof%2Fqq c:collection1   x:collection1] o.a.s.c.ZkController Waiting for coreNodeName for core collection1 in collection collection1 to be assigned
   [junit4]   2> 307935 INFO  (OverseerStateUpdate-96021034274717701-127.0.0.1:33986_mof%2Fqq-n_0000000000) [n:127.0.0.1:33986_mof%2Fqq    ] o.a.s.c.o.ZkStateWriter going to update_collection /collections/collection1/state.json version: 0
   [junit4]   2> 307936 INFO  (zkCallback-21-thread-1-processing-n:127.0.0.1:57631_mof%2Fqq) [n:127.0.0.1:57631_mof%2Fqq    ] o.a.s.c.c.ZkStateReader A cluster state change: [WatchedEvent state:SyncConnected type:NodeDataChanged path:/collections/collection1/state.json] for collection [collection1] has occurred - updating... (live nodes size: [2])
   [junit4]   2> 307936 INFO  (zkCallback-21-thread-1-processing-n:127.0.0.1:57631_mof%2Fqq) [n:127.0.0.1:57631_mof%2Fqq    ] o.a.s.c.c.ZkStateReader Updating data for [collection1] from [0] to [1]
   [junit4]   2> 307937 INFO  (coreLoadExecutor-26-thread-1-processing-n:127.0.0.1:57631_mof%2Fqq) [n:127.0.0.1:57631_mof%2Fqq c:collection1   x:collection1] o.a.s.c.ZkController waiting to find shard id in clusterstate for collection1
   [junit4]   2> 307938 INFO  (coreLoadExecutor-26-thread-1-processing-n:127.0.0.1:57631_mof%2Fqq) [n:127.0.0.1:57631_mof%2Fqq c:collection1   x:collection1] o.a.s.c.ZkController Check for collection zkNode:collection1
   [junit4]   2> 307950 INFO  (coreLoadExecutor-26-thread-1-processing-n:127.0.0.1:57631_mof%2Fqq) [n:127.0.0.1:57631_mof%2Fqq c:collection1   x:collection1] o.a.s.c.ZkController Collection zkNode exists
   [junit4]   2> 307950 INFO  (coreLoadExecutor-26-thread-1-processing-n:127.0.0.1:57631_mof%2Fqq) [n:127.0.0.1:57631_mof%2Fqq c:collection1   x:collection1] o.a.s.c.c.ZkStateReader Load collection config from: [/collections/collection1]
   [junit4]   2> 307951 INFO  (coreLoadExecutor-26-thread-1-processing-n:127.0.0.1:57631_mof%2Fqq) [n:127.0.0.1:57631_mof%2Fqq c:collection1   x:collection1] o.a.s.c.c.ZkStateReader path=[/collections/collection1] [configName]=[conf1] specified config exists in ZooKeeper
   [junit4]   2> 307952 INFO  (coreLoadExecutor-26-thread-1-processing-n:127.0.0.1:57631_mof%2Fqq) [n:127.0.0.1:57631_mof%2Fqq c:collection1   x:collection1] o.a.s.c.SolrResourceLoader new SolrResourceLoader for directory: '/x1/jenkins/jenkins-slave/workspace/Lucene-Solr-NightlyTests-6.x/solr/build/solr-core/test/J0/temp/solr.cloud.SyncSliceTest_F2811E7501E88115-001/shard-1-001/cores/collection1'
   [junit4]   2> 307952 INFO  (coreLoadExecutor-26-thread-1-processing-n:127.0.0.1:57631_mof%2Fqq) [n:127.0.0.1:57631_mof%2Fqq c:collection1   x:collection1] o.a.s.c.SolrResourceLoader JNDI not configured for solr (NoInitialContextEx)
   [junit4]   2> 307952 INFO  (coreLoadExecutor-26-thread-1-processing-n:127.0.0.1:57631_mof%2Fqq) [n:127.0.0.1:57631_mof%2Fqq c:collection1   x:collection1] o.a.s.c.SolrResourceLoader solr home defaulted to 'solr/' (could not find system property or JNDI)
   [junit4]   2> 307954 INFO  (coreLoadExecutor-26-thread-1-processing-n:127.0.0.1:57631_mof%2Fqq) [n:127.0.0.1:57631_mof%2Fqq c:collection1   x:collection1] o.a.s.c.Config loaded config solrconfig.xml with version 0 
   [junit4]   2> 307962 INFO  (coreLoadExecutor-26-thread-1-processing-n:127.0.0.1:57631_mof%2Fqq) [n:127.0.0.1:57631_mof%2Fqq c:collection1   x:collection1] o.a.s.c.SolrConfig current version of requestparams : -1
   [junit4]   2> 307967 INFO  (coreLoadExecutor-26-thread-1-processing-n:127.0.0.1:57631_mof%2Fqq) [n:127.0.0.1:57631_mof%2Fqq c:collection1   x:collection1] o.a.s.c.SolrConfig Using Lucene MatchVersion: 6.1.0
   [junit4]   2> 308002 INFO  (coreLoadExecutor-26-thread-1-processing-n:127.0.0.1:57631_mof%2Fqq) [n:127.0.0.1:57631_mof%2Fqq c:collection1   x:collection1] o.a.s.c.SolrConfig Loaded SolrConfig: solrconfig.xml
   [junit4]   2> 308037 INFO  (coreLoadExecutor-26-thread-1-processing-n:127.0.0.1:57631_mof%2Fqq) [n:127.0.0.1:57631_mof%2Fqq c:collection1   x:collection1] o.a.s.s.IndexSchema [collection1] Schema name=test
   [junit4]   2> 308931 INFO  (coreLoadExecutor-26-thread-1-processing-n:127.0.0.1:57631_mof%2Fqq) [n:127.0.0.1:57631_mof%2Fqq c:collection1   x:collection1] o.a.s.s.OpenExchangeRatesOrgProvider Initialized with rates=open-exchange-rates.json, refreshInterval=1440.
   [junit4]   2> 308971 INFO  (coreLoadExecutor-26-thread-1-processing-n:127.0.0.1:57631_mof%2Fqq) [n:127.0.0.1:57631_mof%2Fqq c:collection1   x:collection1] o.a.s.s.IndexSchema default search field in schema is text
   [junit4]   2> 308988 INFO  (coreLoadExecutor-26-thread-1-processing-n:127.0.0.1:57631_mof%2Fqq) [n:127.0.0.1:57631_mof%2Fqq c:collection1   x:collection1] o.a.s.s.IndexSchema unique key field: id
   [junit4]   2> 309026 INFO  (coreLoadExecutor-26-thread-1-processing-n:127.0.0.1:57631_mof%2Fqq) [n:127.0.0.1:57631_mof%2Fqq c:collection1   x:collection1] o.a.s.s.FileExchangeRateProvider Reloading exchange rates from file currency.xml
   [junit4]   2> 309029 INFO  (coreLoadExecutor-26-thread-1-processing-n:127.0.0.1:57631_mof%2Fqq) [n:127.0.0.1:57631_mof%2Fqq c:collection1   x:collection1] o.a.s.s.FileExchangeRateProvider Reloading exchange rates from file currency.xml
   [junit4]   2> 309053 INFO  (coreLoadExecutor-26-thread-1-processing-n:127.0.0.1:57631_mof%2Fqq) [n:127.0.0.1:57631_mof%2Fqq c:collection1   x:collection1] o.a.s.s.OpenExchangeRatesOrgProvider Reloading exchange rates from open-exchange-rates.json
   [junit4]   2> 309055 INFO  (coreLoadExecutor-26-thread-1-processing-n:127.0.0.1:57631_mof%2Fqq) [n:127.0.0.1:57631_mof%2Fqq c:collection1   x:collection1] o.a.s.s.OpenExchangeRatesOrgProvider Reloading exchange rates from open-exchange-rates.json
   [junit4]   2> 309057 INFO  (coreLoadExecutor-26-thread-1-processing-n:127.0.0.1:57631_mof%2Fqq) [n:127.0.0.1:57631_mof%2Fqq c:collection1   x:collection1] o.a.s.c.ConfigSetProperties Did not find ConfigSet properties, assuming default properties: Can't find resource 'configsetprops.json' in classpath or '/configs/conf1', cwd=/x1/jenkins/jenkins-slave/workspace/Lucene-Solr-NightlyTests-6.x/solr/build/solr-core/test/J0
   [junit4]   2> 309059 INFO  (coreLoadExecutor-26-thread-1-processing-n:127.0.0.1:57631_mof%2Fqq) [n:127.0.0.1:57631_mof%2Fqq c:collection1   x:collection1] o.a.s.c.CoreContainer Creating SolrCore 'collection1' using configuration from collection collection1
   [junit4]   2> 309059 INFO  (coreLoadExecutor-26-thread-1-processing-n:127.0.0.1:57631_mof%2Fqq) [n:127.0.0.1:57631_mof%2Fqq c:collection1 s:shard1 r:core_node1 x:collection1] o.a.s.c.SolrCore org.apache.solr.core.MockDirectoryFactory
   [junit4]   2> 309059 INFO  (coreLoadExecutor-26-thread-1-processing-n:127.0.0.1:57631_mof%2Fqq) [n:127.0.0.1:57631_mof%2Fqq c:collection1 s:shard1 r:core_node1 x:collection1] o.a.s.c.SolrCore [[collection1] ] Opening new SolrCore at [/x1/jenkins/jenkins-slave/workspace/Lucene-Solr-NightlyTests-6.x/solr/build/solr-core/test/J0/temp/solr.cloud.SyncSliceTest_F2811E7501E88115-001/shard-1-001/cores/collection1], dataDir=[/x1/jenkins/jenkins-slave/workspace/Lucene-Solr-NightlyTests-6.x/solr/build/solr-core/test/J0/../../../../../../../../../../x1/jenkins/jenkins-slave/workspace/Lucene-Solr-NightlyTests-6.x/solr/build/solr-core/test/J0/temp/solr.cloud.SyncSliceTest_F2811E7501E88115-001/shard-1-001/cores/collection1/data/]
   [junit4]   2> 309063 INFO  (coreLoadExecutor-26-thread-1-processing-n:127.0.0.1:57631_mof%2Fqq) [n:127.0.0.1:57631_mof%2Fqq c:collection1 s:shard1 r:core_node1 x:collection1] o.a.s.c.JmxMonitoredMap JMX monitoring is enabled. Adding Solr mbeans to JMX Server: com.sun.jmx.mbeanserver.JmxMBeanServer@77f04fd4
   [junit4]   2> 309080 INFO  (coreLoadExecutor-26-thread-1-processing-n:127.0.0.1:57631_mof%2Fqq) [n:127.0.0.1:57631_mof%2Fqq c:collection1 s:shard1 r:core_node1 x:collection1] o.a.s.c.CachingDirectoryFactory return new directory for /x1/jenkins/jenkins-slave/workspace/Lucene-Solr-NightlyTests-6.x/solr/build/solr-core/test/J0/../../../../../../../../../../x1/jenkins/jenkins-slave/workspace/Lucene-Solr-NightlyTests-6.x/solr/build/solr-core/test/J0/temp/solr.cloud.SyncSliceTest_F2811E7501E88115-001/shard-1-001/cores/collection1/data
   [junit4]   2> 309083 INFO  (coreLoadExecutor-26-thread-1-processing-n:127.0.0.1:57631_mof%2Fqq) [n:127.0.0.1:57631_mof%2Fqq c:collection1 s:shard1 r:core_node1 x:collection1] o.a.s.c.SolrCore New index directory detected: old=null new=/x1/jenkins/jenkins-slave/workspace/Lucene-Solr-NightlyTests-6.x/solr/build/solr-core/test/J0/../../../../../../../../../../x1/jenkins/jenkins-slave/workspace/Lucene-Solr-NightlyTests-6.x/solr/build/solr-core/test/J0/temp/solr.cloud.SyncSliceTest_F2811E7501E88115-001/shard-1-001/cores/collection1/data/index/
   [junit4]   2> 309083 WARN  (coreLoadExecutor-26-thread-1-processing-n:127.0.0.1:57631_mof%2Fqq) [n:127.0.0.1:57631_mof%2Fqq c:collection1 s:shard1 r:core_node1 x:collection1] o.a.s.c.SolrCore [collection1] Solr index directory '/x1/jenkins/jenkins-slave/workspace/Lucene-Solr-NightlyTests-6.x/solr/build/solr-core/test/J0/../../../../../../../../../../x1/jenkins/jenkins-slave/workspace/Lucene-Solr-NightlyTests-6.x/solr/build/solr-core/test/J0/temp/solr.cloud.SyncSliceTest_F2811E7501E88115-001/shard-1-001/cores/collection1/data/index' doesn't exist. Creating new index...
   [junit4]   2> 309087 INFO  (coreLoadExecutor-26-thread-1-processing-n:127.0.0.1:57631_mof%2Fqq) [n:127.0.0.1:57631_mof%2Fqq c:collection1 s:shard1 r:core_node1 x:collection1] o.a.s.c.CachingDirectoryFactory return new directory for /x1/jenkins/jenkins-slave/workspace/Lucene-Solr-NightlyTests-6.x/solr/build/solr-core/test/J0/../../../../../../../../../../x1/jenkins/jenkins-slave/workspace/Lucene-Solr-NightlyTests-6.x/solr/build/solr-core/test/J0/temp/solr.cloud.SyncSliceTest_F2811E7501E88115-001/shard-1-001/cores/collection1/data/index
   [junit4]   2> 309087 INFO  (coreLoadExecutor-26-thread-1-processing-n:127.0.0.1:57631_mof%2Fqq) [n:127.0.0.1:57631_mof%2Fqq c:collection1 s:shard1 r:core_node1 x:collection1] o.a.s.u.RandomMergePolicy RandomMergePolicy wrapping class org.apache.lucene.index.TieredMergePolicy: [TieredMergePolicy: maxMergeAtOnce=45, maxMergeAtOnceExplicit=47, maxMergedSegmentMB=24.2763671875, floorSegmentMB=1.1943359375, forceMergeDeletesPctAllowed=11.838891612761904, segmentsPerTier=14.0, maxCFSSegmentSizeMB=8.796093022207999E12, noCFSRatio=0.0
   [junit4]   2> 309088 INFO  (coreLoadExecutor-26-thread-1-processing-n:127.0.0.1:57631_mof%2Fqq) [n:127.0.0.1:57631_mof%2Fqq c:collection1 s:shard1 r:core_node1 x:collection1] o.a.s.c.SolrDeletionPolicy SolrDeletionPolicy.onCommit: commits: num=1
   [junit4]   2> 	commit{dir=MockDirectoryWrapper(RAMDirectory@45e75004 lockFactory=org.apache.lucene.store.SingleInstanceLockFactory@3079af26),segFN=segments_1,generation=1}
   [junit4]   2> 309088 INFO  (coreLoadExecutor-26-thread-1-processing-n:127.0.0.1:57631_mof%2Fqq) [n:127.0.0.1:57631_mof%2Fqq c:collection1 s:shard1 r:core_node1 x:collection1] o.a.s.c.SolrDeletionPolicy newest commit generation = 1
   [junit4]   2> 309103 INFO  (OldIndexDirectoryCleanupThreadForCore-collection1) [n:127.0.0.1:57631_mof%2Fqq c:collection1 s:shard1 r:core_node1 x:collection1] o.a.s.c.SolrCore Looking for old index directories to cleanup for core collection1 in /x1/jenkins/jenkins-slave/workspace/Lucene-Solr-NightlyTests-6.x/solr/build/solr-core/test/J0/../../../../../../../../../../x1/jenkins/jenkins-slave/workspace/Lucene-Solr-NightlyTests-6.x/solr/build/solr-core/test/J0/temp/solr.cloud.SyncSliceTest_F2811E7501E88115-001/shard-1-001/cores/collection1/data/
   [junit4]   2> 309103 WARN  (OldIndexDirectoryCleanupThreadForCore-collection1) [n:127.0.0.1:57631_mof%2Fqq c:collection1 s:shard1 r:core_node1 x:collection1] o.a.s.c.DirectoryFactory /x1/jenkins/jenkins-slave/workspace/Lucene-Solr-NightlyTests-6.x/solr/build/solr-core/test/J0/../../../../../../../../../../x1/jenkins/jenkins-slave/workspace/Lucene-Solr-NightlyTests-6.x/solr/build/solr-core/test/J0/temp/solr.cloud.SyncSliceTest_F2811E7501E88115-001/shard-1-001/cores/collection1/data/ does not point to a valid data directory; skipping clean-up of old index directories.
   [junit4]   2> 309113 INFO  (coreLoadExecutor-26-thread-1-processing-n:127.0.0.1:57631_mof%2Fqq) [n:127.0.0.1:57631_mof%2Fqq c:collection1 s:shard1 r:core_node1 x:collection1] o.a.s.u.p.UpdateRequestProcessorChain creating updateRequestProcessorChain "nodistrib"
   [junit4]   2> 309128 INFO  (coreLoadExecutor-26-thread-1-processing-n:127.0.0.1:57631_mof%2Fqq) [n:127.0.0.1:57631_mof%2Fqq c:collection1 s:shard1 r:core_node1 x:collection1] o.a.s.u.p.UpdateRequestProcessorChain creating updateRequestProcessorChain "dedupe"
   [junit4]   2> 309128 INFO  (coreLoadExecutor-26-thread-1-processing-n:127.0.0.1:57631_mof%2Fqq) [n:127.0.0.1:57631_mof%2Fqq c:collection1 s:shard1 r:core_node1 x:collection1] o.a.s.u.p.UpdateRequestProcessorChain inserting DistributedUpdateProcessorFactory into updateRequestProcessorChain "dedupe"
   [junit4]   2> 309128 INFO  (coreLoadExecutor-26-thread-1-processing-n:127.0.0.1:57631_mof%2Fqq) [n:127.0.0.1:57631_mof%2Fqq c:collection1 s:shard1 r:core_node1 x:collection1] o.a.s.u.p.UpdateRequestProcessorChain creating updateRequestProcessorChain "stored_sig"
   [junit4]   2> 309128 INFO  (coreLoadExecutor-26-thread-1-processing-n:127.0.0.1:57631_mof%2Fqq) [n:127.0.0.1:57631_mof%2Fqq c:collection1 s:shard1 r:core_node1 x:collection1] o.a.s.u.p.UpdateRequestProcessorChain inserting DistributedUpdateProcessorFactory into updateRequestProcessorChain "stored_sig"
   [junit4]   2> 309128 INFO  (coreLoadExecutor-26-thread-1-processing-n:127.0.0.1:57631_mof%2Fqq) [n:127.0.0.1:57631_mof%2Fqq c:collection1 s:shard1 r:core_node1 x:collection1] o.a.s.u.p.UpdateRequestProcessorChain creating updateRequestProcessorChain "distrib-dup-test-chain-explicit"
   [junit4]   2> 309128 INFO  (coreLoadExecutor-26-thread-1-processing-n:127.0.0.1:57631_mof%2Fqq) [n:127.0.0.1:57631_mof%2Fqq c:collection1 s:shard1 r:core_node1 x:collection1] o.a.s.u.p.UpdateRequestProcessorChain creating updateRequestProcessorChain "distrib-dup-test-chain-implicit"
   [junit4]   2> 309128 INFO  (coreLoadExecutor-26-thread-1-processing-n:127.0.0.1:57631_mof%2Fqq) [n:127.0.0.1:57631_mof%2Fqq c:collection1 s:shard1 r:core_node1 x:collection1] o.a.s.u.p.UpdateRequestProcessorChain inserting DistributedUpdateProcessorFactory into updateRequestProcessorChain "distrib-dup-test-chain-implicit"
   [junit4]   2> 309128 INFO  (coreLoadExecutor-26-thread-1-processing-n:127.0.0.1:57631_mof%2Fqq) [n:127.0.0.1:57631_mof%2Fqq c:collection1 s:shard1 r:core_node1 x:collection1] o.a.s.c.SolrCore no updateRequestProcessorChain defined as default, creating implicit default
   [junit4]   2> 309129 WARN  (coreLoadExecutor-26-thread-1-processing-n:127.0.0.1:57631_mof%2Fqq) [n:127.0.0.1:57631_mof%2Fqq c:collection1 s:shard1 r:core_node1 x:collection1] o.a.s.c.RequestHandlers INVALID paramSet a in requestHandler {type = requestHandler,name = /dump,class = DumpRequestHandler,args = {defaults={a=A,b=B}}}
   [junit4]   2> 309151 INFO  (coreLoadExecutor-26-thread-1-processing-n:127.0.0.1:57631_mof%2Fqq) [n:127.0.0.1:57631_mof%2Fqq c:collection1 s:shard1 r:core_node1 x:collection1] o.a.s.h.l.XMLLoader xsltCacheLifetimeSeconds=60
   [junit4]   2> 309157 INFO  (coreLoadExecutor-26-thread-1-processing-n:127.0.0.1:57631_mof%2Fqq) [n:127.0.0.1:57631_mof%2Fqq c:collection1 s:shard1 r:core_node1 x:collection1] o.a.s.h.l.XMLLoader xsltCacheLifetimeSeconds=60
   [junit4]   2> 309159 INFO  (coreLoadExecutor-26-thread-1-processing-n:127.0.0.1:57631_mof%2Fqq) [n:127.0.0.1:57631_mof%2Fqq c:collection1 s:shard1 r:core_node1 x:collection1] o.a.s.h.l.XMLLoader xsltCacheLifetimeSeconds=60
   [junit4]   2> 309160 INFO  (coreLoadExecutor-26-thread-1-processing-n:127.0.0.1:57631_mof%2Fqq) [n:127.0.0.1:57631_mof%2Fqq c:collection1 s:shard1 r:core_node1 x:collection1] o.a.s.h.l.XMLLoader xsltCacheLifetimeSeconds=60
   [junit4]   2> 309204 INFO  (coreLoadExecutor-26-thread-1-processing-n:127.0.0.1:57631_mof%2Fqq) [n:127.0.0.1:57631_mof%2Fqq c:collection1 s:shard1 r:core_node1 x:collection1] o.a.s.c.RequestHandlers Registered paths: /admin/mbeans,standard,/update/json/docs,/admin/luke,/export,/get,/admin/properties,/update/json,/admin/threads,/dump,/update/csv,/sql,/graph,/admin/segments,/admin/system,/replication,/config,/stream,/schema,/admin/plugins,/admin/logging,/admin/ping,/update,/admin/file
   [junit4]   2> 309204 INFO  (coreLoadExecutor-26-thread-1-processing-n:127.0.0.1:57631_mof%2Fqq) [n:127.0.0.1:57631_mof%2Fqq c:collection1 s:shard1 r:core_node1 x:collection1] o.a.s.c.SolrCore Using default statsCache cache: org.apache.solr.search.stats.LocalStatsCache
   [junit4]   2> 309211 INFO  (coreLoadExecutor-26-thread-1-processing-n:127.0.0.1:57631_mof%2Fqq) [n:127.0.0.1:57631_mof%2Fqq c:collection1 s:shard1 r:core_node1 x:collection1] o.a.s.u.UpdateHandler Using UpdateLog implementation: org.apache.solr.update.UpdateLog
   [junit4]   2> 309229 INFO  (coreLoadExecutor-26-thread-1-processing-n:127.0.0.1:57631_mof%2Fqq) [n:127.0.0.1:57631_mof%2Fqq c:collection1 s:shard1 r:core_node1 x:collection1] o.a.s.u.UpdateLog Initializing UpdateLog: dataDir= defaultSyncLevel=FLUSH numRecordsToKeep=100 maxNumLogsToKeep=10 numVersionBuckets=65536
   [junit4]   2> 309230 INFO  (coreLoadExecutor-26-thread-1-processing-n:127.0.0.1:57631_mof%2Fqq) [n:127.0.0.1:57631_mof%2Fqq c:collection1 s:shard1 r:core_node1 x:collection1] o.a.s.u.CommitTracker Hard AutoCommit: disabled
   [junit4]   2> 309230 INFO  (coreLoadExecutor-26-thread-1-processing-n:127.0.0.1:57631_mof%2Fqq) [n:127.0.0.1:57631_mof%2Fqq c:collection1 s:shard1 r:core_node1 x:collection1] o.a.s.u.CommitTracker Soft AutoCommit: disabled
   [junit4]   2> 309232 INFO  (coreLoadExecutor-26-thread-1-processing-n:127.0.0.1:57631_mof%2Fqq) [n:127.0.0.1:57631_mof%2Fqq c:collection1 s:shard1 r:core_node1 x:collection1] o.a.s.u.RandomMergePolicy RandomMergePolicy wrapping class org.apache.lucene.index.LogDocMergePolicy: [LogDocMergePolicy: minMergeSize=1000, mergeFactor=11, maxMergeSize=9223372036854775807, maxMergeSizeForForcedMerge=9223372036854775807, calibrateSizeByDeletes=false, maxMergeDocs=2147483647, maxCFSSegmentSizeMB=8.796093022207999E12, noCFSRatio=1.0]
   [junit4]   2> 309233 INFO  (coreLoadExecutor-26-thread-1-processing-n:127.0.0.1:57631_mof%2Fqq) [n:127.0.0.1:57631_mof%2Fqq c:collection1 s:shard1 r:core_node1 x:collection1] o.a.s.c.SolrDeletionPolicy SolrDeletionPolicy.onInit: commits: num=1
   [junit4]   2> 	commit{dir=MockDirectoryWrapper(RAMDirectory@45e75004 lockFactory=org.apache.lucene.store.SingleInstanceLockFactory@3079af26),segFN=segments_1,generation=1}
   [junit4]   2> 309233 INFO  (coreLoadExecutor-26-thread-1-processing-n:127.0.0.1:57631_mof%2Fqq) [n:127.0.0.1:57631_mof%2Fqq c:collection1 s:shard1 r:core_node1 x:collection1] o.a.s.c.SolrDeletionPolicy newest commit generation = 1
   [junit4]   2> 309233 INFO  (coreLoadExecutor-26-thread-1-processing-n:127.0.0.1:57631_mof%2Fqq) [n:127.0.0.1:57631_mof%2Fqq c:collection1 s:shard1 r:core_node1 x:collection1] o.a.s.s.SolrIndexSearcher Opening [Searcher@61d11513[collection1] main]
   [junit4]   2> 309234 INFO  (coreLoadExecutor-26-thread-1-processing-n:127.0.0.1:57631_mof%2Fqq) [n:127.0.0.1:57631_mof%2Fqq c:collection1 s:shard1 r:core_node1 x:collection1] o.a.s.c.c.ZkStateReader Load collection config from: [/collections/collection1]
   [junit4]   2> 309243 INFO  (coreLoadExecutor-26-thread-1-processing-n:127.0.0.1:57631_mof%2Fqq) [n:127.0.0.1:57631_mof%2Fqq c:collection1 s:shard1 r:core_node1 x:collection1] o.a.s.c.c.ZkStateReader path=[/collections/collection1] [configName]=[conf1] specified config exists in ZooKeeper
   [junit4]   2> 309243 INFO  (coreLoadExecutor-26-thread-1-processing-n:127.0.0.1:57631_mof%2Fqq) [n:127.0.0.1:57631_mof%2Fqq c:collection1 s:shard1 r:core_node1 x:collection1] o.a.s.r.ManagedResourceStorage Setting up ZooKeeper-based storage for the RestManager with znodeBase: /configs/conf1
   [junit4]   2> 309244 INFO  (coreLoadExecutor-26-thread-1-processing-n:127.0.0.1:57631_mof%2Fqq) [n:127.0.0.1:57631_mof%2Fqq c:collection1 s:shard1 r:core_node1 x:collection1] o.a.s.r.ManagedResourceStorage Configured ZooKeeperStorageIO with znodeBase: /configs/conf1
   [junit4]   2> 309244 INFO  (coreLoadExecutor-26-thread-1-processing-n:127.0.0.1:57631_mof%2Fqq) [n:127.0.0.1:57631_mof%2Fqq c:collection1 s:shard1 r:core_node1 x:collection1] o.a.s.r.RestManager Initializing RestManager with initArgs: {}
   [junit4]   2> 309245 INFO  (coreLoadExecutor-26-thread-1-processing-n:127.0.0.1:57631_mof%2Fqq) [n:127.0.0.1:57631_mof%2Fqq c:collection1 s:shard1 r:core_node1 x:collection1] o.a.s.r.ManagedResourceStorage Reading _rest_managed.json using ZooKeeperStorageIO:path=/configs/conf1
   [junit4]   2> 309245 INFO  (coreLoadExecutor-26-thread-1-processing-n:127.0.0.1:57631_mof%2Fqq) [n:127.0.0.1:57631_mof%2Fqq c:collection1 s:shard1 r:core_node1 x:collection1] o.a.s.r.ManagedResourceStorage No data found for znode /configs/conf1/_rest_managed.json
   [junit4]   2> 309245 INFO  (coreLoadExecutor-26-thread-1-processing-n:127.0.0.1:57631_mof%2Fqq) [n:127.0.0.1:57631_mof%2Fqq c:collection1 s:shard1 r:core_node1 x:collection1] o.a.s.r.ManagedResourceStorage Loaded null at path _rest_managed.json using ZooKeeperStorageIO:path=/configs/conf1
   [junit4]   2> 309245 INFO  (coreLoadExecutor-26-thread-1-processing-n:127.0.0.1:57631_mof%2Fqq) [n:127.0.0.1:57631_mof%2Fqq c:collection1 s:shard1 r:core_node1 x:collection1] o.a.s.r.RestManager Initializing 0 registered ManagedResources
   [junit4]   2> 309245 INFO  (coreLoadExecutor-26-thread-1-processing-n:127.0.0.1:57631_mof%2Fqq) [n:127.0.0.1:57631_mof%2Fqq c:collection1 s:shard1 r:core_node1 x:collection1] o.a.s.h.ReplicationHandler Commits will be reserved for  10000
   [junit4]   2> 309260 INFO  (searcherExecutor-27-thread-1-processing-n:127.0.0.1:57631_mof%2Fqq x:collection1 s:shard1 c:collection1 r:core_node1) [n:127.0.0.1:57631_mof%2Fqq c:collection1 s:shard1 r:core_node1 x:collection1] o.a.s.c.SolrCore [collection1] Registered new searcher Searcher@61d11513[collection1] main{ExitableDirectoryReader(UninvertingDirectoryReader())}
   [junit4]   2> 309265 INFO  (coreLoadExecutor-26-thread-1-processing-n:127.0.0.1:57631_mof%2Fqq) [n:127.0.0.1:57631_mof%2Fqq c:collection1 s:shard1 r:core_node1 x:collection1] o.a.s.u.UpdateLog Looking up max value of version field to seed version buckets
   [junit4]   2> 309265 INFO  (coreLoadExecutor-26-thread-1-processing-n:127.0.0.1:57631_mof%2Fqq) [n:127.0.0.1:57631_mof%2Fqq c:collection1 s:shard1 r:core_node1 x:collection1] o.a.s.u.VersionInfo Refreshing highest value of _version_ for 65536 version buckets from index
   [junit4]   2> 309265 INFO  (coreLoadExecutor-26-thread-1-processing-n:127.0.0.1:57631_mof%2Fqq) [n:127.0.0.1:57631_mof%2Fqq c:collection1 s:shard1 r:core_node1 x:collection1] o.a.s.u.VersionInfo No terms found for _version_, cannot seed version bucket highest value from index
   [junit4]   2> 309265 INFO  (coreLoadExecutor-26-thread-1-processing-n:127.0.0.1:57631_mof%2Fqq) [n:127.0.0.1:57631_mof%2Fqq c:collection1 s:shard1 r:core_node1 x:collection1] o.a.s.u.UpdateLog Could not find max version in index or recent updates, using new clock 1536336866594258944
   [junit4]   2> 309270 INFO  (coreLoadExecutor-26-thread-1-processing-n:127.0.0.1:57631_mof%2Fqq) [n:127.0.0.1:57631_mof%2Fqq c:collection1 s:shard1 r:core_node1 x:collection1] o.a.s.u.UpdateLog Took 5.0ms to seed version buckets with highest version 1536336866594258944
   [junit4]   2> 309279 INFO  (coreLoadExecutor-26-thread-1-processing-n:127.0.0.1:57631_mof%2Fqq) [n:127.0.0.1:57631_mof%2Fqq c:collection1 s:shard1 r:core_node1 x:collection1] o.a.s.c.ZkController watch zkdir /configs/conf1
   [junit4]   2> 309281 INFO  (coreLoadExecutor-26-thread-1-processing-n:127.0.0.1:57631_mof%2Fqq) [n:127.0.0.1:57631_mof%2Fqq c:collection1 s:shard1 r:core_node1 x:collection1] o.a.s.c.CoreContainer registering core: collection1
   [junit4]   2> 309295 INFO  (coreZkRegister-21-thread-1-processing-n:127.0.0.1:57631_mof%2Fqq x:collection1 s:shard1 c:collection1 r:core_node1) [n:127.0.0.1:57631_mof%2Fqq c:collection1 s:shard1 r:core_node1 x:collection1] o.a.s.c.ZkController Register replica - core:collection1 address:https://127.0.0.1:57631/mof/qq collection:collection1 shard:shard1
   [junit4]   2> 309319 INFO  (coreZkRegister-21-thread-1-processing-n:127.0.0.1:57631_mof%2Fqq x:collection1 s:shard1 c:collection1 r:core_node1) [n:127.0.0.1:57631_mof%2Fqq c:collection1 s:shard1 r:core_node1 x:collection1] o.a.s.c.c.SolrZkClient makePath: /collections/collection1/leader_elect/shard1/election
   [junit4]   2> 309336 INFO  (coreZkRegister-21-thread-1-processing-n:127.0.0.1:57631_mof%2Fqq x:collection1 s:shard1 c:collection1 r:core_node1) [n:127.0.0.1:57631_mof%2Fqq c:collection1 s:shard1 r:core_node1 x:collection1] o.a.s.c.LeaderElector Joined leadership election with path: /collections/collection1/leader_elect/shard1/election/96021034274717706-core_node1-n_0000000000
   [junit4]   2> 309336 INFO  (coreZkRegister-21-thread-1-processing-n:127.0.0.1:57631_mof%2Fqq x:collection1 s:shard1 c:collection1 r:core_node1) [n:127.0.0.1:57631_mof%2Fqq c:collection1 s:shard1 r:core_node1 x:collection1] o.a.s.c.ShardLeaderElectionContext Running the leader process for shard=shard1 and weAreReplacement=false and leaderVoteWait=10000
   [junit4]   2> 309340 INFO  (coreZkRegister-21-thread-1-processing-n:127.0.0.1:57631_mof%2Fqq x:collection1 s:shard1 c:collection1 r:core_node1) [n:127.0.0.1:57631_mof%2Fqq c:collection1 s:shard1 r:core_node1 x:collection1] o.a.s.c.ShardLeaderElectionContext Enough replicas found to continue.
   [junit4]   2> 309340 INFO  (coreZkRegister-21-thread-1-processing-n:127.0.0.1:57631_mof%2Fqq x:collection1 s:shard1 c:collection1 r:core_node1) [n:127.0.0.1:57631_mof%2Fqq c:collection1 s:shard1 r:core_node1 x:collection1] o.a.s.c.ShardLeaderElectionContext I may be the new leader - try and sync
   [junit4]   2> 309341 INFO  (coreZkRegister-21-thread-1-processing-n:127.0.0.1:57631_mof%2Fqq x:collection1 s:shard1 c:collection1 r:core_node1) [n:127.0.0.1:57631_mof%2Fqq c:collection1 s:shard1 r:core_node1 x:collection1] o.a.s.c.SyncStrategy Sync replicas to https://127.0.0.1:57631/mof/qq/collection1/
   [junit4]   2> 309341 INFO  (coreZkRegister-21-thread-1-processing-n:127.0.0.1:57631_mof%2Fqq x:collection1 s:shard1 c:collection1 r:core_node1) [n:127.0.0.1:57631_mof%2Fqq c:collection1 s:shard1 r:core_node1 x:collection1] o.a.s.c.SyncStrategy Sync Success - now sync replicas to me
   [junit4]   2> 309341 INFO  (coreZkRegister-21-thread-1-processing-n:127.0.0.1:57631_mof%2Fqq x:collection1 s:shard1 c:collection1 r:core_node1) [n:127.0.0.1:57631_mof%2Fqq c:collection1 s:shard1 r:core_node1 x:collection1] o.a.s.c.SyncStrategy https://127.0.0.1:57631/mof/qq/collection1/ has no replicas
   [junit4]   2> 309341 INFO  (OverseerStateUpdate-96021034274717701-127.0.0.1:33986_mof%2Fqq-n_0000000000) [n:127.0.0.1:33986_mof%2Fqq    ] o.a.s.c.Overseer processMessage: queueSize: 1, message = {
   [junit4]   2>   "operation":"leader",
   [junit4]   2>   "shard":"shard1",
   [junit4]   2>   "collection":"collection1"} current state version: 2
   [junit4]   2> 309348 INFO  (coreZkRegister-21-thread-1-processing-n:127.0.0.1:57631_mof%2Fqq x:collection1 s:shard1 c:collection1 r:core_node1) [n:127.0.0.1:57631_mof%2Fqq c:collection1 s:shard1 r:core_node1 x:collection1] o.a.s.c.c.SolrZkClient makePath: /collections/collection1/leaders/shard1
   [junit4]   2> 309355 INFO  (coreZkRegister-21-thread-1-processing-n:127.0.0.1:57631_mof%2Fqq x:collection1 s:shard1 c:collection1 r:core_node1) [n:127.0.0.1:57631_mof%2Fqq c:collection1 s:shard1 r:core_node1 x:collection1] o.a.s.c.ShardLeaderElectionContextBase Creating leader registration node /collections/collection1/leaders/shard1/leader after winning as /collections/collection1/leader_elect/shard1/election/96021034274717706-core_node1-n_0000000000
   [junit4]   2> 309380 INFO  (coreZkRegister-21-thread-1-processing-n:127.0.0.1:57631_mof%2Fqq x:collection1 s:shard1 c:collection1 r:core_node1) [n:127.0.0.1:57631_mof%2Fqq c:collection1 s:shard1 r:core_node1 x:collection1] o.a.s.c.ShardLeaderElectionContext I am the new leader: https://127.0.0.1:57631/mof/qq/collection1/ shard1
   [junit4]   2> 309381 INFO  (OverseerStateUpdate-96021034274717701-127.0.0.1:33986_mof%2Fqq-n_0000000000) [n:127.0.0.1:33986_mof%2Fqq    ] o.a.s.c.Overseer processMessage: queueSize: 1, message = {
   [junit4]   2>   "operation":"leader",
   [junit4]   2>   "shard":"shard1",
   [junit4]   2>   "collection":"collection1",
   [junit4]   2>   "base_url":"https://127.0.0.1:57631/mof/qq",
   [junit4]   2>   "core":"collection1",
   [junit4]   2>   "state":"active"} current state version: 2
   [junit4]   2> 309484 INFO  (OverseerStateUpdate-96021034274717701-127.0.0.1:33986_mof%2Fqq-n_0000000000) [n:127.0.0.1:33986_mof%2Fqq    ] o.a.s.c.o.ZkStateWriter going to update_collection /collections/collection1/state.json version: 1
   [junit4]   2> 309484 INFO  (zkCallback-21-thread-1-processing-n:127.0.0.1:57631_mof%2Fqq) [n:127.0.0.1:57631_mof%2Fqq    ] o.a.s.c.c.ZkStateReader A cluster state change: [WatchedEvent state:SyncConnected type:NodeDataChanged path:/collections/collection1/state.json] for collection [collection1] has occurred - updating... (live nodes size: [2])
   [junit4]   2> 309486 INFO  (zkCallback-21-thread-1-processing-n:127.0.0.1:57631_mof%2Fqq) [n:127.0.0.1:57631_mof%2Fqq    ] o.a.s.c.c.ZkStateReader Updating data for [collection1] from [1] to [2]
   [junit4]   2> 309532 INFO  (coreZkRegister-21-thread-1-processing-n:127.0.0.1:57631_mof%2Fqq x:collection1 s:shard1 c:collection1 r:core_node1) [n:127.0.0.1:57631_mof%2Fqq c:collection1 s:shard1 r:core_node1 x:collection1] o.a.s.c.ZkController We are https://127.0.0.1:57631/mof/qq/collection1/ and leader is https://127.0.0.1:57631/mof/qq/collection1/
   [junit4]   2> 309532 INFO  (coreZkRegister-21-thread-1-processing-n:127.0.0.1:57631_mof%2Fqq x:collection1 s:shard1 c:collection1 r:core_node1) [n:127.0.0.1:57631_mof%2Fqq c:collection1 s:shard1 r:core_node1 x:collection1] o.a.s.c.ZkController No LogReplay needed for core=collection1 baseURL=https://127.0.0.1:57631/mof/qq
   [junit4]   2> 309532 INFO  (coreZkRegister-21-thread-1-processing-n:127.0.0.1:57631_mof%2Fqq x:collection1 s:shard1 c:collection1 r:core_node1) [n:127.0.0.1:57631_mof%2Fqq c:collection1 s:shard1 r:core_node1 x:collection1] o.a.s.c.ZkController I am the leader, no recovery necessary
   [junit4]   2> 309532 INFO  (coreZkRegister-21-thread-1-processing-n:127.0.0.1:57631_mof%2Fqq x:collection1 s:shard1 c:collection1 r:core_node1) [n:127.0.0.1:57631_mof%2Fqq c:collection1 s:shard1 r:core_node1 x:collection1] o.a.s.c.ZkController publishing state=active
   [junit4]   2> 309532 INFO  (coreZkRegister-21-thread-1-processing-n:127.0.0.1:57631_mof%2Fqq x:collection1 s:shard1 c:collection1 r:core_node1) [n:127.0.0.1:57631_mof%2Fqq c:collection1 s:shard1 r:core_node1 x:collection1] o.a.s.c.ZkController numShards not found on descriptor - reading it from system property
   [junit4]   2> 309534 INFO  (OverseerStateUpdate-96021034274717701-127.0.0.1:33986_mof%2Fqq-n_0000000000) [n:127.0.0.1:33986_mof%2Fqq    ] o.a.s.c.Overseer processMessage: queueSize: 1, message = {
   [junit4]   2>   "core":"collection1",
   [junit4]   2>   "core_node_name":"core_node1",
   [junit4]   2>   "roles":null,
   [junit4]   2>   "base_url":"https://127.0.0.1:57631/mof/qq",
   [junit4]   2>   "node_name":"127.0.0.1:57631_mof%2Fqq",
   [junit4]   2>   "numShards":"1",
   [junit4]   2>   "state":"active",
   [junit4]   2>   "shard":"shard1",
   [junit4]   2>   "collection":"collection1",
   [junit4]   2>   "operation":"state"} current state version: 2
   [junit4]   2> 309534 INFO  (OverseerStateUpdate-96021034274717701-127.0.0.1:33986_mof%2Fqq-n_0000000000) [n:127.0.0.1:33986_mof%2Fqq    ] o.a.s.c.o.ReplicaMutator Update state numShards=1 message={
   [junit4]   2>   "core":"collection1",
   [junit4]   2>   "core_node_name":"core_node1",
   [junit4]   2>   "roles":null,
   [junit4]   2>   "base_url":"https://127.0.0.1:57631/mof/qq",
   [junit4]   2>   "node_name":"127.0.0.1:57631_mof%2Fqq",
   [junit4]   2>   "numShards":"1",
   [junit4]   2>   "state":"active",
   [junit4]   2>   "shard":"shard1",
   [junit4]   2>   "collection":"collection1",
   [junit4]   2>   "operation":"state"}
   [junit4]   2> 309568 INFO  (TEST-SyncSliceTest.test-seed#[F2811E7501E88115]) [    ] o.a.s.SolrTestCaseJ4 Writing core.properties file to /x1/jenkins/jenkins-slave/workspace/Lucene-Solr-NightlyTests-6.x/solr/build/solr-core/test/J0/temp/solr.cloud.SyncSliceTest_F2811E7501E88115-001/shard-2-001/cores/collection1
   [junit4]   2> 309568 INFO  (TEST-SyncSliceTest.test-seed#[F2811E7501E88115]) [    ] o.a.s.c.AbstractFullDistribZkTestBase create jetty 2 in directory /x1/jenkins/jenkins-slave/workspace/Lucene-Solr-NightlyTests-6.x/solr/build/solr-core/test/J0/temp/solr.cloud.SyncSliceTest_F2811E7501E88115-001/shard-2-001
   [junit4]   2> 309572 INFO  (TEST-SyncSliceTest.test-seed#[F2811E7501E88115]) [    ] o.e.j.s.Server jetty-9.3.8.v20160314
   [junit4]   2> 309576 INFO  (TEST-SyncSliceTest.test-seed#[F2811E7501E88115]) [    ] o.e.j.s.h.ContextHandler Started o.e.j.s.ServletContextHandler@61505b74{/mof/qq,null,AVAILABLE}
   [junit4]   2> 309580 INFO  (TEST-SyncSliceTest.test-seed#[F2811E7501E88115]) [    ] o.e.j.s.ServerConnector Started ServerConnector@29b57479{SSL,[ssl, http/1.1]}{127.0.0.1:54457}
   [junit4]   2> 309580 INFO  (TEST-SyncSliceTest.test-seed#[F2811E7501E88115]) [    ] o.e.j.s.Server Started @312537ms
   [junit4]   2> 309580 INFO  (TEST-SyncSliceTest.test-seed#[F2811E7501E88115]) [    ] o.a.s.c.s.e.JettySolrRunner Jetty properties: {solr.data.dir=/x1/jenkins/jenkins-slave/workspace/Lucene-Solr-NightlyTests-6.x/solr/build/solr-core/test/J0/temp/solr.cloud.SyncSliceTest_F2811E7501E88115-001/tempDir-001/jetty2, solrconfig=solrconfig.xml, hostContext=/mof/qq, hostPort=54457, coreRootDirectory=/x1/jenkins/jenkins-slave/workspace/Lucene-Solr-NightlyTests-6.x/solr/build/solr-core/test/J0/../../../../../../../../../../x1/jenkins/jenkins-slave/workspace/Lucene-Solr-NightlyTests-6.x/solr/build/solr-core/test/J0/temp/solr.cloud.SyncSliceTest_F2811E7501E88115-001/shard-2-001/cores}
   [junit4]   2> 309580 INFO  (TEST-SyncSliceTest.test-seed#[F2811E7501E88115]) [    ] o.a.s.s.SolrDispatchFilter SolrDispatchFilter.init(): sun.misc.Launcher$AppClassLoader@73d16e93
   [junit4]   2> 309580 INFO  (TEST-SyncSliceTest.test-seed#[F2811E7501E88115]) [    ] o.a.s.c.SolrResourceLoader new SolrResourceLoader for directory: '/x1/jenkins/jenkins-slave/workspace/Lucene-Solr-NightlyTests-6.x/solr/build/solr-core/test/J0/temp/solr.cloud.SyncSliceTest_F2811E7501E88115-001/shard-2-001'
   [junit4]   2> 309580 INFO  (TEST-SyncSliceTest.test-seed#[F2811E7501E88115]) [    ] o.a.s.c.SolrResourceLoader JNDI not configured for solr (NoInitialContextEx)
   [junit4]   2> 309581 INFO  (TEST-SyncSliceTest.test-seed#[F2811E7501E88115]) [    ] o.a.s.c.SolrResourceLoader solr home defaulted to 'solr/' (could not find system property or JNDI)
   [junit4]   2> 309581 INFO  (TEST-SyncSliceTest.test-seed#[F2811E7501E88115]) [    ] o.a.s.c.c.SolrZkClient Using default ZkCredentialsProvider
   [junit4]   2> 309588 INFO  (TEST-SyncSliceTest.test-seed#[F2811E7501E88115]) [    ] o.a.s.c.c.ConnectionManager Waiting for client to connect to ZooKeeper
   [junit4]   2> 309593 INFO  (zkCallback-23-thread-1) [    ] o.a.s.c.c.ConnectionManager Watcher org.apache.solr.common.cloud.ConnectionManager@581517da name:ZooKeeperConnection Watcher:127.0.0.1:47018/solr got event WatchedEvent state:SyncConnected type:None path:null path:null type:None
   [junit4]   2> 309593 INFO  (TEST-SyncSliceTest.test-seed#[F2811E7501E88115]) [    ] o.a.s.c.c.ConnectionManager Client is connected to ZooKeeper
   [junit4]   2> 309594 INFO  (TEST-SyncSliceTest.test-seed#[F2811E7501E88115]) [    ] o.a.s.c.c.SolrZkClient Using default ZkACLProvider
   [junit4]   2> 309604 INFO  (TEST-SyncSliceTest.test-seed#[F2811E7501E88115]) [    ] o.a.s.s.SolrDispatchFilter Loading solr.xml from SolrHome (not found in ZooKeeper)
   [junit4]   2> 309604 INFO  (TEST-SyncSliceTest.test-seed#[F2811E7501E88115]) [    ] o.a.s.c.SolrXmlConfig Loading container configuration from /x1/jenkins/jenkins-slave/workspace/Lucene-Solr-NightlyTests-6.x/solr/build/solr-core/test/J0/temp/solr.cloud.SyncSliceTest_F2811E7501E88115-001/shard-2-001/solr.xml
   [junit4]   2> 309609 INFO  (TEST-SyncSliceTest.test-seed#[F2811E7501E88115]) [    ] o.a.s.c.CorePropertiesLocator Config-defined core root directory: /x1/jenkins/jenkins-slave/workspace/Lucene-Solr-NightlyTests-6.x/solr/build/solr-core/test/J0/../../../../../../../../../../x1/jenkins/jenkins-slave/workspace/Lucene-Solr-NightlyTests-6.x/solr/build/solr-core/test/J0/temp/solr.cloud.SyncSliceTest_F2811E7501E88115-001/shard-2-001/cores
   [junit4]   2> 309609 INFO  (TEST-SyncSliceTest.test-seed#[F2811E7501E88115]) [    ] o.a.s.c.CoreContainer New CoreContainer 1334776752
   [junit4]   2> 309609 INFO  (TEST-SyncSliceTest.test-seed#[F2811E7501E88115]) [    ] o.a.s.c.CoreContainer Loading cores into CoreContainer [instanceDir=/x1/jenkins/jenkins-slave/workspace/Lucene-Solr-NightlyTests-6.x/solr/build/solr-core/test/J0/temp/solr.cloud.SyncSliceTest_F2811E7501E88115-001/shard-2-001]
   [junit4]   2> 309609 WARN  (TEST-SyncSliceTest.test-seed#[F2811E7501E88115]) [    ] o.a.s.c.CoreContainer Couldn't add files from /x1/jenkins/jenkins-slave/workspace/Lucene-Solr-NightlyTests-6.x/solr/build/solr-core/test/J0/temp/solr.cloud.SyncSliceTest_F2811E7501E88115-001/shard-2-001/lib to classpath: /x1/jenkins/jenkins-slave/workspace/Lucene-Solr-NightlyTests-6.x/solr/build/solr-core/test/J0/temp/solr.cloud.SyncSliceTest_F2811E7501E88115-001/shard-2-001/lib
   [junit4]   2> 309609 INFO  (TEST-SyncSliceTest.test-seed#[F2811E7501E88115]) [    ] o.a.s.h.c.HttpShardHandlerFactory created with socketTimeout : 90000,urlScheme : ,connTimeout : 15000,maxConnectionsPerHost : 20,maxConnections : 10000,corePoolSize : 0,maximumPoolSize : 2147483647,maxThreadIdleTime : 5,sizeOfQueue : -1,fairnessPolicy : false,useRetries : false,
   [junit4]   2> 309610 INFO  (TEST-SyncSliceTest.test-seed#[F2811E7501E88115]) [    ] o.a.s.u.UpdateShardHandler Creating UpdateShardHandler HTTP client with params: socketTimeout=340000&connTimeout=45000&retry=true
   [junit4]   2> 309619 INFO  (TEST-SyncSliceTest.test-seed#[F2811E7501E88115]) [    ] o.a.s.l.LogWatcher SLF4J impl is org.slf4j.impl.Log4jLoggerFactory
   [junit4]   2> 309619 INFO  (TEST-SyncSliceTest.test-seed#[F2811E7501E88115]) [    ] o.a.s.l.LogWatcher Registering Log Listener [Log4j (org.slf4j.impl.Log4jLoggerFactory)]
   [junit4]   2> 309619 INFO  (TEST-SyncSliceTest.test-seed#[F2811E7501E88115]) [    ] o.a.s.c.ZkContainer Zookeeper client=127.0.0.1:47018/solr
   [junit4]   2> 309619 INFO  (TEST-SyncSliceTest.test-seed#[F2811E7501E88115]) [    ] o.a.s.c.ZkController zkHost includes chroot
   [junit4]   2> 309619 INFO  (TEST-SyncSliceTest.test-seed#[F2811E7501E88115]) [    ] o.a.s.c.c.SolrZkClient Using default ZkCredentialsProvider
   [junit4]   2> 309634 INFO  (TEST-SyncSliceTest.test-seed#[F2811E7501E88115]) [    ] o.a.s.c.c.ConnectionManager Waiting for client to connect to ZooKeeper
   [junit4]   2> 309636 INFO  (zkCallback-26-thread-1) [    ] o.a.s.c.c.ConnectionManager Watcher org.apache.solr.common.cloud.ConnectionManager@396360a3 name:ZooKeeperConnection Watcher:127.0.0.1:47018 got event WatchedEvent state:SyncConnected type:None path:null path:null type:None
   [junit4]   2> 309636 INFO  (TEST-SyncSliceTest.test-seed#[F2811E7501E88115]) [    ] o.a.s.c.c.ConnectionManager Client is connected to ZooKeeper
   [junit4]   2> 309636 INFO  (TEST-SyncSliceTest.test-seed#[F2811E7501E8

[...truncated too long message...]

unit4]   2> 1559764 INFO  (zkCallback-840-thread-1-processing-n:127.0.0.1:43247_xe) [n:127.0.0.1:43247_xe c:collection1 s:shard3 r:core_node14 x:collection1] o.a.s.c.CachingDirectoryFactory Closing directory, CoreContainer#isShutdown=true
   [junit4]   2> 1559764 INFO  (zkCallback-840-thread-1-processing-n:127.0.0.1:43247_xe) [n:127.0.0.1:43247_xe c:collection1 s:shard3 r:core_node14 x:collection1] o.a.s.c.CachingDirectoryFactory Closing directory: /x1/jenkins/jenkins-slave/workspace/Lucene-Solr-NightlyTests-6.x/solr/build/solr-core/test/J1/temp/solr.cloud.ChaosMonkeySafeLeaderTest_F2811E7501E88115-001/shard-14-001/cores/collection1/data
   [junit4]   2> 1559765 INFO  (zkCallback-840-thread-1-processing-n:127.0.0.1:43247_xe) [n:127.0.0.1:43247_xe c:collection1 s:shard3 r:core_node14 x:collection1] o.a.s.c.ElectionContext Canceling election /collections/collection1/leader_elect/shard3/election/96021114184532017-core_node14-n_0000000003
   [junit4]   2> 1559765 WARN  (zkCallback-840-thread-1-processing-n:127.0.0.1:43247_xe) [n:127.0.0.1:43247_xe c:collection1 s:shard3 r:core_node14 x:collection1] o.a.s.c.LeaderElector 
   [junit4]   2> org.apache.zookeeper.KeeperException$SessionExpiredException: KeeperErrorCode = Session expired for /collections/collection1/leader_elect/shard3/election/96021114184532017-core_node14-n_0000000003
   [junit4]   2> 	at org.apache.zookeeper.KeeperException.create(KeeperException.java:127)
   [junit4]   2> 	at org.apache.zookeeper.KeeperException.create(KeeperException.java:51)
   [junit4]   2> 	at org.apache.zookeeper.ZooKeeper.delete(ZooKeeper.java:873)
   [junit4]   2> 	at org.apache.solr.common.cloud.SolrZkClient$2.execute(SolrZkClient.java:244)
   [junit4]   2> 	at org.apache.solr.common.cloud.SolrZkClient$2.execute(SolrZkClient.java:241)
   [junit4]   2> 	at org.apache.solr.common.cloud.ZkCmdExecutor.retryOperation(ZkCmdExecutor.java:60)
   [junit4]   2> 	at org.apache.solr.common.cloud.SolrZkClient.delete(SolrZkClient.java:241)
   [junit4]   2> 	at org.apache.solr.cloud.ElectionContext.cancelElection(ElectionContext.java:86)
   [junit4]   2> 	at org.apache.solr.cloud.ShardLeaderElectionContextBase.cancelElection(ElectionContext.java:143)
   [junit4]   2> 	at org.apache.solr.cloud.ShardLeaderElectionContext.cancelElection(ElectionContext.java:279)
   [junit4]   2> 	at org.apache.solr.cloud.ShardLeaderElectionContext.runLeaderProcess(ElectionContext.java:455)
   [junit4]   2> 	at org.apache.solr.cloud.LeaderElector.runIamLeaderProcess(LeaderElector.java:170)
   [junit4]   2> 	at org.apache.solr.cloud.LeaderElector.checkIfIamLeader(LeaderElector.java:135)
   [junit4]   2> 	at org.apache.solr.cloud.LeaderElector.access$200(LeaderElector.java:56)
   [junit4]   2> 	at org.apache.solr.cloud.LeaderElector$ElectionWatcher.process(LeaderElector.java:348)
   [junit4]   2> 	at org.apache.solr.common.cloud.SolrZkClient$3.lambda$process$0(SolrZkClient.java:266)
   [junit4]   2> 	at java.util.concurrent.Executors$RunnableAdapter.call(Executors.java:511)
   [junit4]   2> 	at java.util.concurrent.FutureTask.run(FutureTask.java:266)
   [junit4]   2> 	at org.apache.solr.common.util.ExecutorUtil$MDCAwareThreadPoolExecutor.lambda$execute$0(ExecutorUtil.java:229)
   [junit4]   2> 	at java.util.concurrent.ThreadPoolExecutor.runWorker(ThreadPoolExecutor.java:1142)
   [junit4]   2> 	at java.util.concurrent.ThreadPoolExecutor$Worker.run(ThreadPoolExecutor.java:617)
   [junit4]   2> 	at java.lang.Thread.run(Thread.java:745)
   [junit4]   2> 1559768 INFO  (TEST-ChaosMonkeySafeLeaderTest.test-seed#[F2811E7501E88115]) [    ] o.e.j.s.ServerConnector Stopped ServerConnector@5bf7b9e3{SSL,[ssl, http/1.1]}{127.0.0.1:0}
   [junit4]   2> 1559768 INFO  (TEST-ChaosMonkeySafeLeaderTest.test-seed#[F2811E7501E88115]) [    ] o.e.j.s.h.ContextHandler Stopped o.e.j.s.ServletContextHandler@47d14bab{/xe,null,UNAVAILABLE}
   [junit4]   2> 1559770 INFO  (TEST-ChaosMonkeySafeLeaderTest.test-seed#[F2811E7501E88115]) [    ] o.a.s.c.ZkTestServer connecting to 127.0.0.1:42870 42870
   [junit4]   2> 1559984 INFO  (Thread-879) [    ] o.a.s.c.ZkTestServer connecting to 127.0.0.1:42870 42870
   [junit4]   2> 1559985 WARN  (Thread-879) [    ] o.a.s.c.ZkTestServer Watch limit violations: 
   [junit4]   2> Maximum concurrent create/delete watches above limit:
   [junit4]   2> 
   [junit4]   2> 	16	/solr/aliases.json
   [junit4]   2> 	15	/solr/security.json
   [junit4]   2> 	14	/solr/configs/conf1
   [junit4]   2> 
   [junit4]   2> Maximum concurrent data watches above limit:
   [junit4]   2> 
   [junit4]   2> 	16	/solr/clusterprops.json
   [junit4]   2> 	16	/solr/clusterstate.json
   [junit4]   2> 	14	/solr/collections/collection1/state.json
   [junit4]   2> 
   [junit4]   2> Maximum concurrent children watches above limit:
   [junit4]   2> 
   [junit4]   2> 	16	/solr/live_nodes
   [junit4]   2> 	16	/solr/collections
   [junit4]   2> 	13	/solr/overseer/collection-queue-work
   [junit4]   2> 	10	/solr/overseer/queue
   [junit4]   2> 	3	/solr/overseer/queue-work
   [junit4]   2> 
   [junit4]   2> NOTE: download the large Jenkins line-docs file by running 'ant get-jenkins-line-docs' in the lucene directory.
   [junit4]   2> NOTE: reproduce with: ant test  -Dtestcase=ChaosMonkeySafeLeaderTest -Dtests.method=test -Dtests.seed=F2811E7501E88115 -Dtests.multiplier=2 -Dtests.nightly=true -Dtests.slow=true -Dtests.linedocsfile=/x1/jenkins/lucene-data/enwiki.random.lines.txt -Dtests.locale=tr-TR -Dtests.timezone=America/Nassau -Dtests.asserts=true -Dtests.file.encoding=UTF-8
   [junit4] ERROR    335s J1 | ChaosMonkeySafeLeaderTest.test <<<
   [junit4]    > Throwable #1: org.apache.solr.client.solrj.impl.HttpSolrClient$RemoteSolrException: Error from server at https://127.0.0.1:60438/xe/collection1: Expected mime type application/octet-stream but got text/html. <html>
   [junit4]    > <head>
   [junit4]    > <meta http-equiv="Content-Type" content="text/html;charset=ISO-8859-1"/>
   [junit4]    > <title>Error 503 </title>
   [junit4]    > </head>
   [junit4]    > <body>
   [junit4]    > <h2>HTTP ERROR: 503</h2>
   [junit4]    > <p>Problem accessing /xe/collection1/update. Reason:
   [junit4]    > <pre>    {metadata={error-class=org.apache.solr.common.SolrException,root-error-class=org.apache.solr.common.SolrException},msg=SolrCore is loading,code=503}</pre></p>
   [junit4]    > <hr /><a href="http://eclipse.org/jetty">Powered by Jetty:// 9.3.8.v20160314</a><hr/>
   [junit4]    > </body>
   [junit4]    > </html>
   [junit4]    > 	at __randomizedtesting.SeedInfo.seed([F2811E7501E88115:7AD521AFAF14ECED]:0)
   [junit4]    > 	at org.apache.solr.client.solrj.impl.HttpSolrClient.executeMethod(HttpSolrClient.java:558)
   [junit4]    > 	at org.apache.solr.client.solrj.impl.HttpSolrClient.request(HttpSolrClient.java:259)
   [junit4]    > 	at org.apache.solr.client.solrj.impl.HttpSolrClient.request(HttpSolrClient.java:248)
   [junit4]    > 	at org.apache.solr.client.solrj.SolrRequest.process(SolrRequest.java:149)
   [junit4]    > 	at org.apache.solr.client.solrj.SolrClient.deleteByQuery(SolrClient.java:895)
   [junit4]    > 	at org.apache.solr.client.solrj.SolrClient.deleteByQuery(SolrClient.java:858)
   [junit4]    > 	at org.apache.solr.client.solrj.SolrClient.deleteByQuery(SolrClient.java:873)
   [junit4]    > 	at org.apache.solr.cloud.AbstractFullDistribZkTestBase.del(AbstractFullDistribZkTestBase.java:835)
   [junit4]    > 	at org.apache.solr.cloud.ChaosMonkeySafeLeaderTest.tryDelete(ChaosMonkeySafeLeaderTest.java:190)
   [junit4]    > 	at org.apache.solr.cloud.ChaosMonkeySafeLeaderTest.test(ChaosMonkeySafeLeaderTest.java:92)
   [junit4]    > 	at org.apache.solr.BaseDistributedSearchTestCase$ShardsRepeatRule$ShardsFixedStatement.callStatement(BaseDistributedSearchTestCase.java:992)
   [junit4]    > 	at org.apache.solr.BaseDistributedSearchTestCase$ShardsRepeatRule$ShardsStatement.evaluate(BaseDistributedSearchTestCase.java:967)
   [junit4]    > 	at java.lang.Thread.run(Thread.java:745)
   [junit4]   2> 1559987 INFO  (SUITE-ChaosMonkeySafeLeaderTest-seed#[F2811E7501E88115]-worker) [    ] o.a.s.SolrTestCaseJ4 ###deleteCore
   [junit4]   2> NOTE: leaving temporary files on disk at: /x1/jenkins/jenkins-slave/workspace/Lucene-Solr-NightlyTests-6.x/solr/build/solr-core/test/J1/temp/solr.cloud.ChaosMonkeySafeLeaderTest_F2811E7501E88115-001
   [junit4]   2> Jun 05, 2016 10:37:42 PM com.carrotsearch.randomizedtesting.ThreadLeakControl checkThreadLeaks
   [junit4]   2> WARNING: Will linger awaiting termination of 1 leaked thread(s).
   [junit4]   2> NOTE: test params are: codec=Asserting(Lucene60): {}, docValues:{}, maxPointsInLeafNode=202, maxMBSortInHeap=6.251130544922502, sim=ClassicSimilarity, locale=tr-TR, timezone=America/Nassau
   [junit4]   2> NOTE: Linux 3.13.0-85-generic amd64/Oracle Corporation 1.8.0_74 (64-bit)/cpus=4,threads=1,free=64609448,total=451411968
   [junit4]   2> NOTE: All tests run in this JVM: [RecoveryAfterSoftCommitTest, SolrIndexSplitterTest, TestConfigSetsAPIZkFailure, SaslZkACLProviderTest, TestDynamicFieldResource, OutOfBoxZkACLAndCredentialsProvidersTest, SharedFSAutoReplicaFailoverUtilsTest, TestDFISimilarityFactory, CollectionsAPIDistributedZkTest, BadCopyFieldTest, TestTestInjection, MBeansHandlerTest, TermsComponentTest, RestartWhileUpdatingTest, HdfsLockFactoryTest, TestSimpleTrackingShardHandler, DistributedFacetPivotSmallAdvancedTest, TestCopyFieldCollectionResource, SolrIndexConfigTest, TestSolrConfigHandlerCloud, ChaosMonkeySafeLeaderTest]
   [junit4] Completed [52/613 (6!)] on J1 in 336.19s, 1 test, 1 error <<< FAILURES!

[...truncated 46 lines...]
ERROR: Step ‘Archive the artifacts’ failed: no workspace for Lucene-Solr-NightlyTests-6.x #84
ERROR: Step ‘Publish JUnit test result report’ failed: no workspace for Lucene-Solr-NightlyTests-6.x #84
Email was triggered for: Failure - Any
Sending email for trigger: Failure - Any
ERROR: lucene is offline; cannot locate latest1.8
ERROR: lucene is offline; cannot locate latest1.8




Mime
View raw message