lucene-dev mailing list archives

Site index · List index
Message view « Date » · « Thread »
Top « Date » · « Thread »
From Policeman Jenkins Server <jenk...@thetaphi.de>
Subject [JENKINS] Lucene-Solr-master-Linux (64bit/jdk1.8.0_92) - Build # 16949 - Failure!
Date Wed, 08 Jun 2016 20:28:49 GMT
Build: http://jenkins.thetaphi.de/job/Lucene-Solr-master-Linux/16949/
Java: 64bit/jdk1.8.0_92 -XX:-UseCompressedOops -XX:+UseParallelGC

2 tests failed.
FAILED:  org.apache.solr.cloud.TestTolerantUpdateProcessorCloud.testVariousDeletesViaCloudClient

Error Message:
https://127.0.0.1:42789/solr/test_col_shard1_replica2/

Stack Trace:
org.apache.solr.common.SolrException: https://127.0.0.1:42789/solr/test_col_shard1_replica2/
	at __randomizedtesting.SeedInfo.seed([907128AFC0619FEC:E89CA312B6C24019]:0)
	at org.apache.solr.client.solrj.impl.CloudSolrClient.directUpdate(CloudSolrClient.java:745)
	at org.apache.solr.client.solrj.impl.CloudSolrClient.sendRequest(CloudSolrClient.java:1109)
	at org.apache.solr.client.solrj.impl.CloudSolrClient.requestWithRetryOnStaleState(CloudSolrClient.java:998)
	at org.apache.solr.client.solrj.impl.CloudSolrClient.request(CloudSolrClient.java:934)
	at org.apache.solr.client.solrj.SolrRequest.process(SolrRequest.java:149)
	at org.apache.solr.client.solrj.SolrRequest.process(SolrRequest.java:166)
	at org.apache.solr.cloud.TestTolerantUpdateProcessorCloud.testVariousDeletes(TestTolerantUpdateProcessorCloud.java:322)
	at org.apache.solr.cloud.TestTolerantUpdateProcessorCloud.testVariousDeletesViaCloudClient(TestTolerantUpdateProcessorCloud.java:285)
	at sun.reflect.NativeMethodAccessorImpl.invoke0(Native Method)
	at sun.reflect.NativeMethodAccessorImpl.invoke(NativeMethodAccessorImpl.java:62)
	at sun.reflect.DelegatingMethodAccessorImpl.invoke(DelegatingMethodAccessorImpl.java:43)
	at java.lang.reflect.Method.invoke(Method.java:498)
	at com.carrotsearch.randomizedtesting.RandomizedRunner.invoke(RandomizedRunner.java:1764)
	at com.carrotsearch.randomizedtesting.RandomizedRunner$8.evaluate(RandomizedRunner.java:871)
	at com.carrotsearch.randomizedtesting.RandomizedRunner$9.evaluate(RandomizedRunner.java:907)
	at com.carrotsearch.randomizedtesting.RandomizedRunner$10.evaluate(RandomizedRunner.java:921)
	at com.carrotsearch.randomizedtesting.rules.SystemPropertiesRestoreRule$1.evaluate(SystemPropertiesRestoreRule.java:57)
	at org.apache.lucene.util.TestRuleSetupTeardownChained$1.evaluate(TestRuleSetupTeardownChained.java:49)
	at org.apache.lucene.util.AbstractBeforeAfterRule$1.evaluate(AbstractBeforeAfterRule.java:45)
	at org.apache.lucene.util.TestRuleThreadAndTestName$1.evaluate(TestRuleThreadAndTestName.java:48)
	at org.apache.lucene.util.TestRuleIgnoreAfterMaxFailures$1.evaluate(TestRuleIgnoreAfterMaxFailures.java:64)
	at org.apache.lucene.util.TestRuleMarkFailure$1.evaluate(TestRuleMarkFailure.java:47)
	at com.carrotsearch.randomizedtesting.rules.StatementAdapter.evaluate(StatementAdapter.java:36)
	at com.carrotsearch.randomizedtesting.ThreadLeakControl$StatementRunner.run(ThreadLeakControl.java:367)
	at com.carrotsearch.randomizedtesting.ThreadLeakControl.forkTimeoutingTask(ThreadLeakControl.java:809)
	at com.carrotsearch.randomizedtesting.ThreadLeakControl$3.evaluate(ThreadLeakControl.java:460)
	at com.carrotsearch.randomizedtesting.RandomizedRunner.runSingleTest(RandomizedRunner.java:880)
	at com.carrotsearch.randomizedtesting.RandomizedRunner$5.evaluate(RandomizedRunner.java:781)
	at com.carrotsearch.randomizedtesting.RandomizedRunner$6.evaluate(RandomizedRunner.java:816)
	at com.carrotsearch.randomizedtesting.RandomizedRunner$7.evaluate(RandomizedRunner.java:827)
	at com.carrotsearch.randomizedtesting.rules.StatementAdapter.evaluate(StatementAdapter.java:36)
	at com.carrotsearch.randomizedtesting.rules.SystemPropertiesRestoreRule$1.evaluate(SystemPropertiesRestoreRule.java:57)
	at org.apache.lucene.util.AbstractBeforeAfterRule$1.evaluate(AbstractBeforeAfterRule.java:45)
	at com.carrotsearch.randomizedtesting.rules.StatementAdapter.evaluate(StatementAdapter.java:36)
	at org.apache.lucene.util.TestRuleStoreClassName$1.evaluate(TestRuleStoreClassName.java:41)
	at com.carrotsearch.randomizedtesting.rules.NoShadowingOrOverridesOnMethodsRule$1.evaluate(NoShadowingOrOverridesOnMethodsRule.java:40)
	at com.carrotsearch.randomizedtesting.rules.NoShadowingOrOverridesOnMethodsRule$1.evaluate(NoShadowingOrOverridesOnMethodsRule.java:40)
	at com.carrotsearch.randomizedtesting.rules.StatementAdapter.evaluate(StatementAdapter.java:36)
	at com.carrotsearch.randomizedtesting.rules.StatementAdapter.evaluate(StatementAdapter.java:36)
	at com.carrotsearch.randomizedtesting.rules.StatementAdapter.evaluate(StatementAdapter.java:36)
	at org.apache.lucene.util.TestRuleAssertionsRequired$1.evaluate(TestRuleAssertionsRequired.java:53)
	at org.apache.lucene.util.TestRuleMarkFailure$1.evaluate(TestRuleMarkFailure.java:47)
	at org.apache.lucene.util.TestRuleIgnoreAfterMaxFailures$1.evaluate(TestRuleIgnoreAfterMaxFailures.java:64)
	at org.apache.lucene.util.TestRuleIgnoreTestSuites$1.evaluate(TestRuleIgnoreTestSuites.java:54)
	at com.carrotsearch.randomizedtesting.rules.StatementAdapter.evaluate(StatementAdapter.java:36)
	at com.carrotsearch.randomizedtesting.ThreadLeakControl$StatementRunner.run(ThreadLeakControl.java:367)
	at java.lang.Thread.run(Thread.java:745)
Caused by: org.apache.solr.client.solrj.SolrServerException: IOException occured when talking to server at: https://127.0.0.1:42789/solr/test_col_shard1_replica2
	at org.apache.solr.client.solrj.impl.HttpSolrClient.executeMethod(HttpSolrClient.java:620)
	at org.apache.solr.client.solrj.impl.HttpSolrClient.request(HttpSolrClient.java:259)
	at org.apache.solr.client.solrj.impl.HttpSolrClient.request(HttpSolrClient.java:248)
	at org.apache.solr.client.solrj.impl.LBHttpSolrClient.doRequest(LBHttpSolrClient.java:413)
	at org.apache.solr.client.solrj.impl.LBHttpSolrClient.request(LBHttpSolrClient.java:366)
	at org.apache.solr.client.solrj.impl.CloudSolrClient.directUpdate(CloudSolrClient.java:742)
	... 46 more
Caused by: javax.net.ssl.SSLHandshakeException: Remote host closed connection during handshake
	at sun.security.ssl.SSLSocketImpl.readRecord(SSLSocketImpl.java:992)
	at sun.security.ssl.SSLSocketImpl.performInitialHandshake(SSLSocketImpl.java:1375)
	at sun.security.ssl.SSLSocketImpl.startHandshake(SSLSocketImpl.java:1403)
	at sun.security.ssl.SSLSocketImpl.startHandshake(SSLSocketImpl.java:1387)
	at org.apache.http.conn.ssl.SSLConnectionSocketFactory.createLayeredSocket(SSLConnectionSocketFactory.java:394)
	at org.apache.http.conn.ssl.SSLConnectionSocketFactory.connectSocket(SSLConnectionSocketFactory.java:353)
	at org.apache.http.impl.conn.DefaultHttpClientConnectionOperator.connect(DefaultHttpClientConnectionOperator.java:134)
	at org.apache.http.impl.conn.PoolingHttpClientConnectionManager.connect(PoolingHttpClientConnectionManager.java:353)
	at org.apache.http.impl.execchain.MainClientExec.establishRoute(MainClientExec.java:380)
	at org.apache.http.impl.execchain.MainClientExec.execute(MainClientExec.java:236)
	at org.apache.http.impl.execchain.ProtocolExec.execute(ProtocolExec.java:184)
	at org.apache.http.impl.execchain.RetryExec.execute(RetryExec.java:88)
	at org.apache.http.impl.execchain.RedirectExec.execute(RedirectExec.java:110)
	at org.apache.http.impl.client.InternalHttpClient.doExecute(InternalHttpClient.java:184)
	at org.apache.http.impl.client.CloseableHttpClient.execute(CloseableHttpClient.java:82)
	at org.apache.http.impl.client.CloseableHttpClient.execute(CloseableHttpClient.java:55)
	at org.apache.solr.client.solrj.impl.HttpSolrClient.executeMethod(HttpSolrClient.java:511)
	... 51 more
Caused by: java.io.EOFException: SSL peer shut down incorrectly
	at sun.security.ssl.InputRecord.read(InputRecord.java:505)
	at sun.security.ssl.SSLSocketImpl.readRecord(SSLSocketImpl.java:973)
	... 67 more


FAILED:  org.apache.solr.cloud.TestTolerantUpdateProcessorCloud.testSanity

Error Message:
IOException occured when talking to server at: https://127.0.0.1:42789/solr/test_col

Stack Trace:
org.apache.solr.client.solrj.SolrServerException: IOException occured when talking to server at: https://127.0.0.1:42789/solr/test_col
	at __randomizedtesting.SeedInfo.seed([907128AFC0619FEC:19928F52CF4699C2]:0)
	at org.apache.solr.client.solrj.impl.HttpSolrClient.executeMethod(HttpSolrClient.java:620)
	at org.apache.solr.client.solrj.impl.HttpSolrClient.request(HttpSolrClient.java:259)
	at org.apache.solr.client.solrj.impl.HttpSolrClient.request(HttpSolrClient.java:248)
	at org.apache.solr.client.solrj.impl.LBHttpSolrClient.doRequest(LBHttpSolrClient.java:413)
	at org.apache.solr.client.solrj.impl.LBHttpSolrClient.request(LBHttpSolrClient.java:366)
	at org.apache.solr.client.solrj.impl.CloudSolrClient.sendRequest(CloudSolrClient.java:1228)
	at org.apache.solr.client.solrj.impl.CloudSolrClient.requestWithRetryOnStaleState(CloudSolrClient.java:998)
	at org.apache.solr.client.solrj.impl.CloudSolrClient.request(CloudSolrClient.java:934)
	at org.apache.solr.client.solrj.SolrRequest.process(SolrRequest.java:149)
	at org.apache.solr.client.solrj.SolrClient.deleteByQuery(SolrClient.java:895)
	at org.apache.solr.client.solrj.SolrClient.deleteByQuery(SolrClient.java:858)
	at org.apache.solr.client.solrj.SolrClient.deleteByQuery(SolrClient.java:873)
	at org.apache.solr.cloud.TestTolerantUpdateProcessorCloud.clearCollection(TestTolerantUpdateProcessorCloud.java:225)
	at sun.reflect.NativeMethodAccessorImpl.invoke0(Native Method)
	at sun.reflect.NativeMethodAccessorImpl.invoke(NativeMethodAccessorImpl.java:62)
	at sun.reflect.DelegatingMethodAccessorImpl.invoke(DelegatingMethodAccessorImpl.java:43)
	at java.lang.reflect.Method.invoke(Method.java:498)
	at com.carrotsearch.randomizedtesting.RandomizedRunner.invoke(RandomizedRunner.java:1764)
	at com.carrotsearch.randomizedtesting.RandomizedRunner$9.evaluate(RandomizedRunner.java:905)
	at com.carrotsearch.randomizedtesting.RandomizedRunner$10.evaluate(RandomizedRunner.java:921)
	at com.carrotsearch.randomizedtesting.rules.SystemPropertiesRestoreRule$1.evaluate(SystemPropertiesRestoreRule.java:57)
	at org.apache.lucene.util.TestRuleSetupTeardownChained$1.evaluate(TestRuleSetupTeardownChained.java:49)
	at org.apache.lucene.util.AbstractBeforeAfterRule$1.evaluate(AbstractBeforeAfterRule.java:45)
	at org.apache.lucene.util.TestRuleThreadAndTestName$1.evaluate(TestRuleThreadAndTestName.java:48)
	at org.apache.lucene.util.TestRuleIgnoreAfterMaxFailures$1.evaluate(TestRuleIgnoreAfterMaxFailures.java:64)
	at org.apache.lucene.util.TestRuleMarkFailure$1.evaluate(TestRuleMarkFailure.java:47)
	at com.carrotsearch.randomizedtesting.rules.StatementAdapter.evaluate(StatementAdapter.java:36)
	at com.carrotsearch.randomizedtesting.ThreadLeakControl$StatementRunner.run(ThreadLeakControl.java:367)
	at com.carrotsearch.randomizedtesting.ThreadLeakControl.forkTimeoutingTask(ThreadLeakControl.java:809)
	at com.carrotsearch.randomizedtesting.ThreadLeakControl$3.evaluate(ThreadLeakControl.java:460)
	at com.carrotsearch.randomizedtesting.RandomizedRunner.runSingleTest(RandomizedRunner.java:880)
	at com.carrotsearch.randomizedtesting.RandomizedRunner$5.evaluate(RandomizedRunner.java:781)
	at com.carrotsearch.randomizedtesting.RandomizedRunner$6.evaluate(RandomizedRunner.java:816)
	at com.carrotsearch.randomizedtesting.RandomizedRunner$7.evaluate(RandomizedRunner.java:827)
	at com.carrotsearch.randomizedtesting.rules.StatementAdapter.evaluate(StatementAdapter.java:36)
	at com.carrotsearch.randomizedtesting.rules.SystemPropertiesRestoreRule$1.evaluate(SystemPropertiesRestoreRule.java:57)
	at org.apache.lucene.util.AbstractBeforeAfterRule$1.evaluate(AbstractBeforeAfterRule.java:45)
	at com.carrotsearch.randomizedtesting.rules.StatementAdapter.evaluate(StatementAdapter.java:36)
	at org.apache.lucene.util.TestRuleStoreClassName$1.evaluate(TestRuleStoreClassName.java:41)
	at com.carrotsearch.randomizedtesting.rules.NoShadowingOrOverridesOnMethodsRule$1.evaluate(NoShadowingOrOverridesOnMethodsRule.java:40)
	at com.carrotsearch.randomizedtesting.rules.NoShadowingOrOverridesOnMethodsRule$1.evaluate(NoShadowingOrOverridesOnMethodsRule.java:40)
	at com.carrotsearch.randomizedtesting.rules.StatementAdapter.evaluate(StatementAdapter.java:36)
	at com.carrotsearch.randomizedtesting.rules.StatementAdapter.evaluate(StatementAdapter.java:36)
	at com.carrotsearch.randomizedtesting.rules.StatementAdapter.evaluate(StatementAdapter.java:36)
	at org.apache.lucene.util.TestRuleAssertionsRequired$1.evaluate(TestRuleAssertionsRequired.java:53)
	at org.apache.lucene.util.TestRuleMarkFailure$1.evaluate(TestRuleMarkFailure.java:47)
	at org.apache.lucene.util.TestRuleIgnoreAfterMaxFailures$1.evaluate(TestRuleIgnoreAfterMaxFailures.java:64)
	at org.apache.lucene.util.TestRuleIgnoreTestSuites$1.evaluate(TestRuleIgnoreTestSuites.java:54)
	at com.carrotsearch.randomizedtesting.rules.StatementAdapter.evaluate(StatementAdapter.java:36)
	at com.carrotsearch.randomizedtesting.ThreadLeakControl$StatementRunner.run(ThreadLeakControl.java:367)
	at java.lang.Thread.run(Thread.java:745)
Caused by: org.apache.http.conn.ConnectTimeoutException: Connect to 127.0.0.1:42789 [/127.0.0.1] failed: Read timed out
	at org.apache.http.impl.conn.DefaultHttpClientConnectionOperator.connect(DefaultHttpClientConnectionOperator.java:143)
	at org.apache.http.impl.conn.PoolingHttpClientConnectionManager.connect(PoolingHttpClientConnectionManager.java:353)
	at org.apache.http.impl.execchain.MainClientExec.establishRoute(MainClientExec.java:380)
	at org.apache.http.impl.execchain.MainClientExec.execute(MainClientExec.java:236)
	at org.apache.http.impl.execchain.ProtocolExec.execute(ProtocolExec.java:184)
	at org.apache.http.impl.execchain.RetryExec.execute(RetryExec.java:88)
	at org.apache.http.impl.execchain.RedirectExec.execute(RedirectExec.java:110)
	at org.apache.http.impl.client.InternalHttpClient.doExecute(InternalHttpClient.java:184)
	at org.apache.http.impl.client.CloseableHttpClient.execute(CloseableHttpClient.java:82)
	at org.apache.http.impl.client.CloseableHttpClient.execute(CloseableHttpClient.java:55)
	at org.apache.solr.client.solrj.impl.HttpSolrClient.executeMethod(HttpSolrClient.java:511)
	... 50 more
Caused by: java.net.SocketTimeoutException: Read timed out
	at java.net.SocketInputStream.socketRead0(Native Method)
	at java.net.SocketInputStream.socketRead(SocketInputStream.java:116)
	at java.net.SocketInputStream.read(SocketInputStream.java:170)
	at java.net.SocketInputStream.read(SocketInputStream.java:141)
	at sun.security.ssl.InputRecord.readFully(InputRecord.java:465)
	at sun.security.ssl.InputRecord.read(InputRecord.java:503)
	at sun.security.ssl.SSLSocketImpl.readRecord(SSLSocketImpl.java:973)
	at sun.security.ssl.SSLSocketImpl.performInitialHandshake(SSLSocketImpl.java:1375)
	at sun.security.ssl.SSLSocketImpl.startHandshake(SSLSocketImpl.java:1403)
	at sun.security.ssl.SSLSocketImpl.startHandshake(SSLSocketImpl.java:1387)
	at org.apache.http.conn.ssl.SSLConnectionSocketFactory.createLayeredSocket(SSLConnectionSocketFactory.java:394)
	at org.apache.http.conn.ssl.SSLConnectionSocketFactory.connectSocket(SSLConnectionSocketFactory.java:353)
	at org.apache.http.impl.conn.DefaultHttpClientConnectionOperator.connect(DefaultHttpClientConnectionOperator.java:134)
	... 60 more




Build Log:
[...truncated 12129 lines...]
   [junit4] Suite: org.apache.solr.cloud.TestTolerantUpdateProcessorCloud
   [junit4]   2> Creating dataDir: /home/jenkins/workspace/Lucene-Solr-master-Linux/solr/build/solr-core/test/J0/temp/solr.cloud.TestTolerantUpdateProcessorCloud_907128AFC0619FEC-001/init-core-data-001
   [junit4]   2> 1711249 WARN  (SUITE-TestTolerantUpdateProcessorCloud-seed#[907128AFC0619FEC]-worker) [    ] o.a.s.SolrTestCaseJ4 startTrackingSearchers: numOpens=4 numCloses=4
   [junit4]   2> 1711250 INFO  (SUITE-TestTolerantUpdateProcessorCloud-seed#[907128AFC0619FEC]-worker) [    ] o.a.s.SolrTestCaseJ4 Randomized ssl (true) and clientAuth (true) via: @org.apache.solr.util.RandomizeSSL(reason=, ssl=NaN, value=NaN, clientAuth=NaN)
   [junit4]   2> 1711251 INFO  (SUITE-TestTolerantUpdateProcessorCloud-seed#[907128AFC0619FEC]-worker) [    ] o.a.s.c.ZkTestServer STARTING ZK TEST SERVER
   [junit4]   2> 1711251 INFO  (Thread-5004) [    ] o.a.s.c.ZkTestServer client port:0.0.0.0/0.0.0.0:0
   [junit4]   2> 1711251 INFO  (Thread-5004) [    ] o.a.s.c.ZkTestServer Starting server
   [junit4]   2> 1711351 INFO  (SUITE-TestTolerantUpdateProcessorCloud-seed#[907128AFC0619FEC]-worker) [    ] o.a.s.c.ZkTestServer start zk server on port:43359
   [junit4]   2> 1711352 INFO  (SUITE-TestTolerantUpdateProcessorCloud-seed#[907128AFC0619FEC]-worker) [    ] o.a.s.c.c.SolrZkClient Using default ZkCredentialsProvider
   [junit4]   2> 1711352 INFO  (SUITE-TestTolerantUpdateProcessorCloud-seed#[907128AFC0619FEC]-worker) [    ] o.a.s.c.c.ConnectionManager Waiting for client to connect to ZooKeeper
   [junit4]   2> 1711353 INFO  (zkCallback-2307-thread-1) [    ] o.a.s.c.c.ConnectionManager Watcher org.apache.solr.common.cloud.ConnectionManager@116b5f6f name:ZooKeeperConnection Watcher:127.0.0.1:43359 got event WatchedEvent state:SyncConnected type:None path:null path:null type:None
   [junit4]   2> 1711353 INFO  (SUITE-TestTolerantUpdateProcessorCloud-seed#[907128AFC0619FEC]-worker) [    ] o.a.s.c.c.ConnectionManager Client is connected to ZooKeeper
   [junit4]   2> 1711354 INFO  (SUITE-TestTolerantUpdateProcessorCloud-seed#[907128AFC0619FEC]-worker) [    ] o.a.s.c.c.SolrZkClient Using default ZkACLProvider
   [junit4]   2> 1711354 INFO  (SUITE-TestTolerantUpdateProcessorCloud-seed#[907128AFC0619FEC]-worker) [    ] o.a.s.c.c.SolrZkClient makePath: /solr/solr.xml
   [junit4]   2> 1711354 INFO  (SUITE-TestTolerantUpdateProcessorCloud-seed#[907128AFC0619FEC]-worker) [    ] o.a.s.c.c.SolrZkClient makePath: /solr/clusterprops.json
   [junit4]   2> 1711358 INFO  (jetty-launcher-2306-thread-2) [    ] o.e.j.s.Server jetty-9.3.8.v20160314
   [junit4]   2> 1711358 INFO  (jetty-launcher-2306-thread-1) [    ] o.e.j.s.Server jetty-9.3.8.v20160314
   [junit4]   2> 1711359 INFO  (jetty-launcher-2306-thread-5) [    ] o.e.j.s.Server jetty-9.3.8.v20160314
   [junit4]   2> 1711359 INFO  (jetty-launcher-2306-thread-2) [    ] o.e.j.s.h.ContextHandler Started o.e.j.s.ServletContextHandler@3587f3ec{/solr,null,AVAILABLE}
   [junit4]   2> 1711360 INFO  (jetty-launcher-2306-thread-4) [    ] o.e.j.s.Server jetty-9.3.8.v20160314
   [junit4]   2> 1711360 INFO  (jetty-launcher-2306-thread-3) [    ] o.e.j.s.Server jetty-9.3.8.v20160314
   [junit4]   2> 1711360 INFO  (jetty-launcher-2306-thread-1) [    ] o.e.j.s.h.ContextHandler Started o.e.j.s.ServletContextHandler@c94665c{/solr,null,AVAILABLE}
   [junit4]   2> 1711362 INFO  (jetty-launcher-2306-thread-3) [    ] o.e.j.s.h.ContextHandler Started o.e.j.s.ServletContextHandler@385cccfb{/solr,null,AVAILABLE}
   [junit4]   2> 1711363 INFO  (jetty-launcher-2306-thread-5) [    ] o.e.j.s.h.ContextHandler Started o.e.j.s.ServletContextHandler@6fa023a2{/solr,null,AVAILABLE}
   [junit4]   2> 1711366 INFO  (jetty-launcher-2306-thread-2) [    ] o.e.j.s.ServerConnector Started ServerConnector@5c1d51ab{SSL,[ssl, http/1.1]}{127.0.0.1:๔๐๓๙๗}
   [junit4]   2> 1711366 INFO  (jetty-launcher-2306-thread-2) [    ] o.e.j.s.Server Started @๑๗๑๓๑๒๕ms
   [junit4]   2> 1711366 INFO  (jetty-launcher-2306-thread-2) [    ] o.a.s.c.s.e.JettySolrRunner Jetty properties: {hostContext=/solr, hostPort=40397}
   [junit4]   2> 1711366 INFO  (jetty-launcher-2306-thread-1) [    ] o.e.j.s.ServerConnector Started ServerConnector@5a5b28a3{SSL,[ssl, http/1.1]}{127.0.0.1:๓๖๕๕๖}
   [junit4]   2> 1711366 INFO  (jetty-launcher-2306-thread-1) [    ] o.e.j.s.Server Started @๑๗๑๓๑๒๕ms
   [junit4]   2> 1711366 INFO  (jetty-launcher-2306-thread-2) [    ] o.a.s.s.SolrDispatchFilter SolrDispatchFilter.init(): sun.misc.Launcher$AppClassLoader@73d16e93
   [junit4]   2> 1711366 INFO  (jetty-launcher-2306-thread-1) [    ] o.a.s.c.s.e.JettySolrRunner Jetty properties: {hostContext=/solr, hostPort=36556}
   [junit4]   2> 1711366 INFO  (jetty-launcher-2306-thread-2) [    ] o.a.s.c.SolrResourceLoader new SolrResourceLoader for directory: '/home/jenkins/workspace/Lucene-Solr-master-Linux/solr/build/solr-core/test/J0/temp/solr.cloud.TestTolerantUpdateProcessorCloud_907128AFC0619FEC-001/tempDir-001/node2'
   [junit4]   2> 1711366 INFO  (jetty-launcher-2306-thread-3) [    ] o.e.j.s.ServerConnector Started ServerConnector@3d9a2668{SSL,[ssl, http/1.1]}{127.0.0.1:๔๕๑๖๑}
   [junit4]   2> 1711366 INFO  (jetty-launcher-2306-thread-1) [    ] o.a.s.s.SolrDispatchFilter SolrDispatchFilter.init(): sun.misc.Launcher$AppClassLoader@73d16e93
   [junit4]   2> 1711366 INFO  (jetty-launcher-2306-thread-3) [    ] o.e.j.s.Server Started @๑๗๑๓๑๒๕ms
   [junit4]   2> 1711366 INFO  (jetty-launcher-2306-thread-1) [    ] o.a.s.c.SolrResourceLoader new SolrResourceLoader for directory: '/home/jenkins/workspace/Lucene-Solr-master-Linux/solr/build/solr-core/test/J0/temp/solr.cloud.TestTolerantUpdateProcessorCloud_907128AFC0619FEC-001/tempDir-001/node1'
   [junit4]   2> 1711366 INFO  (jetty-launcher-2306-thread-3) [    ] o.a.s.c.s.e.JettySolrRunner Jetty properties: {hostContext=/solr, hostPort=45161}
   [junit4]   2> 1711366 INFO  (jetty-launcher-2306-thread-2) [    ] o.a.s.c.SolrResourceLoader JNDI not configured for solr (NoInitialContextEx)
   [junit4]   2> 1711366 INFO  (jetty-launcher-2306-thread-5) [    ] o.e.j.s.ServerConnector Started ServerConnector@5e2e23b3{SSL,[ssl, http/1.1]}{127.0.0.1:๓๔๖๗๔}
   [junit4]   2> 1711366 INFO  (jetty-launcher-2306-thread-3) [    ] o.a.s.s.SolrDispatchFilter SolrDispatchFilter.init(): sun.misc.Launcher$AppClassLoader@73d16e93
   [junit4]   2> 1711366 INFO  (jetty-launcher-2306-thread-2) [    ] o.a.s.c.SolrResourceLoader solr home defaulted to 'solr/' (could not find system property or JNDI)
   [junit4]   2> 1711367 INFO  (jetty-launcher-2306-thread-3) [    ] o.a.s.c.SolrResourceLoader new SolrResourceLoader for directory: '/home/jenkins/workspace/Lucene-Solr-master-Linux/solr/build/solr-core/test/J0/temp/solr.cloud.TestTolerantUpdateProcessorCloud_907128AFC0619FEC-001/tempDir-001/node5'
   [junit4]   2> 1711366 INFO  (jetty-launcher-2306-thread-1) [    ] o.a.s.c.SolrResourceLoader JNDI not configured for solr (NoInitialContextEx)
   [junit4]   2> 1711367 INFO  (jetty-launcher-2306-thread-3) [    ] o.a.s.c.SolrResourceLoader JNDI not configured for solr (NoInitialContextEx)
   [junit4]   2> 1711367 INFO  (jetty-launcher-2306-thread-2) [    ] o.a.s.c.c.SolrZkClient Using default ZkCredentialsProvider
   [junit4]   2> 1711367 INFO  (jetty-launcher-2306-thread-3) [    ] o.a.s.c.SolrResourceLoader solr home defaulted to 'solr/' (could not find system property or JNDI)
   [junit4]   2> 1711367 INFO  (jetty-launcher-2306-thread-1) [    ] o.a.s.c.SolrResourceLoader solr home defaulted to 'solr/' (could not find system property or JNDI)
   [junit4]   2> 1711368 INFO  (jetty-launcher-2306-thread-3) [    ] o.a.s.c.c.SolrZkClient Using default ZkCredentialsProvider
   [junit4]   2> 1711368 INFO  (jetty-launcher-2306-thread-2) [    ] o.a.s.c.c.ConnectionManager Waiting for client to connect to ZooKeeper
   [junit4]   2> 1711369 INFO  (jetty-launcher-2306-thread-1) [    ] o.a.s.c.c.SolrZkClient Using default ZkCredentialsProvider
   [junit4]   2> 1711367 INFO  (jetty-launcher-2306-thread-5) [    ] o.e.j.s.Server Started @๑๗๑๓๑๒๖ms
   [junit4]   2> 1711369 INFO  (jetty-launcher-2306-thread-5) [    ] o.a.s.c.s.e.JettySolrRunner Jetty properties: {hostContext=/solr, hostPort=34674}
   [junit4]   2> 1711369 INFO  (jetty-launcher-2306-thread-5) [    ] o.a.s.s.SolrDispatchFilter SolrDispatchFilter.init(): sun.misc.Launcher$AppClassLoader@73d16e93
   [junit4]   2> 1711369 INFO  (jetty-launcher-2306-thread-5) [    ] o.a.s.c.SolrResourceLoader new SolrResourceLoader for directory: '/home/jenkins/workspace/Lucene-Solr-master-Linux/solr/build/solr-core/test/J0/temp/solr.cloud.TestTolerantUpdateProcessorCloud_907128AFC0619FEC-001/tempDir-001/node4'
   [junit4]   2> 1711369 INFO  (jetty-launcher-2306-thread-5) [    ] o.a.s.c.SolrResourceLoader JNDI not configured for solr (NoInitialContextEx)
   [junit4]   2> 1711369 INFO  (jetty-launcher-2306-thread-5) [    ] o.a.s.c.SolrResourceLoader solr home defaulted to 'solr/' (could not find system property or JNDI)
   [junit4]   2> 1711369 INFO  (jetty-launcher-2306-thread-5) [    ] o.a.s.c.c.SolrZkClient Using default ZkCredentialsProvider
   [junit4]   2> 1711370 INFO  (jetty-launcher-2306-thread-3) [    ] o.a.s.c.c.ConnectionManager Waiting for client to connect to ZooKeeper
   [junit4]   2> 1711370 INFO  (zkCallback-2309-thread-1) [    ] o.a.s.c.c.ConnectionManager Watcher org.apache.solr.common.cloud.ConnectionManager@3ff1cedf name:ZooKeeperConnection Watcher:127.0.0.1:43359/solr got event WatchedEvent state:SyncConnected type:None path:null path:null type:None
   [junit4]   2> 1711370 INFO  (zkCallback-2308-thread-1) [    ] o.a.s.c.c.ConnectionManager Watcher org.apache.solr.common.cloud.ConnectionManager@4a50d885 name:ZooKeeperConnection Watcher:127.0.0.1:43359/solr got event WatchedEvent state:SyncConnected type:None path:null path:null type:None
   [junit4]   2> 1711370 INFO  (jetty-launcher-2306-thread-3) [    ] o.a.s.c.c.ConnectionManager Client is connected to ZooKeeper
   [junit4]   2> 1711370 INFO  (jetty-launcher-2306-thread-2) [    ] o.a.s.c.c.ConnectionManager Client is connected to ZooKeeper
   [junit4]   2> 1711370 INFO  (jetty-launcher-2306-thread-3) [    ] o.a.s.c.c.SolrZkClient Using default ZkACLProvider
   [junit4]   2> 1711370 INFO  (jetty-launcher-2306-thread-2) [    ] o.a.s.c.c.SolrZkClient Using default ZkACLProvider
   [junit4]   2> 1711371 INFO  (jetty-launcher-2306-thread-3) [    ] o.a.s.s.SolrDispatchFilter solr.xml found in ZooKeeper. Loading...
   [junit4]   2> 1711371 INFO  (jetty-launcher-2306-thread-2) [    ] o.a.s.s.SolrDispatchFilter solr.xml found in ZooKeeper. Loading...
   [junit4]   2> 1711371 INFO  (jetty-launcher-2306-thread-4) [    ] o.e.j.s.h.ContextHandler Started o.e.j.s.ServletContextHandler@6f8b3699{/solr,null,AVAILABLE}
   [junit4]   2> 1711372 INFO  (jetty-launcher-2306-thread-4) [    ] o.e.j.s.ServerConnector Started ServerConnector@98f86c6{SSL,[ssl, http/1.1]}{127.0.0.1:๔๒๗๘๙}
   [junit4]   2> 1711372 INFO  (jetty-launcher-2306-thread-4) [    ] o.e.j.s.Server Started @๑๗๑๓๑๓๑ms
   [junit4]   2> 1711372 INFO  (jetty-launcher-2306-thread-4) [    ] o.a.s.c.s.e.JettySolrRunner Jetty properties: {hostContext=/solr, hostPort=42789}
   [junit4]   2> 1711372 INFO  (jetty-launcher-2306-thread-4) [    ] o.a.s.s.SolrDispatchFilter SolrDispatchFilter.init(): sun.misc.Launcher$AppClassLoader@73d16e93
   [junit4]   2> 1711372 INFO  (jetty-launcher-2306-thread-4) [    ] o.a.s.c.SolrResourceLoader new SolrResourceLoader for directory: '/home/jenkins/workspace/Lucene-Solr-master-Linux/solr/build/solr-core/test/J0/temp/solr.cloud.TestTolerantUpdateProcessorCloud_907128AFC0619FEC-001/tempDir-001/node3'
   [junit4]   2> 1711373 INFO  (jetty-launcher-2306-thread-4) [    ] o.a.s.c.SolrResourceLoader JNDI not configured for solr (NoInitialContextEx)
   [junit4]   2> 1711373 INFO  (jetty-launcher-2306-thread-4) [    ] o.a.s.c.SolrResourceLoader solr home defaulted to 'solr/' (could not find system property or JNDI)
   [junit4]   2> 1711373 INFO  (jetty-launcher-2306-thread-4) [    ] o.a.s.c.c.SolrZkClient Using default ZkCredentialsProvider
   [junit4]   2> 1711373 INFO  (jetty-launcher-2306-thread-4) [    ] o.a.s.c.c.ConnectionManager Waiting for client to connect to ZooKeeper
   [junit4]   2> 1711373 INFO  (jetty-launcher-2306-thread-5) [    ] o.a.s.c.c.ConnectionManager Waiting for client to connect to ZooKeeper
   [junit4]   2> 1711383 INFO  (jetty-launcher-2306-thread-1) [    ] o.a.s.c.c.ConnectionManager Waiting for client to connect to ZooKeeper
   [junit4]   2> 1711384 INFO  (zkCallback-2312-thread-1) [    ] o.a.s.c.c.ConnectionManager Watcher org.apache.solr.common.cloud.ConnectionManager@ddaf591 name:ZooKeeperConnection Watcher:127.0.0.1:43359/solr got event WatchedEvent state:SyncConnected type:None path:null path:null type:None
   [junit4]   2> 1711384 INFO  (jetty-launcher-2306-thread-4) [    ] o.a.s.c.c.ConnectionManager Client is connected to ZooKeeper
   [junit4]   2> 1711384 INFO  (jetty-launcher-2306-thread-4) [    ] o.a.s.c.c.SolrZkClient Using default ZkACLProvider
   [junit4]   2> 1711385 INFO  (jetty-launcher-2306-thread-4) [    ] o.a.s.s.SolrDispatchFilter solr.xml found in ZooKeeper. Loading...
   [junit4]   2> 1711385 INFO  (jetty-launcher-2306-thread-2) [    ] o.a.s.c.CorePropertiesLocator Config-defined core root directory: /home/jenkins/workspace/Lucene-Solr-master-Linux/solr/build/solr-core/test/J0/temp/solr.cloud.TestTolerantUpdateProcessorCloud_907128AFC0619FEC-001/tempDir-001/node2/.
   [junit4]   2> 1711385 INFO  (jetty-launcher-2306-thread-3) [    ] o.a.s.c.CorePropertiesLocator Config-defined core root directory: /home/jenkins/workspace/Lucene-Solr-master-Linux/solr/build/solr-core/test/J0/temp/solr.cloud.TestTolerantUpdateProcessorCloud_907128AFC0619FEC-001/tempDir-001/node5/.
   [junit4]   2> 1711385 INFO  (jetty-launcher-2306-thread-2) [    ] o.a.s.c.CoreContainer New CoreContainer 1171251221
   [junit4]   2> 1711385 INFO  (jetty-launcher-2306-thread-3) [    ] o.a.s.c.CoreContainer New CoreContainer 956443948
   [junit4]   2> 1711385 INFO  (jetty-launcher-2306-thread-2) [    ] o.a.s.c.CoreContainer Loading cores into CoreContainer [instanceDir=/home/jenkins/workspace/Lucene-Solr-master-Linux/solr/build/solr-core/test/J0/temp/solr.cloud.TestTolerantUpdateProcessorCloud_907128AFC0619FEC-001/tempDir-001/node2]
   [junit4]   2> 1711385 WARN  (NIOServerCxn.Factory:0.0.0.0/0.0.0.0:0) [    ] o.a.z.s.NIOServerCnxn caught end of stream exception
   [junit4]   2> EndOfStreamException: Unable to read additional data from client sessionid 0x15531af8fc00002, likely client has closed socket
   [junit4]   2> 	at org.apache.zookeeper.server.NIOServerCnxn.doIO(NIOServerCnxn.java:228)
   [junit4]   2> 	at org.apache.zookeeper.server.NIOServerCnxnFactory.run(NIOServerCnxnFactory.java:208)
   [junit4]   2> 	at java.lang.Thread.run(Thread.java:745)
   [junit4]   2> 1711386 INFO  (zkCallback-2311-thread-1) [    ] o.a.s.c.c.ConnectionManager Watcher org.apache.solr.common.cloud.ConnectionManager@103726aa name:ZooKeeperConnection Watcher:127.0.0.1:43359/solr got event WatchedEvent state:SyncConnected type:None path:null path:null type:None
   [junit4]   2> 1711386 INFO  (jetty-launcher-2306-thread-5) [    ] o.a.s.c.c.ConnectionManager Client is connected to ZooKeeper
   [junit4]   2> 1711386 INFO  (zkCallback-2310-thread-1) [    ] o.a.s.c.c.ConnectionManager Watcher org.apache.solr.common.cloud.ConnectionManager@371bf47a name:ZooKeeperConnection Watcher:127.0.0.1:43359/solr got event WatchedEvent state:SyncConnected type:None path:null path:null type:None
   [junit4]   2> 1711385 WARN  (jetty-launcher-2306-thread-2) [    ] o.a.s.c.CoreContainer Couldn't add files from /home/jenkins/workspace/Lucene-Solr-master-Linux/solr/build/solr-core/test/J0/temp/solr.cloud.TestTolerantUpdateProcessorCloud_907128AFC0619FEC-001/tempDir-001/node2/lib to classpath: /home/jenkins/workspace/Lucene-Solr-master-Linux/solr/build/solr-core/test/J0/temp/solr.cloud.TestTolerantUpdateProcessorCloud_907128AFC0619FEC-001/tempDir-001/node2/lib
   [junit4]   2> 1711385 INFO  (jetty-launcher-2306-thread-3) [    ] o.a.s.c.CoreContainer Loading cores into CoreContainer [instanceDir=/home/jenkins/workspace/Lucene-Solr-master-Linux/solr/build/solr-core/test/J0/temp/solr.cloud.TestTolerantUpdateProcessorCloud_907128AFC0619FEC-001/tempDir-001/node5]
   [junit4]   2> 1711387 INFO  (jetty-launcher-2306-thread-1) [    ] o.a.s.c.c.ConnectionManager Client is connected to ZooKeeper
   [junit4]   2> 1711387 INFO  (jetty-launcher-2306-thread-2) [    ] o.a.s.h.c.HttpShardHandlerFactory created with socketTimeout : 90000,urlScheme : https,connTimeout : 15000,maxConnectionsPerHost : 20,maxConnections : 10000,corePoolSize : 0,maximumPoolSize : 2147483647,maxThreadIdleTime : 5,sizeOfQueue : -1,fairnessPolicy : false,
   [junit4]   2> 1711387 WARN  (jetty-launcher-2306-thread-3) [    ] o.a.s.c.CoreContainer Couldn't add files from /home/jenkins/workspace/Lucene-Solr-master-Linux/solr/build/solr-core/test/J0/temp/solr.cloud.TestTolerantUpdateProcessorCloud_907128AFC0619FEC-001/tempDir-001/node5/lib to classpath: /home/jenkins/workspace/Lucene-Solr-master-Linux/solr/build/solr-core/test/J0/temp/solr.cloud.TestTolerantUpdateProcessorCloud_907128AFC0619FEC-001/tempDir-001/node5/lib
   [junit4]   2> 1711387 INFO  (jetty-launcher-2306-thread-1) [    ] o.a.s.c.c.SolrZkClient Using default ZkACLProvider
   [junit4]   2> 1711387 INFO  (jetty-launcher-2306-thread-3) [    ] o.a.s.h.c.HttpShardHandlerFactory created with socketTimeout : 90000,urlScheme : https,connTimeout : 15000,maxConnectionsPerHost : 20,maxConnections : 10000,corePoolSize : 0,maximumPoolSize : 2147483647,maxThreadIdleTime : 5,sizeOfQueue : -1,fairnessPolicy : false,
   [junit4]   2> 1711387 INFO  (jetty-launcher-2306-thread-5) [    ] o.a.s.c.c.SolrZkClient Using default ZkACLProvider
   [junit4]   2> 1711387 INFO  (jetty-launcher-2306-thread-5) [    ] o.a.s.s.SolrDispatchFilter solr.xml found in ZooKeeper. Loading...
   [junit4]   2> 1711388 INFO  (jetty-launcher-2306-thread-2) [    ] o.a.s.u.UpdateShardHandler Creating UpdateShardHandler HTTP client with params: 
   [junit4]   2> 1711388 INFO  (jetty-launcher-2306-thread-3) [    ] o.a.s.u.UpdateShardHandler Creating UpdateShardHandler HTTP client with params: 
   [junit4]   2> 1711389 INFO  (jetty-launcher-2306-thread-2) [    ] o.a.s.l.LogWatcher SLF4J impl is org.slf4j.impl.Log4jLoggerFactory
   [junit4]   2> 1711389 INFO  (jetty-launcher-2306-thread-3) [    ] o.a.s.l.LogWatcher SLF4J impl is org.slf4j.impl.Log4jLoggerFactory
   [junit4]   2> 1711389 INFO  (jetty-launcher-2306-thread-3) [    ] o.a.s.l.LogWatcher Registering Log Listener [Log4j (org.slf4j.impl.Log4jLoggerFactory)]
   [junit4]   2> 1711389 INFO  (jetty-launcher-2306-thread-1) [    ] o.a.s.s.SolrDispatchFilter solr.xml found in ZooKeeper. Loading...
   [junit4]   2> 1711389 INFO  (jetty-launcher-2306-thread-2) [    ] o.a.s.l.LogWatcher Registering Log Listener [Log4j (org.slf4j.impl.Log4jLoggerFactory)]
   [junit4]   2> 1711389 INFO  (jetty-launcher-2306-thread-2) [    ] o.a.s.c.ZkContainer Zookeeper client=127.0.0.1:43359/solr
   [junit4]   2> 1711389 INFO  (jetty-launcher-2306-thread-3) [    ] o.a.s.c.ZkContainer Zookeeper client=127.0.0.1:43359/solr
   [junit4]   2> 1711389 INFO  (jetty-launcher-2306-thread-2) [    ] o.a.s.c.ZkController zkHost includes chroot
   [junit4]   2> 1711389 INFO  (jetty-launcher-2306-thread-3) [    ] o.a.s.c.ZkController zkHost includes chroot
   [junit4]   2> 1711389 INFO  (jetty-launcher-2306-thread-2) [    ] o.a.s.c.c.SolrZkClient Using default ZkCredentialsProvider
   [junit4]   2> 1711389 INFO  (jetty-launcher-2306-thread-3) [    ] o.a.s.c.c.SolrZkClient Using default ZkCredentialsProvider
   [junit4]   2> 1711390 INFO  (jetty-launcher-2306-thread-2) [    ] o.a.s.c.c.ConnectionManager Waiting for client to connect to ZooKeeper
   [junit4]   2> 1711390 INFO  (jetty-launcher-2306-thread-4) [    ] o.a.s.c.CorePropertiesLocator Config-defined core root directory: /home/jenkins/workspace/Lucene-Solr-master-Linux/solr/build/solr-core/test/J0/temp/solr.cloud.TestTolerantUpdateProcessorCloud_907128AFC0619FEC-001/tempDir-001/node3/.
   [junit4]   2> 1711390 INFO  (jetty-launcher-2306-thread-4) [    ] o.a.s.c.CoreContainer New CoreContainer 139183083
   [junit4]   2> 1711390 INFO  (jetty-launcher-2306-thread-4) [    ] o.a.s.c.CoreContainer Loading cores into CoreContainer [instanceDir=/home/jenkins/workspace/Lucene-Solr-master-Linux/solr/build/solr-core/test/J0/temp/solr.cloud.TestTolerantUpdateProcessorCloud_907128AFC0619FEC-001/tempDir-001/node3]
   [junit4]   2> 1711390 WARN  (jetty-launcher-2306-thread-4) [    ] o.a.s.c.CoreContainer Couldn't add files from /home/jenkins/workspace/Lucene-Solr-master-Linux/solr/build/solr-core/test/J0/temp/solr.cloud.TestTolerantUpdateProcessorCloud_907128AFC0619FEC-001/tempDir-001/node3/lib to classpath: /home/jenkins/workspace/Lucene-Solr-master-Linux/solr/build/solr-core/test/J0/temp/solr.cloud.TestTolerantUpdateProcessorCloud_907128AFC0619FEC-001/tempDir-001/node3/lib
   [junit4]   2> 1711390 INFO  (jetty-launcher-2306-thread-4) [    ] o.a.s.h.c.HttpShardHandlerFactory created with socketTimeout : 90000,urlScheme : https,connTimeout : 15000,maxConnectionsPerHost : 20,maxConnections : 10000,corePoolSize : 0,maximumPoolSize : 2147483647,maxThreadIdleTime : 5,sizeOfQueue : -1,fairnessPolicy : false,
   [junit4]   2> 1711391 WARN  (NIOServerCxn.Factory:0.0.0.0/0.0.0.0:0) [    ] o.a.z.s.NIOServerCnxn caught end of stream exception
   [junit4]   2> EndOfStreamException: Unable to read additional data from client sessionid 0x15531af8fc00004, likely client has closed socket
   [junit4]   2> 	at org.apache.zookeeper.server.NIOServerCnxn.doIO(NIOServerCnxn.java:228)
   [junit4]   2> 	at org.apache.zookeeper.server.NIOServerCnxnFactory.run(NIOServerCnxnFactory.java:208)
   [junit4]   2> 	at java.lang.Thread.run(Thread.java:745)
   [junit4]   2> 1711391 INFO  (jetty-launcher-2306-thread-3) [    ] o.a.s.c.c.ConnectionManager Waiting for client to connect to ZooKeeper
   [junit4]   2> 1711392 INFO  (jetty-launcher-2306-thread-5) [    ] o.a.s.c.CorePropertiesLocator Config-defined core root directory: /home/jenkins/workspace/Lucene-Solr-master-Linux/solr/build/solr-core/test/J0/temp/solr.cloud.TestTolerantUpdateProcessorCloud_907128AFC0619FEC-001/tempDir-001/node4/.
   [junit4]   2> 1711392 INFO  (jetty-launcher-2306-thread-5) [    ] o.a.s.c.CoreContainer New CoreContainer 1616138058
   [junit4]   2> 1711392 INFO  (jetty-launcher-2306-thread-5) [    ] o.a.s.c.CoreContainer Loading cores into CoreContainer [instanceDir=/home/jenkins/workspace/Lucene-Solr-master-Linux/solr/build/solr-core/test/J0/temp/solr.cloud.TestTolerantUpdateProcessorCloud_907128AFC0619FEC-001/tempDir-001/node4]
   [junit4]   2> 1711393 WARN  (jetty-launcher-2306-thread-5) [    ] o.a.s.c.CoreContainer Couldn't add files from /home/jenkins/workspace/Lucene-Solr-master-Linux/solr/build/solr-core/test/J0/temp/solr.cloud.TestTolerantUpdateProcessorCloud_907128AFC0619FEC-001/tempDir-001/node4/lib to classpath: /home/jenkins/workspace/Lucene-Solr-master-Linux/solr/build/solr-core/test/J0/temp/solr.cloud.TestTolerantUpdateProcessorCloud_907128AFC0619FEC-001/tempDir-001/node4/lib
   [junit4]   2> 1711393 INFO  (jetty-launcher-2306-thread-5) [    ] o.a.s.h.c.HttpShardHandlerFactory created with socketTimeout : 90000,urlScheme : https,connTimeout : 15000,maxConnectionsPerHost : 20,maxConnections : 10000,corePoolSize : 0,maximumPoolSize : 2147483647,maxThreadIdleTime : 5,sizeOfQueue : -1,fairnessPolicy : false,
   [junit4]   2> 1711393 INFO  (zkCallback-2318-thread-1) [    ] o.a.s.c.c.ConnectionManager Watcher org.apache.solr.common.cloud.ConnectionManager@7809b107 name:ZooKeeperConnection Watcher:127.0.0.1:43359 got event WatchedEvent state:SyncConnected type:None path:null path:null type:None
   [junit4]   2> 1711393 INFO  (jetty-launcher-2306-thread-3) [    ] o.a.s.c.c.ConnectionManager Client is connected to ZooKeeper
   [junit4]   2> 1711393 INFO  (jetty-launcher-2306-thread-3) [    ] o.a.s.c.c.SolrZkClient Using default ZkACLProvider
   [junit4]   2> 1711394 INFO  (jetty-launcher-2306-thread-5) [    ] o.a.s.u.UpdateShardHandler Creating UpdateShardHandler HTTP client with params: 
   [junit4]   2> 1711394 INFO  (jetty-launcher-2306-thread-4) [    ] o.a.s.u.UpdateShardHandler Creating UpdateShardHandler HTTP client with params: 
   [junit4]   2> 1711394 INFO  (zkCallback-2317-thread-1) [    ] o.a.s.c.c.ConnectionManager Watcher org.apache.solr.common.cloud.ConnectionManager@39f04f8e name:ZooKeeperConnection Watcher:127.0.0.1:43359 got event WatchedEvent state:SyncConnected type:None path:null path:null type:None
   [junit4]   2> 1711394 INFO  (jetty-launcher-2306-thread-2) [    ] o.a.s.c.c.ConnectionManager Client is connected to ZooKeeper
   [junit4]   2> 1711394 INFO  (jetty-launcher-2306-thread-2) [    ] o.a.s.c.c.SolrZkClient Using default ZkACLProvider
   [junit4]   2> 1711394 INFO  (jetty-launcher-2306-thread-5) [    ] o.a.s.l.LogWatcher SLF4J impl is org.slf4j.impl.Log4jLoggerFactory
   [junit4]   2> 1711394 INFO  (jetty-launcher-2306-thread-5) [    ] o.a.s.l.LogWatcher Registering Log Listener [Log4j (org.slf4j.impl.Log4jLoggerFactory)]
   [junit4]   2> 1711394 INFO  (jetty-launcher-2306-thread-4) [    ] o.a.s.l.LogWatcher SLF4J impl is org.slf4j.impl.Log4jLoggerFactory
   [junit4]   2> 1711394 INFO  (jetty-launcher-2306-thread-4) [    ] o.a.s.l.LogWatcher Registering Log Listener [Log4j (org.slf4j.impl.Log4jLoggerFactory)]
   [junit4]   2> 1711394 INFO  (jetty-launcher-2306-thread-5) [    ] o.a.s.c.ZkContainer Zookeeper client=127.0.0.1:43359/solr
   [junit4]   2> 1711394 INFO  (jetty-launcher-2306-thread-4) [    ] o.a.s.c.ZkContainer Zookeeper client=127.0.0.1:43359/solr
   [junit4]   2> 1711395 INFO  (jetty-launcher-2306-thread-5) [    ] o.a.s.c.ZkController zkHost includes chroot
   [junit4]   2> 1711395 INFO  (jetty-launcher-2306-thread-4) [    ] o.a.s.c.ZkController zkHost includes chroot
   [junit4]   2> 1711395 INFO  (jetty-launcher-2306-thread-5) [    ] o.a.s.c.c.SolrZkClient Using default ZkCredentialsProvider
   [junit4]   2> 1711395 INFO  (jetty-launcher-2306-thread-4) [    ] o.a.s.c.c.SolrZkClient Using default ZkCredentialsProvider
   [junit4]   2> 1711395 INFO  (jetty-launcher-2306-thread-3) [n:127.0.0.1:45161_solr    ] o.a.s.c.ZkController Added new OnReconnect listener org.apache.solr.cloud.ZkController$$Lambda$60/448245138@7b13ad02
   [junit4]   2> 1711395 INFO  (jetty-launcher-2306-thread-2) [n:127.0.0.1:40397_solr    ] o.a.s.c.ZkController Added new OnReconnect listener org.apache.solr.cloud.ZkController$$Lambda$60/448245138@2149a67a
   [junit4]   2> 1711395 INFO  (jetty-launcher-2306-thread-5) [    ] o.a.s.c.c.ConnectionManager Waiting for client to connect to ZooKeeper
   [junit4]   2> 1711395 INFO  (jetty-launcher-2306-thread-3) [n:127.0.0.1:45161_solr    ] o.a.s.c.c.ConnectionManager Waiting for client to connect to ZooKeeper
   [junit4]   2> 1711395 INFO  (jetty-launcher-2306-thread-1) [    ] o.a.s.c.CorePropertiesLocator Config-defined core root directory: /home/jenkins/workspace/Lucene-Solr-master-Linux/solr/build/solr-core/test/J0/temp/solr.cloud.TestTolerantUpdateProcessorCloud_907128AFC0619FEC-001/tempDir-001/node1/.
   [junit4]   2> 1711395 INFO  (jetty-launcher-2306-thread-4) [    ] o.a.s.c.c.ConnectionManager Waiting for client to connect to ZooKeeper
   [junit4]   2> 1711395 INFO  (jetty-launcher-2306-thread-1) [    ] o.a.s.c.CoreContainer New CoreContainer 1028155016
   [junit4]   2> 1711395 INFO  (jetty-launcher-2306-thread-1) [    ] o.a.s.c.CoreContainer Loading cores into CoreContainer [instanceDir=/home/jenkins/workspace/Lucene-Solr-master-Linux/solr/build/solr-core/test/J0/temp/solr.cloud.TestTolerantUpdateProcessorCloud_907128AFC0619FEC-001/tempDir-001/node1]
   [junit4]   2> 1711395 INFO  (jetty-launcher-2306-thread-2) [n:127.0.0.1:40397_solr    ] o.a.s.c.c.ConnectionManager Waiting for client to connect to ZooKeeper
   [junit4]   2> 1711395 WARN  (jetty-launcher-2306-thread-1) [    ] o.a.s.c.CoreContainer Couldn't add files from /home/jenkins/workspace/Lucene-Solr-master-Linux/solr/build/solr-core/test/J0/temp/solr.cloud.TestTolerantUpdateProcessorCloud_907128AFC0619FEC-001/tempDir-001/node1/lib to classpath: /home/jenkins/workspace/Lucene-Solr-master-Linux/solr/build/solr-core/test/J0/temp/solr.cloud.TestTolerantUpdateProcessorCloud_907128AFC0619FEC-001/tempDir-001/node1/lib
   [junit4]   2> 1711396 INFO  (jetty-launcher-2306-thread-1) [    ] o.a.s.h.c.HttpShardHandlerFactory created with socketTimeout : 90000,urlScheme : https,connTimeout : 15000,maxConnectionsPerHost : 20,maxConnections : 10000,corePoolSize : 0,maximumPoolSize : 2147483647,maxThreadIdleTime : 5,sizeOfQueue : -1,fairnessPolicy : false,
   [junit4]   2> 1711396 INFO  (zkCallback-2325-thread-1-processing-n:127.0.0.1:45161_solr) [n:127.0.0.1:45161_solr    ] o.a.s.c.c.ConnectionManager Watcher org.apache.solr.common.cloud.ConnectionManager@1230769d name:ZooKeeperConnection Watcher:127.0.0.1:43359/solr got event WatchedEvent state:SyncConnected type:None path:null path:null type:None
   [junit4]   2> 1711396 INFO  (zkCallback-2323-thread-1) [    ] o.a.s.c.c.ConnectionManager Watcher org.apache.solr.common.cloud.ConnectionManager@ec514aa name:ZooKeeperConnection Watcher:127.0.0.1:43359 got event WatchedEvent state:SyncConnected type:None path:null path:null type:None
   [junit4]   2> 1711396 INFO  (zkCallback-2324-thread-1) [    ] o.a.s.c.c.ConnectionManager Watcher org.apache.solr.common.cloud.ConnectionManager@1c23119a name:ZooKeeperConnection Watcher:127.0.0.1:43359 got event WatchedEvent state:SyncConnected type:None path:null path:null type:None
   [junit4]   2> 1711396 INFO  (jetty-launcher-2306-thread-5) [    ] o.a.s.c.c.ConnectionManager Client is connected to ZooKeeper
   [junit4]   2> 1711396 INFO  (zkCallback-2326-thread-1-processing-n:127.0.0.1:40397_solr) [n:127.0.0.1:40397_solr    ] o.a.s.c.c.ConnectionManager Watcher org.apache.solr.common.cloud.ConnectionManager@b996065 name:ZooKeeperConnection Watcher:127.0.0.1:43359/solr got event WatchedEvent state:SyncConnected type:None path:null path:null type:None
   [junit4]   2> 1711396 INFO  (jetty-launcher-2306-thread-4) [    ] o.a.s.c.c.ConnectionManager Client is connected to ZooKeeper
   [junit4]   2> 1711396 INFO  (jetty-launcher-2306-thread-5) [    ] o.a.s.c.c.SolrZkClient Using default ZkACLProvider
   [junit4]   2> 1711396 INFO  (jetty-launcher-2306-thread-3) [n:127.0.0.1:45161_solr    ] o.a.s.c.c.ConnectionManager Client is connected to ZooKeeper
   [junit4]   2> 1711396 INFO  (jetty-launcher-2306-thread-4) [    ] o.a.s.c.c.SolrZkClient Using default ZkACLProvider
   [junit4]   2> 1711396 INFO  (jetty-launcher-2306-thread-2) [n:127.0.0.1:40397_solr    ] o.a.s.c.c.ConnectionManager Client is connected to ZooKeeper
   [junit4]   2> 1711396 INFO  (jetty-launcher-2306-thread-1) [    ] o.a.s.u.UpdateShardHandler Creating UpdateShardHandler HTTP client with params: 
   [junit4]   2> 1711397 INFO  (jetty-launcher-2306-thread-5) [n:127.0.0.1:34674_solr    ] o.a.s.c.ZkController Added new OnReconnect listener org.apache.solr.cloud.ZkController$$Lambda$60/448245138@29578bed
   [junit4]   2> 1711397 INFO  (jetty-launcher-2306-thread-2) [n:127.0.0.1:40397_solr    ] o.a.s.c.c.SolrZkClient makePath: /overseer/queue
   [junit4]   2> 1711397 INFO  (jetty-launcher-2306-thread-5) [n:127.0.0.1:34674_solr    ] o.a.s.c.c.ConnectionManager Waiting for client to connect to ZooKeeper
   [junit4]   2> 1711397 INFO  (jetty-launcher-2306-thread-3) [n:127.0.0.1:45161_solr    ] o.a.s.c.c.SolrZkClient makePath: /overseer/queue
   [junit4]   2> 1711398 INFO  (jetty-launcher-2306-thread-1) [    ] o.a.s.l.LogWatcher SLF4J impl is org.slf4j.impl.Log4jLoggerFactory
   [junit4]   2> 1711398 INFO  (jetty-launcher-2306-thread-4) [n:127.0.0.1:42789_solr    ] o.a.s.c.ZkController Added new OnReconnect listener org.apache.solr.cloud.ZkController$$Lambda$60/448245138@509a048d
   [junit4]   2> 1711398 INFO  (jetty-launcher-2306-thread-1) [    ] o.a.s.l.LogWatcher Registering Log Listener [Log4j (org.slf4j.impl.Log4jLoggerFactory)]
   [junit4]   2> 1711398 INFO  (jetty-launcher-2306-thread-1) [    ] o.a.s.c.ZkContainer Zookeeper client=127.0.0.1:43359/solr
   [junit4]   2> 1711398 INFO  (jetty-launcher-2306-thread-4) [n:127.0.0.1:42789_solr    ] o.a.s.c.c.ConnectionManager Waiting for client to connect to ZooKeeper
   [junit4]   2> 1711398 INFO  (jetty-launcher-2306-thread-1) [    ] o.a.s.c.ZkController zkHost includes chroot
   [junit4]   2> 1711398 INFO  (zkCallback-2329-thread-1-processing-n:127.0.0.1:34674_solr) [n:127.0.0.1:34674_solr    ] o.a.s.c.c.ConnectionManager Watcher org.apache.solr.common.cloud.ConnectionManager@72d51d7e name:ZooKeeperConnection Watcher:127.0.0.1:43359/solr got event WatchedEvent state:SyncConnected type:None path:null path:null type:None
   [junit4]   2> 1711398 INFO  (jetty-launcher-2306-thread-1) [    ] o.a.s.c.c.SolrZkClient Using default ZkCredentialsProvider
   [junit4]   2> 1711398 INFO  (jetty-launcher-2306-thread-5) [n:127.0.0.1:34674_solr    ] o.a.s.c.c.ConnectionManager Client is connected to ZooKeeper
   [junit4]   2> 1711398 INFO  (jetty-launcher-2306-thread-1) [    ] o.a.s.c.c.ConnectionManager Waiting for client to connect to ZooKeeper
   [junit4]   2> 1711398 INFO  (zkCallback-2330-thread-1-processing-n:127.0.0.1:42789_solr) [n:127.0.0.1:42789_solr    ] o.a.s.c.c.ConnectionManager Watcher org.apache.solr.common.cloud.ConnectionManager@5670a6e3 name:ZooKeeperConnection Watcher:127.0.0.1:43359/solr got event WatchedEvent state:SyncConnected type:None path:null path:null type:None
   [junit4]   2> 1711399 INFO  (jetty-launcher-2306-thread-4) [n:127.0.0.1:42789_solr    ] o.a.s.c.c.ConnectionManager Client is connected to ZooKeeper
   [junit4]   2> 1711399 INFO  (jetty-launcher-2306-thread-2) [n:127.0.0.1:40397_solr    ] o.a.s.c.c.SolrZkClient makePath: /overseer/collection-queue-work
   [junit4]   2> 1711399 INFO  (zkCallback-2331-thread-1) [    ] o.a.s.c.c.ConnectionManager Watcher org.apache.solr.common.cloud.ConnectionManager@6e48ee5b name:ZooKeeperConnection Watcher:127.0.0.1:43359 got event WatchedEvent state:SyncConnected type:None path:null path:null type:None
   [junit4]   2> 1711399 INFO  (jetty-launcher-2306-thread-1) [    ] o.a.s.c.c.ConnectionManager Client is connected to ZooKeeper
   [junit4]   2> 1711399 INFO  (jetty-launcher-2306-thread-1) [    ] o.a.s.c.c.SolrZkClient Using default ZkACLProvider
   [junit4]   2> 1711399 INFO  (jetty-launcher-2306-thread-3) [n:127.0.0.1:45161_solr    ] o.a.s.c.c.SolrZkClient makePath: /overseer/collection-queue-work
   [junit4]   2> 1711399 INFO  (jetty-launcher-2306-thread-5) [n:127.0.0.1:34674_solr    ] o.a.s.c.c.SolrZkClient makePath: /overseer/collection-queue-work
   [junit4]   2> 1711399 INFO  (jetty-launcher-2306-thread-4) [n:127.0.0.1:42789_solr    ] o.a.s.c.c.SolrZkClient makePath: /overseer/collection-queue-work
   [junit4]   2> 1711400 INFO  (jetty-launcher-2306-thread-1) [n:127.0.0.1:36556_solr    ] o.a.s.c.ZkController Added new OnReconnect listener org.apache.solr.cloud.ZkController$$Lambda$60/448245138@d8ac047
   [junit4]   2> 1711400 INFO  (jetty-launcher-2306-thread-1) [n:127.0.0.1:36556_solr    ] o.a.s.c.c.ConnectionManager Waiting for client to connect to ZooKeeper
   [junit4]   2> 1711401 INFO  (zkCallback-2332-thread-1-processing-n:127.0.0.1:36556_solr) [n:127.0.0.1:36556_solr    ] o.a.s.c.c.ConnectionManager Watcher org.apache.solr.common.cloud.ConnectionManager@28a7318b name:ZooKeeperConnection Watcher:127.0.0.1:43359/solr got event WatchedEvent state:SyncConnected type:None path:null path:null type:None
   [junit4]   2> 1711401 INFO  (jetty-launcher-2306-thread-1) [n:127.0.0.1:36556_solr    ] o.a.s.c.c.ConnectionManager Client is connected to ZooKeeper
   [junit4]   2> 1711401 INFO  (jetty-launcher-2306-thread-3) [n:127.0.0.1:45161_solr    ] o.a.s.c.c.SolrZkClient makePath: /overseer/collection-map-running
   [junit4]   2> 1711402 INFO  (jetty-launcher-2306-thread-4) [n:127.0.0.1:42789_solr    ] o.a.s.c.c.SolrZkClient makePath: /overseer/collection-map-running
   [junit4]   2> 1711402 INFO  (jetty-launcher-2306-thread-2) [n:127.0.0.1:40397_solr    ] o.a.s.c.c.SolrZkClient makePath: /overseer/collection-map-running
   [junit4]   2> 1711402 INFO  (jetty-launcher-2306-thread-5) [n:127.0.0.1:34674_solr    ] o.a.s.c.c.SolrZkClient makePath: /overseer/collection-map-running
   [junit4]   2> 1711403 INFO  (jetty-launcher-2306-thread-2) [n:127.0.0.1:40397_solr    ] o.a.s.c.c.SolrZkClient makePath: /overseer/collection-map-completed
   [junit4]   2> 1711403 INFO  (jetty-launcher-2306-thread-4) [n:127.0.0.1:42789_solr    ] o.a.s.c.c.SolrZkClient makePath: /overseer/collection-map-completed
   [junit4]   2> 1711405 INFO  (jetty-launcher-2306-thread-3) [n:127.0.0.1:45161_solr    ] o.a.s.c.c.SolrZkClient makePath: /overseer/collection-map-completed
   [junit4]   2> 1711405 INFO  (jetty-launcher-2306-thread-5) [n:127.0.0.1:34674_solr    ] o.a.s.c.c.SolrZkClient makePath: /overseer/collection-map-completed
   [junit4]   2> 1711405 INFO  (jetty-launcher-2306-thread-4) [n:127.0.0.1:42789_solr    ] o.a.s.c.c.SolrZkClient makePath: /overseer/collection-map-failure
   [junit4]   2> 1711405 INFO  (jetty-launcher-2306-thread-2) [n:127.0.0.1:40397_solr    ] o.a.s.c.c.SolrZkClient makePath: /overseer/collection-map-failure
   [junit4]   2> 1711406 INFO  (jetty-launcher-2306-thread-1) [n:127.0.0.1:36556_solr    ] o.a.s.c.c.SolrZkClient makePath: /overseer/collection-map-failure
   [junit4]   2> 1711406 INFO  (jetty-launcher-2306-thread-5) [n:127.0.0.1:34674_solr    ] o.a.s.c.c.SolrZkClient makePath: /overseer/collection-map-failure
   [junit4]   2> 1711406 INFO  (jetty-launcher-2306-thread-3) [n:127.0.0.1:45161_solr    ] o.a.s.c.c.SolrZkClient makePath: /overseer/collection-map-failure
   [junit4]   2> 1711406 INFO  (jetty-launcher-2306-thread-2) [n:127.0.0.1:40397_solr    ] o.a.s.c.c.SolrZkClient makePath: /live_nodes
   [junit4]   2> 1711406 INFO  (jetty-launcher-2306-thread-4) [n:127.0.0.1:42789_solr    ] o.a.s.c.c.SolrZkClient makePath: /live_nodes
   [junit4]   2> 1711407 INFO  (jetty-launcher-2306-thread-1) [n:127.0.0.1:36556_solr    ] o.a.s.c.c.SolrZkClient makePath: /collections
   [junit4]   2> 1711407 INFO  (jetty-launcher-2306-thread-3) [n:127.0.0.1:45161_solr    ] o.a.s.c.c.SolrZkClient makePath: /collections
   [junit4]   2> 1711407 INFO  (jetty-launcher-2306-thread-2) [n:127.0.0.1:40397_solr    ] o.a.s.c.c.SolrZkClient makePath: /collections
   [junit4]   2> 1711407 INFO  (jetty-launcher-2306-thread-4) [n:127.0.0.1:42789_solr    ] o.a.s.c.c.SolrZkClient makePath: /collections
   [junit4]   2> 1711407 INFO  (jetty-launcher-2306-thread-5) [n:127.0.0.1:34674_solr    ] o.a.s.c.c.SolrZkClient makePath: /collections
   [junit4]   2> 1711407 INFO  (jetty-launcher-2306-thread-2) [n:127.0.0.1:40397_solr    ] o.a.s.c.c.SolrZkClient makePath: /aliases.json
   [junit4]   2> 1711407 INFO  (jetty-launcher-2306-thread-1) [n:127.0.0.1:36556_solr    ] o.a.s.c.c.SolrZkClient makePath: /aliases.json
   [junit4]   2> 1711407 INFO  (jetty-launcher-2306-thread-4) [n:127.0.0.1:42789_solr    ] o.a.s.c.c.SolrZkClient makePath: /aliases.json
   [junit4]   2> 1711408 INFO  (jetty-launcher-2306-thread-5) [n:127.0.0.1:34674_solr    ] o.a.s.c.c.SolrZkClient makePath: /aliases.json
   [junit4]   2> 1711408 INFO  (jetty-launcher-2306-thread-3) [n:127.0.0.1:45161_solr    ] o.a.s.c.c.SolrZkClient makePath: /aliases.json
   [junit4]   2> 1711410 INFO  (jetty-launcher-2306-thread-3) [n:127.0.0.1:45161_solr    ] o.a.s.c.c.SolrZkClient makePath: /clusterstate.json
   [junit4]   2> 1711410 INFO  (jetty-launcher-2306-thread-5) [n:127.0.0.1:34674_solr    ] o.a.s.c.c.SolrZkClient makePath: /clusterstate.json
   [junit4]   2> 1711410 INFO  (jetty-launcher-2306-thread-1) [n:127.0.0.1:36556_solr    ] o.a.s.c.c.SolrZkClient makePath: /clusterstate.json
   [junit4]   2> 1711410 INFO  (jetty-launcher-2306-thread-4) [n:127.0.0.1:42789_solr    ] o.a.s.c.c.SolrZkClient makePath: /clusterstate.json
   [junit4]   2> 1711410 INFO  (jetty-launcher-2306-thread-2) [n:127.0.0.1:40397_solr    ] o.a.s.c.c.SolrZkClient makePath: /clusterstate.json
   [junit4]   2> 1711410 INFO  (jetty-launcher-2306-thread-1) [n:127.0.0.1:36556_solr    ] o.a.s.c.c.SolrZkClient makePath: /security.json
   [junit4]   2> 1711410 INFO  (jetty-launcher-2306-thread-4) [n:127.0.0.1:42789_solr    ] o.a.s.c.c.SolrZkClient makePath: /security.json
   [junit4]   2> 1711410 INFO  (jetty-launcher-2306-thread-3) [n:127.0.0.1:45161_solr    ] o.a.s.c.c.SolrZkClient makePath: /security.json
   [junit4]   2> 1711410 INFO  (jetty-launcher-2306-thread-5) [n:127.0.0.1:34674_solr    ] o.a.s.c.c.SolrZkClient makePath: /security.json
   [junit4]   2> 1711410 INFO  (jetty-launcher-2306-thread-2) [n:127.0.0.1:40397_solr    ] o.a.s.c.c.SolrZkClient makePath: /security.json
   [junit4]   2> 1711411 INFO  (jetty-launcher-2306-thread-3) [n:127.0.0.1:45161_solr    ] o.a.s.c.c.ZkStateReader Updating cluster state from ZooKeeper... 
   [junit4]   2> 1711411 INFO  (jetty-launcher-2306-thread-4) [n:127.0.0.1:42789_solr    ] o.a.s.c.c.ZkStateReader Updating cluster state from ZooKeeper... 
   [junit4]   2> 1711411 INFO  (jetty-launcher-2306-thread-1) [n:127.0.0.1:36556_solr    ] o.a.s.c.c.ZkStateReader Updating cluster state from ZooKeeper... 
   [junit4]   2> 1711411 INFO  (jetty-launcher-2306-thread-5) [n:127.0.0.1:34674_solr    ] o.a.s.c.c.ZkStateReader Updating cluster state from ZooKeeper... 
   [junit4]   2> 1711411 INFO  (jetty-launcher-2306-thread-2) [n:127.0.0.1:40397_solr    ] o.a.s.c.c.ZkStateReader Updating cluster state from ZooKeeper... 
   [junit4]   2> 1711411 INFO  (jetty-launcher-2306-thread-4) [n:127.0.0.1:42789_solr    ] o.a.s.c.c.ZkStateReader Loaded cluster properties: {urlScheme=https}
   [junit4]   2> 1711411 INFO  (jetty-launcher-2306-thread-5) [n:127.0.0.1:34674_solr    ] o.a.s.c.c.ZkStateReader Loaded cluster properties: {urlScheme=https}
   [junit4]   2> 1711411 INFO  (jetty-launcher-2306-thread-3) [n:127.0.0.1:45161_solr    ] o.a.s.c.c.ZkStateReader Loaded cluster properties: {urlScheme=https}
   [junit4]   2> 1711411 INFO  (jetty-launcher-2306-thread-1) [n:127.0.0.1:36556_solr    ] o.a.s.c.c.ZkStateReader Loaded cluster properties: {urlScheme=https}
   [junit4]   2> 1711412 INFO  (jetty-launcher-2306-thread-5) [n:127.0.0.1:34674_solr    ] o.a.s.c.c.ZkStateReader Updated live nodes from ZooKeeper... (0) -> (0)
   [junit4]   2> 1711412 INFO  (jetty-launcher-2306-thread-4) [n:127.0.0.1:42789_solr    ] o.a.s.c.c.ZkStateReader Updated live nodes from ZooKeeper... (0) -> (0)
   [junit4]   2> 1711412 INFO  (jetty-launcher-2306-thread-1) [n:127.0.0.1:36556_solr    ] o.a.s.c.c.ZkStateReader Updated live nodes from ZooKeeper... (0) -> (0)
   [junit4]   2> 1711411 INFO  (jetty-launcher-2306-thread-2) [n:127.0.0.1:40397_solr    ] o.a.s.c.c.ZkStateReader Loaded cluster properties: {urlScheme=https}
   [junit4]   2> 1711412 INFO  (jetty-launcher-2306-thread-3) [n:127.0.0.1:45161_solr    ] o.a.s.c.c.ZkStateReader Updated live nodes from ZooKeeper... (0) -> (0)
   [junit4]   2> 1711412 INFO  (jetty-launcher-2306-thread-2) [n:127.0.0.1:40397_solr    ] o.a.s.c.c.ZkStateReader Updated live nodes from ZooKeeper... (0) -> (0)
   [junit4]   2> 1711417 INFO  (jetty-launcher-2306-thread-1) [n:127.0.0.1:36556_solr    ] o.a.s.c.c.SolrZkClient makePath: /overseer_elect
   [junit4]   2> 1711417 INFO  (jetty-launcher-2306-thread-3) [n:127.0.0.1:45161_solr    ] o.a.s.c.c.SolrZkClient makePath: /overseer_elect
   [junit4]   2> 1711417 INFO  (jetty-launcher-2306-thread-5) [n:127.0.0.1:34674_solr    ] o.a.s.c.c.SolrZkClient makePath: /overseer_elect
   [junit4]   2> 1711417 INFO  (jetty-launcher-2306-thread-4) [n:127.0.0.1:42789_solr    ] o.a.s.c.c.SolrZkClient makePath: /overseer_elect
   [junit4]   2> 1711417 INFO  (jetty-launcher-2306-thread-2) [n:127.0.0.1:40397_solr    ] o.a.s.c.c.SolrZkClient makePath: /overseer_elect
   [junit4]   2> 1711418 INFO  (jetty-launcher-2306-thread-1) [n:127.0.0.1:36556_solr    ] o.a.s.c.c.SolrZkClient makePath: /overseer_elect/election
   [junit4]   2> 1711418 INFO  (jetty-launcher-2306-thread-3) [n:127.0.0.1:45161_solr    ] o.a.s.c.c.SolrZkClient makePath: /overseer_elect/election
   [junit4]   2> 1711418 INFO  (jetty-launcher-2306-thread-2) [n:127.0.0.1:40397_solr    ] o.a.s.c.c.SolrZkClient makePath: /overseer_elect/election
   [junit4]   2> 1711418 INFO  (jetty-launcher-2306-thread-5) [n:127.0.0.1:34674_solr    ] o.a.s.c.c.SolrZkClient makePath: /overseer_elect/election
   [junit4]   2> 1711418 INFO  (jetty-launcher-2306-thread-4) [n:127.0.0.1:42789_solr    ] o.a.s.c.c.SolrZkClient makePath: /overseer_elect/election
   [junit4]   2> 1711418 INFO  (jetty-launcher-2306-thread-3) [n:127.0.0.1:45161_solr    ] o.a.s.c.Overseer Overseer (id=null) closing
   [junit4]   2> 1711418 INFO  (jetty-launcher-2306-thread-1) [n:127.0.0.1:36556_solr    ] o.a.s.c.Overseer Overseer (id=null) closing
   [junit4]   2> 1711419 INFO  (jetty-launcher-2306-thread-2) [n:127.0.0.1:40397_solr    ] o.a.s.c.Overseer Overseer (id=null) closing
   [junit4]   2> 1711419 INFO  (jetty-launcher-2306-thread-3) [n:127.0.0.1:45161_solr    ] o.a.s.c.LeaderElector Joined leadership election with path: /overseer_elect/election/96037597159096328-127.0.0.1:45161_solr-n_0000000000
   [junit4]   2> 1711419 INFO  (jetty-launcher-2306-thread-5) [n:127.0.0.1:34674_solr    ] o.a.s.c.Overseer Overseer (id=null) closing
   [junit4]   2> 1711419 INFO  (jetty-launcher-2306-thread-1) [n:127.0.0.1:36556_solr    ] o.a.s.c.LeaderElector Joined leadership election with path: /overseer_elect/election/96037597159096335-127.0.0.1:36556_solr-n_0000000001
   [junit4]   2> 1711419 INFO  (jetty-launcher-2306-thread-4) [n:127.0.0.1:42789_solr    ] o.a.s.c.Overseer Overseer (id=null) closing
   [junit4]   2> 1711419 INFO  (jetty-launcher-2306-thread-2) [n:127.0.0.1:40397_solr    ] o.a.s.c.LeaderElector Joined leadership election with path: /overseer_elect/election/96037597159096331-127.0.0.1:40397_solr-n_0000000002
   [junit4]   2> 1711419 INFO  (jetty-launcher-2306-thread-3) [n:127.0.0.1:45161_solr    ] o.a.s.c.OverseerElectionContext I am going to be the leader 127.0.0.1:45161_solr
   [junit4]   2> 1711419 INFO  (jetty-launcher-2306-thread-5) [n:127.0.0.1:34674_solr    ] o.a.s.c.LeaderElector Joined leadership election with path: /overseer_elect/election/96037597159096332-127.0.0.1:34674_solr-n_0000000003
   [junit4]   2> 1711419 INFO  (jetty-launcher-2306-thread-3) [n:127.0.0.1:45161_solr    ] o.a.s.c.c.SolrZkClient makePath: /overseer_elect/leader
   [junit4]   2> 1711419 INFO  (jetty-launcher-2306-thread-4) [n:127.0.0.1:42789_solr    ] o.a.s.c.LeaderElector Joined leadership election with path: /overseer_elect/election/96037597159096333-127.0.0.1:42789_solr-n_0000000004
   [junit4]   2> 1711419 INFO  (jetty-launcher-2306-thread-1) [n:127.0.0.1:36556_solr    ] o.a.s.c.LeaderElector Watching path /overseer_elect/election/96037597159096328-127.0.0.1:45161_solr-n_0000000000 to know if I could be the leader
   [junit4]   2> 1711420 INFO  (jetty-launcher-2306-thread-2) [n:127.0.0.1:40397_solr    ] o.a.s.c.LeaderElector Watching path /overseer_elect/election/96037597159096335-127.0.0.1:36556_solr-n_0000000001 to know if I could be the leader
   [junit4]   2> 1711420 INFO  (jetty-launcher-2306-thread-1) [n:127.0.0.1:36556_solr    ] o.a.s.c.ZkController Register node as live in ZooKeeper:/live_nodes/127.0.0.1:36556_solr
   [junit4]   2> 1711420 INFO  (jetty-launcher-2306-thread-5) [n:127.0.0.1:34674_solr    ] o.a.s.c.LeaderElector Watching path /overseer_elect/election/96037597159096331-127.0.0.1:40397_solr-n_0000000002 to know if I could be the leader
   [junit4]   2> 1711420 INFO  (jetty-launcher-2306-thread-4) [n:127.0.0.1:42789_solr    ] o.a.s.c.LeaderElector Watching path /overseer_elect/election/96037597159096332-127.0.0.1:34674_solr-n_0000000003 to know if I could be the leader
   [junit4]   2> 1711420 INFO  (jetty-launcher-2306-thread-2) [n:127.0.0.1:40397_solr    ] o.a.s.c.ZkController Register node as live in ZooKeeper:/live_nodes/127.0.0.1:40397_solr
   [junit4]   2> 1711420 INFO  (jetty-launcher-2306-thread-3) [n:127.0.0.1:45161_solr    ] o.a.s.c.Overseer Overseer (id=96037597159096328-127.0.0.1:45161_solr-n_0000000000) starting
   [junit4]   2> 1711420 INFO  (jetty-launcher-2306-thread-5) [n:127.0.0.1:34674_solr    ] o.a.s.c.ZkController Register node as live in ZooKeeper:/live_nodes/127.0.0.1:34674_solr
   [junit4]   2> 1711420 INFO  (jetty-launcher-2306-thread-4) [n:127.0.0.1:42789_solr    ] o.a.s.c.ZkController Register node as live in ZooKeeper:/live_nodes/127.0.0.1:42789_solr
   [junit4]   2> 1711420 INFO  (jetty-launcher-2306-thread-1) [n:127.0.0.1:36556_solr    ] o.a.s.c.c.SolrZkClient makePath: /live_nodes/127.0.0.1:36556_solr
   [junit4]   2> 1711420 INFO  (jetty-launcher-2306-thread-2) [n:127.0.0.1:40397_solr    ] o.a.s.c.c.SolrZkClient makePath: /live_nodes/127.0.0.1:40397_solr
   [junit4]   2> 1711420 INFO  (jetty-launcher-2306-thread-5) [n:127.0.0.1:34674_solr    ] o.a.s.c.c.SolrZkClient makePath: /live_nodes/127.0.0.1:34674_solr
   [junit4]   2> 1711421 INFO  (jetty-launcher-2306-thread-4) [n:127.0.0.1:42789_solr    ] o.a.s.c.c.SolrZkClient makePath: /live_nodes/127.0.0.1:42789_solr
   [junit4]   2> 1711421 INFO  (zkCallback-2325-thread-1-processing-n:127.0.0.1:45161_solr) [n:127.0.0.1:45161_solr    ] o.a.s.c.c.ZkStateReader A live node change: [WatchedEvent state:SyncConnected type:NodeChildrenChanged path:/live_nodes], has occurred - updating... (live nodes size: [0])
   [junit4]   2> 1711421 INFO  (zkCallback-2332-thread-1-processing-n:127.0.0.1:36556_solr) [n:127.0.0.1:36556_solr    ] o.a.s.c.c.ZkStateReader A live node change: [WatchedEvent state:SyncConnected type:NodeChildrenChanged path:/live_nodes], has occurred - updating... (live nodes size: [0])
   [junit4]   2> 1711421 INFO  (zkCallback-2329-thread-1-processing-n:127.0.0.1:34674_solr) [n:127.0.0.1:34674_solr    ] o.a.s.c.c.ZkStateReader A live node change: [WatchedEvent state:SyncConnected type:NodeChildrenChanged path:/live_nodes], has occurred - updating... (live nodes size: [0])
   [junit4]   2> 1711421 INFO  (zkCallback-2326-thread-1-processing-n:127.0.0.1:40397_solr) [n:127.0.0.1:40397_solr    ] o.a.s.c.c.ZkStateReader A live node change: [WatchedEvent state:SyncConnected type:NodeChildrenChanged path:/live_nodes], has occurred - updating... (live nodes size: [0])
   [junit4]   2> 1711421 INFO  (jetty-launcher-2306-thread-3) [n:127.0.0.1:45161_solr    ] o.a.s.c.c.SolrZkClient makePath: /overseer/queue-work
   [junit4]   2> 1711422 INFO  (zkCallback-2325-thread-1-processing-n:127.0.0.1:45161_solr) [n:127.0.0.1:45161_solr    ] o.a.s.c.c.ZkStateReader Updated live nodes from ZooKeeper... (0) -> (3)
   [junit4]   2> 1711422 INFO  (zkCallback-2330-thread-1-processing-n:127.0.0.1:42789_solr) [n:127.0.0.1:42789_solr    ] o.a.s.c.c.ZkStateReader A live node change: [WatchedEvent state:SyncConnected type:NodeChildrenChanged path:/live_nodes], has occurred - updating... (live nodes size: [0])
   [junit4]   2> 1711423 INFO  (zkCallback-2332-thread-1-processing-n:127.0.0.1:36556_solr) [n:127.0.0.1:36556_solr    ] o.a.s.c.c.ZkStateReader Updated live nodes from ZooKeeper... (0) -> (3)
   [junit4]   2> 1711426 INFO  (zkCallback-2329-thread-1-processing-n:127.0.0.1:34674_solr) [n:127.0.0.1:34674_solr    ] o.a.s.c.c.ZkStateReader Updated live nodes from ZooKeeper... (0) -> (3)
   [junit4]   2> 1711427 INFO  (zkCallback-2326-thread-1-processing-n:127.0.0.1:40397_solr) [n:127.0.0.1:40397_solr    ] o.a.s.c.c.ZkStateReader Updated live nodes from ZooKeeper... (0) -> (3)
   [junit4]   2> 1711428 INFO  (zkCallback-2332-thread-1-processing-n:127.0.0.1:36556_solr) [n:127.0.0.1:36556_solr    ] o.a.s.c.c.ZkStateReader A live node change: [WatchedEvent state:SyncConnected type:NodeChildrenChanged path:/live_nodes], has occurred - updating... (live nodes size: [3])
   [junit4]   2> 1711429 INFO  (zkCallback-2326-thread-1-processing-n:127.0.0.1:40397_solr) [n:127.0.0.1:40397_solr    ] o.a.s.c.c.ZkStateReader A live node change: [WatchedEvent state:SyncConnected type:NodeChildrenChanged path:/live_nodes], has occurred - updating... (live nodes size: [3])
   [junit4]   2> 1711429 INFO  (zkCallback-2330-thread-2-processing-n:127.0.0.1:42789_solr) [n:127.0.0.1:42789_solr    ] o.a.s.c.c.ZkStateReader A live node change: [WatchedEvent state:SyncConnected type:NodeChildrenChanged path:/live_nodes], has occurred - updating... (live nodes size: [0])
   [junit4]   2> 1711429 INFO  (zkCallback-2329-thread-1-processing-n:127.0.0.1:34674_solr) [n:127.0.0.1:34674_solr    ] o.a.s.c.c.ZkStateReader A live node change: [WatchedEvent state:SyncConnected type:NodeChildrenChanged path:/live_nodes], has occurred - updating... (live nodes size: [3])
   [junit4]   2> 1711428 INFO  (zkCallback-2325-thread-1-processing-n:127.0.0.1:45161_solr) [n:127.0.0.1:45161_solr    ] o.a.s.c.c.ZkStateReader A live node change: [WatchedEvent state:SyncConnected type:NodeChildrenChanged path:/live_nodes], has occurred - updating... (live nodes size: [3])
   [junit4]   2> 1711434 INFO  (zkCallback-2330-thread-1-processing-n:127.0.0.1:42789_solr) [n:127.0.0.1:42789_solr    ] o.a.s.c.c.ZkStateReader Updated live nodes from ZooKeeper... (0) -> (3)
   [junit4]   2> 1711434 INFO  (zkCallback-2332-thread-1-processing-n:127.0.0.1:36556_solr) [n:127.0.0.1:36556_solr    ] o.a.s.c.c.ZkStateReader Updated live nodes from ZooKeeper... (3) -> (4)
   [junit4]   2> 1711435 INFO  (zkCallback-2326-thread-1-processing-n:127.0.0.1:40397_solr) [n:127.0.0.1:40397_solr    ] o.a.s.c.c.ZkStateReader Updated live nodes from ZooKeeper... (3) -> (4)
   [junit4]   2> 1711435 INFO  (zkCallback-2329-thread-1-processing-n:127.0.0.1:34674_solr) [n:127.0.0.1:34674_solr    ] o.a.s.c.c.ZkStateReader Updated live nodes from ZooKeeper... (3) -> (4)
   [junit4]   2> 1711435 INFO  (zkCallback-2330-thread-2-processing-n:127.0.0.1:42789_solr) [n:127.0.0.1:42789_solr    ] o.a.s.c.c.ZkStateReader Updated live nodes from ZooKeeper... (3) -> (4)
   [junit4]   2> 1711435 INFO  (zkCallback-2325-thread-1-processing-n:127.0.0.1:45161_solr) [n:127.0.0.1:45161_solr    ] o.a.s.c.c.ZkStateReader Updated live nodes from ZooKeeper... (3) -> (4)
   [junit4]   2> 1711437 INFO  (jetty-launcher-2306-thread-3) [n:127.0.0.1:45161_solr    ] o.a.s.c.OverseerAutoReplicaFailoverThread Starting OverseerAutoReplicaFailoverThread autoReplicaFailoverWorkLoopDelay=10000 autoReplicaFailoverWaitAfterExpiration=30000 autoReplicaFailoverBadNodeExpiration=60000
   [junit4]   2> 1711438 INFO  (OverseerCollectionConfigSetProcessor-96037597159096328-127.0.0.1:45161_solr-n_0000000000) [n:127.0.0.1:45161_solr    ] o.a.s.c.OverseerTaskProcessor Process current queue of overseer operations
   [junit4]   2> 1711438 INFO  (jetty-launcher-2306-thread-3) [n:127.0.0.1:45161_solr    ] o.a.s.c.ZkController Publish node=127.0.0.1:45161_solr as DOWN
   [junit4]   2> 1711438 INFO  (OverseerStateUpdate-96037597159096328-127.0.0.1:45161_solr-n_0000000000) [n:127.0.0.1:45161_solr    ] o.a.s.c.Overseer Starting to work on the main queue
   [junit4]   2> 1711441 INFO  (jetty-launcher-2306-thread-2) [n:127.0.0.1:40397_solr    ] o.a.s.c.CoreContainer Security conf doesn't exist. Skipping setup for authorization module.
   [junit4]   2> 1711441 INFO  (jetty-launcher-2306-thread-2) [n:127.0.0.1:40397_solr    ] o.a.s.c.CoreContainer No authentication plugin used.
   [junit4]   2> 1711441 INFO  (jetty-launcher-2306-thread-2) [n:127.0.0.1:40397_solr    ] o.a.s.c.CorePropertiesLocator Looking for core definitions underneath /home/jenkins/workspace/Lucene-Solr-master-Linux/solr/build/solr-core/test/J0/temp/solr.cloud.TestTolerantUpdateProcessorCloud_907128AFC0619FEC-001/tempDir-001/node2/.
   [junit4]   2> 1711442 INFO  (jetty-launcher-2306-thread-2) [n:127.0.0.1:40397_solr    ] o.a.s.c.CorePropertiesLocator Found 0 core definitions
   [junit4]   2> 1711442 INFO  (OverseerStateUpdate-96037597159096328-127.0.0.1:45161_solr-n_0000000000) [n:127.0.0.1:45161_solr    ] o.a.s.c.c.ZkStateReader Updated live nodes from ZooKeeper... (4) -> (4)
   [junit4]   2> 1711442 INFO  (jetty-launcher-2306-thread-2) [n:127.0.0.1:40397_solr    ] o.a.s.s.SolrDispatchFilter user.dir=/home/jenkins/workspace/Lucene-Solr-master-Linux/solr/build/solr-core/test/J0
   [junit4]   2> 1711442 INFO  (jetty-launcher-2306-thread-2) [n:127.0.0.1:40397_solr    ] o.a.s.s.SolrDispatchFilter SolrDispatchFilter.init() done
   [junit4]   2> 1711444 INFO  (OverseerStateUpdate-96037597159096328-127.0.0.1:45161_solr-n_0000000000) [n:127.0.0.1:45161_solr    ] o.a.s.c.Overseer processMessage: queueSize: 1, message = {
   [junit4]   2>   "operation":"downnode",
   [junit4]   2>   "node_name":"127.0.0.1:45161_solr"} current state version: 0
   [junit4]   2> 1711444 INFO  (OverseerStateUpdate-96037597159096328-127.0.0.1:45161_solr-n_0000000000) [n:127.0.0.1:45161_solr    ] o.a.s.c.o.NodeMutator DownNode state invoked for node: 127.0.0.1:45161_solr
   [junit4]   2> 1711448 INFO  (jetty-launcher-2306-thread-1) [n:127.0.0.1:36556_solr    ] o.a.s.c.CoreContainer Security conf doesn't exist. Skipping setup for authorization module.
   [junit4]   2> 1711448 INFO  (jetty-launcher-2306-thread-1) [n:127.0.0.1:36556_solr    ] o.a.s.c.CoreContainer No authentication plugin used.
   [junit4]   2> 1711449 INFO  (jetty-launcher-2306-thread-1) [n:127.0.0.1:36556_solr    ] o.a.s.c.CorePropertiesLocator Looking for core definitions underneath /home/jenkins/workspace/Lucene-Solr-master-Linux/solr/build/solr-core/test/J0/temp/solr.cloud.TestTolerantUpdateProcessorCloud_907128AFC0619FEC-001/tempDir-001/node1/.
   [junit4]   2> 1711449 INFO  (jetty-launcher-2306-thread-1) [n:127.0.0.1:36556_solr    ] o.a.s.c.CorePropertiesLocator Found 0 core definitions
   [junit4]   2> 1711450 INFO  (jetty-launcher-2306-thread-1) [n:127.0.0.1:36556_solr    ] o.a.s.s.SolrDispatchFilter user.dir=/home/jenkins/workspace/Lucene-Solr-master-Linux/solr/build/solr-core/test/J0
   [junit4]   2> 1711450 INFO  (jetty-launcher-2306-thread-1) [n:127.0.0.1:36556_solr    ] o.a.s.s.SolrDispatchFilter SolrDispatchFilter.init() done
   [junit4]   2> 1711453 INFO  (jetty-launcher-2306-thread-4) [n:127.0.0.1:42789_solr    ] o.a.s.c.CoreContainer Security conf doesn't exist. Skipping setup for authorization module.
   [junit4]   2> 1711453 INFO  (jetty-launcher-2306-thread-4) [n:127.0.0.1:42789_solr    ] o.a.s.c.CoreContainer No authentication plugin used.
   [junit4]   2> 1711454 INFO  (jetty-launcher-2306-thread-4) [n:127.0.0.1:42789_solr    ] o.a.s.c.CorePropertiesLocator Looking for core definitions underneath /home/jenkins/workspace/Lucene-Solr-master-Linux/solr/build/solr-core/test/J0/temp/solr.cloud.TestTolerantUpdateProcessorCloud_907128AFC0619FEC-001/tempDir-001/node3/.
   [junit4]   2> 1711454 INFO  (jetty-launcher-2306-thread-4) [n:127.0.0.1:42789_solr    ] o.a.s.c.CorePropertiesLocator Found 0 core definitions
   [junit4]   2> 1711455 INFO  (jetty-launcher-2306-thread-4) [n:127.0.0.1:42789_solr    ] o.a.s.s.SolrDispatchFilter user.dir=/home/jenkins/workspace/Lucene-Solr-master-Linux/solr/build/solr-core/test/J0
   [junit4]   2> 1711455 INFO  (jetty-launcher-2306-thread-4) [n:127.0.0.1:42789_solr    ] o.a.s.s.SolrDispatchFilter SolrDispatchFilter.init() done
   [junit4]   2> 1711455 INFO  (jetty-launcher-2306-thread-5) [n:127.0.0.1:34674_solr    ] o.a.s.c.CoreContainer Security conf doesn't exist. Skipping setup for authorization module.
   [junit4]   2> 1711455 INFO  (jetty-launcher-2306-thread-5) [n:127.0.0.1:34674_solr    ] o.a.s.c.CoreContainer No authentication plugin used.
   [junit4]   2> 1711455 INFO  (jetty-launcher-2306-thread-5) [n:127.0.0.1:34674_solr    ] o.a.s.c.CorePropertiesLocator Looking for core definitions underneath /home/jenkins/workspace/Lucene-Solr-master-Linux/solr/build/solr-core/test/J0/temp/solr.cloud.TestTolerantUpdateProcessorCloud_907128AFC0619FEC-001/tempDir-001/node4/.
   [junit4]   2> 1711455 INFO  (jetty-launcher-2306-thread-5) [n:127.0.0.1:34674_solr    ] o.a.s.c.CorePropertiesLocator Found 0 core definitions
   [junit4]   2> 1711456 INFO  (jetty-launcher-2306-thread-5) [n:127.0.0.1:34674_solr    ] o.a.s.s.SolrDispatchFilter user.dir=/home/jenkins/workspace/Lucene-Solr-master-Linux/solr/build/solr-core/test/J0
   [junit4]   2> 1711456 INFO  (jetty-launcher-2306-thread-5) [n:127.0.0.1:34674_solr    ] o.a.s.s.SolrDispatchFilter SolrDispatchFilter.init() done
   [junit4]   2> 1712441 INFO  (jetty-launcher-2306-thread-3) [n:127.0.0.1:45161_solr    ] o.a.s.c.ZkController Register node as live in ZooKeeper:/live_nodes/127.0.0.1:45161_solr
   [junit4]   2> 1712442 INFO  (jetty-launcher-2306-thread-3) [n:127.0.0.1:45161_solr    ] o.a.s.c.c.SolrZkClient makePath: /live_nodes/127.0.0.1:45161_solr
   [junit4]   2> 1712442 INFO  (zkCallback-2332-thread-1-processing-n:127.0.0.1:36556_solr) [n:127.0.0.1:36556_solr    ] o.a.s.c.c.ZkStateReader A live node change: [WatchedEvent state:SyncConnected type:NodeChildrenChanged path:/live_nodes], has occurred - updating... (live nodes size: [4])
   [junit4]   2> 1712442 INFO  (zkCallback-2329-thread-1-processing-n:127.0.0.1:34674_solr) [n:127.0.0.1:34674_solr    ] o.a.s.c.c.ZkStateReader A live node change: [WatchedEvent state:SyncConnected type:NodeChildrenChanged path:/live_nodes], has occurred - updating... (live nodes size: [4])
   [junit4]   2> 1712442 INFO  (zkCallback-2326-thread-1-processing-n:127.0.0.1:40397_solr) [n:127.0.0.1:40397_solr    ] o.a.s.c.c.ZkStateReader A live node change: [WatchedEvent state:SyncConnected type:NodeChildrenChanged path:/live_nodes], has occurred - updating... (live nodes size: [4])
   [junit4]   2> 1712442 INFO  (zkCallback-2330-thread-2-processing-n:127.0.0.1:42789_solr) [n:127.0.0.1:42789_solr    ] o.a.s.c.c.ZkStateReader A live node change: [WatchedEvent state:SyncConnected type:NodeChildrenChanged path:/live_nodes], has occurred - updating... (live nodes size: [4])
   [junit4]   2> 1712442 INFO  (zkCallback-2332-thread-1-processing-n:127.0.0.1:36556_solr) [n:127.0.0.1:36556_solr    ] o.a.s.c.c.ZkStateReader Updated live nodes from ZooKeeper... (4) -> (5)
   [junit4]   2> 1712442 INFO  (zkCallback-2329-thread-1-processing-n:127.0.0.1:34674_solr) [n:127.0.0.1:34674_solr    ] o.a.s.c.c.ZkStateReader Updated live nodes from ZooKeeper... (4) -> (5)
   [junit4]   2> 1712442 INFO  (zkCallback-2326-thread-1-processing-n:127.0.0.1:40397_solr) [n:127.0.0.1:40397_solr    ] o.a.s.c.c.ZkStateReader Updated live nodes from ZooKeeper... (4) -> (5)
   [junit4]   2> 1712442 INFO  (zkCallback-2330-thread-2-processing-n:127.0.0.1:42789_solr) [n:127.0.0.1:42789_solr    ] o.a.s.c.c.ZkStateReader Updated live nodes from ZooKeeper... (4) -> (5)
   [junit4]   2> 1712442 INFO  (zkCallback-2325-thread-1-processing-n:127.0.0.1:45161_solr) [n:127.0.0.1:45161_solr    ] o.a.s.c.c.ZkStateReader A live node change: [WatchedEvent state:SyncConnected type:NodeChildrenChanged path:/live_nodes], has occurred - updating... (live nodes size: [4])
   [junit4]   2> 1712443 INFO  (zkCallback-2325-thread-1-processing-n:127.0.0.1:45161_solr) [n:127.0.0.1:45161_solr    ] o.a.s.c.c.ZkStateReader Updated live nodes from ZooKeeper... (4) -> (5)
   [junit4]   2> 1712451 INFO  (jetty-launcher-2306-thread-3) [n:127.0.0.1:45161_solr    ] o.a.s.c.CoreContainer Security conf doesn't exist. Skipping setup for authorization module.
   [junit4]   2> 1712451 INFO  (jetty-launcher-2306-thread-3) [n:127.0.0.1:45161_solr    ] o.a.s.c.CoreContainer No authentication plugin used.
   [junit4]   2> 1712451 INFO  (jetty-launcher-2306-thread-3) [n:127.0.0.1:45161_solr    ] o.a.s.c.CorePropertiesLocator Looking for core definitions underneath /home/jenkins/workspace/Lucene-Solr-master-Linux/solr/build/solr-core/test/J0/temp/solr.cloud.TestTolerantUpdateProcessorCloud_907128AFC0619FEC-001/tempDir-001/node5/.
   [junit4]   2> 1712452 INFO  (jetty-launcher-2306-thread-3) [n:127.0.0.1:45161_solr    ] o.a.s.c.CorePropertiesLocator Found 0 core definitions
   [junit4]   2> 1712452 INFO  (jetty-launcher-2306-thread-3) [n:127.0.0.1:45161_solr    ] o.a.s.s.SolrDispatchFilter user.dir=/home/jenkins/workspace/Lucene-Solr-master-Linux/solr/build/solr-core/test/J0
   [junit4]   2> 1712452 INFO  (jetty-launcher-2306-thread-3) [n:127.0.0.1:45161_solr    ] o.a.s.s.SolrDispatchFilter SolrDispatchFilter.init() done
   [junit4]   2> 1712452 INFO  (SUITE-TestTolerantUpdateProcessorCloud-seed#[907128AFC0619FEC]-worker) [    ] o.a.s.c.c.SolrZkClient Using default ZkCredentialsProvider
   [junit4]   2> 1712452 INFO  (SUITE-TestTolerantUpdateProcessorCloud-seed#[907128AFC0619FEC]-worker) [    ] o.a.s.c.c.ConnectionManager Waiting for client to connect to ZooKeeper
   [junit4]   2> 1712453 INFO  (zkCallback-2338-thread-1) [    ] o.a.s.c.c.ConnectionManager Watcher org.apache.solr.common.cloud.ConnectionManager@5f5d108e name:ZooKeeperConnection Watcher:127.0.0.1:43359 got event WatchedEvent state:SyncConnected type:None path:null path:null type:None
   [junit4]   2> 1712453 INFO  (SUITE-TestTolerantUpdateProcessorCloud-seed#[907128AFC0619FEC]-worker) [    ] o.a.s.c.c.ConnectionManager Client is connected to ZooKeeper
   [junit4]   2> 1712453 INFO  (SUITE-TestTolerantUpdateProcessorCloud-seed#[907128AFC0619FEC]-worker) [    ] o.a.s.c.c.SolrZkClient Using default ZkACLProvider
   [junit4]   2> 1712454 INFO  (SUITE-TestTolerantUpdateProcessorCloud-seed#[907128AFC0619FEC]-worker) [    ] o.a.s.c.s.i.CloudSolrClient Final constructed zkHost string: 127.0.0.1:43359/solr
   [junit4]   2> 1712454 INFO  (SUITE-TestTolerantUpdateProcessorCloud-seed#[907128AFC0619FEC]-worker) [    ] o.a.s.c.c.SolrZkClient Using default ZkCredentialsProvider
   [junit4]   2> 1712455 INFO  (SUITE-TestTolerantUpdateProcessorCloud-seed#[907128AFC0619FEC]-worker) [    ] o.a.s.c.c.ConnectionManager Waiting for client to connect to ZooKeeper
   [junit4]   2> 1712455 INFO  (zkCallback-2341-thread-1) [    ] o.a.s.c.c.ConnectionManager Watcher org.apache.solr.common.cloud.ConnectionManager@7b88f2d6 name:ZooKeeperConnection Watcher:127.0.0.1:43359/solr got event WatchedEvent state:SyncConnected type:None path:null path:null type:None
   [junit4]   2> 1712455 INFO  (SUITE-TestTolerantUpdateProcessorCloud-seed#[907128AFC0619FEC]-worker) [    ] o.a.s.c.c.ConnectionManager Client is connected to ZooKeeper
   [junit4]   2> 1712455 INFO  (SUITE-TestTolerantUpdateProcessorCloud-seed#[907128AFC0619FEC]-worker) [    ] o.a.s.c.c.SolrZkClient Using default ZkACLProvider
   [junit4]   2> 1712455 INFO  (SUITE-TestTolerantUpdateProcessorCloud-seed#[907128AFC0619FEC]-worker) [    ] o.a.s.c.c.ZkStateReader Updating cluster state from ZooKeeper... 
   [junit4]   2> 1712456 INFO  (SUITE-TestTolerantUpdateProcessorCloud-seed#[907128AFC0619FEC]-worker) [    ] o.a.s.c.c.ZkStateReader Loaded cluster properties: {urlScheme=https}
   [junit4]   2> 1712456 INFO  (SUITE-TestTolerantUpdateProcessorCloud-seed#[907128AFC0619FEC]-worker) [    ] o.a.s.c.c.ZkStateReader Updated live nodes from ZooKeeper... (0) -> (5)
   [junit4]   2> 1712456 INFO  (SUITE-TestTolerantUpdateProcessorCloud-seed#[907128AFC0619FEC]-worker) [    ] o.a.s.c.c.SolrZkClient makePath: /configs/solrCloudCollectionConfig/protwords.txt
   [junit4]   2> 1712457 INFO  (SUITE-TestTolerantUpdateProcessorCloud-seed#[907128AFC0619FEC]-worker) [    ] o.a.s.c.c.SolrZkClient makePath: /configs/solrCloudCollectionConfig/solrconfig-delaying-component.xml
   [junit4]   2> 1712458 INFO  (SUITE-TestTolerantUpdateProcessorCloud-seed#[907128AFC0619FEC]-worker) [    ] o.a.s.c.c.SolrZkClient makePath: /configs/solrCloudCollectionConfig/bad_solrconfig.xml
   [junit4]   2> 1712458 INFO  (SUITE-TestTolerantUpdateProcessorCloud-seed#[907128AFC0619FEC]-worker) [    ] o.a.s.c.c.SolrZkClient makePath: /configs/solrCloudCollectionConfig/solrconfig-sortingmergepolicyfactory.xml
   [junit4]   2> 1712459 INFO  (SUITE-TestTolerantUpdateProcessorCloud-seed#[907128AFC0619FEC]-worker) [    ] o.a.s.c.c.SolrZkClient makePath: /configs/solrCloudCollectionConfig/solrconfig-nocache.xml
   [junit4]   2> 1712460 INFO  (SUITE-TestTolerantUpdateProcessorCloud-seed#[907128AFC0619FEC]-worker) [    ] o.a.s.c.c.SolrZkClient makePath: /configs/solrCloudCollectionConfig/solrconfig-implicitproperties.xml
   [junit4]   2> 1712461 INFO  (SUITE-TestTolerantUpdateProcessorCloud-seed#[907128AFC0619FEC]-worker) [    ] o.a.s.c.c.SolrZkClient makePath: /configs/solrCloudCollectionConfig/solrconfig-mergepolicy-legacy.xml
   [junit4]   2> 1712461 INFO  (SUITE-TestTolerantUpdateProcessorCloud-seed#[907128AFC0619FEC]-worker) [    ] o.a.s.c.c.SolrZkClient makePath: /configs/solrCloudCollectionConfig/bad-schema-uniquekey-uses-default.xml
   [junit4]   2> 1712462 INFO  (SUITE-TestTolerantUpdateProcessorCloud-seed#[907128AFC0619FEC]-worker) [    ] o.a.s.c.c.SolrZkClient makePath: /configs/solrCloudCollectionConfig/bad-schema-sim-default-has-no-explicit-sim.xml
   [junit4]   2> 1712462 INFO  (SUITE-TestTolerantUpdateProcessorCloud-seed#[907128AFC0619FEC]-worker) [    ] o.a.s.c.c.SolrZkClient makePath: /configs/solrCloudCollectionConfig/bad-schema-uniquekey-multivalued.xml
   [junit4]   2> 1712463 INFO  (SUITE-TestTolerantUpdateProcessorCloud-seed#[907128AFC0619FEC]-worker) [    ] o.a.s.c.c.SolrZkClient makePath: /configs/solrCloudCollectionConfig/analyzingInfixSuggest.txt
   [junit4]   2> 1712464 INFO  (SUITE-TestTolerantUpdateProcessorCloud-seed#[907128AFC0619FEC]-worker) [    ] o.a.s.c.c.SolrZkClient makePath: /configs/solrCloudCollectionConfig/missleading.extension.updateprocessor.js.txt
   [junit4]   2> 1712464 INFO  (SUITE-TestTolerantUpdateProcessorCloud-seed#[907128AFC0619FEC]-worker) [    ] o.a.s.c.c.SolrZkClient makePath: /configs/solrCloudCollectionConfig/bad-schema-multiple-asterisk-copyfield-source-should-fail-test.xml
   [junit4]   2> 1712465 INFO  (SUITE-TestTolerantUpdateProcessorCloud-seed#[907128AFC0619FEC]-worker) [    ] o.a.s.c.c.SolrZkClient makePath: /configs/solrCloudCollectionConfig/schema-replication2.xml
   [junit4]   2> 1712465 INFO  (SUITE-TestTolerantUpdateProcessorCloud-seed#[907128AFC0619FEC]-worker) [    ] o.a.s.c.c.SolrZkClient makePath: /configs/solrCloudCollectionConfig/solrconfig-infostream-logging.xml
   [junit4]   2> 1712466 INFO  (SUITE-TestTolerantUpdateProcessorCloud-seed#[907128AFC0619FEC]-worker) [    ] o.a.s.c.c.SolrZkClient makePath: /configs/solrCloudCollectionConfig/solrconfig-collapseqparser.xml
   [junit4]   2> 1712467 INFO  (SUITE-TestTolerantUpdateProcessorCloud-seed#[907128AFC0619FEC]-worker) [    ] o.a.s.c.c.SolrZkClient makePath: /configs/solrCloudCollectionConfig/bad-schema-currency-ft-bogus-code-in-xml.xml
   [junit4]   2> 1712468 INFO  (SUITE-TestTolerantUpdateProcessorCloud-seed#[907128AFC0619FEC]-worker) [    ] o.a.s.c.c.SolrZkClient makePath: /configs/solrCloudCollectionConfig/old_synonyms.txt
   [junit4]   2> 1712468 INFO  (SUITE-TestTolerantUpdateProcessorCloud-seed#[907128AFC0619FEC]-worker) [    ] o.a.s.c.c.SolrZkClient makePath: /configs/solrCloudCollectionConfig/enumsConfig.xml
   [junit4]   2> 1712469 INFO  (SUITE-TestTolerantUpdateProcessorCloud-seed#[907128AFC0619FEC]-worker) [    ] o.a.s.c.c.SolrZkClient makePath: /configs/solrCloudCollectionConfig/solrconfig-script-updateprocessor.xml
   [junit4]   2> 1712469 INFO  (SUITE-TestTolerantUpdateProcessorCloud-seed#[907128AFC0619FEC]-worker) [    ] o.a.s.c.c.SolrZkClient makePath: /configs/solrCloudCollectionConfig/schema-add-schema-fields-update-processor.xml
   [junit4]   2> 1712470 INFO  (SUITE-TestTolerantUpdateProcessorCloud-seed#[907128AFC0619FEC]-worker) [    ] o.a.s.c.c.SolrZkClient makePath: /configs/solrCloudCollectionConfig/solrconfig-mergepolicyfactory-nocfs.xml
   [junit4]   2> 1712471 INFO  (SUITE-TestTolerantUpdateProcessorCloud-seed#[907128AFC0619FEC]-worker) [    ] o.a.s.c.c.SolrZkClient makePath: /configs/solrCloudCollectionConfig/bad-schema-sweetspot-both-tf.xml
   [junit4]   2> 1712472 INFO  (SUITE-TestTolerantUpdateProcessorCloud-seed#[907128AFC0619FEC]-worker) [    ] o.a.s.c.c.SolrZkClient makePath: /configs/solrCloudCollectionConfig/schema-phrasesuggest.xml
   [junit4]   2> 1712473 INFO  (SUITE-TestTolerantUpdateProcessorCloud-seed#[907128AFC0619FEC]-worker) [    ] o.a.s.c.c.SolrZkClient makePath: /configs/solrCloudCollectionConfig/solrconfig.xml
   [junit4]   2> 1712473 INFO  (SUITE-TestTolerantUpdateProcessorCloud-seed#[907128AFC0619FEC]-worker) [    ] o.a.s.c.c.SolrZkClient makePath: /configs/solrCloudCollectionConfig/solrconfig-delpolicy1.xml
   [junit4]   2> 1712474 INFO  (SUITE-TestTolerantUpdateProcessorCloud-seed#[907128AFC0619FEC]-worker) [    ] o.a.s.c.c.SolrZkClient makePath: /configs/solrCloudCollectionConfig/schema-sim.xml
   [junit4]   2> 1712475 INFO  (SUITE-TestTolerantUpdateProcessorCloud-seed#[907128AFC0619FEC]-worker) [    ] o.a.s.c.c.SolrZkClient makePath: /configs/solrCloudCollectionConfig/schema15.xml
   [junit4]   2> 1712476 INFO  (SUITE-TestTolerantUpdateProcessorCloud-seed#[907128AFC0619FEC]-worker) [    ] o.a.s.c.c.SolrZkClient makePath: /configs/solrCloudCollectionConfig/schema-sql.xml
   [junit4]   2> 1712476 INFO  (SUITE-TestTolerantUpdateProcessorCloud-seed#[907128AFC0619FEC]-worker) [    ] o.a.s.c.c.SolrZkClient makePath: /configs/solrCloudCollectionConfig/bad-schema-misplaced-asterisk-copyfield-source-should-fail-test.xml
   [junit4]   2> 1712477 INFO  (SUITE-TestTolerantUpdateProcessorCloud-seed#[907128AFC0619FEC]-worker) [    ] o.a.s.c.c.SolrZkClient makePath: /configs/solrCloudCollectionConfig/stemdict.txt
   [junit4]   2> 1712478 INFO  (SUITE-TestTolerantUpdateProcessorCloud-seed#[907128AFC0619FEC]-worker) [    ] o.a.s.c.c.SolrZkClient makePath: /configs/solrCloudCollectionConfig/hunspell-test.aff
   [junit4]   2> 1712479 INFO  (SUITE-TestTolerantUpdateProcessorCloud-seed#[907128AFC0619FEC]-worker) [    ] o.a.s.c.c.SolrZkClient makePath: /configs/solrCloudCollectionConfig/solrconfig-sql.xml
   [junit4]   2> 1712480 INFO  (SUITE-TestTolerantUpdateProcessorCloud-seed#[907128AFC0619FEC]-worker) [    ] o.a.s.c.c.SolrZkClient makePath: /configs/solrCloudCollectionConfig/solrconfig-spatial.xml
   [junit4]   2> 1712480 INFO  (SUITE-TestTolerantUpdateProcessorCloud-seed#[907128AFC0619FEC]-worker) [    ] o.a.s.c.c.SolrZkClient makePath: /configs/solrCloudCollectionConfig/solrconfig-slave1.xml
   [junit4]   2> 1712481 INFO  (SUITE-TestTolerantUpdateProcessorCloud-seed#[907128AFC0619FEC]-worker) [    ] o.a.s.c.c.SolrZkClient makePath: /configs/solrCloudCo

[...truncated too long message...]

mbda$execute$0(ExecutorUtil.java:229)
   [junit4]   2> 	at java.util.concurrent.ThreadPoolExecutor.runWorker(ThreadPoolExecutor.java:1142)
   [junit4]   2> 	at java.util.concurrent.ThreadPoolExecutor$Worker.run(ThreadPoolExecutor.java:617)
   [junit4]   2> 	at java.lang.Thread.run(Thread.java:745)
   [junit4]   2> 1838715 INFO  (jetty-launcher-2306-thread-6) [    ] o.e.j.s.h.ContextHandler Stopped o.e.j.s.ServletContextHandler@3587f3ec{/solr,null,UNAVAILABLE}
   [junit4]   2> 1838716 INFO  (zkCallback-2325-thread-4-processing-n:127.0.0.1:45161_solr) [n:127.0.0.1:45161_solr    ] o.a.s.c.c.ZkStateReader Updated live nodes from ZooKeeper... (2) -> (1)
   [junit4]   2> 1838720 INFO  (jetty-launcher-2306-thread-10) [    ] o.a.s.c.Overseer Overseer (id=96037597159096328-127.0.0.1:45161_solr-n_0000000000) closing
   [junit4]   2> 1838720 INFO  (OverseerStateUpdate-96037597159096328-127.0.0.1:45161_solr-n_0000000000) [n:127.0.0.1:45161_solr    ] o.a.s.c.Overseer Overseer Loop exiting : 127.0.0.1:45161_solr
   [junit4]   2> 1838721 INFO  (zkCallback-2325-thread-4-processing-n:127.0.0.1:45161_solr) [n:127.0.0.1:45161_solr    ] o.a.s.c.c.ZkStateReader A live node change: [WatchedEvent state:SyncConnected type:NodeChildrenChanged path:/live_nodes], has occurred - updating... (live nodes size: [1])
   [junit4]   2> 1838721 WARN  (zkCallback-2325-thread-4-processing-n:127.0.0.1:45161_solr) [n:127.0.0.1:45161_solr    ] o.a.s.c.c.ZkStateReader ZooKeeper watch triggered, but Solr cannot talk to ZK: [KeeperErrorCode = Session expired for /live_nodes]
   [junit4]   2> 1838721 INFO  (jetty-launcher-2306-thread-10) [    ] o.e.j.s.h.ContextHandler Stopped o.e.j.s.ServletContextHandler@385cccfb{/solr,null,UNAVAILABLE}
   [junit4]   2> 1838722 INFO  (SUITE-TestTolerantUpdateProcessorCloud-seed#[907128AFC0619FEC]-worker) [    ] o.a.s.c.ZkTestServer connecting to 127.0.0.1:43359 43359
   [junit4]   2> 1838754 INFO  (Thread-5004) [    ] o.a.s.c.ZkTestServer connecting to 127.0.0.1:43359 43359
   [junit4]   2> 1838755 WARN  (Thread-5004) [    ] o.a.s.c.ZkTestServer Watch limit violations: 
   [junit4]   2> Maximum concurrent create/delete watches above limit:
   [junit4]   2> 
   [junit4]   2> 	6	/solr/aliases.json
   [junit4]   2> 	5	/solr/security.json
   [junit4]   2> 	4	/solr/configs/solrCloudCollectionConfig/managed-schema
   [junit4]   2> 	4	/solr/configs/solrCloudCollectionConfig
   [junit4]   2> 
   [junit4]   2> Maximum concurrent data watches above limit:
   [junit4]   2> 
   [junit4]   2> 	6	/solr/clusterstate.json
   [junit4]   2> 	6	/solr/clusterprops.json
   [junit4]   2> 	4	/solr/collections/test_col/state.json
   [junit4]   2> 	2	/solr/overseer_elect/election/96037597159096328-127.0.0.1:45161_solr-n_0000000000
   [junit4]   2> 	2	/solr/overseer_elect/election/96037597159096331-127.0.0.1:40397_solr-n_0000000002
   [junit4]   2> 
   [junit4]   2> Maximum concurrent children watches above limit:
   [junit4]   2> 
   [junit4]   2> 	6	/solr/live_nodes
   [junit4]   2> 	6	/solr/collections
   [junit4]   2> 
   [junit4]   2> 1838755 INFO  (SUITE-TestTolerantUpdateProcessorCloud-seed#[907128AFC0619FEC]-worker) [    ] o.a.s.SolrTestCaseJ4 ###deleteCore
   [junit4]   2> NOTE: leaving temporary files on disk at: /home/jenkins/workspace/Lucene-Solr-master-Linux/solr/build/solr-core/test/J0/temp/solr.cloud.TestTolerantUpdateProcessorCloud_907128AFC0619FEC-001
   [junit4]   2> Jun 08, 2016 8:26:04 PM com.carrotsearch.randomizedtesting.ThreadLeakControl checkThreadLeaks
   [junit4]   2> WARNING: Will linger awaiting termination of 5 leaked thread(s).
   [junit4]   2> NOTE: test params are: codec=CheapBastard, sim=RandomSimilarity(queryNorm=false,coord=no): {}, locale=th-TH-u-nu-thai-x-lvariant-TH, timezone=America/Indiana/Vincennes
   [junit4]   2> NOTE: Linux 4.4.0-21-generic amd64/Oracle Corporation 1.8.0_92 (64-bit)/cpus=12,threads=1,free=167176760,total=477626368
   [junit4]   2> NOTE: All tests run in this JVM: [TestRealTimeGet, SOLR749Test, TestOmitPositions, TestReloadDeadlock, TestHighlightDedupGrouping, PathHierarchyTokenizerFactoryTest, TestLRUCache, TestDocSet, CdcrUpdateLogTest, DateRangeFieldTest, JSONWriterTest, TestLuceneMatchVersion, TestRemoteStreaming, AsyncCallRequestStatusResponseTest, BlockJoinFacetDistribTest, DirectoryFactoryTest, TestFastOutputStream, AlternateDirectoryTest, OutputWriterTest, TestAtomicUpdateErrorCases, CloneFieldUpdateProcessorFactoryTest, DisMaxRequestHandlerTest, ResourceLoaderTest, TestMaxScoreQueryParser, RequiredFieldsTest, CoreAdminCreateDiscoverTest, TestClusterStateMutator, GraphQueryTest, TestMiniSolrCloudClusterSSL, TestCustomSort, TestExceedMaxTermLength, TestCSVLoader, SharedFSAutoReplicaFailoverTest, HdfsChaosMonkeySafeLeaderTest, ExternalFileFieldSortTest, TestConfigSetsAPIExclusivity, TestSolrConfigHandler, TestPseudoReturnFields, TestCustomDocTransformer, TestLeaderElectionZkExpiry, OverseerTaskQueueTest, WrapperMergePolicyFactoryTest, CollectionTooManyReplicasTest, TestSmileRequest, TestManagedSchema, TestBinaryField, HdfsBasicDistributedZk2Test, ForceLeaderTest, CdcrVersionReplicationTest, CloudExitableDirectoryReaderTest, DistribJoinFromCollectionTest, RAMDirectoryFactoryTest, TestAnalyzeInfixSuggestions, TestStandardQParsers, TestMiniSolrCloudCluster, OverseerCollectionConfigSetProcessorTest, SignatureUpdateProcessorFactoryTest, CopyFieldTest, TestConfig, PingRequestHandlerTest, TestXmlQParser, ConnectionReuseTest, HdfsRecoverLeaseTest, TestFieldCacheReopen, TestIBSimilarityFactory, TestSQLHandler, TestManagedSynonymFilterFactory, DistributedSpellCheckComponentTest, TestUninvertingReader, TestFunctionQuery, SuggestComponentContextFilterQueryTest, TestFieldCacheSortRandom, SmileWriterTest, RankQueryTest, PrimUtilsTest, ParsingFieldUpdateProcessorsTest, TestLazyCores, TestRandomFaceting, CreateCollectionCleanupTest, QueryResultKeyTest, TestRebalanceLeaders, CdcrReplicationDistributedZkTest, TestReplicationHandler, HdfsUnloadDistributedZkTest, BlockDirectoryTest, UUIDFieldTest, ConcurrentDeleteAndCreateCollectionTest, BitVectorTest, TestPhraseSuggestions, PeerSyncTest, RequestLoggingTest, XsltUpdateRequestHandlerTest, SyncSliceTest, TestDistribIDF, TestClassicSimilarityFactory, TestCloudPivotFacet, SolrCoreTest, TestReplicationHandlerBackup, CursorPagingTest, BasicDistributedZkTest, LeaderElectionIntegrationTest, ShardRoutingTest, ZkSolrClientTest, TestDistributedSearch, TestJoin, StatsComponentTest, TestGroupingSearch, TestSort, TestBadConfig, TestIndexSearcher, CurrencyFieldOpenExchangeTest, CurrencyFieldXmlFileTest, SimplePostToolTest, AnalysisAfterCoreReloadTest, TestExtendedDismaxParser, TestFoldingMultitermQuery, SuggesterTSTTest, SuggesterTest, TestStressLucene, SpatialFilterTest, PolyFieldTest, NoCacheHeaderTest, WordBreakSolrSpellCheckerTest, SchemaVersionSpecificBehaviorTest, QueryEqualityTest, DefaultValueUpdateProcessorTest, StatelessScriptUpdateProcessorFactoryTest, DistanceFunctionTest, CacheHeaderTest, IndexBasedSpellCheckerTest, DocumentAnalysisRequestHandlerTest, PrimitiveFieldTypeTest, TermsComponentTest, RequestHandlersTest, TestIndexingPerformance, FieldAnalysisRequestHandlerTest, FastVectorHighlighterTest, IndexSchemaRuntimeFieldTest, SolrPluginUtilsTest, TestCollationField, ReturnFieldsTest, TestAnalyzedSuggestions, BinaryUpdateRequestHandlerTest, TestComponentsName, TestBinaryResponseWriter, TestLFUCache, PreAnalyzedFieldTest, DateFieldTest, SpellingQueryConverterTest, TestUtils, ZkNodePropsTest, SliceStateTest, SystemInfoHandlerTest, DistributedMLTComponentTest, TestRTGBase, TestCrossCoreJoin, TestCursorMarkWithoutUniqueKey, TestSimpleTrackingShardHandler, BaseCdcrDistributedZkTest, CollectionStateFormat2Test, DeleteInactiveReplicaTest, DeleteStatusTest, LeaderInitiatedRecoveryOnCommitTest, MultiThreadedOCPTest, RestartWhileUpdatingTest, SSLMigrationTest, SaslZkACLProviderTest, SolrCloudExampleTest, TestCloudBackupRestore, TestExclusionRuleCollectionAccess, TestRandomRequestDistribution, TestSSLRandomization, TestSizeLimitedDistributedMap, TestSolrCloudWithKerberosAlt, TestTolerantUpdateProcessorCloud]
   [junit4] Completed [505/612 (1!)] on J0 in 128.03s, 19 tests, 2 errors <<< FAILURES!

[...truncated 330 lines...]
   [junit4] JVM J0: stdout was not empty, see: /home/jenkins/workspace/Lucene-Solr-master-Linux/solr/build/solr-core/test/temp/junit4-J0-20160608_195524_073.sysout
   [junit4] >>> JVM J0 emitted unexpected output (verbatim) ----
   [junit4] java.lang.OutOfMemoryError: GC overhead limit exceeded
   [junit4] Dumping heap to /home/jenkins/workspace/Lucene-Solr-master-Linux/heapdumps/java_pid21103.hprof ...
   [junit4] Heap dump file created [438405688 bytes in 1.167 secs]
   [junit4] <<< JVM J0: EOF ----

[...truncated 11 lines...]
BUILD FAILED
/home/jenkins/workspace/Lucene-Solr-master-Linux/build.xml:740: The following error occurred while executing this line:
/home/jenkins/workspace/Lucene-Solr-master-Linux/build.xml:684: The following error occurred while executing this line:
/home/jenkins/workspace/Lucene-Solr-master-Linux/build.xml:59: The following error occurred while executing this line:
/home/jenkins/workspace/Lucene-Solr-master-Linux/solr/build.xml:233: The following error occurred while executing this line:
/home/jenkins/workspace/Lucene-Solr-master-Linux/solr/common-build.xml:531: The following error occurred while executing this line:
/home/jenkins/workspace/Lucene-Solr-master-Linux/lucene/common-build.xml:1427: The following error occurred while executing this line:
/home/jenkins/workspace/Lucene-Solr-master-Linux/lucene/common-build.xml:984: There were test failures: 612 suites (10 ignored), 2560 tests, 2 errors, 116 ignored (72 assumptions) [seed: 907128AFC0619FEC]

Total time: 57 minutes 26 seconds
Build step 'Invoke Ant' marked build as failure
Archiving artifacts
[WARNINGS] Skipping publisher since build result is FAILURE
Recording test results
Email was triggered for: Failure - Any
Sending email for trigger: Failure - Any



Mime
View raw message