lucene-dev mailing list archives

Site index · List index
Message view « Date » · « Thread »
Top « Date » · « Thread »
From Policeman Jenkins Server <jenk...@thetaphi.de>
Subject [JENKINS] Lucene-Solr-6.x-Linux (32bit/jdk1.8.0_92) - Build # 865 - Failure!
Date Fri, 10 Jun 2016 00:44:26 GMT
Build: http://jenkins.thetaphi.de/job/Lucene-Solr-6.x-Linux/865/
Java: 32bit/jdk1.8.0_92 -client -XX:+UseG1GC

1 tests failed.
FAILED:  junit.framework.TestSuite.org.apache.solr.schema.TestManagedSchemaAPI

Error Message:
ObjectTracker found 4 object(s) that were not released!!! [TransactionLog, MDCAwareThreadPoolExecutor, MockDirectoryWrapper, MockDirectoryWrapper]

Stack Trace:
java.lang.AssertionError: ObjectTracker found 4 object(s) that were not released!!! [TransactionLog, MDCAwareThreadPoolExecutor, MockDirectoryWrapper, MockDirectoryWrapper]
	at __randomizedtesting.SeedInfo.seed([344274A1430716F1]:0)
	at org.junit.Assert.fail(Assert.java:93)
	at org.junit.Assert.assertTrue(Assert.java:43)
	at org.junit.Assert.assertNull(Assert.java:551)
	at org.apache.solr.SolrTestCaseJ4.teardownTestCases(SolrTestCaseJ4.java:257)
	at sun.reflect.GeneratedMethodAccessor21.invoke(Unknown Source)
	at sun.reflect.DelegatingMethodAccessorImpl.invoke(DelegatingMethodAccessorImpl.java:43)
	at java.lang.reflect.Method.invoke(Method.java:498)
	at com.carrotsearch.randomizedtesting.RandomizedRunner.invoke(RandomizedRunner.java:1764)
	at com.carrotsearch.randomizedtesting.RandomizedRunner$7.evaluate(RandomizedRunner.java:834)
	at com.carrotsearch.randomizedtesting.rules.StatementAdapter.evaluate(StatementAdapter.java:36)
	at com.carrotsearch.randomizedtesting.rules.SystemPropertiesRestoreRule$1.evaluate(SystemPropertiesRestoreRule.java:57)
	at org.apache.lucene.util.AbstractBeforeAfterRule$1.evaluate(AbstractBeforeAfterRule.java:45)
	at com.carrotsearch.randomizedtesting.rules.StatementAdapter.evaluate(StatementAdapter.java:36)
	at org.apache.lucene.util.TestRuleStoreClassName$1.evaluate(TestRuleStoreClassName.java:41)
	at com.carrotsearch.randomizedtesting.rules.NoShadowingOrOverridesOnMethodsRule$1.evaluate(NoShadowingOrOverridesOnMethodsRule.java:40)
	at com.carrotsearch.randomizedtesting.rules.NoShadowingOrOverridesOnMethodsRule$1.evaluate(NoShadowingOrOverridesOnMethodsRule.java:40)
	at com.carrotsearch.randomizedtesting.rules.StatementAdapter.evaluate(StatementAdapter.java:36)
	at com.carrotsearch.randomizedtesting.rules.StatementAdapter.evaluate(StatementAdapter.java:36)
	at com.carrotsearch.randomizedtesting.rules.StatementAdapter.evaluate(StatementAdapter.java:36)
	at org.apache.lucene.util.TestRuleAssertionsRequired$1.evaluate(TestRuleAssertionsRequired.java:53)
	at org.apache.lucene.util.TestRuleMarkFailure$1.evaluate(TestRuleMarkFailure.java:47)
	at org.apache.lucene.util.TestRuleIgnoreAfterMaxFailures$1.evaluate(TestRuleIgnoreAfterMaxFailures.java:64)
	at org.apache.lucene.util.TestRuleIgnoreTestSuites$1.evaluate(TestRuleIgnoreTestSuites.java:54)
	at com.carrotsearch.randomizedtesting.rules.StatementAdapter.evaluate(StatementAdapter.java:36)
	at com.carrotsearch.randomizedtesting.ThreadLeakControl$StatementRunner.run(ThreadLeakControl.java:367)
	at java.lang.Thread.run(Thread.java:745)




Build Log:
[...truncated 11090 lines...]
   [junit4] Suite: org.apache.solr.schema.TestManagedSchemaAPI
   [junit4]   2> Creating dataDir: /home/jenkins/workspace/Lucene-Solr-6.x-Linux/solr/build/solr-core/test/J1/temp/solr.schema.TestManagedSchemaAPI_344274A1430716F1-001/init-core-data-001
   [junit4]   2> 671495 INFO  (SUITE-TestManagedSchemaAPI-seed#[344274A1430716F1]-worker) [    ] o.a.s.SolrTestCaseJ4 Randomized ssl (true) and clientAuth (true) via: @org.apache.solr.util.RandomizeSSL(reason=, ssl=NaN, value=NaN, clientAuth=NaN)
   [junit4]   2> 671497 INFO  (SUITE-TestManagedSchemaAPI-seed#[344274A1430716F1]-worker) [    ] o.a.s.c.ZkTestServer STARTING ZK TEST SERVER
   [junit4]   2> 671497 INFO  (Thread-1068) [    ] o.a.s.c.ZkTestServer client port:0.0.0.0/0.0.0.0:0
   [junit4]   2> 671497 INFO  (Thread-1068) [    ] o.a.s.c.ZkTestServer Starting server
   [junit4]   2> 671597 INFO  (SUITE-TestManagedSchemaAPI-seed#[344274A1430716F1]-worker) [    ] o.a.s.c.ZkTestServer start zk server on port:34033
   [junit4]   2> 671597 INFO  (SUITE-TestManagedSchemaAPI-seed#[344274A1430716F1]-worker) [    ] o.a.s.c.c.SolrZkClient Using default ZkCredentialsProvider
   [junit4]   2> 671598 INFO  (SUITE-TestManagedSchemaAPI-seed#[344274A1430716F1]-worker) [    ] o.a.s.c.c.ConnectionManager Waiting for client to connect to ZooKeeper
   [junit4]   2> 671600 INFO  (zkCallback-453-thread-1) [    ] o.a.s.c.c.ConnectionManager Watcher org.apache.solr.common.cloud.ConnectionManager@b1a1b5 name:ZooKeeperConnection Watcher:127.0.0.1:34033 got event WatchedEvent state:SyncConnected type:None path:null path:null type:None
   [junit4]   2> 671600 INFO  (SUITE-TestManagedSchemaAPI-seed#[344274A1430716F1]-worker) [    ] o.a.s.c.c.ConnectionManager Client is connected to ZooKeeper
   [junit4]   2> 671601 INFO  (SUITE-TestManagedSchemaAPI-seed#[344274A1430716F1]-worker) [    ] o.a.s.c.c.SolrZkClient Using default ZkACLProvider
   [junit4]   2> 671601 INFO  (SUITE-TestManagedSchemaAPI-seed#[344274A1430716F1]-worker) [    ] o.a.s.c.c.SolrZkClient makePath: /solr/solr.xml
   [junit4]   2> 671603 INFO  (SUITE-TestManagedSchemaAPI-seed#[344274A1430716F1]-worker) [    ] o.a.s.c.c.SolrZkClient makePath: /solr/clusterprops.json
   [junit4]   2> 671606 INFO  (jetty-launcher-452-thread-1) [    ] o.e.j.s.Server jetty-9.3.8.v20160314
   [junit4]   2> 671606 INFO  (jetty-launcher-452-thread-2) [    ] o.e.j.s.Server jetty-9.3.8.v20160314
   [junit4]   2> 671607 INFO  (jetty-launcher-452-thread-1) [    ] o.e.j.s.h.ContextHandler Started o.e.j.s.ServletContextHandler@1d4afd4{/solr,null,AVAILABLE}
   [junit4]   2> 671607 INFO  (jetty-launcher-452-thread-2) [    ] o.e.j.s.h.ContextHandler Started o.e.j.s.ServletContextHandler@1e12841{/solr,null,AVAILABLE}
   [junit4]   2> 671610 INFO  (jetty-launcher-452-thread-2) [    ] o.e.j.s.ServerConnector Started ServerConnector@755931{SSL,[ssl, http/1.1]}{127.0.0.1:44598}
   [junit4]   2> 671610 INFO  (jetty-launcher-452-thread-1) [    ] o.e.j.s.ServerConnector Started ServerConnector@11ebddb{SSL,[ssl, http/1.1]}{127.0.0.1:43656}
   [junit4]   2> 671610 INFO  (jetty-launcher-452-thread-2) [    ] o.e.j.s.Server Started @673095ms
   [junit4]   2> 671610 INFO  (jetty-launcher-452-thread-1) [    ] o.e.j.s.Server Started @673095ms
   [junit4]   2> 671610 INFO  (jetty-launcher-452-thread-2) [    ] o.a.s.c.s.e.JettySolrRunner Jetty properties: {hostContext=/solr, hostPort=44598}
   [junit4]   2> 671610 INFO  (jetty-launcher-452-thread-1) [    ] o.a.s.c.s.e.JettySolrRunner Jetty properties: {hostContext=/solr, hostPort=43656}
   [junit4]   2> 671610 INFO  (jetty-launcher-452-thread-2) [    ] o.a.s.s.SolrDispatchFilter SolrDispatchFilter.init(): sun.misc.Launcher$AppClassLoader@1d16e93
   [junit4]   2> 671610 INFO  (jetty-launcher-452-thread-1) [    ] o.a.s.s.SolrDispatchFilter SolrDispatchFilter.init(): sun.misc.Launcher$AppClassLoader@1d16e93
   [junit4]   2> 671611 INFO  (jetty-launcher-452-thread-2) [    ] o.a.s.c.SolrResourceLoader new SolrResourceLoader for directory: '/home/jenkins/workspace/Lucene-Solr-6.x-Linux/solr/build/solr-core/test/J1/temp/solr.schema.TestManagedSchemaAPI_344274A1430716F1-001/tempDir-001/node2'
   [junit4]   2> 671611 INFO  (jetty-launcher-452-thread-1) [    ] o.a.s.c.SolrResourceLoader new SolrResourceLoader for directory: '/home/jenkins/workspace/Lucene-Solr-6.x-Linux/solr/build/solr-core/test/J1/temp/solr.schema.TestManagedSchemaAPI_344274A1430716F1-001/tempDir-001/node1'
   [junit4]   2> 671611 INFO  (jetty-launcher-452-thread-2) [    ] o.a.s.c.SolrResourceLoader JNDI not configured for solr (NoInitialContextEx)
   [junit4]   2> 671611 INFO  (jetty-launcher-452-thread-1) [    ] o.a.s.c.SolrResourceLoader JNDI not configured for solr (NoInitialContextEx)
   [junit4]   2> 671611 INFO  (jetty-launcher-452-thread-2) [    ] o.a.s.c.SolrResourceLoader solr home defaulted to 'solr/' (could not find system property or JNDI)
   [junit4]   2> 671611 INFO  (jetty-launcher-452-thread-1) [    ] o.a.s.c.SolrResourceLoader solr home defaulted to 'solr/' (could not find system property or JNDI)
   [junit4]   2> 671611 INFO  (jetty-launcher-452-thread-2) [    ] o.a.s.c.c.SolrZkClient Using default ZkCredentialsProvider
   [junit4]   2> 671611 INFO  (jetty-launcher-452-thread-1) [    ] o.a.s.c.c.SolrZkClient Using default ZkCredentialsProvider
   [junit4]   2> 671611 INFO  (jetty-launcher-452-thread-2) [    ] o.a.s.c.c.ConnectionManager Waiting for client to connect to ZooKeeper
   [junit4]   2> 671612 INFO  (jetty-launcher-452-thread-1) [    ] o.a.s.c.c.ConnectionManager Waiting for client to connect to ZooKeeper
   [junit4]   2> 671613 INFO  (zkCallback-455-thread-1) [    ] o.a.s.c.c.ConnectionManager Watcher org.apache.solr.common.cloud.ConnectionManager@475eb6 name:ZooKeeperConnection Watcher:127.0.0.1:34033/solr got event WatchedEvent state:SyncConnected type:None path:null path:null type:None
   [junit4]   2> 671613 INFO  (jetty-launcher-452-thread-1) [    ] o.a.s.c.c.ConnectionManager Client is connected to ZooKeeper
   [junit4]   2> 671614 INFO  (zkCallback-454-thread-1) [    ] o.a.s.c.c.ConnectionManager Watcher org.apache.solr.common.cloud.ConnectionManager@1e073de name:ZooKeeperConnection Watcher:127.0.0.1:34033/solr got event WatchedEvent state:SyncConnected type:None path:null path:null type:None
   [junit4]   2> 671614 INFO  (jetty-launcher-452-thread-1) [    ] o.a.s.c.c.SolrZkClient Using default ZkACLProvider
   [junit4]   2> 671614 INFO  (jetty-launcher-452-thread-2) [    ] o.a.s.c.c.ConnectionManager Client is connected to ZooKeeper
   [junit4]   2> 671615 INFO  (jetty-launcher-452-thread-2) [    ] o.a.s.c.c.SolrZkClient Using default ZkACLProvider
   [junit4]   2> 671615 INFO  (jetty-launcher-452-thread-1) [    ] o.a.s.s.SolrDispatchFilter solr.xml found in ZooKeeper. Loading...
   [junit4]   2> 671615 INFO  (jetty-launcher-452-thread-2) [    ] o.a.s.s.SolrDispatchFilter solr.xml found in ZooKeeper. Loading...
   [junit4]   2> 671631 INFO  (jetty-launcher-452-thread-1) [    ] o.a.s.c.CorePropertiesLocator Config-defined core root directory: /home/jenkins/workspace/Lucene-Solr-6.x-Linux/solr/build/solr-core/test/J1/temp/solr.schema.TestManagedSchemaAPI_344274A1430716F1-001/tempDir-001/node1/.
   [junit4]   2> 671631 INFO  (jetty-launcher-452-thread-2) [    ] o.a.s.c.CorePropertiesLocator Config-defined core root directory: /home/jenkins/workspace/Lucene-Solr-6.x-Linux/solr/build/solr-core/test/J1/temp/solr.schema.TestManagedSchemaAPI_344274A1430716F1-001/tempDir-001/node2/.
   [junit4]   2> 671631 INFO  (jetty-launcher-452-thread-1) [    ] o.a.s.c.CoreContainer New CoreContainer 31602192
   [junit4]   2> 671631 WARN  (NIOServerCxn.Factory:0.0.0.0/0.0.0.0:0) [    ] o.a.z.s.NIOServerCnxn caught end of stream exception
   [junit4]   2> EndOfStreamException: Unable to read additional data from client sessionid 0x15537a99db80001, likely client has closed socket
   [junit4]   2> 	at org.apache.zookeeper.server.NIOServerCnxn.doIO(NIOServerCnxn.java:228)
   [junit4]   2> 	at org.apache.zookeeper.server.NIOServerCnxnFactory.run(NIOServerCnxnFactory.java:208)
   [junit4]   2> 	at java.lang.Thread.run(Thread.java:745)
   [junit4]   2> 671631 INFO  (jetty-launcher-452-thread-2) [    ] o.a.s.c.CoreContainer New CoreContainer 11311100
   [junit4]   2> 671631 INFO  (jetty-launcher-452-thread-1) [    ] o.a.s.c.CoreContainer Loading cores into CoreContainer [instanceDir=/home/jenkins/workspace/Lucene-Solr-6.x-Linux/solr/build/solr-core/test/J1/temp/solr.schema.TestManagedSchemaAPI_344274A1430716F1-001/tempDir-001/node1]
   [junit4]   2> 671631 INFO  (jetty-launcher-452-thread-2) [    ] o.a.s.c.CoreContainer Loading cores into CoreContainer [instanceDir=/home/jenkins/workspace/Lucene-Solr-6.x-Linux/solr/build/solr-core/test/J1/temp/solr.schema.TestManagedSchemaAPI_344274A1430716F1-001/tempDir-001/node2]
   [junit4]   2> 671632 WARN  (jetty-launcher-452-thread-1) [    ] o.a.s.c.CoreContainer Couldn't add files from /home/jenkins/workspace/Lucene-Solr-6.x-Linux/solr/build/solr-core/test/J1/temp/solr.schema.TestManagedSchemaAPI_344274A1430716F1-001/tempDir-001/node1/lib to classpath: /home/jenkins/workspace/Lucene-Solr-6.x-Linux/solr/build/solr-core/test/J1/temp/solr.schema.TestManagedSchemaAPI_344274A1430716F1-001/tempDir-001/node1/lib
   [junit4]   2> 671632 WARN  (jetty-launcher-452-thread-2) [    ] o.a.s.c.CoreContainer Couldn't add files from /home/jenkins/workspace/Lucene-Solr-6.x-Linux/solr/build/solr-core/test/J1/temp/solr.schema.TestManagedSchemaAPI_344274A1430716F1-001/tempDir-001/node2/lib to classpath: /home/jenkins/workspace/Lucene-Solr-6.x-Linux/solr/build/solr-core/test/J1/temp/solr.schema.TestManagedSchemaAPI_344274A1430716F1-001/tempDir-001/node2/lib
   [junit4]   2> 671632 INFO  (jetty-launcher-452-thread-1) [    ] o.a.s.h.c.HttpShardHandlerFactory created with socketTimeout : 90000,urlScheme : https,connTimeout : 15000,maxConnectionsPerHost : 20,maxConnections : 10000,corePoolSize : 0,maximumPoolSize : 2147483647,maxThreadIdleTime : 5,sizeOfQueue : -1,fairnessPolicy : false,useRetries : false,
   [junit4]   2> 671632 INFO  (jetty-launcher-452-thread-2) [    ] o.a.s.h.c.HttpShardHandlerFactory created with socketTimeout : 90000,urlScheme : https,connTimeout : 15000,maxConnectionsPerHost : 20,maxConnections : 10000,corePoolSize : 0,maximumPoolSize : 2147483647,maxThreadIdleTime : 5,sizeOfQueue : -1,fairnessPolicy : false,useRetries : false,
   [junit4]   2> 671633 INFO  (jetty-launcher-452-thread-1) [    ] o.a.s.u.UpdateShardHandler Creating UpdateShardHandler HTTP client with params: socketTimeout=340000&connTimeout=45000&retry=true
   [junit4]   2> 671633 INFO  (jetty-launcher-452-thread-2) [    ] o.a.s.u.UpdateShardHandler Creating UpdateShardHandler HTTP client with params: socketTimeout=340000&connTimeout=45000&retry=true
   [junit4]   2> 671633 INFO  (jetty-launcher-452-thread-1) [    ] o.a.s.l.LogWatcher SLF4J impl is org.slf4j.impl.Log4jLoggerFactory
   [junit4]   2> 671633 INFO  (jetty-launcher-452-thread-1) [    ] o.a.s.l.LogWatcher Registering Log Listener [Log4j (org.slf4j.impl.Log4jLoggerFactory)]
   [junit4]   2> 671633 INFO  (jetty-launcher-452-thread-2) [    ] o.a.s.l.LogWatcher SLF4J impl is org.slf4j.impl.Log4jLoggerFactory
   [junit4]   2> 671633 INFO  (jetty-launcher-452-thread-1) [    ] o.a.s.c.ZkContainer Zookeeper client=127.0.0.1:34033/solr
   [junit4]   2> 671633 INFO  (jetty-launcher-452-thread-2) [    ] o.a.s.l.LogWatcher Registering Log Listener [Log4j (org.slf4j.impl.Log4jLoggerFactory)]
   [junit4]   2> 671633 INFO  (jetty-launcher-452-thread-1) [    ] o.a.s.c.ZkController zkHost includes chroot
   [junit4]   2> 671633 INFO  (jetty-launcher-452-thread-1) [    ] o.a.s.c.c.SolrZkClient Using default ZkCredentialsProvider
   [junit4]   2> 671634 INFO  (jetty-launcher-452-thread-2) [    ] o.a.s.c.ZkContainer Zookeeper client=127.0.0.1:34033/solr
   [junit4]   2> 671634 INFO  (jetty-launcher-452-thread-2) [    ] o.a.s.c.ZkController zkHost includes chroot
   [junit4]   2> 671634 INFO  (jetty-launcher-452-thread-2) [    ] o.a.s.c.c.SolrZkClient Using default ZkCredentialsProvider
   [junit4]   2> 671634 INFO  (jetty-launcher-452-thread-1) [    ] o.a.s.c.c.ConnectionManager Waiting for client to connect to ZooKeeper
   [junit4]   2> 671634 INFO  (jetty-launcher-452-thread-2) [    ] o.a.s.c.c.ConnectionManager Waiting for client to connect to ZooKeeper
   [junit4]   2> 671635 INFO  (zkCallback-460-thread-1) [    ] o.a.s.c.c.ConnectionManager Watcher org.apache.solr.common.cloud.ConnectionManager@3d260c name:ZooKeeperConnection Watcher:127.0.0.1:34033 got event WatchedEvent state:SyncConnected type:None path:null path:null type:None
   [junit4]   2> 671635 INFO  (jetty-launcher-452-thread-1) [    ] o.a.s.c.c.ConnectionManager Client is connected to ZooKeeper
   [junit4]   2> 671635 INFO  (zkCallback-461-thread-1) [    ] o.a.s.c.c.ConnectionManager Watcher org.apache.solr.common.cloud.ConnectionManager@1b1af2e name:ZooKeeperConnection Watcher:127.0.0.1:34033 got event WatchedEvent state:SyncConnected type:None path:null path:null type:None
   [junit4]   2> 671635 INFO  (jetty-launcher-452-thread-2) [    ] o.a.s.c.c.ConnectionManager Client is connected to ZooKeeper
   [junit4]   2> 671635 INFO  (jetty-launcher-452-thread-1) [    ] o.a.s.c.c.SolrZkClient Using default ZkACLProvider
   [junit4]   2> 671636 INFO  (jetty-launcher-452-thread-2) [    ] o.a.s.c.c.SolrZkClient Using default ZkACLProvider
   [junit4]   2> 671637 WARN  (NIOServerCxn.Factory:0.0.0.0/0.0.0.0:0) [    ] o.a.z.s.NIOServerCnxn caught end of stream exception
   [junit4]   2> EndOfStreamException: Unable to read additional data from client sessionid 0x15537a99db80004, likely client has closed socket
   [junit4]   2> 	at org.apache.zookeeper.server.NIOServerCnxn.doIO(NIOServerCnxn.java:228)
   [junit4]   2> 	at org.apache.zookeeper.server.NIOServerCnxnFactory.run(NIOServerCnxnFactory.java:208)
   [junit4]   2> 	at java.lang.Thread.run(Thread.java:745)
   [junit4]   2> 671637 INFO  (jetty-launcher-452-thread-2) [n:127.0.0.1:44598_solr    ] o.a.s.c.ZkController Added new OnReconnect listener org.apache.solr.cloud.ZkController$$Lambda$49/13564790@101bad0
   [junit4]   2> 671637 INFO  (jetty-launcher-452-thread-1) [n:127.0.0.1:43656_solr    ] o.a.s.c.ZkController Added new OnReconnect listener org.apache.solr.cloud.ZkController$$Lambda$49/13564790@1c7ce10
   [junit4]   2> 671638 INFO  (jetty-launcher-452-thread-2) [n:127.0.0.1:44598_solr    ] o.a.s.c.c.ConnectionManager Waiting for client to connect to ZooKeeper
   [junit4]   2> 671638 INFO  (jetty-launcher-452-thread-1) [n:127.0.0.1:43656_solr    ] o.a.s.c.c.ConnectionManager Waiting for client to connect to ZooKeeper
   [junit4]   2> 671639 INFO  (zkCallback-462-thread-1-processing-n:127.0.0.1:44598_solr) [n:127.0.0.1:44598_solr    ] o.a.s.c.c.ConnectionManager Watcher org.apache.solr.common.cloud.ConnectionManager@1a5068a name:ZooKeeperConnection Watcher:127.0.0.1:34033/solr got event WatchedEvent state:SyncConnected type:None path:null path:null type:None
   [junit4]   2> 671639 INFO  (jetty-launcher-452-thread-2) [n:127.0.0.1:44598_solr    ] o.a.s.c.c.ConnectionManager Client is connected to ZooKeeper
   [junit4]   2> 671639 INFO  (zkCallback-463-thread-1-processing-n:127.0.0.1:43656_solr) [n:127.0.0.1:43656_solr    ] o.a.s.c.c.ConnectionManager Watcher org.apache.solr.common.cloud.ConnectionManager@1056015 name:ZooKeeperConnection Watcher:127.0.0.1:34033/solr got event WatchedEvent state:SyncConnected type:None path:null path:null type:None
   [junit4]   2> 671640 INFO  (jetty-launcher-452-thread-1) [n:127.0.0.1:43656_solr    ] o.a.s.c.c.ConnectionManager Client is connected to ZooKeeper
   [junit4]   2> 671640 INFO  (jetty-launcher-452-thread-2) [n:127.0.0.1:44598_solr    ] o.a.s.c.c.SolrZkClient makePath: /overseer/queue
   [junit4]   2> 671640 INFO  (jetty-launcher-452-thread-1) [n:127.0.0.1:43656_solr    ] o.a.s.c.c.SolrZkClient makePath: /overseer/queue
   [junit4]   2> 671641 INFO  (jetty-launcher-452-thread-2) [n:127.0.0.1:44598_solr    ] o.a.s.c.c.SolrZkClient makePath: /overseer/collection-queue-work
   [junit4]   2> 671641 INFO  (jetty-launcher-452-thread-1) [n:127.0.0.1:43656_solr    ] o.a.s.c.c.SolrZkClient makePath: /overseer/collection-queue-work
   [junit4]   2> 671643 INFO  (jetty-launcher-452-thread-1) [n:127.0.0.1:43656_solr    ] o.a.s.c.c.SolrZkClient makePath: /overseer/collection-map-running
   [junit4]   2> 671643 INFO  (jetty-launcher-452-thread-2) [n:127.0.0.1:44598_solr    ] o.a.s.c.c.SolrZkClient makePath: /overseer/collection-map-running
   [junit4]   2> 671644 INFO  (jetty-launcher-452-thread-2) [n:127.0.0.1:44598_solr    ] o.a.s.c.c.SolrZkClient makePath: /overseer/collection-map-completed
   [junit4]   2> 671644 INFO  (jetty-launcher-452-thread-1) [n:127.0.0.1:43656_solr    ] o.a.s.c.c.SolrZkClient makePath: /overseer/collection-map-completed
   [junit4]   2> 671645 INFO  (jetty-launcher-452-thread-2) [n:127.0.0.1:44598_solr    ] o.a.s.c.c.SolrZkClient makePath: /overseer/collection-map-failure
   [junit4]   2> 671645 INFO  (jetty-launcher-452-thread-1) [n:127.0.0.1:43656_solr    ] o.a.s.c.c.SolrZkClient makePath: /overseer/collection-map-failure
   [junit4]   2> 671645 INFO  (jetty-launcher-452-thread-1) [n:127.0.0.1:43656_solr    ] o.a.s.c.c.SolrZkClient makePath: /live_nodes
   [junit4]   2> 671645 INFO  (jetty-launcher-452-thread-2) [n:127.0.0.1:44598_solr    ] o.a.s.c.c.SolrZkClient makePath: /live_nodes
   [junit4]   2> 671646 INFO  (jetty-launcher-452-thread-2) [n:127.0.0.1:44598_solr    ] o.a.s.c.c.SolrZkClient makePath: /collections
   [junit4]   2> 671646 INFO  (jetty-launcher-452-thread-1) [n:127.0.0.1:43656_solr    ] o.a.s.c.c.SolrZkClient makePath: /collections
   [junit4]   2> 671647 INFO  (jetty-launcher-452-thread-2) [n:127.0.0.1:44598_solr    ] o.a.s.c.c.SolrZkClient makePath: /aliases.json
   [junit4]   2> 671647 INFO  (jetty-launcher-452-thread-1) [n:127.0.0.1:43656_solr    ] o.a.s.c.c.SolrZkClient makePath: /aliases.json
   [junit4]   2> 671647 INFO  (jetty-launcher-452-thread-1) [n:127.0.0.1:43656_solr    ] o.a.s.c.c.SolrZkClient makePath: /clusterstate.json
   [junit4]   2> 671647 INFO  (jetty-launcher-452-thread-2) [n:127.0.0.1:44598_solr    ] o.a.s.c.c.SolrZkClient makePath: /clusterstate.json
   [junit4]   2> 671648 INFO  (jetty-launcher-452-thread-1) [n:127.0.0.1:43656_solr    ] o.a.s.c.c.SolrZkClient makePath: /security.json
   [junit4]   2> 671648 INFO  (jetty-launcher-452-thread-2) [n:127.0.0.1:44598_solr    ] o.a.s.c.c.SolrZkClient makePath: /security.json
   [junit4]   2> 671648 INFO  (jetty-launcher-452-thread-2) [n:127.0.0.1:44598_solr    ] o.a.s.c.c.ZkStateReader Updating cluster state from ZooKeeper... 
   [junit4]   2> 671649 INFO  (jetty-launcher-452-thread-1) [n:127.0.0.1:43656_solr    ] o.a.s.c.c.ZkStateReader Updating cluster state from ZooKeeper... 
   [junit4]   2> 671649 INFO  (jetty-launcher-452-thread-2) [n:127.0.0.1:44598_solr    ] o.a.s.c.c.ZkStateReader Loaded cluster properties: {urlScheme=https}
   [junit4]   2> 671649 INFO  (jetty-launcher-452-thread-2) [n:127.0.0.1:44598_solr    ] o.a.s.c.c.ZkStateReader Updated live nodes from ZooKeeper... (0) -> (0)
   [junit4]   2> 671649 INFO  (jetty-launcher-452-thread-1) [n:127.0.0.1:43656_solr    ] o.a.s.c.c.ZkStateReader Loaded cluster properties: {urlScheme=https}
   [junit4]   2> 671651 INFO  (jetty-launcher-452-thread-1) [n:127.0.0.1:43656_solr    ] o.a.s.c.c.ZkStateReader Updated live nodes from ZooKeeper... (0) -> (0)
   [junit4]   2> 671652 INFO  (jetty-launcher-452-thread-2) [n:127.0.0.1:44598_solr    ] o.a.s.c.c.SolrZkClient makePath: /overseer_elect
   [junit4]   2> 671652 INFO  (jetty-launcher-452-thread-1) [n:127.0.0.1:43656_solr    ] o.a.s.c.c.SolrZkClient makePath: /overseer_elect
   [junit4]   2> 671652 INFO  (jetty-launcher-452-thread-2) [n:127.0.0.1:44598_solr    ] o.a.s.c.c.SolrZkClient makePath: /overseer_elect/election
   [junit4]   2> 671652 INFO  (jetty-launcher-452-thread-1) [n:127.0.0.1:43656_solr    ] o.a.s.c.c.SolrZkClient makePath: /overseer_elect/election
   [junit4]   2> 671653 INFO  (jetty-launcher-452-thread-1) [n:127.0.0.1:43656_solr    ] o.a.s.c.Overseer Overseer (id=null) closing
   [junit4]   2> 671653 INFO  (jetty-launcher-452-thread-2) [n:127.0.0.1:44598_solr    ] o.a.s.c.Overseer Overseer (id=null) closing
   [junit4]   2> 671653 INFO  (jetty-launcher-452-thread-1) [n:127.0.0.1:43656_solr    ] o.a.s.c.LeaderElector Joined leadership election with path: /overseer_elect/election/96044168693415942-127.0.0.1:43656_solr-n_0000000000
   [junit4]   2> 671653 INFO  (jetty-launcher-452-thread-2) [n:127.0.0.1:44598_solr    ] o.a.s.c.LeaderElector Joined leadership election with path: /overseer_elect/election/96044168693415941-127.0.0.1:44598_solr-n_0000000001
   [junit4]   2> 671653 INFO  (jetty-launcher-452-thread-1) [n:127.0.0.1:43656_solr    ] o.a.s.c.OverseerElectionContext I am going to be the leader 127.0.0.1:43656_solr
   [junit4]   2> 671653 INFO  (jetty-launcher-452-thread-1) [n:127.0.0.1:43656_solr    ] o.a.s.c.c.SolrZkClient makePath: /overseer_elect/leader
   [junit4]   2> 671653 INFO  (jetty-launcher-452-thread-2) [n:127.0.0.1:44598_solr    ] o.a.s.c.LeaderElector Watching path /overseer_elect/election/96044168693415942-127.0.0.1:43656_solr-n_0000000000 to know if I could be the leader
   [junit4]   2> 671654 INFO  (jetty-launcher-452-thread-2) [n:127.0.0.1:44598_solr    ] o.a.s.c.ZkController Register node as live in ZooKeeper:/live_nodes/127.0.0.1:44598_solr
   [junit4]   2> 671654 INFO  (jetty-launcher-452-thread-2) [n:127.0.0.1:44598_solr    ] o.a.s.c.c.SolrZkClient makePath: /live_nodes/127.0.0.1:44598_solr
   [junit4]   2> 671654 INFO  (jetty-launcher-452-thread-1) [n:127.0.0.1:43656_solr    ] o.a.s.c.Overseer Overseer (id=96044168693415942-127.0.0.1:43656_solr-n_0000000000) starting
   [junit4]   2> 671655 INFO  (zkCallback-463-thread-1-processing-n:127.0.0.1:43656_solr) [n:127.0.0.1:43656_solr    ] o.a.s.c.c.ZkStateReader A live node change: [WatchedEvent state:SyncConnected type:NodeChildrenChanged path:/live_nodes], has occurred - updating... (live nodes size: [0])
   [junit4]   2> 671655 INFO  (zkCallback-462-thread-1-processing-n:127.0.0.1:44598_solr) [n:127.0.0.1:44598_solr    ] o.a.s.c.c.ZkStateReader A live node change: [WatchedEvent state:SyncConnected type:NodeChildrenChanged path:/live_nodes], has occurred - updating... (live nodes size: [0])
   [junit4]   2> 671655 INFO  (zkCallback-463-thread-1-processing-n:127.0.0.1:43656_solr) [n:127.0.0.1:43656_solr    ] o.a.s.c.c.ZkStateReader Updated live nodes from ZooKeeper... (0) -> (1)
   [junit4]   2> 671655 INFO  (zkCallback-462-thread-1-processing-n:127.0.0.1:44598_solr) [n:127.0.0.1:44598_solr    ] o.a.s.c.c.ZkStateReader Updated live nodes from ZooKeeper... (0) -> (1)
   [junit4]   2> 671655 INFO  (jetty-launcher-452-thread-1) [n:127.0.0.1:43656_solr    ] o.a.s.c.c.SolrZkClient makePath: /overseer/queue-work
   [junit4]   2> 671658 INFO  (jetty-launcher-452-thread-1) [n:127.0.0.1:43656_solr    ] o.a.s.c.OverseerAutoReplicaFailoverThread Starting OverseerAutoReplicaFailoverThread autoReplicaFailoverWorkLoopDelay=10000 autoReplicaFailoverWaitAfterExpiration=30000 autoReplicaFailoverBadNodeExpiration=60000
   [junit4]   2> 671658 INFO  (OverseerCollectionConfigSetProcessor-96044168693415942-127.0.0.1:43656_solr-n_0000000000) [n:127.0.0.1:43656_solr    ] o.a.s.c.OverseerTaskProcessor Process current queue of overseer operations
   [junit4]   2> 671658 INFO  (OverseerStateUpdate-96044168693415942-127.0.0.1:43656_solr-n_0000000000) [n:127.0.0.1:43656_solr    ] o.a.s.c.Overseer Starting to work on the main queue
   [junit4]   2> 671659 INFO  (jetty-launcher-452-thread-1) [n:127.0.0.1:43656_solr    ] o.a.s.c.ZkController Publish node=127.0.0.1:43656_solr as DOWN
   [junit4]   2> 671659 INFO  (OverseerStateUpdate-96044168693415942-127.0.0.1:43656_solr-n_0000000000) [n:127.0.0.1:43656_solr    ] o.a.s.c.c.ZkStateReader Updated live nodes from ZooKeeper... (1) -> (1)
   [junit4]   2> 671660 INFO  (OverseerStateUpdate-96044168693415942-127.0.0.1:43656_solr-n_0000000000) [n:127.0.0.1:43656_solr    ] o.a.s.c.Overseer processMessage: queueSize: 1, message = {
   [junit4]   2>   "operation":"downnode",
   [junit4]   2>   "node_name":"127.0.0.1:43656_solr"} current state version: 0
   [junit4]   2> 671660 INFO  (OverseerStateUpdate-96044168693415942-127.0.0.1:43656_solr-n_0000000000) [n:127.0.0.1:43656_solr    ] o.a.s.c.o.NodeMutator DownNode state invoked for node: 127.0.0.1:43656_solr
   [junit4]   2> 671695 INFO  (jetty-launcher-452-thread-2) [n:127.0.0.1:44598_solr    ] o.a.s.c.CoreContainer Security conf doesn't exist. Skipping setup for authorization module.
   [junit4]   2> 671696 INFO  (jetty-launcher-452-thread-2) [n:127.0.0.1:44598_solr    ] o.a.s.c.CoreContainer No authentication plugin used.
   [junit4]   2> 671696 INFO  (jetty-launcher-452-thread-2) [n:127.0.0.1:44598_solr    ] o.a.s.c.CorePropertiesLocator Looking for core definitions underneath /home/jenkins/workspace/Lucene-Solr-6.x-Linux/solr/build/solr-core/test/J1/temp/solr.schema.TestManagedSchemaAPI_344274A1430716F1-001/tempDir-001/node2/.
   [junit4]   2> 671696 INFO  (jetty-launcher-452-thread-2) [n:127.0.0.1:44598_solr    ] o.a.s.c.CorePropertiesLocator Found 0 core definitions
   [junit4]   2> 671697 INFO  (jetty-launcher-452-thread-2) [n:127.0.0.1:44598_solr    ] o.a.s.s.SolrDispatchFilter user.dir=/home/jenkins/workspace/Lucene-Solr-6.x-Linux/solr/build/solr-core/test/J1
   [junit4]   2> 671697 INFO  (jetty-launcher-452-thread-2) [n:127.0.0.1:44598_solr    ] o.a.s.s.SolrDispatchFilter SolrDispatchFilter.init() done
   [junit4]   2> 672660 INFO  (jetty-launcher-452-thread-1) [n:127.0.0.1:43656_solr    ] o.a.s.c.ZkController Register node as live in ZooKeeper:/live_nodes/127.0.0.1:43656_solr
   [junit4]   2> 672660 INFO  (jetty-launcher-452-thread-1) [n:127.0.0.1:43656_solr    ] o.a.s.c.c.SolrZkClient makePath: /live_nodes/127.0.0.1:43656_solr
   [junit4]   2> 672661 INFO  (zkCallback-462-thread-1-processing-n:127.0.0.1:44598_solr) [n:127.0.0.1:44598_solr    ] o.a.s.c.c.ZkStateReader A live node change: [WatchedEvent state:SyncConnected type:NodeChildrenChanged path:/live_nodes], has occurred - updating... (live nodes size: [1])
   [junit4]   2> 672661 INFO  (zkCallback-463-thread-1-processing-n:127.0.0.1:43656_solr) [n:127.0.0.1:43656_solr    ] o.a.s.c.c.ZkStateReader A live node change: [WatchedEvent state:SyncConnected type:NodeChildrenChanged path:/live_nodes], has occurred - updating... (live nodes size: [1])
   [junit4]   2> 672662 INFO  (zkCallback-462-thread-1-processing-n:127.0.0.1:44598_solr) [n:127.0.0.1:44598_solr    ] o.a.s.c.c.ZkStateReader Updated live nodes from ZooKeeper... (1) -> (2)
   [junit4]   2> 672662 INFO  (zkCallback-463-thread-1-processing-n:127.0.0.1:43656_solr) [n:127.0.0.1:43656_solr    ] o.a.s.c.c.ZkStateReader Updated live nodes from ZooKeeper... (1) -> (2)
   [junit4]   2> 672682 INFO  (jetty-launcher-452-thread-1) [n:127.0.0.1:43656_solr    ] o.a.s.c.CoreContainer Security conf doesn't exist. Skipping setup for authorization module.
   [junit4]   2> 672682 INFO  (jetty-launcher-452-thread-1) [n:127.0.0.1:43656_solr    ] o.a.s.c.CoreContainer No authentication plugin used.
   [junit4]   2> 672683 INFO  (jetty-launcher-452-thread-1) [n:127.0.0.1:43656_solr    ] o.a.s.c.CorePropertiesLocator Looking for core definitions underneath /home/jenkins/workspace/Lucene-Solr-6.x-Linux/solr/build/solr-core/test/J1/temp/solr.schema.TestManagedSchemaAPI_344274A1430716F1-001/tempDir-001/node1/.
   [junit4]   2> 672683 INFO  (jetty-launcher-452-thread-1) [n:127.0.0.1:43656_solr    ] o.a.s.c.CorePropertiesLocator Found 0 core definitions
   [junit4]   2> 672683 INFO  (jetty-launcher-452-thread-1) [n:127.0.0.1:43656_solr    ] o.a.s.s.SolrDispatchFilter user.dir=/home/jenkins/workspace/Lucene-Solr-6.x-Linux/solr/build/solr-core/test/J1
   [junit4]   2> 672683 INFO  (jetty-launcher-452-thread-1) [n:127.0.0.1:43656_solr    ] o.a.s.s.SolrDispatchFilter SolrDispatchFilter.init() done
   [junit4]   2> 672684 INFO  (SUITE-TestManagedSchemaAPI-seed#[344274A1430716F1]-worker) [    ] o.a.s.c.c.SolrZkClient Using default ZkCredentialsProvider
   [junit4]   2> 672684 INFO  (SUITE-TestManagedSchemaAPI-seed#[344274A1430716F1]-worker) [    ] o.a.s.c.c.ConnectionManager Waiting for client to connect to ZooKeeper
   [junit4]   2> 672685 INFO  (zkCallback-466-thread-1) [    ] o.a.s.c.c.ConnectionManager Watcher org.apache.solr.common.cloud.ConnectionManager@1c15507 name:ZooKeeperConnection Watcher:127.0.0.1:34033 got event WatchedEvent state:SyncConnected type:None path:null path:null type:None
   [junit4]   2> 672685 INFO  (SUITE-TestManagedSchemaAPI-seed#[344274A1430716F1]-worker) [    ] o.a.s.c.c.ConnectionManager Client is connected to ZooKeeper
   [junit4]   2> 672686 INFO  (SUITE-TestManagedSchemaAPI-seed#[344274A1430716F1]-worker) [    ] o.a.s.c.c.SolrZkClient Using default ZkACLProvider
   [junit4]   2> 672687 INFO  (SUITE-TestManagedSchemaAPI-seed#[344274A1430716F1]-worker) [    ] o.a.s.c.s.i.CloudSolrClient Final constructed zkHost string: 127.0.0.1:34033/solr
   [junit4]   2> 672687 INFO  (SUITE-TestManagedSchemaAPI-seed#[344274A1430716F1]-worker) [    ] o.a.s.c.c.SolrZkClient Using default ZkCredentialsProvider
   [junit4]   2> 672687 INFO  (SUITE-TestManagedSchemaAPI-seed#[344274A1430716F1]-worker) [    ] o.a.s.c.c.ConnectionManager Waiting for client to connect to ZooKeeper
   [junit4]   2> 672688 INFO  (zkCallback-469-thread-1) [    ] o.a.s.c.c.ConnectionManager Watcher org.apache.solr.common.cloud.ConnectionManager@c85b6 name:ZooKeeperConnection Watcher:127.0.0.1:34033/solr got event WatchedEvent state:SyncConnected type:None path:null path:null type:None
   [junit4]   2> 672688 INFO  (SUITE-TestManagedSchemaAPI-seed#[344274A1430716F1]-worker) [    ] o.a.s.c.c.ConnectionManager Client is connected to ZooKeeper
   [junit4]   2> 672688 INFO  (SUITE-TestManagedSchemaAPI-seed#[344274A1430716F1]-worker) [    ] o.a.s.c.c.SolrZkClient Using default ZkACLProvider
   [junit4]   2> 672688 INFO  (SUITE-TestManagedSchemaAPI-seed#[344274A1430716F1]-worker) [    ] o.a.s.c.c.ZkStateReader Updating cluster state from ZooKeeper... 
   [junit4]   2> 672689 INFO  (SUITE-TestManagedSchemaAPI-seed#[344274A1430716F1]-worker) [    ] o.a.s.c.c.ZkStateReader Loaded cluster properties: {urlScheme=https}
   [junit4]   2> 672689 INFO  (SUITE-TestManagedSchemaAPI-seed#[344274A1430716F1]-worker) [    ] o.a.s.c.c.ZkStateReader Updated live nodes from ZooKeeper... (0) -> (2)
   [junit4]   2> 672690 INFO  (SUITE-TestManagedSchemaAPI-seed#[344274A1430716F1]-worker) [    ] o.a.s.c.c.SolrZkClient makePath: /configs/conf1/solrconfig.xml
   [junit4]   2> 672691 INFO  (SUITE-TestManagedSchemaAPI-seed#[344274A1430716F1]-worker) [    ] o.a.s.c.c.SolrZkClient makePath: /configs/conf1/managed-schema
   [junit4]   2> 672704 INFO  (TEST-TestManagedSchemaAPI.test-seed#[344274A1430716F1]) [    ] o.a.s.SolrTestCaseJ4 ###Starting test
   [junit4]   2> 672827 INFO  (qtp3559961-3345) [n:127.0.0.1:44598_solr    ] o.a.s.h.a.CollectionsHandler Invoked Collection Action :create with params replicationFactor=2&collection.configName=conf1&name=testschemaapi&action=CREATE&numShards=1&wt=javabin&version=2 and sendToOCPQueue=true
   [junit4]   2> 672829 INFO  (OverseerCollectionConfigSetProcessor-96044168693415942-127.0.0.1:43656_solr-n_0000000000) [n:127.0.0.1:43656_solr    ] o.a.s.c.OverseerTaskProcessor Overseer Collection Message Handler: Get the message id:/overseer/collection-queue-work/qn-0000000000 message:{
   [junit4]   2>   "name":"testschemaapi",
   [junit4]   2>   "fromApi":"true",
   [junit4]   2>   "replicationFactor":"2",
   [junit4]   2>   "collection.configName":"conf1",
   [junit4]   2>   "numShards":"1",
   [junit4]   2>   "stateFormat":"2",
   [junit4]   2>   "operation":"create"}
   [junit4]   2> 672829 INFO  (OverseerThreadFactory-1452-thread-1-processing-n:127.0.0.1:43656_solr) [n:127.0.0.1:43656_solr    ] o.a.s.c.OverseerCollectionMessageHandler OverseerCollectionMessageHandler.processMessage : create , {
   [junit4]   2>   "name":"testschemaapi",
   [junit4]   2>   "fromApi":"true",
   [junit4]   2>   "replicationFactor":"2",
   [junit4]   2>   "collection.configName":"conf1",
   [junit4]   2>   "numShards":"1",
   [junit4]   2>   "stateFormat":"2",
   [junit4]   2>   "operation":"create"}
   [junit4]   2> 672829 INFO  (OverseerThreadFactory-1452-thread-1-processing-n:127.0.0.1:43656_solr) [n:127.0.0.1:43656_solr    ] o.a.s.c.OverseerCollectionMessageHandler Create collection testschemaapi
   [junit4]   2> 672829 INFO  (OverseerThreadFactory-1452-thread-1-processing-n:127.0.0.1:43656_solr) [n:127.0.0.1:43656_solr    ] o.a.s.c.OverseerCollectionMessageHandler creating collections conf node /collections/testschemaapi 
   [junit4]   2> 672829 INFO  (OverseerThreadFactory-1452-thread-1-processing-n:127.0.0.1:43656_solr) [n:127.0.0.1:43656_solr    ] o.a.s.c.c.SolrZkClient makePath: /collections/testschemaapi
   [junit4]   2> 672830 INFO  (zkCallback-463-thread-1-processing-n:127.0.0.1:43656_solr) [n:127.0.0.1:43656_solr    ] o.a.s.c.c.ZkStateReader A collections change: [WatchedEvent state:SyncConnected type:NodeChildrenChanged path:/collections], has occurred - updating...
   [junit4]   2> 672830 INFO  (zkCallback-462-thread-1-processing-n:127.0.0.1:44598_solr) [n:127.0.0.1:44598_solr    ] o.a.s.c.c.ZkStateReader A collections change: [WatchedEvent state:SyncConnected type:NodeChildrenChanged path:/collections], has occurred - updating...
   [junit4]   2> 672830 INFO  (zkCallback-469-thread-1) [    ] o.a.s.c.c.ZkStateReader A collections change: [WatchedEvent state:SyncConnected type:NodeChildrenChanged path:/collections], has occurred - updating...
   [junit4]   2> 672831 INFO  (OverseerStateUpdate-96044168693415942-127.0.0.1:43656_solr-n_0000000000) [n:127.0.0.1:43656_solr    ] o.a.s.c.Overseer processMessage: queueSize: 1, message = {
   [junit4]   2>   "name":"testschemaapi",
   [junit4]   2>   "fromApi":"true",
   [junit4]   2>   "replicationFactor":"2",
   [junit4]   2>   "collection.configName":"conf1",
   [junit4]   2>   "numShards":"1",
   [junit4]   2>   "stateFormat":"2",
   [junit4]   2>   "operation":"create"} current state version: 0
   [junit4]   2> 672831 INFO  (OverseerStateUpdate-96044168693415942-127.0.0.1:43656_solr-n_0000000000) [n:127.0.0.1:43656_solr    ] o.a.s.c.o.ClusterStateMutator building a new cName: testschemaapi
   [junit4]   2> 672832 INFO  (OverseerStateUpdate-96044168693415942-127.0.0.1:43656_solr-n_0000000000) [n:127.0.0.1:43656_solr    ] o.a.s.c.o.ZkStateWriter going to create_collection /collections/testschemaapi/state.json
   [junit4]   2> 672932 INFO  (OverseerThreadFactory-1452-thread-1-processing-n:127.0.0.1:43656_solr) [n:127.0.0.1:43656_solr    ] o.a.s.c.OverseerCollectionMessageHandler Creating SolrCores for new collection testschemaapi, shardNames [shard1] , replicationFactor : 2
   [junit4]   2> 672932 INFO  (OverseerThreadFactory-1452-thread-1-processing-n:127.0.0.1:43656_solr) [n:127.0.0.1:43656_solr    ] o.a.s.c.OverseerCollectionMessageHandler Creating core testschemaapi_shard1_replica2 as part of shard shard1 of collection testschemaapi on 127.0.0.1:44598_solr
   [junit4]   2> 672932 INFO  (OverseerThreadFactory-1452-thread-1-processing-n:127.0.0.1:43656_solr) [n:127.0.0.1:43656_solr    ] o.a.s.c.OverseerCollectionMessageHandler Creating core testschemaapi_shard1_replica1 as part of shard shard1 of collection testschemaapi on 127.0.0.1:43656_solr
   [junit4]   2> 672940 INFO  (qtp3559961-3356) [n:127.0.0.1:44598_solr    ] o.a.s.h.a.CoreAdminOperation core create command qt=/admin/cores&collection.configName=conf1&name=testschemaapi_shard1_replica2&action=CREATE&numShards=1&collection=testschemaapi&shard=shard1&wt=javabin&version=2
   [junit4]   2> 672941 INFO  (qtp3559961-3356) [n:127.0.0.1:44598_solr    ] o.a.s.c.CoreDescriptor Created CoreDescriptor: {name=testschemaapi_shard1_replica2, collection.configName=conf1, config=solrconfig.xml, transient=false, schema=schema.xml, loadOnStartup=true, configSetProperties=configsetprops.json, collection=testschemaapi, numShards=1, dataDir=data/, shard=shard1}
   [junit4]   2> 672941 INFO  (qtp3559961-3356) [n:127.0.0.1:44598_solr c:testschemaapi s:shard1  x:testschemaapi_shard1_replica2] o.a.s.c.ZkController publishing state=down
   [junit4]   2> 672942 INFO  (qtp3559961-3356) [n:127.0.0.1:44598_solr c:testschemaapi s:shard1  x:testschemaapi_shard1_replica2] o.a.s.c.ZkController Registering watch for collection testschemaapi
   [junit4]   2> 672942 INFO  (OverseerStateUpdate-96044168693415942-127.0.0.1:43656_solr-n_0000000000) [n:127.0.0.1:43656_solr    ] o.a.s.c.Overseer processMessage: queueSize: 1, message = {
   [junit4]   2>   "core":"testschemaapi_shard1_replica2",
   [junit4]   2>   "roles":null,
   [junit4]   2>   "base_url":"https://127.0.0.1:44598/solr",
   [junit4]   2>   "node_name":"127.0.0.1:44598_solr",
   [junit4]   2>   "numShards":"1",
   [junit4]   2>   "state":"down",
   [junit4]   2>   "shard":"shard1",
   [junit4]   2>   "collection":"testschemaapi",
   [junit4]   2>   "operation":"state"} current state version: 0
   [junit4]   2> 672942 INFO  (qtp3559961-3356) [n:127.0.0.1:44598_solr c:testschemaapi s:shard1  x:testschemaapi_shard1_replica2] o.a.s.c.c.ZkStateReader Add data for [testschemaapi] ver [0]
   [junit4]   2> 672943 INFO  (OverseerStateUpdate-96044168693415942-127.0.0.1:43656_solr-n_0000000000) [n:127.0.0.1:43656_solr    ] o.a.s.c.o.ReplicaMutator Update state numShards=1 message={
   [junit4]   2>   "core":"testschemaapi_shard1_replica2",
   [junit4]   2>   "roles":null,
   [junit4]   2>   "base_url":"https://127.0.0.1:44598/solr",
   [junit4]   2>   "node_name":"127.0.0.1:44598_solr",
   [junit4]   2>   "numShards":"1",
   [junit4]   2>   "state":"down",
   [junit4]   2>   "shard":"shard1",
   [junit4]   2>   "collection":"testschemaapi",
   [junit4]   2>   "operation":"state"}
   [junit4]   2> 672943 INFO  (qtp3559961-3356) [n:127.0.0.1:44598_solr c:testschemaapi s:shard1  x:testschemaapi_shard1_replica2] o.a.s.c.ZkController look for our core node name
   [junit4]   2> 673044 INFO  (OverseerStateUpdate-96044168693415942-127.0.0.1:43656_solr-n_0000000000) [n:127.0.0.1:43656_solr    ] o.a.s.c.o.ZkStateWriter going to update_collection /collections/testschemaapi/state.json version: 0
   [junit4]   2> 673045 INFO  (zkCallback-462-thread-1-processing-n:127.0.0.1:44598_solr) [n:127.0.0.1:44598_solr    ] o.a.s.c.c.ZkStateReader A cluster state change: [WatchedEvent state:SyncConnected type:NodeDataChanged path:/collections/testschemaapi/state.json] for collection [testschemaapi] has occurred - updating... (live nodes size: [2])
   [junit4]   2> 673045 INFO  (zkCallback-462-thread-1-processing-n:127.0.0.1:44598_solr) [n:127.0.0.1:44598_solr    ] o.a.s.c.c.ZkStateReader Updating data for [testschemaapi] from [0] to [1]
   [junit4]   2> 673063 INFO  (qtp27040634-3341) [n:127.0.0.1:43656_solr    ] o.a.s.h.a.CoreAdminOperation core create command qt=/admin/cores&collection.configName=conf1&name=testschemaapi_shard1_replica1&action=CREATE&numShards=1&collection=testschemaapi&shard=shard1&wt=javabin&version=2
   [junit4]   2> 673064 INFO  (qtp27040634-3341) [n:127.0.0.1:43656_solr    ] o.a.s.c.CoreDescriptor Created CoreDescriptor: {name=testschemaapi_shard1_replica1, collection.configName=conf1, config=solrconfig.xml, transient=false, schema=schema.xml, loadOnStartup=true, configSetProperties=configsetprops.json, collection=testschemaapi, numShards=1, dataDir=data/, shard=shard1}
   [junit4]   2> 673065 INFO  (qtp27040634-3341) [n:127.0.0.1:43656_solr c:testschemaapi s:shard1  x:testschemaapi_shard1_replica1] o.a.s.c.ZkController publishing state=down
   [junit4]   2> 673066 INFO  (qtp27040634-3341) [n:127.0.0.1:43656_solr c:testschemaapi s:shard1  x:testschemaapi_shard1_replica1] o.a.s.c.ZkController Registering watch for collection testschemaapi
   [junit4]   2> 673066 INFO  (OverseerStateUpdate-96044168693415942-127.0.0.1:43656_solr-n_0000000000) [n:127.0.0.1:43656_solr    ] o.a.s.c.Overseer processMessage: queueSize: 1, message = {
   [junit4]   2>   "core":"testschemaapi_shard1_replica1",
   [junit4]   2>   "roles":null,
   [junit4]   2>   "base_url":"https://127.0.0.1:43656/solr",
   [junit4]   2>   "node_name":"127.0.0.1:43656_solr",
   [junit4]   2>   "numShards":"1",
   [junit4]   2>   "state":"down",
   [junit4]   2>   "shard":"shard1",
   [junit4]   2>   "collection":"testschemaapi",
   [junit4]   2>   "operation":"state"} current state version: 0
   [junit4]   2> 673066 INFO  (OverseerStateUpdate-96044168693415942-127.0.0.1:43656_solr-n_0000000000) [n:127.0.0.1:43656_solr    ] o.a.s.c.o.ReplicaMutator Update state numShards=1 message={
   [junit4]   2>   "core":"testschemaapi_shard1_replica1",
   [junit4]   2>   "roles":null,
   [junit4]   2>   "base_url":"https://127.0.0.1:43656/solr",
   [junit4]   2>   "node_name":"127.0.0.1:43656_solr",
   [junit4]   2>   "numShards":"1",
   [junit4]   2>   "state":"down",
   [junit4]   2>   "shard":"shard1",
   [junit4]   2>   "collection":"testschemaapi",
   [junit4]   2>   "operation":"state"}
   [junit4]   2> 673066 INFO  (qtp27040634-3341) [n:127.0.0.1:43656_solr c:testschemaapi s:shard1  x:testschemaapi_shard1_replica1] o.a.s.c.c.ZkStateReader Add data for [testschemaapi] ver [1]
   [junit4]   2> 673067 INFO  (qtp27040634-3341) [n:127.0.0.1:43656_solr c:testschemaapi s:shard1  x:testschemaapi_shard1_replica1] o.a.s.c.ZkController look for our core node name
   [junit4]   2> 673168 INFO  (OverseerStateUpdate-96044168693415942-127.0.0.1:43656_solr-n_0000000000) [n:127.0.0.1:43656_solr    ] o.a.s.c.o.ZkStateWriter going to update_collection /collections/testschemaapi/state.json version: 1
   [junit4]   2> 673168 INFO  (zkCallback-463-thread-2-processing-n:127.0.0.1:43656_solr) [n:127.0.0.1:43656_solr    ] o.a.s.c.c.ZkStateReader A cluster state change: [WatchedEvent state:SyncConnected type:NodeDataChanged path:/collections/testschemaapi/state.json] for collection [testschemaapi] has occurred - updating... (live nodes size: [2])
   [junit4]   2> 673168 INFO  (zkCallback-462-thread-1-processing-n:127.0.0.1:44598_solr) [n:127.0.0.1:44598_solr    ] o.a.s.c.c.ZkStateReader A cluster state change: [WatchedEvent state:SyncConnected type:NodeDataChanged path:/collections/testschemaapi/state.json] for collection [testschemaapi] has occurred - updating... (live nodes size: [2])
   [junit4]   2> 673169 INFO  (zkCallback-463-thread-2-processing-n:127.0.0.1:43656_solr) [n:127.0.0.1:43656_solr    ] o.a.s.c.c.ZkStateReader Updating data for [testschemaapi] from [1] to [2]
   [junit4]   2> 673169 INFO  (zkCallback-462-thread-1-processing-n:127.0.0.1:44598_solr) [n:127.0.0.1:44598_solr    ] o.a.s.c.c.ZkStateReader Updating data for [testschemaapi] from [1] to [2]
   [junit4]   2> 673943 INFO  (qtp3559961-3356) [n:127.0.0.1:44598_solr c:testschemaapi s:shard1  x:testschemaapi_shard1_replica2] o.a.s.c.ZkController waiting to find shard id in clusterstate for testschemaapi_shard1_replica2
   [junit4]   2> 673943 INFO  (qtp3559961-3356) [n:127.0.0.1:44598_solr c:testschemaapi s:shard1  x:testschemaapi_shard1_replica2] o.a.s.c.ZkController Check for collection zkNode:testschemaapi
   [junit4]   2> 673943 INFO  (qtp3559961-3356) [n:127.0.0.1:44598_solr c:testschemaapi s:shard1  x:testschemaapi_shard1_replica2] o.a.s.c.ZkController Collection zkNode exists
   [junit4]   2> 673943 INFO  (qtp3559961-3356) [n:127.0.0.1:44598_solr c:testschemaapi s:shard1  x:testschemaapi_shard1_replica2] o.a.s.c.c.ZkStateReader Load collection config from: [/collections/testschemaapi]
   [junit4]   2> 673944 INFO  (qtp3559961-3356) [n:127.0.0.1:44598_solr c:testschemaapi s:shard1  x:testschemaapi_shard1_replica2] o.a.s.c.c.ZkStateReader path=[/collections/testschemaapi] [configName]=[conf1] specified config exists in ZooKeeper
   [junit4]   2> 673944 INFO  (qtp3559961-3356) [n:127.0.0.1:44598_solr c:testschemaapi s:shard1  x:testschemaapi_shard1_replica2] o.a.s.c.SolrResourceLoader new SolrResourceLoader for directory: '/home/jenkins/workspace/Lucene-Solr-6.x-Linux/solr/build/solr-core/test/J1/temp/solr.schema.TestManagedSchemaAPI_344274A1430716F1-001/tempDir-001/node2/testschemaapi_shard1_replica2'
   [junit4]   2> 673944 INFO  (qtp3559961-3356) [n:127.0.0.1:44598_solr c:testschemaapi s:shard1  x:testschemaapi_shard1_replica2] o.a.s.c.SolrResourceLoader JNDI not configured for solr (NoInitialContextEx)
   [junit4]   2> 673944 INFO  (qtp3559961-3356) [n:127.0.0.1:44598_solr c:testschemaapi s:shard1  x:testschemaapi_shard1_replica2] o.a.s.c.SolrResourceLoader solr home defaulted to 'solr/' (could not find system property or JNDI)
   [junit4]   2> 673945 INFO  (qtp3559961-3356) [n:127.0.0.1:44598_solr c:testschemaapi s:shard1  x:testschemaapi_shard1_replica2] o.a.s.c.Config loaded config solrconfig.xml with version 0 
   [junit4]   2> 673951 INFO  (qtp3559961-3356) [n:127.0.0.1:44598_solr c:testschemaapi s:shard1  x:testschemaapi_shard1_replica2] o.a.s.c.SolrConfig current version of requestparams : -1
   [junit4]   2> 673957 INFO  (qtp3559961-3356) [n:127.0.0.1:44598_solr c:testschemaapi s:shard1  x:testschemaapi_shard1_replica2] o.a.s.c.SolrConfig Using Lucene MatchVersion: 6.2.0
   [junit4]   2> 673968 INFO  (qtp3559961-3356) [n:127.0.0.1:44598_solr c:testschemaapi s:shard1  x:testschemaapi_shard1_replica2] o.a.s.c.SolrConfig Loaded SolrConfig: solrconfig.xml
   [junit4]   2> 673975 INFO  (qtp3559961-3356) [n:127.0.0.1:44598_solr c:testschemaapi s:shard1  x:testschemaapi_shard1_replica2] o.a.s.s.IndexSchema [testschemaapi_shard1_replica2] Schema name=minimal
   [junit4]   2> 673980 INFO  (qtp3559961-3356) [n:127.0.0.1:44598_solr c:testschemaapi s:shard1  x:testschemaapi_shard1_replica2] o.a.s.s.IndexSchema unique key field: id
   [junit4]   2> 673982 INFO  (qtp3559961-3356) [n:127.0.0.1:44598_solr c:testschemaapi s:shard1  x:testschemaapi_shard1_replica2] o.a.s.c.ConfigSetProperties Did not find ConfigSet properties, assuming default properties: Can't find resource 'configsetprops.json' in classpath or '/configs/conf1', cwd=/home/jenkins/workspace/Lucene-Solr-6.x-Linux/solr/build/solr-core/test/J1
   [junit4]   2> 673982 INFO  (qtp3559961-3356) [n:127.0.0.1:44598_solr c:testschemaapi s:shard1  x:testschemaapi_shard1_replica2] o.a.s.c.CoreContainer Creating SolrCore 'testschemaapi_shard1_replica2' using configuration from collection testschemaapi
   [junit4]   2> 673982 INFO  (qtp3559961-3356) [n:127.0.0.1:44598_solr c:testschemaapi s:shard1 r:core_node1 x:testschemaapi_shard1_replica2] o.a.s.c.SolrCore org.apache.solr.core.MockDirectoryFactory
   [junit4]   2> 673982 INFO  (qtp3559961-3356) [n:127.0.0.1:44598_solr c:testschemaapi s:shard1 r:core_node1 x:testschemaapi_shard1_replica2] o.a.s.c.SolrCore [[testschemaapi_shard1_replica2] ] Opening new SolrCore at [/home/jenkins/workspace/Lucene-Solr-6.x-Linux/solr/build/solr-core/test/J1/temp/solr.schema.TestManagedSchemaAPI_344274A1430716F1-001/tempDir-001/node2/testschemaapi_shard1_replica2], dataDir=[/home/jenkins/workspace/Lucene-Solr-6.x-Linux/solr/build/solr-core/test/J1/temp/solr.schema.TestManagedSchemaAPI_344274A1430716F1-001/tempDir-001/node2/./testschemaapi_shard1_replica2/data/]
   [junit4]   2> 673982 INFO  (qtp3559961-3356) [n:127.0.0.1:44598_solr c:testschemaapi s:shard1 r:core_node1 x:testschemaapi_shard1_replica2] o.a.s.c.SolrCore JMX monitoring not detected for core: testschemaapi_shard1_replica2
   [junit4]   2> 673983 INFO  (qtp3559961-3356) [n:127.0.0.1:44598_solr c:testschemaapi s:shard1 r:core_node1 x:testschemaapi_shard1_replica2] o.a.s.c.CachingDirectoryFactory return new directory for /home/jenkins/workspace/Lucene-Solr-6.x-Linux/solr/build/solr-core/test/J1/temp/solr.schema.TestManagedSchemaAPI_344274A1430716F1-001/tempDir-001/node2/./testschemaapi_shard1_replica2/data
   [junit4]   2> 673983 INFO  (qtp3559961-3356) [n:127.0.0.1:44598_solr c:testschemaapi s:shard1 r:core_node1 x:testschemaapi_shard1_replica2] o.a.s.c.SolrCore New index directory detected: old=null new=/home/jenkins/workspace/Lucene-Solr-6.x-Linux/solr/build/solr-core/test/J1/temp/solr.schema.TestManagedSchemaAPI_344274A1430716F1-001/tempDir-001/node2/./testschemaapi_shard1_replica2/data/index/
   [junit4]   2> 673983 WARN  (qtp3559961-3356) [n:127.0.0.1:44598_solr c:testschemaapi s:shard1 r:core_node1 x:testschemaapi_shard1_replica2] o.a.s.c.SolrCore [testschemaapi_shard1_replica2] Solr index directory '/home/jenkins/workspace/Lucene-Solr-6.x-Linux/solr/build/solr-core/test/J1/temp/solr.schema.TestManagedSchemaAPI_344274A1430716F1-001/tempDir-001/node2/./testschemaapi_shard1_replica2/data/index' doesn't exist. Creating new index...
   [junit4]   2> 673984 INFO  (qtp3559961-3356) [n:127.0.0.1:44598_solr c:testschemaapi s:shard1 r:core_node1 x:testschemaapi_shard1_replica2] o.a.s.c.CachingDirectoryFactory return new directory for /home/jenkins/workspace/Lucene-Solr-6.x-Linux/solr/build/solr-core/test/J1/temp/solr.schema.TestManagedSchemaAPI_344274A1430716F1-001/tempDir-001/node2/./testschemaapi_shard1_replica2/data/index
   [junit4]   2> 673985 INFO  (qtp3559961-3356) [n:127.0.0.1:44598_solr c:testschemaapi s:shard1 r:core_node1 x:testschemaapi_shard1_replica2] o.a.s.c.SolrDeletionPolicy SolrDeletionPolicy.onCommit: commits: num=1
   [junit4]   2> 	commit{dir=MockDirectoryWrapper(RAMDirectory@11ab8c0 lockFactory=org.apache.lucene.store.SingleInstanceLockFactory@1a15ba),segFN=segments_1,generation=1}
   [junit4]   2> 673985 INFO  (qtp3559961-3356) [n:127.0.0.1:44598_solr c:testschemaapi s:shard1 r:core_node1 x:testschemaapi_shard1_replica2] o.a.s.c.SolrDeletionPolicy newest commit generation = 1
   [junit4]   2> 673985 INFO  (OldIndexDirectoryCleanupThreadForCore-testschemaapi_shard1_replica2) [n:127.0.0.1:44598_solr c:testschemaapi s:shard1 r:core_node1 x:testschemaapi_shard1_replica2] o.a.s.c.SolrCore Looking for old index directories to cleanup for core testschemaapi_shard1_replica2 in /home/jenkins/workspace/Lucene-Solr-6.x-Linux/solr/build/solr-core/test/J1/temp/solr.schema.TestManagedSchemaAPI_344274A1430716F1-001/tempDir-001/node2/./testschemaapi_shard1_replica2/data/
   [junit4]   2> 673985 WARN  (OldIndexDirectoryCleanupThreadForCore-testschemaapi_shard1_replica2) [n:127.0.0.1:44598_solr c:testschemaapi s:shard1 r:core_node1 x:testschemaapi_shard1_replica2] o.a.s.c.DirectoryFactory /home/jenkins/workspace/Lucene-Solr-6.x-Linux/solr/build/solr-core/test/J1/temp/solr.schema.TestManagedSchemaAPI_344274A1430716F1-001/tempDir-001/node2/./testschemaapi_shard1_replica2/data/ does not point to a valid data directory; skipping clean-up of old index directories.
   [junit4]   2> 673987 INFO  (qtp3559961-3356) [n:127.0.0.1:44598_solr c:testschemaapi s:shard1 r:core_node1 x:testschemaapi_shard1_replica2] o.a.s.c.SolrCore no updateRequestProcessorChain defined as default, creating implicit default
   [junit4]   2> 673988 INFO  (qtp3559961-3356) [n:127.0.0.1:44598_solr c:testschemaapi s:shard1 r:core_node1 x:testschemaapi_shard1_replica2] o.a.s.h.l.XMLLoader xsltCacheLifetimeSeconds=60
   [junit4]   2> 673990 INFO  (qtp3559961-3356) [n:127.0.0.1:44598_solr c:testschemaapi s:shard1 r:core_node1 x:testschemaapi_shard1_replica2] o.a.s.h.l.XMLLoader xsltCacheLifetimeSeconds=60
   [junit4]   2> 673990 INFO  (qtp3559961-3356) [n:127.0.0.1:44598_solr c:testschemaapi s:shard1 r:core_node1 x:testschemaapi_shard1_replica2] o.a.s.h.l.XMLLoader xsltCacheLifetimeSeconds=60
   [junit4]   2> 673991 INFO  (qtp3559961-3356) [n:127.0.0.1:44598_solr c:testschemaapi s:shard1 r:core_node1 x:testschemaapi_shard1_replica2] o.a.s.h.l.XMLLoader xsltCacheLifetimeSeconds=60
   [junit4]   2> 673993 INFO  (qtp3559961-3356) [n:127.0.0.1:44598_solr c:testschemaapi s:shard1 r:core_node1 x:testschemaapi_shard1_replica2] o.a.s.c.RequestHandlers Registered paths: /admin/mbeans,/update/csv,/sql,/update/json/docs,/admin/luke,/graph,/export,/select,/admin/segments,/get,/admin/system,/replication,/admin/properties,/config,/stream,/schema,/admin/plugins,/admin/logging,/update/json,/admin/ping,/admin/threads,/update,/admin/file
   [junit4]   2> 673993 INFO  (qtp3559961-3356) [n:127.0.0.1:44598_solr c:testschemaapi s:shard1 r:core_node1 x:testschemaapi_shard1_replica2] o.a.s.c.SolrCore Using default statsCache cache: org.apache.solr.search.stats.LocalStatsCache
   [junit4]   2> 673993 INFO  (qtp3559961-3356) [n:127.0.0.1:44598_solr c:testschemaapi s:shard1 r:core_node1 x:testschemaapi_shard1_replica2] o.a.s.u.UpdateHandler Using UpdateLog implementation: org.apache.solr.update.UpdateLog
   [junit4]   2> 673994 INFO  (qtp3559961-3356) [n:127.0.0.1:44598_solr c:testschemaapi s:shard1 r:core_node1 x:testschemaapi_shard1_replica2] o.a.s.u.UpdateLog Initializing UpdateLog: dataDir=null defaultSyncLevel=FLUSH numRecordsToKeep=100 maxNumLogsToKeep=10 numVersionBuckets=65536
   [junit4]   2> 673995 INFO  (qtp3559961-3356) [n:127.0.0.1:44598_solr c:testschemaapi s:shard1 r:core_node1 x:testschemaapi_shard1_replica2] o.a.s.u.CommitTracker Hard AutoCommit: disabled
   [junit4]   2> 673995 INFO  (qtp3559961-3356) [n:127.0.0.1:44598_solr c:testschemaapi s:shard1 r:core_node1 x:testschemaapi_shard1_replica2] o.a.s.u.CommitTracker Soft AutoCommit: disabled
   [junit4]   2> 673996 INFO  (qtp3559961-3356) [n:127.0.0.1:44598_solr c:testschemaapi s:shard1 r:core_node1 x:testschemaapi_shard1_replica2] o.a.s.c.SolrDeletionPolicy SolrDeletionPolicy.onInit: commits: num=1
   [junit4]   2> 	commit{dir=MockDirectoryWrapper(RAMDirectory@11ab8c0 lockFactory=org.apache.lucene.store.SingleInstanceLockFactory@1a15ba),segFN=segments_1,generation=1}
   [junit4]   2> 673996 INFO  (qtp3559961-3356) [n:127.0.0.1:44598_solr c:testschemaapi s:shard1 r:core_node1 x:testschemaapi_shard1_replica2] o.a.s.c.SolrDeletionPolicy newest commit generation = 1
   [junit4]   2> 673996 INFO  (qtp3559961-3356) [n:127.0.0.1:44598_solr c:testschemaapi s:shard1 r:core_node1 x:testschemaapi_shard1_replica2] o.a.s.s.SolrIndexSearcher Opening [Searcher@a3124f[testschemaapi_shard1_replica2] main]
   [junit4]   2> 673996 INFO  (qtp3559961-3356) [n:127.0.0.1:44598_solr c:testschemaapi s:shard1 r:core_node1 x:testschemaapi_shard1_replica2] o.a.s.c.c.ZkStateReader Load collection config from: [/collections/testschemaapi]
   [junit4]   2> 673997 INFO  (qtp3559961-3356) [n:127.0.0.1:44598_solr c:testschemaapi s:shard1 r:core_node1 x:testschemaapi_shard1_replica2] o.a.s.c.c.ZkStateReader path=[/collections/testschemaapi] [configName]=[conf1] specified config exists in ZooKeeper
   [junit4]   2> 673997 INFO  (qtp3559961-3356) [n:127.0.0.1:44598_solr c:testschemaapi s:shard1 r:core_node1 x:testschemaapi_shard1_replica2] o.a.s.r.ManagedResourceStorage Setting up ZooKeeper-based storage for the RestManager with znodeBase: /configs/conf1
   [junit4]   2> 673997 INFO  (qtp3559961-3356) [n:127.0.0.1:44598_solr c:testschemaapi s:shard1 r:core_node1 x:testschemaapi_shard1_replica2] o.a.s.r.ManagedResourceStorage Configured ZooKeeperStorageIO with znodeBase: /configs/conf1
   [junit4]   2> 673997 INFO  (qtp3559961-3356) [n:127.0.0.1:44598_solr c:testschemaapi s:shard1 r:core_node1 x:testschemaapi_shard1_replica2] o.a.s.r.RestManager Initializing RestManager with initArgs: {}
   [junit4]   2> 673997 INFO  (qtp3559961-3356) [n:127.0.0.1:44598_solr c:testschemaapi s:shard1 r:core_node1 x:testschemaapi_shard1_replica2] o.a.s.r.ManagedResourceStorage Reading _rest_managed.json using ZooKeeperStorageIO:path=/configs/conf1
   [junit4]   2> 673997 INFO  (qtp3559961-3356) [n:127.0.0.1:44598_solr c:testschemaapi s:shard1 r:core_node1 x:testschemaapi_shard1_replica2] o.a.s.r.ManagedResourceStorage No data found for znode /configs/conf1/_rest_managed.json
   [junit4]   2> 673997 INFO  (qtp3559961-3356) [n:127.0.0.1:44598_solr c:testschemaapi s:shard1 r:core_node1 x:testschemaapi_shard1_replica2] o.a.s.r.ManagedResourceStorage Loaded null at path _rest_managed.json using ZooKeeperStorageIO:path=/configs/conf1
   [junit4]   2> 673997 INFO  (qtp3559961-3356) [n:127.0.0.1:44598_solr c:testschemaapi s:shard1 r:core_node1 x:testschemaapi_shard1_replica2] o.a.s.r.RestManager Initializing 0 registered ManagedResources
   [junit4]   2> 673998 INFO  (qtp3559961-3356) [n:127.0.0.1:44598_solr c:testschemaapi s:shard1 r:core_node1 x:testschemaapi_shard1_replica2] o.a.s.s.ZkIndexSchemaReader Creating ZooKeeper watch for the managed schema at /configs/conf1/managed-schema
   [junit4]   2> 673998 INFO  (qtp3559961-3356) [n:127.0.0.1:44598_solr c:testschemaapi s:shard1 r:core_node1 x:testschemaapi_shard1_replica2] o.a.s.c.ZkController Added new OnReconnect listener ZkIndexSchemaReader: /configs/conf1/managed-schema, uniqueCoreId: testschemaapi_shard1_replica2:2975873228602660
   [junit4]   2> 673998 INFO  (qtp3559961-3356) [n:127.0.0.1:44598_solr c:testschemaapi s:shard1 r:core_node1 x:testschemaapi_shard1_replica2] o.a.s.h.ReplicationHandler Commits will be reserved for  10000
   [junit4]   2> 673998 INFO  (searcherExecutor-1457-thread-1-processing-n:127.0.0.1:44598_solr x:testschemaapi_shard1_replica2 s:shard1 c:testschemaapi r:core_node1) [n:127.0.0.1:44598_solr c:testschemaapi s:shard1 r:core_node1 x:testschemaapi_shard1_replica2] o.a.s.c.SolrCore [testschemaapi_shard1_replica2] Registered new searcher Searcher@a3124f[testschemaapi_shard1_replica2] main{ExitableDirectoryReader(UninvertingDirectoryReader())}
   [junit4]   2> 673998 INFO  (qtp3559961-3356) [n:127.0.0.1:44598_solr c:testschemaapi s:shard1 r:core_node1 x:testschemaapi_shard1_replica2] o.a.s.u.UpdateLog Looking up max value of version field to seed version buckets
   [junit4]   2> 673998 INFO  (qtp3559961-3356) [n:127.0.0.1:44598_solr c:testschemaapi s:shard1 r:core_node1 x:testschemaapi_shard1_replica2] o.a.s.u.VersionInfo Refreshing highest value of _version_ for 65536 version buckets from index
   [junit4]   2> 673998 INFO  (qtp3559961-3356) [n:127.0.0.1:44598_solr c:testschemaapi s:shard1 r:core_node1 x:testschemaapi_shard1_replica2] o.a.s.u.VersionInfo No terms found for _version_, cannot seed version bucket highest value from index
   [junit4]   2> 673998 INFO  (qtp3559961-3356) [n:127.0.0.1:44598_solr c:testschemaapi s:shard1 r:core_node1 x:testschemaapi_shard1_replica2] o.a.s.u.UpdateLog Could not find max version in index or recent updates, using new clock 1536706701716094976
   [junit4]   2> 674001 INFO  (qtp3559961-3356) [n:127.0.0.1:44598_solr c:testschemaapi s:shard1 r:core_node1 x:testschemaapi_shard1_replica2] o.a.s.u.UpdateLog Took 2.0ms to seed version buckets with highest version 1536706701716094976
   [junit4]   2> 674001 INFO  (qtp3559961-3356) [n:127.0.0.1:44598_solr c:testschemaapi s:shard1 r:core_node1 x:testschemaapi_shard1_replica2] o.a.s.c.ZkController watch zkdir /configs/conf1
   [junit4]   2> 674002 INFO  (qtp3559961-3356) [n:127.0.0.1:44598_solr c:testschemaapi s:shard1 r:core_node1 x:testschemaapi_shard1_replica2] o.a.s.c.CoreContainer registering core: testschemaapi_shard1_replica2
   [junit4]   2> 674002 INFO  (qtp3559961-3356) [n:127.0.0.1:44598_solr c:testschemaapi s:shard1 r:core_node1 x:testschemaapi_shard1_replica2] o.a.s.c.ZkController Register replica - core:testschemaapi_shard1_replica2 address:https://127.0.0.1:44598/solr collection:testschemaapi shard:shard1
   [junit4]   2> 674002 INFO  (qtp3559961-3356) [n:127.0.0.1:44598_solr c:testschemaapi s:shard1 r:core_node1 x:testschemaapi_shard1_replica2] o.a.s.c.c.SolrZkClient makePath: /collections/testschemaapi/leader_elect/shard1/election
   [junit4]   2> 674004 INFO  (qtp3559961-3356) [n:127.0.0.1:44598_solr c:testschemaapi s:shard1 r:core_node1 x:testschemaapi_shard1_replica2] o.a.s.c.LeaderElector Joined leadership election with path: /collections/testschemaapi/leader_elect/shard1/election/96044168693415941-core_node1-n_0000000000
   [junit4]   2> 674005 INFO  (qtp3559961-3356) [n:127.0.0.1:44598_solr c:testschemaapi s:shard1 r:core_node1 x:testschemaapi_shard1_replica2] o.a.s.c.ShardLeaderElectionContext Running the leader process for shard=shard1 and weAreReplacement=false and leaderVoteWait=10000
   [junit4]   2> 674006 INFO  (qtp3559961-3356) [n:127.0.0.1:44598_solr c:testschemaapi s:shard1 r:core_node1 x:testschemaapi_shard1_replica2] o.a.s.c.ShardLeaderElectionContext Waiting until we see more replicas up for shard shard1: total=2 found=1 timeoutin=9999ms
   [junit4]   2> 674006 INFO  (OverseerStateUpdate-96044168693415942-127.0.0.1:43656_solr-n_0000000000) [n:127.0.0.1:43656_solr    ] o.a.s.c.Overseer processMessage: queueSize: 1, message = {
   [junit4]   2>   "operation":"leader",
   [junit4]   2>   "shard":"shard1",
   [junit4]   2>   "collection":"testschemaapi"} current state version: 0
   [junit4]   2> 674067 INFO  (qtp27040634-3341) [n:127.0.0.1:43656_solr c:testschemaapi s:shard1  x:testschemaapi_shard1_replica1] o.a.s.c.ZkController waiting to find shard id in clusterstate for testschemaapi_shard1_replica1
   [junit4]   2> 674067 INFO  (qtp27040634-3341) [n:127.0.0.1:43656_solr c:testschemaapi s:shard1  x:testschemaapi_shard1_replica1] o.a.s.c.ZkController Check for collection zkNode:testschemaapi
   [junit4]   2> 674067 INFO  (qtp27040634-3341) [n:127.0.0.1:43656_solr c:testschemaapi s:shard1  x:testschemaapi_shard1_replica1] o.a.s.c.ZkController Collection zkNode exists
   [junit4]   2> 674067 INFO  (qtp27040634-3341) [n:127.0.0.1:43656_solr c:testschemaapi s:shard1  x:testschemaapi_shard1_replica1] o.a.s.c.c.ZkStateReader Load collection config from: [/collections/testschemaapi]
   [junit4]   2> 674067 INFO  (qtp27040634-3341) [n:127.0.0.1:43656_solr c:testschemaapi s:shard1  x:testschemaapi_shard1_replica1] o.a.s.c.c.ZkStateReader path=[/collections/testschemaapi] [configName]=[conf1] specified config exists in ZooKeeper
   [junit4]   2> 674068 INFO  (qtp27040634-3341) [n:127.0.0.1:43656_solr c:testschemaapi s:shard1  x:testschemaapi_shard1_replica1] o.a.s.c.SolrResourceLoader new SolrResourceLoader for directory: '/home/jenkins/workspace/Lucene-Solr-6.x-Linux/solr/build/solr-core/test/J1/temp/solr.schema.TestManagedSchemaAPI_344274A1430716F1-001/tempDir-001/node1/testschemaapi_shard1_replica1'
   [junit4]   2> 674068 INFO  (qtp27040634-3341) [n:127.0.0.1:43656_solr c:testschemaapi s:shard1  x:testschemaapi_shard1_replica1] o.a.s.c.SolrResourceLoader JNDI not configured for solr (NoInitialContextEx)
   [junit4]   2> 674068 INFO  (qtp27040634-3341) [n:127.0.0.1:43656_solr c:testschemaapi s:shard1  x:testschemaapi_shard1_replica1] o.a.s.c.SolrResourceLoader solr home defaulted to 'solr/' (could not find system property or JNDI)
   [junit4]   2> 674069 INFO  (qtp27040634-3341) [n:127.0.0.1:43656_solr c:testschemaapi s:shard1  x:testschemaapi_shard1_replica1] o.a.s.c.Config loaded config solrconfig.xml with version 0 
   [junit4]   2> 674073 INFO  (qtp27040634-3341) [n:127.0.0.1:43656_solr c:testschemaapi s:shard1  x:testschemaapi_shard1_replica1] o.a.s.c.SolrConfig current version of requestparams : -1
   [junit4]   2> 674076 INFO  (qtp27040634-3341) [n:127.0.0.1:43656_solr c:testschemaapi s:shard1  x:testschemaapi_shard1_replica1] o.a.s.c.SolrConfig Using Lucene MatchVersion: 6.2.0
   [junit4]   2> 674084 INFO  (qtp27040634-3341) [n:127.0.0.1:43656_solr c:testschemaapi s:shard1  x:testschemaapi_shard1_replica1] o.a.s.c.SolrConfig Loaded SolrConfig: solrconfig.xml
   [junit4]   2> 674089 INFO  (qtp27040634-3341) [n:127.0.0.1:43656_solr c:testschemaapi s:shard1  x:testschemaapi_shard1_replica1] o.a.s.s.IndexSchema [testschemaapi_shard1_replica1] Schema name=minimal
   [junit4]   2> 674092 INFO  (qtp27040634-3341) [n:127.0.0.1:43656_solr c:testschemaapi s:shard1  x:testschemaapi_shard1_replica1] o.a.s.s.IndexSchema unique key field: id
   [junit4]   2> 674093 INFO  (qtp27040634-3341) [n:127.0.0.1:43656_solr c:testschemaapi s:shard1  x:testschemaapi_shard1_replica1] o.a.s.c.ConfigSetProperties Did not find ConfigSet properties, assuming default properties: Can't find resource 'configsetprops.json' in classpath or '/configs/conf1', cwd=/home/jenkins/workspace/Lucene-Solr-6.x-Linux/solr/build/solr-core/test/J1
   [junit4]   2> 674093 INFO  (qtp27040634-3341) [n:127.0.0.1:43656_solr c:testschemaapi s:shard1  x:testschemaapi_shard1_replica1] o.a.s.c.CoreContainer Creating SolrCore 'testschemaapi_shard1_replica1' using configuration from collection testschemaapi
   [junit4]   2> 674093 INFO  (qtp27040634-3341) [n:127.0.0.1:43656_solr c:testschemaapi s:shard1 r:core_node2 x:testschemaapi_shard1_replica1] o.a.s.c.SolrCore org.apache.solr.core.MockDirectoryFactory
   [junit4]   2> 674093 INFO  (qtp27040634-3341) [n:127.0.0.1:43656_solr c:testschemaapi s:shard1 r:core_node2 x:testschemaapi_shard1_replica1] o.a.s.c.SolrCore [[testschemaapi_shard1_replica1] ] Opening new SolrCore at [/home/jenkins/workspace/Lucene-Solr-6.x-Linux/solr/build/solr-core/test/J1/temp/solr.schema.TestManagedSchemaAPI_344274A1430716F1-001/tempDir-001/node1/testschemaapi_shard1_replica1], dataDir=[/home/jenkins/workspace/Lucene-Solr-6.x-Linux/solr/build/solr-core/test/J1/temp/solr.schema.TestManagedSchemaAPI_344274A1430716F1-001/tempDir-001/node1/./testschemaapi_shard1_replica1/data/]
   [junit4]   2> 674093 INFO  (qtp27040634-3341) [n:127.0.0.1:43656_solr c:testschemaapi s:shard1 r:core_node2 x:testschemaapi_shard1_replica1] o.a.s.c.SolrCore JMX monitoring not detected for core: testschemaapi_shard1_replica1
   [junit4]   2> 674094 INFO  (qtp27040634-3341) [n:127.0.0.1:43656_solr c:testschemaapi s:shard1 r:core_node2 x:testschemaapi_shard1_replica1] o.a.s.c.CachingDirectoryFactory return new directory for /home/jenkins/workspace/Lucene-Solr-6.x-Linux/solr/build/solr-core/test/J1/temp/solr.schema.TestManagedSchemaAPI_344274A1430716F1-001/tempDir-001/node1/./testschemaapi_shard1_replica1/data
   [junit4]   2> 674094 INFO  (qtp27040634-3341) [n:127.0.0.1:43656_solr c:testschemaapi s:shard1 r:core_node2 x:testschemaapi_shard1_replica1] o.a.s.c.SolrCore New index directory detected: old=null new=/home/jenkins/workspace/Lucene-Solr-6.x-Linux/solr/build/solr-core/test/J1/temp/solr.schema.TestManagedSchemaAPI_344274A1430716F1-001/tempDir-001/node1/./testschemaapi_shard1_replica1/data/index/
   [junit4]   2> 674094 WARN  (qtp27040634-3341) [n:127.0.0.1:43656_solr c:testschemaapi s:shard1 r:core_node2 x:testschemaapi_shard1_replica1] o.a.s.c.SolrCore [testschemaapi_shard1_replica1] Solr index directory '/home/jenkins/workspace/Lucene-Solr-6.x-Linux/solr/build/solr-core/test/J1/temp/solr.schema.TestManagedSchemaAPI_344274A1430716F1-001/tempDir-001/node1/./testschemaapi_shard1_replica1/data/index' doesn't exist. Creating new index...
   [junit4]   2> 674094 INFO  (qtp27040634-3341) [n:127.0.0.1:43656_solr c:testschemaapi s:shard1 r:core_node2 x:testschemaapi_shard1_replica1] o.a.s.c.CachingDirectoryFactory return new directory for /home/jenkins/workspace/Lucene-Solr-6.x-Linux/solr/build/solr-core/test/J1/temp/solr.schema.TestManagedSchemaAPI_344274A1430716F1-001/tempDir-001/node1/./testschemaapi_shard1_replica1/data/index
   [junit4]   2> 674095 INFO  (qtp27040634-3341) [n:127.0.0.1:43656_solr c:testschemaapi s:shard1 r:core_node2 x:testschemaapi_shard1_replica1] o.a.s.c.SolrDeletionPolicy SolrDeletionPolicy.onCommit: commits: num=1
   [junit4]   2> 	commit{dir=MockDirectoryWrapper(RAMDirectory@1a9c4af lockFactory=org.apache.lucene.store.SingleInstanceLockFactory@1a99941),segFN=segments_1,generation=1}
   [junit4]   2> 674095 INFO  (qtp27040634-3341) [n:127.0.0.1:43656_solr c:testschemaapi s:shard1 r:core_node2 x:testschemaapi_shard1_replica1] o.a.s.c.SolrDeletionPolicy newest commit generation = 1
   [junit4]   2> 674095 INFO  (OldIndexDirectoryCleanupThreadForCore-testschemaapi_shard1_replica1) [n:127.0.0.1:43656_solr c:testschemaapi s:shard1 r:core_node2 x:testschemaapi_shard1_replica1] o.a.s.c.SolrCore Looking for old index directories to cleanup for core testschemaapi_shard1_replica1 in /home/jenkins/workspace/Lucene-Solr-6.x-Linux/solr/build/solr-core/test/J1/temp/solr.schema.TestManagedSchemaAPI_344274A1430716F1-001/tempDir-001/node1/./testschemaapi_shard1_replica1/data/
   [junit4]   2> 674095 WARN  (OldIndexDirectoryCleanupThreadForCore-testschemaapi_shard1_replica1) [n:127.0.0.1:43656_solr c:testschemaapi s:shard1 r:core_node2 x:testschemaapi_shard1_replica1] o.a.s.c.DirectoryFactory /home/jenkins/workspace/Lucene-Solr-6.x-Linux/solr/build/solr-core/test/J1/temp/solr.schema.TestManagedSchemaAPI_344274A1430716F1-001/tempDir-001/node1/./testschemaapi_shard1_replica1/data/ does not point to a valid data directory; skipping clean-up of old index directories.
   [junit4]   2> 674096 INFO  (qtp27040634-3341) [n:127.0.0.1:43656_solr c:testschemaapi s:shard1 r:core_node2 x:testschemaapi_shard1_replica1] o.a.s.c.SolrCore no updateRequestProcessorChain defined as default, creating implicit default
   [junit4]   2> 674097 INFO  (qtp27040634-3341) [n:127.0.0.1:43656_solr c:testschemaapi s:shard1 r:core_node2 x:testschemaapi_shard1_replica1] o.a.s.h.l.XMLLoader xsltCacheLifetimeSeconds=60
   [junit4]   2> 674098 INFO  (qtp27040634-3341) [n:127.0.0.1:43656_solr c:testschemaapi s:shard1 r:core_node2 x:testschemaapi_shard1_replica1] o.a.s.h.l.XMLLoader xsltCacheLifetimeSeconds=60
   [junit4]   2> 674099 INFO  (qtp27040634-3341) [n:127.0.0.1:43656_solr c:testschemaapi s:shard1 r:core_node2 x:testschemaapi_shard1_replica1] o.a.s.h.l.XMLLoader xsltCacheLifetimeSeconds=60
   [junit4]   2> 674099 INFO  (qtp27040634-3341) [n:127.0.0.1:43656_solr c:testschemaapi s:shard1 r:core_node2 x:testschemaapi_shard1_replica1] o.a.s.h.l.XMLLoader xsltCacheLifetimeSeconds=60
   [junit4]   2> 674100 INFO  (qtp27040634-3341) [n:127.0.0.1:43656_solr c:testschemaapi s:shard1 r:core_node2 x:testschemaapi_shard1_replica1] o.a.s.c.RequestHandlers Registered paths: /admin/mbeans,/update/csv,/sql,/update/json/docs,/admin/luke,/graph,/export,/select,/admin/segments,/get,/admin/system,/replication,/admin/properties,/config,/stream,/schema,/admin/plugins,/admin/logging,/update/json,/admin/ping,/admin/threads,/update,/admin/file
   [junit4]   2> 674100 INFO  (qtp27040634-3341) [n:127.0.0.1:43656_solr c:testschemaapi s:shard1 r:core_node2 x:testschemaapi_shard1_replica1] o.a.s.c.SolrCore Using default statsCache cache: org.apache.solr.search.stats.LocalStatsCache
   [junit4]   2> 674101 INFO  (qtp27040634-3341) [n:127.0.0.1:43656_solr c:testschemaapi s:shard1 r:core_node2 x:testschemaapi_shard1_replica1] o.a.s.u.UpdateHandler Using UpdateLog implementation: org.apache.solr.update.UpdateLog
   [junit4]   2> 674101 INFO  (qtp27040634-3341) [n:127.0.0.1:43656_solr c:testschemaapi s:shard1 r:core_node2 x:testschemaapi_shard1_replica1] o.a.s.u.UpdateLog Initializing UpdateLog: dataDir=null defaultSyncLevel=FLUSH numRecordsToKeep=100 maxNumLogsToKeep=10 numVersionBuckets=65536
   [junit4]   2> 674102 INFO  (qtp27040634-3341) [n:127.0.0.1:43656_solr c:testschemaapi s:shard1 r:core_node2 x:testschemaapi_shard1_replica1] o.a.s.u.CommitTracker Hard AutoCommit: disabled
   [junit4]   2> 674102 INFO  (qtp27040634-3341) [n:127.0.0.1:43656_solr c:testschemaapi s:shard1 r:core_node2 x:testschemaapi_shard1_replica1] o.a.s.u.CommitTracker Soft AutoCommit: disabled
   [junit4]   2> 674102 INFO  (qtp27040634-3341) [n:127.0.0.1:43656_solr c:testschemaapi s:shard1 r:core_node2 x:testschemaapi_shard1_replica1] o.a.s.c.SolrDeletionPolicy SolrDeletionPolicy.onInit: commits: num=1
   [junit4]   2> 	commit{dir=MockDirectoryWrapper(RAMDirectory@1a9c4af lockFactory=org.apache.lucene.store.SingleInstanceLockFactory@1a99941),segFN=segments_1,generation=1}
   [junit4]   2> 674102 INFO  (qtp27040634-3341) [n:127.0.0.1:43656_solr c:testschemaapi s:shard1 r:core_node2 x:testschemaapi_shard1_replica1] o.a.s.c.SolrDeletionPolicy newest commit generation = 1
   [junit4]   2> 674102 INFO  (qtp27040634-3341) [n:127.0.0.1:43656_solr c:testschemaapi s:shard1 r:core_node2 x:testschemaapi_shard1_replica1] o.a.s.s.SolrIndexSearcher Opening [Searcher@1defa9b[testschemaapi_shard1_replica1] main]
   [junit4]   2> 674102 INFO  (qtp27040634-3341) [n:127.0.0.1:43656_solr c:testschemaapi s:shard1 r:core_node2 x:testschemaapi_shard1_replica1] o.a.s.c.c.ZkStateReader Load collection config from: [/collections/testschemaapi]
   [junit4]   2> 674103 INFO  (qtp27040634-3341) [n:127.0.0.1:43656_solr c:testschemaapi s:shard1 r:core_node2 x:testschemaapi_shard1_replica1] o.a.s.c.c.ZkStateReader path=[/collections/testschemaapi] [configName]=[conf1] specified config exists in ZooKeeper
   [junit4]   2> 674103 INFO  (qtp27040634-3341) [n:127.0.0.1:43656_solr c:testschemaapi s:shard1 r:core_node2 x:testschemaapi_shard1_replica1] o.a.s.r.ManagedResourceStorage Setting up ZooKeeper-based storage for the RestManager with znodeBase: /configs/conf1
   [junit4]   2> 674103 INFO  (qtp27040634-3341) [n:127.0.0.1:43656_solr c:testschemaapi s:shard1 r:core_node2 x:testschemaapi_shard1_replica1] o.a.s.r.ManagedResourceStorage Configured ZooKeeperStorageIO with znodeBase: /configs/conf1
   [junit4]   2> 674103 INFO  (qtp27040634-3341) [n:127.0.0.1:43656_solr c:testschemaapi s:shard1 r:core_node2 x:testschemaapi_shard1_replica1] o.a.s.r.RestManager Initializing RestManager with initArgs: {}
   [junit4]   2> 674103 INFO  (qtp27040634-3341) [n:127.0.0.1:43656_solr c:testschemaapi s:shard1 r:core_node2 x:testschemaapi_shard1_replica1] o.a.s.r.ManagedResourceStorage Reading _rest_managed.json using ZooKeeperStorageIO:path=/configs/conf1
   [junit4]   2> 674103 INFO  (qtp27040634-3341) [n:127.0.0.1:43656_solr c:testschemaapi s:shard1 r:core_node2 x:testschemaapi_shard1_replica1] o.a.s.r.ManagedResourceStorage No data found for znode /configs/conf1/_rest_managed.json
   [junit4]   2> 674103 INFO  (qtp27040634-3341) [n:127.0.0.1:43656_solr c:testschemaapi s:shard1 r:core_node2 x:testschemaapi_shard1_replica1] o.a.s.r.ManagedResourceStorage Loaded null at path _rest_managed.json using ZooKeeperStorageIO:path=/configs/conf1
   [junit4]   2> 674103 INFO  (qtp27040634-3341) [n:127.0.0.1:43656_solr c:testschemaapi s:shard1 r:core_node2 x:testschemaapi_shard1_replica1] o.a.s.r.RestManager Initializing 0 registered ManagedResources
   [junit4]   2> 674103 INFO  (qtp27040634-3341) [n:127.0.0.1:43656_solr c:testschemaapi s:shard1 r:core_node2 x:testschemaapi_shard1_replica1] o.a.s.s.ZkIndexSchemaReader Creating ZooKeeper watch for the managed schema at /configs/conf1/managed-schema
   [junit4]   2> 674104 INFO  (qtp27040634-3341) [n:127.0.0.1:43656_solr c:testschemaapi s:shard1 r:core_node2 x:testschemaapi_shard1_replica1] o.a.s.c.ZkController Added new OnReconnect listener ZkIndexSchemaReader: /configs/conf1/managed-schema, uniqueCoreId: testschemaapi_shard1_replica1:2975873339813519
   [junit4]   2> 674104 INFO  (qtp27040634-3341) [n:127.0.0.1:43656_solr c:testschemaapi s:shard1 r:core_node2 x:testschemaapi_shard1_replica1] o.a.s.h.ReplicationHandler Commits will be reserved for  10000
   [junit4]   2> 674104 INFO  (searcherExecutor-1462-thread-1-processing-n:127.0.0.1:43656_solr x:testschemaapi_shard1_replica1 s:shard1 c:testschemaapi r:core_node2) [n:127.0.0.1:43656_solr c:testschemaapi s:shard1 r:core_node2 x:testschemaapi_shard1_replica1] o.a.s.c.SolrCore [testschemaapi_shard1_replica1] Registered new searcher Searcher@1defa9b[testschemaapi_shard1_replica1] main{ExitableDirectoryReader(UninvertingDirectoryReader())}
   [junit4]   2> 674104 INFO  (qtp27040634-3341) [n:127.0.0.1:43656_solr c:testschemaapi s:shard1 r:core_node2 x:testschemaapi_shard1_replica1] o.a.s.u.UpdateLog Looking up max value of version field to seed version buckets
   [junit4]   2> 674104 INFO  (qtp27040634-3341) [n:127.0.0.1:43656_solr c:testschemaapi s:shard1 r:core_node2 x:testschemaapi_shard1_replica1] o.a.s.u.VersionInfo Refreshing highest value of _version_ for 65536 version buckets from index
   [junit4]   2> 674104 INFO  (qtp27040634-3341) [n:127.0.0.1:43656_solr c:testschemaapi s:shard1 r:core_node2 x:testschemaapi_shard1_replica1] o.a.s.u.VersionInfo No terms found for _version_, cannot seed version bucket highest value from index
   [junit4]   2> 674104 INFO  (qtp27040634-3341) [n:127.0.0.1:43656_solr c:testschemaapi s:shard1 r:core_node2 x:testschemaapi_shard1_replica1] o.a.s.u.UpdateLog Could not find max version in index or recent updates, using new clock 1536706701827244032
   [junit4]   2> 674106 INFO  (qtp27040634-3341) [n:127.0.0.1:43656_solr c:testschemaapi s:shard1 r:core_node2 x:testschemaapi_shard1_replica1] o.a.s.u.UpdateLog Took 1.0ms to seed version buckets with highest version 1536706701827244032
   [junit4]   2> 674106 INFO  (qtp27040634-3341) [n:127.0.0.1:43656_solr c:testschemaapi s:shard1 r:core_node2 x:testschemaapi_shard1_replica1] o.a.s.c.ZkController watch zkdir /configs/conf1
   [junit4]   2> 674106 INFO  (qtp27040634-3341) [n:127.0.0.1:43656_solr c:testschemaapi s:shard1 r:core_node2 x:testschemaapi_shard1_replica1] o.a.s.c.CoreContainer registering core: testschemaapi_shard1_replica1
   [junit4]   2> 674106 INFO  (qtp27040634-3341) [n:127.0.0.1:43656_solr c:testschemaapi s:shard1 r:core_node2 x:testschemaapi_shard1_replica1] o.a.s.c.ZkController Register replica - core:testschemaapi_shard1_replica1 address:https://127.0.0.1:43656/solr collection:testschemaapi shard:shard1
   [junit4]   2> 674107 INFO  (qtp27040634-3341) [n:127.0.0.1:43656_solr c:testschemaapi s:shard1 r:core_node2 x:testschemaapi_shard1_replica1] o.a.s.c.LeaderElector Joined leadership election with path: /collections/testschemaapi/leader_elect/shard1/election/96044168693415942-core_node2-n_0000000001
   [junit4]   2> 674107 INFO  (qtp27040634-3341) [n:127.0.0.1:43656_solr c:testschemaapi s:shard1 r:core_node2 x:testschemaapi_shard1_replica1] o.a.s.c.LeaderElector Watching path /collections/testschemaapi/leader_elect/shard1/election/96044168693415941-core_node1-n_0000000000 to know if I could be the leader
   [junit4]   2> 674108 INFO  (OverseerStateUpdate-96044168693415942-127.0.0.1:43656_solr-n_0000000000) [n:127.0.0.1:43656_solr    ] o.a.s.c.o.ZkStateWriter going to update_collection /collections/testschemaapi/state.json version: 2
   [junit4]   2> 674108 INFO  (zkCallback-463-thread-1-processing-n:127.0.0.1:43656_solr) [n:127.0.0.1:43656_solr    ] o.a.s.c.c.ZkStateReader A cluster state change: [WatchedEvent state:SyncConnected type:NodeDataChanged path:/collections/testschemaapi/state.json] for collection [testschemaapi] has occurred - updating... (live nodes size: [2])
   [junit4]   2> 674108 INFO  (zkCallback-462-thread-1-processing-n:127.0.0.1:44598_solr) [n:127.0.0.1:44598_solr    ] o.a.s.c.c.ZkStateReader A cluster state change: [WatchedEvent state:SyncConnected type:NodeDataChanged path:/collections/testschemaapi/state.json] for collection [testschemaapi] has occurred - updating... (live nodes size: [2])
   [junit4]   2> 674108 INFO  (zkCallback-462-thread-1-processing-n:127.0.0.1:44598_solr) [n:127.0.0.1:44598_solr    ] o.a.s.c.c.ZkStateReader Updating data for [testschemaapi] from [2] to [3]
   [junit4]   2> 674108 INFO  (zkCallback-463-thread-1-processing-n:127.0.0.1:43656_solr) [n:127.0.0.1:43656_solr    ] o.a.s.c.c.ZkStateReader Updating data for [testschemaapi] from [2] to [3]
   [junit4]   2> 674507 INFO  (qtp3559961-3356) [n:127.0.0.1:44598_solr c:testschemaapi s:shard1 r:core_node1 x:testschemaapi_shard1_replica2] o.a.s.c.ShardLeaderElectionContext Enough replicas found to continue.
   [junit4]   2> 674507 INFO  (qtp3559961-3356) [n:127.0.0.1:44598_solr c:testschemaapi s:shard1 r:core_node1 x:testschemaapi_shard1_replica2] o.a.s.c.ShardLeaderElectionContext I may be the new leader - try and sync
   [junit4]   2> 674507 INFO  (qtp3559961-3356) [n:127.0.0.1:44598_solr c:testschemaapi s:shard1 r:core_node1 x:testschemaapi_shard1_replica2] o.a.s.c.SyncStrategy Sync replicas to https://127.0.0.1:44598/solr/testschemaapi_shard1_replica2/
   [junit4]   2> 674507 INFO  (qtp3559961-3356) [n:127.0.0.1:44598_solr c:testschemaapi s:shard1 r:core_node1 x:testschemaapi_shard1_replica2] o.a.s.u.PeerSync PeerSync: core=testschemaapi_shard1_replica2 url=https://127.0.0.1:44598/solr START replicas=[https://127.0.0.1:43656/solr/testschemaapi_shard1_replica1/] nUpdates=100
   [junit4]   2> 674507 INFO  (qtp3559961-3356) [n:127.0.0.1:44598_solr c:testschemaapi s:shard1 r:core_node1 x:testschemaapi_shard1_replica2] o.a.s.u.PeerSync PeerSync: core=testschemaapi_shard1_replica2 url=https://127.0.0.1:44598/solr DONE.  We have no versions.  sync failed.
   [junit4]   2> 674507 INFO  (qtp3559961-3356) [n:127.0.0.1:44598_solr c:testschemaapi s:shard1 r:core_node1 x:testschemaapi_shard1_replica2] o.a.s.c.SyncStrategy Leader's attempt to sync with shard failed, moving to the next candidate
   [junit4]   2> 674507 INFO  (qtp3559961-3356) [n:127.0.0.1:44598_solr c:testschemaapi s:shard1 r:core_node1 x:testschemaapi_shard1_replica2] o.a.s.c.ShardLeaderElectionContext We failed sync, but we have no versions - we can't sync in that case - we were active before, so become leader anyway
   [junit4]   2> 674508 INFO  (qtp3559961-3356) [n:127.0.0.1:44598_solr c:testschemaapi s:shard1 r:core_node1 x:testschemaapi_shard1_replica2] o.a.s.c.c.SolrZkClient makePath: /collections/testschemaapi/leaders/shard1
   [junit4]   2> 674511 INFO  (qtp3559961-3356) [n:127.0.0.1:44598_solr c:testschemaapi s:shard1 r:core_node1 x:testschemaapi_shard1_replica2] o.a.s.c.ShardLeaderElectionContextBase Creating leader registration node /collections/testschemaapi/leaders/shard1/leader after winning as /collections/testschemaapi/leader_elect/shard1/election/96044168693415941-core_node1-n_0000000000
   [junit4]   2> 674513 INFO  (qtp3559961-3356) [n:127.0.0.1:44598_solr c:testschemaapi s:shard1 r:core_node1 x:testschemaapi_shard1_replica2] o.a.s.c.ShardLeaderElectionContext I am the new leader: https://127.0.0.1:44598/solr/testschemaapi_shard1_replica2/ shard1
   [junit4]   2> 674513 INFO  (OverseerStateUpdate-96044168693415942-127.0.0.1:43656_solr-n_0000000000) [n:127.0.0.1:43656_solr    ] o.a.s.c.Overseer processMessage: queueSize: 1, message = {
   [junit4]   2>   "operation":"leader",
   [junit4]   2>   "shard":"shard1",
   [junit4]   2>   "collection":"testschemaapi",
   [junit4]   2>   "base_url":"https://127.0.0.1:44598/solr",
   [junit4]   2>   "core":"testschemaapi_shard1_replica2",
   [junit4]   2>   "state":"active"} current state version: 0
   [junit4]   2> 674514 INFO  (qtp27040634-3349) [n:127.0.0.1:43656_solr c:testschemaapi s:shard1 r:core_node2 x:testschemaapi_shard1_replica1] o.a.s.c.S.Request [testschemaapi_shard1_replica1]  webapp=/solr path=/get params={distrib=false&qt=/get&fingerprint=false&getVersions=100&wt=javabin&version=2} status=0 QTime=0
   [junit4]   2> 674615 INFO  (OverseerStateUpdate-96044168693415942-127.0.0.1:43656_solr-n_0000000000) [n:127.0.0.1:43656_solr    ] o.a.s.c.o.ZkStateWriter going to update_collection /collections/testschemaapi/state.json version: 3
   [junit4]   2> 674616 INFO  (zkCallback-463-thread-2-processing-n:127.0.0.1:43656_solr) [n:127.0.0.1:43656_solr    ] o.a.s.c.c.ZkStateReader A cluster state change: [WatchedEvent state:SyncConnected type:NodeDataChanged path:/collections/testschemaapi/state.json] for collection [testschemaapi] has occurred - updating... (live nodes size: [2])
   [junit4]   2> 674616 INFO  (zkCallback-462-thread-1-processing-n:127.0.0.1:44598_solr) [n:127.0.0.1:44598_solr    ] o.a.s.c.c.ZkStateReader A cluster state change: [WatchedEvent state:SyncConnected type:NodeDataChanged path:/collections/testschemaapi/state.json] for collection [testschemaapi] has occurred - updating... (live nodes size: [2])
   [junit4]   2> 674616 INFO  (zkCallback-463-thread-2-processing-n:127.0.0.1:43656_solr) [n:127.0.0.1:43656_solr    ] o.a.s.c.c.ZkStateReader Updating data for [testschemaapi] from [3] to [4]
   [junit4]   2> 674616 INFO  (zkCallback-462-thread-1-processing-n:127.0.0.1:44598_solr) [n:127.0.0.1:44598_solr    ] o.a.s.c.c.ZkStateReader Updating data for [testschemaapi] from [3] to [4]
   [junit4]   2> 674664 INFO  (qtp3559961-3356) [n:127.0.0.1:44598_solr c:testschemaapi s:shard1 r:core_node1 x:testschemaapi_shard1_replica2] o.a.s.c.ZkController We are https://127.0.0.1:44598/solr/testschemaapi_shard1_replica2/ and leader is https://127.0.0.1:44598/solr/testschemaapi_shard1_replica2/
   [junit4]   2> 674664 INFO  (qtp3559961-3356) [n:127.0.0.1:44598_solr c:testschemaapi s:shard1 r:core_node1 x:testschemaapi_shard1_replica2] o.a.s.c.ZkController No LogReplay needed for core=testschemaapi_shard1_replica2 baseURL=https://127.0.0.1:44598/solr
   [junit4]   2> 674664 INFO  (qtp3559961-3356) [n:127.0.0.1:44598_solr c:testschemaapi s:shard1 r:core_node1 x:testschemaapi_shard1_replica2] o.a.s.c.ZkController I am the leader, no recovery necessary
   [junit4]   2> 674664 INFO  (qtp3559961-3356) [n:127.0.0.1:44598_solr c:testschemaapi s:shard1 r:core_node1 x:testschemaapi_shard1_replica2] o.a.s.c.ZkController publishing state=active
   [junit4]   2> 674665 INFO  (OverseerStateUpdate-96044168693415942-127.0.0.1:43656_solr-n_0000000000) [n:127.0.0.1:43656_solr    ] o.a.s.c.Overseer processMessage: queueSize: 1, message = {
   [junit4]   2>   "core":"testschemaapi_shard1_replica2",
   [junit4]   2>   "core_node_name":"core_node1",
   [junit4]   2>   "roles":null,
   [junit4]   2>   "base_url":"https://127.0.0.1:44598/solr",
   [junit4]   2>   "node_name":"127.0.0.1:44598_solr",
   [junit4]   2>   "numShards":"1",
   [junit4]   2>   "state":"active",
   [junit4]   2>   "shard":"shard1",
   [junit4]   2>   "collection":"testschemaapi",
   [junit4]   2>   "operation":"state"} current state version: 0
   [junit4]   2> 674665 INFO  (OverseerStateUpdate-96044168693415942-127.0.0.1:43656_solr-n_0000000000) [n:127.0.0.1:43656_solr    ] o.a.s.c.o.ReplicaMutator Update state numShards=1 message={
   [junit4]   2>   "core":"testschemaapi_shard1_replica2",
   [junit4]   2>   "core_node_name":"core_node1",
   [junit4]   2>   "roles":null,
   [junit4]   2>   "base_url":"https://127.0.0.1:44598/solr",
   [junit4]   2>   "node_name":"127.0.0.1:44598_solr",
   [junit4]   2>   "numShards":"1",
   [junit4]   2>   "state":"active",
   [junit4]   2>   "shard":"shard1",
   [junit4]   2>   "collection":"testschemaapi",
   [junit4]   2>   "operation":"state"}
   [junit4]   2> 674666 INFO  (qtp3559961-3356) [n:127.0.0.1:44598_solr c:testschemaapi s:shard1 r:core_node1 x:testschemaapi_shard1_replica2] o.a.s.s.HttpSolrCall [admin] webapp=null path=/admin/cores params={qt=/admin/cores&collection.configName=conf1&name=testschemaapi_shard1_replica2&action=CREATE&numShards=1&collection=testschemaapi&shard=shard1&wt=javabin&version=2} status=0 QTime=1725
   [junit4]   2> 674767 INFO  (OverseerStateUpdate-96044168693415942-127.0.0.1:43656_solr-n_0000000000) [n:127.0.0.1:4

[...truncated too long message...]

mmits=0,autocommits=0,soft autocommits=0,optimizes=0,rollbacks=0,expungeDeletes=0,docsPending=0,adds=0,deletesById=0,deletesByQuery=0,errors=0,cumulative_adds=0,cumulative_deletesById=0,cumulative_deletesByQuery=0,cumulative_errors=0,transaction_logs_total_size=0,transaction_logs_total_number=0}
   [junit4]   2> 684588 INFO  (Thread-1106) [n:127.0.0.1:44598_solr c:testschemaapi s:shard1 r:core_node1 x:testschemaapi_shard1_replica2] o.a.s.u.SolrCoreState Closing SolrCoreState
   [junit4]   2> 684588 INFO  (Thread-1106) [n:127.0.0.1:44598_solr c:testschemaapi s:shard1 r:core_node1 x:testschemaapi_shard1_replica2] o.a.s.u.DefaultSolrCoreState SolrCoreState ref count has reached 0 - closing IndexWriter
   [junit4]   2> 684588 INFO  (Thread-1106) [n:127.0.0.1:44598_solr c:testschemaapi s:shard1 r:core_node1 x:testschemaapi_shard1_replica2] o.a.s.u.DefaultSolrCoreState closing IndexWriter with IndexWriterCloser
   [junit4]   2> 684588 INFO  (Thread-1106) [n:127.0.0.1:44598_solr c:testschemaapi s:shard1 r:core_node1 x:testschemaapi_shard1_replica2] o.a.s.u.DirectUpdateHandler2 Committing on IndexWriter close.
   [junit4]   2> 684589 INFO  (Thread-1106) [n:127.0.0.1:44598_solr c:testschemaapi s:shard1 r:core_node1 x:testschemaapi_shard1_replica2] o.a.s.c.SolrDeletionPolicy SolrDeletionPolicy.onCommit: commits: num=2
   [junit4]   2> 	commit{dir=MockDirectoryWrapper(RAMDirectory@11ab8c0 lockFactory=org.apache.lucene.store.SingleInstanceLockFactory@1a15ba),segFN=segments_1,generation=1}
   [junit4]   2> 	commit{dir=MockDirectoryWrapper(RAMDirectory@11ab8c0 lockFactory=org.apache.lucene.store.SingleInstanceLockFactory@1a15ba),segFN=segments_2,generation=2}
   [junit4]   2> 684589 INFO  (Thread-1106) [n:127.0.0.1:44598_solr c:testschemaapi s:shard1 r:core_node1 x:testschemaapi_shard1_replica2] o.a.s.c.SolrDeletionPolicy newest commit generation = 2
   [junit4]   2> 684590 INFO  (Thread-1106) [n:127.0.0.1:44598_solr c:testschemaapi s:shard1 r:core_node1 x:testschemaapi_shard1_replica2] o.a.s.c.SolrCore [testschemaapi_shard1_replica2] Closing main searcher on request.
   [junit4]   2> 684590 INFO  (Thread-1106) [n:127.0.0.1:44598_solr c:testschemaapi s:shard1 r:core_node1 x:testschemaapi_shard1_replica2] o.a.s.c.CachingDirectoryFactory Closing MockDirectoryFactory - 2 directories currently being tracked
   [junit4]   2> 684590 INFO  (Thread-1106) [n:127.0.0.1:44598_solr c:testschemaapi s:shard1 r:core_node1 x:testschemaapi_shard1_replica2] o.a.s.c.CachingDirectoryFactory looking to close /home/jenkins/workspace/Lucene-Solr-6.x-Linux/solr/build/solr-core/test/J1/temp/solr.schema.TestManagedSchemaAPI_344274A1430716F1-001/tempDir-001/node2/./testschemaapi_shard1_replica2/data/index [CachedDir<<refCount=0;path=/home/jenkins/workspace/Lucene-Solr-6.x-Linux/solr/build/solr-core/test/J1/temp/solr.schema.TestManagedSchemaAPI_344274A1430716F1-001/tempDir-001/node2/./testschemaapi_shard1_replica2/data/index;done=false>>]
   [junit4]   2> 684590 INFO  (Thread-1106) [n:127.0.0.1:44598_solr c:testschemaapi s:shard1 r:core_node1 x:testschemaapi_shard1_replica2] o.a.s.c.CachingDirectoryFactory Closing directory, CoreContainer#isShutdown=true
   [junit4]   2> 684590 INFO  (Thread-1106) [n:127.0.0.1:44598_solr c:testschemaapi s:shard1 r:core_node1 x:testschemaapi_shard1_replica2] o.a.s.c.CachingDirectoryFactory Closing directory: /home/jenkins/workspace/Lucene-Solr-6.x-Linux/solr/build/solr-core/test/J1/temp/solr.schema.TestManagedSchemaAPI_344274A1430716F1-001/tempDir-001/node2/./testschemaapi_shard1_replica2/data/index
   [junit4]   2> 684590 INFO  (Thread-1106) [n:127.0.0.1:44598_solr c:testschemaapi s:shard1 r:core_node1 x:testschemaapi_shard1_replica2] o.a.s.c.CachingDirectoryFactory looking to close /home/jenkins/workspace/Lucene-Solr-6.x-Linux/solr/build/solr-core/test/J1/temp/solr.schema.TestManagedSchemaAPI_344274A1430716F1-001/tempDir-001/node2/./testschemaapi_shard1_replica2/data [CachedDir<<refCount=0;path=/home/jenkins/workspace/Lucene-Solr-6.x-Linux/solr/build/solr-core/test/J1/temp/solr.schema.TestManagedSchemaAPI_344274A1430716F1-001/tempDir-001/node2/./testschemaapi_shard1_replica2/data;done=false>>]
   [junit4]   2> 684590 INFO  (Thread-1106) [n:127.0.0.1:44598_solr c:testschemaapi s:shard1 r:core_node1 x:testschemaapi_shard1_replica2] o.a.s.c.CachingDirectoryFactory Closing directory, CoreContainer#isShutdown=true
   [junit4]   2> 684591 INFO  (Thread-1106) [n:127.0.0.1:44598_solr c:testschemaapi s:shard1 r:core_node1 x:testschemaapi_shard1_replica2] o.a.s.c.CachingDirectoryFactory Closing directory: /home/jenkins/workspace/Lucene-Solr-6.x-Linux/solr/build/solr-core/test/J1/temp/solr.schema.TestManagedSchemaAPI_344274A1430716F1-001/tempDir-001/node2/./testschemaapi_shard1_replica2/data
   [junit4]   2> 684591 WARN  (Thread-1106) [n:127.0.0.1:44598_solr c:testschemaapi s:shard1 r:core_node1 x:testschemaapi_shard1_replica2] o.a.s.c.ZkController listener throws error
   [junit4]   2> org.apache.solr.common.SolrException: Unable to reload core [testschemaapi_shard1_replica2]
   [junit4]   2> 	at org.apache.solr.core.CoreContainer.reload(CoreContainer.java:920)
   [junit4]   2> 	at org.apache.solr.core.SolrCore.lambda$getConfListener$6(SolrCore.java:2510)
   [junit4]   2> 	at org.apache.solr.cloud.ZkController$4.run(ZkController.java:2405)
   [junit4]   2> Caused by: org.apache.solr.common.SolrException: Could not find config name for collection:testschemaapi
   [junit4]   2> 	at org.apache.solr.core.SolrCore.<init>(SolrCore.java:773)
   [junit4]   2> 	at org.apache.solr.core.SolrCore.reload(SolrCore.java:462)
   [junit4]   2> 	at org.apache.solr.core.CoreContainer.reload(CoreContainer.java:914)
   [junit4]   2> 	... 2 more
   [junit4]   2> Caused by: org.apache.solr.common.SolrException: Could not find config name for collection:testschemaapi
   [junit4]   2> 	at org.apache.solr.rest.ManagedResourceStorage.newStorageIO(ManagedResourceStorage.java:101)
   [junit4]   2> 	at org.apache.solr.core.SolrCore.initRestManager(SolrCore.java:2305)
   [junit4]   2> 	at org.apache.solr.core.SolrCore.<init>(SolrCore.java:749)
   [junit4]   2> 	... 4 more
   [junit4]   2> Jun 10, 2016 12:15:23 AM com.carrotsearch.randomizedtesting.ThreadLeakControl checkThreadLeaks
   [junit4]   2> WARNING: Will linger awaiting termination of 1 leaked thread(s).
   [junit4]   2> NOTE: test params are: codec=Asserting(Lucene60): {_version_=PostingsFormat(name=LuceneVarGapFixedInterval), id=FSTOrd50, myNewField1=FSTOrd50, myNewField=BlockTreeOrds(blocksize=128)}, docValues:{}, maxPointsInLeafNode=1461, maxMBSortInHeap=7.790356658212975, sim=RandomSimilarity(queryNorm=true,coord=yes): {}, locale=mk, timezone=Pacific/Nauru
   [junit4]   2> NOTE: Linux 4.4.0-21-generic i386/Oracle Corporation 1.8.0_92 (32-bit)/cpus=12,threads=1,free=145019568,total=527433728
   [junit4]   2> NOTE: All tests run in this JVM: [TestLRUStatsCache, TestIntervalFaceting, UpdateRequestProcessorFactoryTest, TestUninvertingReader, SpellCheckCollatorTest, OpenExchangeRatesOrgProviderTest, TestRestManager, FileUtilsTest, HdfsThreadLeakTest, TestBlobHandler, TestSolrDeletionPolicy2, TestMissingGroups, TestWordDelimiterFilterFactory, ChaosMonkeyNothingIsSafeTest, SimplePostToolTest, TestConfigOverlay, DirectSolrSpellCheckerTest, UniqFieldsUpdateProcessorFactoryTest, CustomCollectionTest, TestCoreContainer, HighlighterTest, ConfigSetsAPITest, TestCopyFieldCollectionResource, CloudMLTQParserTest, SpellCheckComponentTest, TestGeoJSONResponseWriter, TestScoreJoinQPNoScore, TestFieldTypeCollectionResource, TestSolr4Spatial2, SecurityConfHandlerTest, TestFiltering, TestLeaderInitiatedRecoveryThread, HttpPartitionTest, WordBreakSolrSpellCheckerTest, TestTrie, DistribCursorPagingTest, SpatialFilterTest, AliasIntegrationTest, TestPerFieldSimilarityWithDefaultOverride, DistanceFunctionTest, TestUpdate, TestUniqueKeyFieldResource, TestManagedSchemaAPI]
   [junit4]   2> NOTE: reproduce with: ant test  -Dtestcase=TestManagedSchemaAPI -Dtests.seed=344274A1430716F1 -Dtests.multiplier=3 -Dtests.slow=true -Dtests.locale=mk -Dtests.timezone=Pacific/Nauru -Dtests.asserts=true -Dtests.file.encoding=UTF-8
   [junit4] ERROR   0.00s J1 | TestManagedSchemaAPI (suite) <<<
   [junit4]    > Throwable #1: java.lang.AssertionError: ObjectTracker found 4 object(s) that were not released!!! [TransactionLog, MDCAwareThreadPoolExecutor, MockDirectoryWrapper, MockDirectoryWrapper]
   [junit4]    > 	at __randomizedtesting.SeedInfo.seed([344274A1430716F1]:0)
   [junit4]    > 	at org.apache.solr.SolrTestCaseJ4.teardownTestCases(SolrTestCaseJ4.java:257)
   [junit4]    > 	at java.lang.Thread.run(Thread.java:745)
   [junit4] Completed [163/613 (1!)] on J1 in 13.37s, 1 test, 1 failure <<< FAILURES!

[...truncated 1470 lines...]
BUILD FAILED
/home/jenkins/workspace/Lucene-Solr-6.x-Linux/build.xml:740: The following error occurred while executing this line:
/home/jenkins/workspace/Lucene-Solr-6.x-Linux/build.xml:684: The following error occurred while executing this line:
/home/jenkins/workspace/Lucene-Solr-6.x-Linux/build.xml:59: The following error occurred while executing this line:
/home/jenkins/workspace/Lucene-Solr-6.x-Linux/solr/build.xml:233: The following error occurred while executing this line:
/home/jenkins/workspace/Lucene-Solr-6.x-Linux/solr/common-build.xml:531: The following error occurred while executing this line:
/home/jenkins/workspace/Lucene-Solr-6.x-Linux/lucene/common-build.xml:1427: The following error occurred while executing this line:
/home/jenkins/workspace/Lucene-Solr-6.x-Linux/lucene/common-build.xml:984: There were test failures: 613 suites (10 ignored), 2569 tests, 1 suite-level error, 116 ignored (72 assumptions) [seed: 344274A1430716F1]

Total time: 75 minutes 21 seconds
Build step 'Invoke Ant' marked build as failure
Archiving artifacts
[WARNINGS] Skipping publisher since build result is FAILURE
Recording test results
Email was triggered for: Failure - Any
Sending email for trigger: Failure - Any



Mime
View raw message