lucene-dev mailing list archives

Site index · List index
Message view « Date » · « Thread »
Top « Date » · « Thread »
From Policeman Jenkins Server <jenk...@thetaphi.de>
Subject [JENKINS] Lucene-Solr-6.x-Windows (32bit/jdk1.8.0_92) - Build # 222 - Failure!
Date Wed, 01 Jun 2016 19:15:50 GMT
Build: http://jenkins.thetaphi.de/job/Lucene-Solr-6.x-Windows/222/
Java: 32bit/jdk1.8.0_92 -server -XX:+UseG1GC

1 tests failed.
FAILED:  junit.framework.TestSuite.org.apache.solr.handler.component.DistributedMLTComponentTest

Error Message:
Could not remove the following files (in the order of attempts):    C:\Users\jenkins\workspace\Lucene-Solr-6.x-Windows\solr\build\solr-core\test\J1\temp\solr.handler.component.DistributedMLTComponentTest_38B919DD0AE428F5-001\tempDir-001\shard2\collection1: java.nio.file.DirectoryNotEmptyException: C:\Users\jenkins\workspace\Lucene-Solr-6.x-Windows\solr\build\solr-core\test\J1\temp\solr.handler.component.DistributedMLTComponentTest_38B919DD0AE428F5-001\tempDir-001\shard2\collection1    C:\Users\jenkins\workspace\Lucene-Solr-6.x-Windows\solr\build\solr-core\test\J1\temp\solr.handler.component.DistributedMLTComponentTest_38B919DD0AE428F5-001\tempDir-001\shard2: java.nio.file.DirectoryNotEmptyException: C:\Users\jenkins\workspace\Lucene-Solr-6.x-Windows\solr\build\solr-core\test\J1\temp\solr.handler.component.DistributedMLTComponentTest_38B919DD0AE428F5-001\tempDir-001\shard2    C:\Users\jenkins\workspace\Lucene-Solr-6.x-Windows\solr\build\solr-core\test\J1\temp\solr.handler.component.DistributedMLTComponentTest_38B919DD0AE428F5-001\tempDir-001: java.nio.file.DirectoryNotEmptyException: C:\Users\jenkins\workspace\Lucene-Solr-6.x-Windows\solr\build\solr-core\test\J1\temp\solr.handler.component.DistributedMLTComponentTest_38B919DD0AE428F5-001\tempDir-001 

Stack Trace:
java.io.IOException: Could not remove the following files (in the order of attempts):
   C:\Users\jenkins\workspace\Lucene-Solr-6.x-Windows\solr\build\solr-core\test\J1\temp\solr.handler.component.DistributedMLTComponentTest_38B919DD0AE428F5-001\tempDir-001\shard2\collection1: java.nio.file.DirectoryNotEmptyException: C:\Users\jenkins\workspace\Lucene-Solr-6.x-Windows\solr\build\solr-core\test\J1\temp\solr.handler.component.DistributedMLTComponentTest_38B919DD0AE428F5-001\tempDir-001\shard2\collection1
   C:\Users\jenkins\workspace\Lucene-Solr-6.x-Windows\solr\build\solr-core\test\J1\temp\solr.handler.component.DistributedMLTComponentTest_38B919DD0AE428F5-001\tempDir-001\shard2: java.nio.file.DirectoryNotEmptyException: C:\Users\jenkins\workspace\Lucene-Solr-6.x-Windows\solr\build\solr-core\test\J1\temp\solr.handler.component.DistributedMLTComponentTest_38B919DD0AE428F5-001\tempDir-001\shard2
   C:\Users\jenkins\workspace\Lucene-Solr-6.x-Windows\solr\build\solr-core\test\J1\temp\solr.handler.component.DistributedMLTComponentTest_38B919DD0AE428F5-001\tempDir-001: java.nio.file.DirectoryNotEmptyException: C:\Users\jenkins\workspace\Lucene-Solr-6.x-Windows\solr\build\solr-core\test\J1\temp\solr.handler.component.DistributedMLTComponentTest_38B919DD0AE428F5-001\tempDir-001

	at __randomizedtesting.SeedInfo.seed([38B919DD0AE428F5]:0)
	at org.apache.lucene.util.IOUtils.rm(IOUtils.java:323)
	at org.apache.lucene.util.TestRuleTemporaryFilesCleanup.afterAlways(TestRuleTemporaryFilesCleanup.java:216)
	at com.carrotsearch.randomizedtesting.rules.TestRuleAdapter$1.afterAlways(TestRuleAdapter.java:31)
	at com.carrotsearch.randomizedtesting.rules.StatementAdapter.evaluate(StatementAdapter.java:43)
	at com.carrotsearch.randomizedtesting.rules.StatementAdapter.evaluate(StatementAdapter.java:36)
	at org.apache.lucene.util.TestRuleAssertionsRequired$1.evaluate(TestRuleAssertionsRequired.java:53)
	at org.apache.lucene.util.TestRuleMarkFailure$1.evaluate(TestRuleMarkFailure.java:47)
	at org.apache.lucene.util.TestRuleIgnoreAfterMaxFailures$1.evaluate(TestRuleIgnoreAfterMaxFailures.java:64)
	at org.apache.lucene.util.TestRuleIgnoreTestSuites$1.evaluate(TestRuleIgnoreTestSuites.java:54)
	at com.carrotsearch.randomizedtesting.rules.StatementAdapter.evaluate(StatementAdapter.java:36)
	at com.carrotsearch.randomizedtesting.ThreadLeakControl$StatementRunner.run(ThreadLeakControl.java:367)
	at java.lang.Thread.run(Thread.java:745)




Build Log:
[...truncated 11970 lines...]
   [junit4] Suite: org.apache.solr.handler.component.DistributedMLTComponentTest
   [junit4]   2> Creating dataDir: C:\Users\jenkins\workspace\Lucene-Solr-6.x-Windows\solr\build\solr-core\test\J1\temp\solr.handler.component.DistributedMLTComponentTest_38B919DD0AE428F5-001\init-core-data-001
   [junit4]   2> 2149427 INFO  (SUITE-DistributedMLTComponentTest-seed#[38B919DD0AE428F5]-worker) [    ] o.a.s.SolrTestCaseJ4 Randomized ssl (false) and clientAuth (false)
   [junit4]   2> 2149428 INFO  (SUITE-DistributedMLTComponentTest-seed#[38B919DD0AE428F5]-worker) [    ] o.a.s.BaseDistributedSearchTestCase Setting hostContext system property: /
   [junit4]   2> 2150124 INFO  (TEST-DistributedMLTComponentTest.test-seed#[38B919DD0AE428F5]) [    ] o.a.s.SolrTestCaseJ4 Writing core.properties file to C:\Users\jenkins\workspace\Lucene-Solr-6.x-Windows\solr\build\solr-core\test\J1\temp\solr.handler.component.DistributedMLTComponentTest_38B919DD0AE428F5-001\tempDir-001\control\cores\collection1
   [junit4]   2> 2150128 INFO  (TEST-DistributedMLTComponentTest.test-seed#[38B919DD0AE428F5]) [    ] o.e.j.s.Server jetty-9.3.8.v20160314
   [junit4]   2> 2150129 INFO  (TEST-DistributedMLTComponentTest.test-seed#[38B919DD0AE428F5]) [    ] o.e.j.s.h.ContextHandler Started o.e.j.s.ServletContextHandler@14af230{/,null,AVAILABLE}
   [junit4]   2> 2150136 INFO  (TEST-DistributedMLTComponentTest.test-seed#[38B919DD0AE428F5]) [    ] o.e.j.s.ServerConnector Started ServerConnector@3c2fef{HTTP/1.1,[http/1.1]}{127.0.0.1:63246}
   [junit4]   2> 2150136 INFO  (TEST-DistributedMLTComponentTest.test-seed#[38B919DD0AE428F5]) [    ] o.e.j.s.Server Started @2154365ms
   [junit4]   2> 2150136 INFO  (TEST-DistributedMLTComponentTest.test-seed#[38B919DD0AE428F5]) [    ] o.a.s.c.s.e.JettySolrRunner Jetty properties: {hostContext=/, hostPort=63246, coreRootDirectory=C:\Users\jenkins\workspace\Lucene-Solr-6.x-Windows\solr\build\solr-core\test\J1\temp\solr.handler.component.DistributedMLTComponentTest_38B919DD0AE428F5-001\tempDir-001\control\cores}
   [junit4]   2> 2150136 INFO  (TEST-DistributedMLTComponentTest.test-seed#[38B919DD0AE428F5]) [    ] o.a.s.s.SolrDispatchFilter SolrDispatchFilter.init(): sun.misc.Launcher$AppClassLoader@1d16e93
   [junit4]   2> 2150136 INFO  (TEST-DistributedMLTComponentTest.test-seed#[38B919DD0AE428F5]) [    ] o.a.s.c.SolrResourceLoader new SolrResourceLoader for directory: 'C:\Users\jenkins\workspace\Lucene-Solr-6.x-Windows\solr\build\solr-core\test\J1\temp\solr.handler.component.DistributedMLTComponentTest_38B919DD0AE428F5-001\tempDir-001\control'
   [junit4]   2> 2150137 INFO  (TEST-DistributedMLTComponentTest.test-seed#[38B919DD0AE428F5]) [    ] o.a.s.c.SolrResourceLoader JNDI not configured for solr (NoInitialContextEx)
   [junit4]   2> 2150137 INFO  (TEST-DistributedMLTComponentTest.test-seed#[38B919DD0AE428F5]) [    ] o.a.s.c.SolrResourceLoader solr home defaulted to 'solr/' (could not find system property or JNDI)
   [junit4]   2> 2150138 INFO  (TEST-DistributedMLTComponentTest.test-seed#[38B919DD0AE428F5]) [    ] o.a.s.c.SolrXmlConfig Loading container configuration from C:\Users\jenkins\workspace\Lucene-Solr-6.x-Windows\solr\build\solr-core\test\J1\temp\solr.handler.component.DistributedMLTComponentTest_38B919DD0AE428F5-001\tempDir-001\control\solr.xml
   [junit4]   2> 2150154 INFO  (TEST-DistributedMLTComponentTest.test-seed#[38B919DD0AE428F5]) [    ] o.a.s.c.CorePropertiesLocator Config-defined core root directory: C:\Users\jenkins\workspace\Lucene-Solr-6.x-Windows\solr\build\solr-core\test\J1\temp\solr.handler.component.DistributedMLTComponentTest_38B919DD0AE428F5-001\tempDir-001\control\cores
   [junit4]   2> 2150154 INFO  (TEST-DistributedMLTComponentTest.test-seed#[38B919DD0AE428F5]) [    ] o.a.s.c.CoreContainer New CoreContainer 6763877
   [junit4]   2> 2150154 INFO  (TEST-DistributedMLTComponentTest.test-seed#[38B919DD0AE428F5]) [    ] o.a.s.c.CoreContainer Loading cores into CoreContainer [instanceDir=C:\Users\jenkins\workspace\Lucene-Solr-6.x-Windows\solr\build\solr-core\test\J1\temp\solr.handler.component.DistributedMLTComponentTest_38B919DD0AE428F5-001\tempDir-001\control]
   [junit4]   2> 2150154 WARN  (TEST-DistributedMLTComponentTest.test-seed#[38B919DD0AE428F5]) [    ] o.a.s.c.CoreContainer Couldn't add files from C:\Users\jenkins\workspace\Lucene-Solr-6.x-Windows\solr\build\solr-core\test\J1\temp\solr.handler.component.DistributedMLTComponentTest_38B919DD0AE428F5-001\tempDir-001\control\lib to classpath: C:\Users\jenkins\workspace\Lucene-Solr-6.x-Windows\solr\build\solr-core\test\J1\temp\solr.handler.component.DistributedMLTComponentTest_38B919DD0AE428F5-001\tempDir-001\control\lib
   [junit4]   2> 2150155 INFO  (TEST-DistributedMLTComponentTest.test-seed#[38B919DD0AE428F5]) [    ] o.a.s.h.c.HttpShardHandlerFactory created with socketTimeout : 90000,urlScheme : ,connTimeout : 15000,maxConnectionsPerHost : 20,maxConnections : 10000,corePoolSize : 0,maximumPoolSize : 2147483647,maxThreadIdleTime : 5,sizeOfQueue : -1,fairnessPolicy : false,useRetries : false,
   [junit4]   2> 2150165 INFO  (TEST-DistributedMLTComponentTest.test-seed#[38B919DD0AE428F5]) [    ] o.a.s.u.UpdateShardHandler Creating UpdateShardHandler HTTP client with params: socketTimeout=340000&connTimeout=45000&retry=true
   [junit4]   2> 2150167 INFO  (TEST-DistributedMLTComponentTest.test-seed#[38B919DD0AE428F5]) [    ] o.a.s.l.LogWatcher SLF4J impl is org.slf4j.impl.Log4jLoggerFactory
   [junit4]   2> 2150167 INFO  (TEST-DistributedMLTComponentTest.test-seed#[38B919DD0AE428F5]) [    ] o.a.s.l.LogWatcher Registering Log Listener [Log4j (org.slf4j.impl.Log4jLoggerFactory)]
   [junit4]   2> 2150168 INFO  (TEST-DistributedMLTComponentTest.test-seed#[38B919DD0AE428F5]) [    ] o.a.s.c.CoreContainer Security conf doesn't exist. Skipping setup for authorization module.
   [junit4]   2> 2150168 INFO  (TEST-DistributedMLTComponentTest.test-seed#[38B919DD0AE428F5]) [    ] o.a.s.c.CoreContainer No authentication plugin used.
   [junit4]   2> 2150169 INFO  (TEST-DistributedMLTComponentTest.test-seed#[38B919DD0AE428F5]) [    ] o.a.s.c.CorePropertiesLocator Looking for core definitions underneath C:\Users\jenkins\workspace\Lucene-Solr-6.x-Windows\solr\build\solr-core\test\J1\temp\solr.handler.component.DistributedMLTComponentTest_38B919DD0AE428F5-001\tempDir-001\control\cores
   [junit4]   2> 2150172 INFO  (TEST-DistributedMLTComponentTest.test-seed#[38B919DD0AE428F5]) [    ] o.a.s.c.CoreDescriptor Created CoreDescriptor: {name=collection1, config=solrconfig.xml, loadOnStartup=true, schema=schema.xml, configSetProperties=configsetprops.json, transient=false, dataDir=data\, configSet=collection1}
   [junit4]   2> 2150172 INFO  (TEST-DistributedMLTComponentTest.test-seed#[38B919DD0AE428F5]) [    ] o.a.s.c.CorePropertiesLocator Found core collection1 in C:\Users\jenkins\workspace\Lucene-Solr-6.x-Windows\solr\build\solr-core\test\J1\temp\solr.handler.component.DistributedMLTComponentTest_38B919DD0AE428F5-001\tempDir-001\control\cores\collection1
   [junit4]   2> 2150172 INFO  (TEST-DistributedMLTComponentTest.test-seed#[38B919DD0AE428F5]) [    ] o.a.s.c.CorePropertiesLocator Found 1 core definitions
   [junit4]   2> 2150173 INFO  (TEST-DistributedMLTComponentTest.test-seed#[38B919DD0AE428F5]) [    ] o.a.s.s.SolrDispatchFilter user.dir=C:\Users\jenkins\workspace\Lucene-Solr-6.x-Windows\solr\build\solr-core\test\J1
   [junit4]   2> 2150173 INFO  (TEST-DistributedMLTComponentTest.test-seed#[38B919DD0AE428F5]) [    ] o.a.s.s.SolrDispatchFilter SolrDispatchFilter.init() done
   [junit4]   2> 2150173 INFO  (coreLoadExecutor-7892-thread-1) [    ] o.a.s.c.SolrResourceLoader new SolrResourceLoader for directory: 'C:\Users\jenkins\workspace\Lucene-Solr-6.x-Windows\solr\core\src\test-files\solr\collection1'
   [junit4]   2> 2150173 INFO  (coreLoadExecutor-7892-thread-1) [    ] o.a.s.c.SolrResourceLoader JNDI not configured for solr (NoInitialContextEx)
   [junit4]   2> 2150174 INFO  (coreLoadExecutor-7892-thread-1) [    ] o.a.s.c.SolrResourceLoader solr home defaulted to 'solr/' (could not find system property or JNDI)
   [junit4]   2> 2150174 INFO  (coreLoadExecutor-7892-thread-1) [    ] o.a.s.c.SolrResourceLoader Adding 'file:/C:/Users/jenkins/workspace/Lucene-Solr-6.x-Windows/solr/core/src/test-files/solr/collection1/lib/classes/' to classloader
   [junit4]   2> 2150174 INFO  (coreLoadExecutor-7892-thread-1) [    ] o.a.s.c.SolrResourceLoader Adding 'file:/C:/Users/jenkins/workspace/Lucene-Solr-6.x-Windows/solr/core/src/test-files/solr/collection1/lib/README' to classloader
   [junit4]   2> 2150279 INFO  (coreLoadExecutor-7892-thread-1) [    ] o.a.s.c.SolrConfig current version of requestparams : -1
   [junit4]   2> 2150291 WARN  (coreLoadExecutor-7892-thread-1) [    ] o.a.s.c.Config Beginning with Solr 5.5, <mergePolicy> is deprecated, use <mergePolicyFactory> instead.
   [junit4]   2> 2150292 INFO  (coreLoadExecutor-7892-thread-1) [    ] o.a.s.c.SolrConfig Using Lucene MatchVersion: 6.1.0
   [junit4]   2> 2150317 INFO  (coreLoadExecutor-7892-thread-1) [    ] o.a.s.c.SolrConfig Loaded SolrConfig: solrconfig.xml
   [junit4]   2> 2150324 INFO  (coreLoadExecutor-7892-thread-1) [    ] o.a.s.s.IndexSchema [collection1] Schema name=test
   [junit4]   2> 2150355 ERROR (Finalizer) [    ] o.a.s.u.ConcurrentLFUCache ConcurrentLFUCache was not destroyed prior to finalize(), indicates a bug -- POSSIBLE RESOURCE LEAK!!!
   [junit4]   2> 2150423 INFO  (coreLoadExecutor-7892-thread-1) [    ] o.a.s.s.OpenExchangeRatesOrgProvider Initialized with rates=open-exchange-rates.json, refreshInterval=1440.
   [junit4]   2> 2150432 INFO  (coreLoadExecutor-7892-thread-1) [    ] o.a.s.s.IndexSchema default search field in schema is text
   [junit4]   2> 2150433 INFO  (coreLoadExecutor-7892-thread-1) [    ] o.a.s.s.IndexSchema unique key field: id
   [junit4]   2> 2150438 INFO  (coreLoadExecutor-7892-thread-1) [    ] o.a.s.s.FileExchangeRateProvider Reloading exchange rates from file currency.xml
   [junit4]   2> 2150441 INFO  (coreLoadExecutor-7892-thread-1) [    ] o.a.s.s.FileExchangeRateProvider Reloading exchange rates from file currency.xml
   [junit4]   2> 2150442 INFO  (coreLoadExecutor-7892-thread-1) [    ] o.a.s.s.OpenExchangeRatesOrgProvider Reloading exchange rates from open-exchange-rates.json
   [junit4]   2> 2150444 INFO  (coreLoadExecutor-7892-thread-1) [    ] o.a.s.s.OpenExchangeRatesOrgProvider Reloading exchange rates from open-exchange-rates.json
   [junit4]   2> 2150459 INFO  (coreLoadExecutor-7892-thread-1) [    ] o.a.s.c.ConfigSetProperties Did not find ConfigSet properties, assuming default properties: Can't find resource 'configsetprops.json' in classpath or 'C:\Users\jenkins\workspace\Lucene-Solr-6.x-Windows\solr\core\src\test-files\solr\collection1'
   [junit4]   2> 2150459 INFO  (coreLoadExecutor-7892-thread-1) [    ] o.a.s.c.CoreContainer Creating SolrCore 'collection1' using configuration from configset C:\Users\jenkins\workspace\Lucene-Solr-6.x-Windows\solr\core\src\test-files\solr\collection1
   [junit4]   2> 2150459 INFO  (coreLoadExecutor-7892-thread-1) [    x:collection1] o.a.s.c.SolrCore org.apache.solr.core.MockDirectoryFactory
   [junit4]   2> 2150460 INFO  (coreLoadExecutor-7892-thread-1) [    x:collection1] o.a.s.c.SolrCore [[collection1] ] Opening new SolrCore at [C:\Users\jenkins\workspace\Lucene-Solr-6.x-Windows\solr\core\src\test-files\solr\collection1], dataDir=[C:\Users\jenkins\workspace\Lucene-Solr-6.x-Windows\solr\build\solr-core\test\J1\temp\solr.handler.component.DistributedMLTComponentTest_38B919DD0AE428F5-001\tempDir-001\control\cores\collection1\data\]
   [junit4]   2> 2150460 INFO  (coreLoadExecutor-7892-thread-1) [    x:collection1] o.a.s.c.JmxMonitoredMap JMX monitoring is enabled. Adding Solr mbeans to JMX Server: com.sun.jmx.mbeanserver.JmxMBeanServer@17cc58f
   [junit4]   2> 2150463 INFO  (coreLoadExecutor-7892-thread-1) [    x:collection1] o.a.s.c.CachingDirectoryFactory return new directory for C:\Users\jenkins\workspace\Lucene-Solr-6.x-Windows\solr\build\solr-core\test\J1\temp\solr.handler.component.DistributedMLTComponentTest_38B919DD0AE428F5-001\tempDir-001\control\cores\collection1\data\
   [junit4]   2> 2150467 INFO  (coreLoadExecutor-7892-thread-1) [    x:collection1] o.a.s.c.SolrCore New index directory detected: old=null new=C:\Users\jenkins\workspace\Lucene-Solr-6.x-Windows\solr\build\solr-core\test\J1\temp\solr.handler.component.DistributedMLTComponentTest_38B919DD0AE428F5-001\tempDir-001\control\cores\collection1\data\index/
   [junit4]   2> 2150467 WARN  (coreLoadExecutor-7892-thread-1) [    x:collection1] o.a.s.c.SolrCore [collection1] Solr index directory 'C:\Users\jenkins\workspace\Lucene-Solr-6.x-Windows\solr\build\solr-core\test\J1\temp\solr.handler.component.DistributedMLTComponentTest_38B919DD0AE428F5-001\tempDir-001\control\cores\collection1\data\index' doesn't exist. Creating new index...
   [junit4]   2> 2150468 INFO  (coreLoadExecutor-7892-thread-1) [    x:collection1] o.a.s.c.CachingDirectoryFactory return new directory for C:\Users\jenkins\workspace\Lucene-Solr-6.x-Windows\solr\build\solr-core\test\J1\temp\solr.handler.component.DistributedMLTComponentTest_38B919DD0AE428F5-001\tempDir-001\control\cores\collection1\data\index
   [junit4]   2> 2150468 INFO  (coreLoadExecutor-7892-thread-1) [    x:collection1] o.a.s.u.RandomMergePolicy RandomMergePolicy wrapping class org.apache.lucene.index.LogByteSizeMergePolicy: [LogByteSizeMergePolicy: minMergeSize=1677721, mergeFactor=34, maxMergeSize=2147483648, maxMergeSizeForForcedMerge=9223372036854775807, calibrateSizeByDeletes=true, maxMergeDocs=2147483647, maxCFSSegmentSizeMB=8.796093022207999E12, noCFSRatio=0.2969515504259035]
   [junit4]   2> 2150475 INFO  (coreLoadExecutor-7892-thread-1) [    x:collection1] o.a.s.c.SolrDeletionPolicy SolrDeletionPolicy.onCommit: commits: num=1
   [junit4]   2> 	commit{dir=MockDirectoryWrapper(RAMDirectory@da99c1 lockFactory=org.apache.lucene.store.SingleInstanceLockFactory@1463c08),segFN=segments_1,generation=1}
   [junit4]   2> 2150475 INFO  (coreLoadExecutor-7892-thread-1) [    x:collection1] o.a.s.c.SolrDeletionPolicy newest commit generation = 1
   [junit4]   2> 2150481 INFO  (coreLoadExecutor-7892-thread-1) [    x:collection1] o.a.s.u.p.UpdateRequestProcessorChain creating updateRequestProcessorChain "dedupe"
   [junit4]   2> 2150481 INFO  (coreLoadExecutor-7892-thread-1) [    x:collection1] o.a.s.u.p.UpdateRequestProcessorChain inserting DistributedUpdateProcessorFactory into updateRequestProcessorChain "dedupe"
   [junit4]   2> 2150481 INFO  (coreLoadExecutor-7892-thread-1) [    x:collection1] o.a.s.u.p.UpdateRequestProcessorChain creating updateRequestProcessorChain "dedupe-allfields"
   [junit4]   2> 2150481 INFO  (coreLoadExecutor-7892-thread-1) [    x:collection1] o.a.s.u.p.UpdateRequestProcessorChain inserting DistributedUpdateProcessorFactory into updateRequestProcessorChain "dedupe-allfields"
   [junit4]   2> 2150482 INFO  (coreLoadExecutor-7892-thread-1) [    x:collection1] o.a.s.u.p.UpdateRequestProcessorChain creating updateRequestProcessorChain "stored_sig"
   [junit4]   2> 2150482 INFO  (coreLoadExecutor-7892-thread-1) [    x:collection1] o.a.s.u.p.UpdateRequestProcessorChain inserting DistributedUpdateProcessorFactory into updateRequestProcessorChain "stored_sig"
   [junit4]   2> 2150482 INFO  (coreLoadExecutor-7892-thread-1) [    x:collection1] o.a.s.u.p.UpdateRequestProcessorChain creating updateRequestProcessorChain "uniq-fields"
   [junit4]   2> 2150482 INFO  (coreLoadExecutor-7892-thread-1) [    x:collection1] o.a.s.u.p.UpdateRequestProcessorChain inserting DistributedUpdateProcessorFactory into updateRequestProcessorChain "uniq-fields"
   [junit4]   2> 2150483 INFO  (coreLoadExecutor-7892-thread-1) [    x:collection1] o.a.s.u.p.UpdateRequestProcessorChain creating updateRequestProcessorChain "distrib-dup-test-chain-explicit"
   [junit4]   2> 2150483 INFO  (coreLoadExecutor-7892-thread-1) [    x:collection1] o.a.s.u.p.UpdateRequestProcessorChain creating updateRequestProcessorChain "distrib-dup-test-chain-implicit"
   [junit4]   2> 2150483 INFO  (coreLoadExecutor-7892-thread-1) [    x:collection1] o.a.s.u.p.UpdateRequestProcessorChain inserting DistributedUpdateProcessorFactory into updateRequestProcessorChain "distrib-dup-test-chain-implicit"
   [junit4]   2> 2150483 INFO  (coreLoadExecutor-7892-thread-1) [    x:collection1] o.a.s.c.SolrCore no updateRequestProcessorChain defined as default, creating implicit default
   [junit4]   2> 2150484 INFO  (OldIndexDirectoryCleanupThreadForCore-collection1) [    x:collection1] o.a.s.c.SolrCore Looking for old index directories to cleanup for core collection1 in C:\Users\jenkins\workspace\Lucene-Solr-6.x-Windows\solr\build\solr-core\test\J1\temp\solr.handler.component.DistributedMLTComponentTest_38B919DD0AE428F5-001\tempDir-001\control\cores\collection1\data\
   [junit4]   2> 2150485 WARN  (OldIndexDirectoryCleanupThreadForCore-collection1) [    x:collection1] o.a.s.c.DirectoryFactory C:\Users\jenkins\workspace\Lucene-Solr-6.x-Windows\solr\build\solr-core\test\J1\temp\solr.handler.component.DistributedMLTComponentTest_38B919DD0AE428F5-001\tempDir-001\control\cores\collection1\data\ does not point to a valid data directory; skipping clean-up of old index directories.
   [junit4]   2> 2150493 INFO  (coreLoadExecutor-7892-thread-1) [    x:collection1] o.a.s.h.l.XMLLoader xsltCacheLifetimeSeconds=60
   [junit4]   2> 2150496 INFO  (coreLoadExecutor-7892-thread-1) [    x:collection1] o.a.s.h.l.XMLLoader xsltCacheLifetimeSeconds=60
   [junit4]   2> 2150499 INFO  (coreLoadExecutor-7892-thread-1) [    x:collection1] o.a.s.h.l.XMLLoader xsltCacheLifetimeSeconds=60
   [junit4]   2> 2150501 INFO  (coreLoadExecutor-7892-thread-1) [    x:collection1] o.a.s.h.l.XMLLoader xsltCacheLifetimeSeconds=60
   [junit4]   2> 2150506 INFO  (coreLoadExecutor-7892-thread-1) [    x:collection1] o.a.s.c.PluginBag requestHandler : 'lazy' created with startup=lazy 
   [junit4]   2> 2150508 INFO  (coreLoadExecutor-7892-thread-1) [    x:collection1] o.a.s.c.RequestHandlers Registered paths: /admin/mbeans,standard,spellCheckCompRH,lazy,/update/json/docs,/admin/luke,/export,spellCheckWithWordbreak_Direct,tvrh,/get,/admin/properties,/update/json,mltrh,/admin/threads,/search-facet-def,/update/csv,/sql,/graph,/search-facet-invariants,/admin/segments,spellCheckCompRH1,/mlt,/admin/system,/replication,dismax,defaults,/config,/stream,/schema,/admin/plugins,/admin/logging,spellCheckWithWordbreak,mock,/admin/ping,/update,/admin/file,/terms,spellCheckCompRH_Direct,/debug/dump
   [junit4]   2> 2150508 INFO  (coreLoadExecutor-7892-thread-1) [    x:collection1] o.a.s.c.SolrCore Using default statsCache cache: org.apache.solr.search.stats.LocalStatsCache
   [junit4]   2> 2150510 INFO  (coreLoadExecutor-7892-thread-1) [    x:collection1] o.a.s.u.UpdateHandler Using UpdateLog implementation: org.apache.solr.update.UpdateLog
   [junit4]   2> 2150510 INFO  (coreLoadExecutor-7892-thread-1) [    x:collection1] o.a.s.u.UpdateLog Initializing UpdateLog: dataDir= defaultSyncLevel=FLUSH numRecordsToKeep=100 maxNumLogsToKeep=10 numVersionBuckets=65536
   [junit4]   2> 2150512 INFO  (coreLoadExecutor-7892-thread-1) [    x:collection1] o.a.s.u.CommitTracker Hard AutoCommit: disabled
   [junit4]   2> 2150512 INFO  (coreLoadExecutor-7892-thread-1) [    x:collection1] o.a.s.u.CommitTracker Soft AutoCommit: disabled
   [junit4]   2> 2150513 INFO  (coreLoadExecutor-7892-thread-1) [    x:collection1] o.a.s.u.RandomMergePolicy RandomMergePolicy wrapping class org.apache.lucene.index.TieredMergePolicy: [TieredMergePolicy: maxMergeAtOnce=35, maxMergeAtOnceExplicit=15, maxMergedSegmentMB=44.859375, floorSegmentMB=0.634765625, forceMergeDeletesPctAllowed=20.978501812830604, segmentsPerTier=18.0, maxCFSSegmentSizeMB=8.796093022207999E12, noCFSRatio=0.4747013979229491
   [junit4]   2> 2150514 INFO  (coreLoadExecutor-7892-thread-1) [    x:collection1] o.a.s.c.SolrDeletionPolicy SolrDeletionPolicy.onInit: commits: num=1
   [junit4]   2> 	commit{dir=MockDirectoryWrapper(RAMDirectory@da99c1 lockFactory=org.apache.lucene.store.SingleInstanceLockFactory@1463c08),segFN=segments_1,generation=1}
   [junit4]   2> 2150514 INFO  (coreLoadExecutor-7892-thread-1) [    x:collection1] o.a.s.c.SolrDeletionPolicy newest commit generation = 1
   [junit4]   2> 2150514 INFO  (coreLoadExecutor-7892-thread-1) [    x:collection1] o.a.s.s.SolrIndexSearcher Opening [Searcher@1eeb16b[collection1] main]
   [junit4]   2> 2150514 INFO  (coreLoadExecutor-7892-thread-1) [    x:collection1] o.a.s.r.RestManager Initializing RestManager with initArgs: {storageIO=org.apache.solr.rest.ManagedResourceStorage$InMemoryStorageIO}
   [junit4]   2> 2150514 INFO  (coreLoadExecutor-7892-thread-1) [    x:collection1] o.a.s.r.ManagedResourceStorage Reading _rest_managed.json using InMemoryStorage
   [junit4]   2> 2150514 INFO  (coreLoadExecutor-7892-thread-1) [    x:collection1] o.a.s.r.RestManager Initializing 0 registered ManagedResources
   [junit4]   2> 2150515 INFO  (coreLoadExecutor-7892-thread-1) [    x:collection1] o.a.s.h.c.SpellCheckComponent Initializing spell checkers
   [junit4]   2> 2150537 INFO  (coreLoadExecutor-7892-thread-1) [    x:collection1] o.a.s.s.DirectSolrSpellChecker init: {name=direct,classname=DirectSolrSpellChecker,field=lowerfilt,minQueryLength=3}
   [junit4]   2> 2150617 INFO  (coreLoadExecutor-7892-thread-1) [    x:collection1] o.a.s.h.ReplicationHandler Commits will be reserved for  10000
   [junit4]   2> 2150617 INFO  (searcherExecutor-7893-thread-1-processing-x:collection1) [    x:collection1] o.a.s.h.c.SpellCheckComponent Loading spell index for spellchecker: default
   [junit4]   2> 2150619 INFO  (searcherExecutor-7893-thread-1-processing-x:collection1) [    x:collection1] o.a.s.h.c.SpellCheckComponent Loading spell index for spellchecker: direct
   [junit4]   2> 2150619 INFO  (searcherExecutor-7893-thread-1-processing-x:collection1) [    x:collection1] o.a.s.h.c.SpellCheckComponent Loading spell index for spellchecker: wordbreak
   [junit4]   2> 2150619 INFO  (searcherExecutor-7893-thread-1-processing-x:collection1) [    x:collection1] o.a.s.h.c.SpellCheckComponent Loading spell index for spellchecker: multipleFields
   [junit4]   2> 2150619 INFO  (coreLoadExecutor-7892-thread-1) [    x:collection1] o.a.s.u.UpdateLog Looking up max value of version field to seed version buckets
   [junit4]   2> 2150619 INFO  (coreLoadExecutor-7892-thread-1) [    x:collection1] o.a.s.u.VersionInfo Refreshing highest value of _version_ for 65536 version buckets from index
   [junit4]   2> 2150619 INFO  (searcherExecutor-7893-thread-1-processing-x:collection1) [    x:collection1] o.a.s.h.c.SpellCheckComponent Loading spell index for spellchecker: jarowinkler
   [junit4]   2> 2150619 INFO  (coreLoadExecutor-7892-thread-1) [    x:collection1] o.a.s.u.VersionInfo No terms found for _version_, cannot seed version bucket highest value from index
   [junit4]   2> 2150619 INFO  (coreLoadExecutor-7892-thread-1) [    x:collection1] o.a.s.u.UpdateLog Could not find max version in index or recent updates, using new clock 1535962077035757568
   [junit4]   2> 2150619 INFO  (searcherExecutor-7893-thread-1-processing-x:collection1) [    x:collection1] o.a.s.h.c.SpellCheckComponent Loading spell index for spellchecker: external
   [junit4]   2> 2150619 INFO  (searcherExecutor-7893-thread-1-processing-x:collection1) [    x:collection1] o.a.s.h.c.SpellCheckComponent Loading spell index for spellchecker: freq
   [junit4]   2> 2150620 INFO  (searcherExecutor-7893-thread-1-processing-x:collection1) [    x:collection1] o.a.s.h.c.SpellCheckComponent Loading spell index for spellchecker: fqcn
   [junit4]   2> 2150620 INFO  (searcherExecutor-7893-thread-1-processing-x:collection1) [    x:collection1] o.a.s.h.c.SpellCheckComponent Loading spell index for spellchecker: perDict
   [junit4]   2> 2150620 INFO  (searcherExecutor-7893-thread-1-processing-x:collection1) [    x:collection1] o.a.s.c.SolrCore [collection1] Registered new searcher Searcher@1eeb16b[collection1] main{ExitableDirectoryReader(UninvertingDirectoryReader())}
   [junit4]   2> 2150621 INFO  (coreLoadExecutor-7892-thread-1) [    x:collection1] o.a.s.u.UpdateLog Took 2.0ms to seed version buckets with highest version 1535962077035757568
   [junit4]   2> 2150621 INFO  (coreLoadExecutor-7892-thread-1) [    x:collection1] o.a.s.c.CoreContainer registering core: collection1
   [junit4]   2> 2151138 INFO  (TEST-DistributedMLTComponentTest.test-seed#[38B919DD0AE428F5]) [    ] o.a.s.SolrTestCaseJ4 Writing core.properties file to C:\Users\jenkins\workspace\Lucene-Solr-6.x-Windows\solr\build\solr-core\test\J1\temp\solr.handler.component.DistributedMLTComponentTest_38B919DD0AE428F5-001\tempDir-001\shard0\cores\collection1
   [junit4]   2> 2151141 INFO  (TEST-DistributedMLTComponentTest.test-seed#[38B919DD0AE428F5]) [    ] o.e.j.s.Server jetty-9.3.8.v20160314
   [junit4]   2> 2151141 INFO  (TEST-DistributedMLTComponentTest.test-seed#[38B919DD0AE428F5]) [    ] o.e.j.s.h.ContextHandler Started o.e.j.s.ServletContextHandler@5a76e7{/,null,AVAILABLE}
   [junit4]   2> 2151142 INFO  (TEST-DistributedMLTComponentTest.test-seed#[38B919DD0AE428F5]) [    ] o.e.j.s.ServerConnector Started ServerConnector@18e930a{HTTP/1.1,[http/1.1]}{127.0.0.1:63249}
   [junit4]   2> 2151142 INFO  (TEST-DistributedMLTComponentTest.test-seed#[38B919DD0AE428F5]) [    ] o.e.j.s.Server Started @2155372ms
   [junit4]   2> 2151142 INFO  (TEST-DistributedMLTComponentTest.test-seed#[38B919DD0AE428F5]) [    ] o.a.s.c.s.e.JettySolrRunner Jetty properties: {hostContext=/, hostPort=63249, coreRootDirectory=C:\Users\jenkins\workspace\Lucene-Solr-6.x-Windows\solr\build\solr-core\test\J1\temp\solr.handler.component.DistributedMLTComponentTest_38B919DD0AE428F5-001\tempDir-001\shard0\cores}
   [junit4]   2> 2151143 INFO  (TEST-DistributedMLTComponentTest.test-seed#[38B919DD0AE428F5]) [    ] o.a.s.s.SolrDispatchFilter SolrDispatchFilter.init(): sun.misc.Launcher$AppClassLoader@1d16e93
   [junit4]   2> 2151143 INFO  (TEST-DistributedMLTComponentTest.test-seed#[38B919DD0AE428F5]) [    ] o.a.s.c.SolrResourceLoader new SolrResourceLoader for directory: 'C:\Users\jenkins\workspace\Lucene-Solr-6.x-Windows\solr\build\solr-core\test\J1\temp\solr.handler.component.DistributedMLTComponentTest_38B919DD0AE428F5-001\tempDir-001\shard0'
   [junit4]   2> 2151145 INFO  (TEST-DistributedMLTComponentTest.test-seed#[38B919DD0AE428F5]) [    ] o.a.s.c.SolrResourceLoader JNDI not configured for solr (NoInitialContextEx)
   [junit4]   2> 2151145 INFO  (TEST-DistributedMLTComponentTest.test-seed#[38B919DD0AE428F5]) [    ] o.a.s.c.SolrResourceLoader solr home defaulted to 'solr/' (could not find system property or JNDI)
   [junit4]   2> 2151145 INFO  (TEST-DistributedMLTComponentTest.test-seed#[38B919DD0AE428F5]) [    ] o.a.s.c.SolrXmlConfig Loading container configuration from C:\Users\jenkins\workspace\Lucene-Solr-6.x-Windows\solr\build\solr-core\test\J1\temp\solr.handler.component.DistributedMLTComponentTest_38B919DD0AE428F5-001\tempDir-001\shard0\solr.xml
   [junit4]   2> 2151155 INFO  (TEST-DistributedMLTComponentTest.test-seed#[38B919DD0AE428F5]) [    ] o.a.s.c.CorePropertiesLocator Config-defined core root directory: C:\Users\jenkins\workspace\Lucene-Solr-6.x-Windows\solr\build\solr-core\test\J1\temp\solr.handler.component.DistributedMLTComponentTest_38B919DD0AE428F5-001\tempDir-001\shard0\cores
   [junit4]   2> 2151155 INFO  (TEST-DistributedMLTComponentTest.test-seed#[38B919DD0AE428F5]) [    ] o.a.s.c.CoreContainer New CoreContainer 18013444
   [junit4]   2> 2151155 INFO  (TEST-DistributedMLTComponentTest.test-seed#[38B919DD0AE428F5]) [    ] o.a.s.c.CoreContainer Loading cores into CoreContainer [instanceDir=C:\Users\jenkins\workspace\Lucene-Solr-6.x-Windows\solr\build\solr-core\test\J1\temp\solr.handler.component.DistributedMLTComponentTest_38B919DD0AE428F5-001\tempDir-001\shard0]
   [junit4]   2> 2151155 WARN  (TEST-DistributedMLTComponentTest.test-seed#[38B919DD0AE428F5]) [    ] o.a.s.c.CoreContainer Couldn't add files from C:\Users\jenkins\workspace\Lucene-Solr-6.x-Windows\solr\build\solr-core\test\J1\temp\solr.handler.component.DistributedMLTComponentTest_38B919DD0AE428F5-001\tempDir-001\shard0\lib to classpath: C:\Users\jenkins\workspace\Lucene-Solr-6.x-Windows\solr\build\solr-core\test\J1\temp\solr.handler.component.DistributedMLTComponentTest_38B919DD0AE428F5-001\tempDir-001\shard0\lib
   [junit4]   2> 2151156 INFO  (TEST-DistributedMLTComponentTest.test-seed#[38B919DD0AE428F5]) [    ] o.a.s.h.c.HttpShardHandlerFactory created with socketTimeout : 90000,urlScheme : ,connTimeout : 15000,maxConnectionsPerHost : 20,maxConnections : 10000,corePoolSize : 0,maximumPoolSize : 2147483647,maxThreadIdleTime : 5,sizeOfQueue : -1,fairnessPolicy : false,useRetries : false,
   [junit4]   2> 2151159 INFO  (TEST-DistributedMLTComponentTest.test-seed#[38B919DD0AE428F5]) [    ] o.a.s.u.UpdateShardHandler Creating UpdateShardHandler HTTP client with params: socketTimeout=340000&connTimeout=45000&retry=true
   [junit4]   2> 2151160 INFO  (TEST-DistributedMLTComponentTest.test-seed#[38B919DD0AE428F5]) [    ] o.a.s.l.LogWatcher SLF4J impl is org.slf4j.impl.Log4jLoggerFactory
   [junit4]   2> 2151160 INFO  (TEST-DistributedMLTComponentTest.test-seed#[38B919DD0AE428F5]) [    ] o.a.s.l.LogWatcher Registering Log Listener [Log4j (org.slf4j.impl.Log4jLoggerFactory)]
   [junit4]   2> 2151160 INFO  (TEST-DistributedMLTComponentTest.test-seed#[38B919DD0AE428F5]) [    ] o.a.s.c.CoreContainer Security conf doesn't exist. Skipping setup for authorization module.
   [junit4]   2> 2151160 INFO  (TEST-DistributedMLTComponentTest.test-seed#[38B919DD0AE428F5]) [    ] o.a.s.c.CoreContainer No authentication plugin used.
   [junit4]   2> 2151161 INFO  (TEST-DistributedMLTComponentTest.test-seed#[38B919DD0AE428F5]) [    ] o.a.s.c.CorePropertiesLocator Looking for core definitions underneath C:\Users\jenkins\workspace\Lucene-Solr-6.x-Windows\solr\build\solr-core\test\J1\temp\solr.handler.component.DistributedMLTComponentTest_38B919DD0AE428F5-001\tempDir-001\shard0\cores
   [junit4]   2> 2151163 INFO  (TEST-DistributedMLTComponentTest.test-seed#[38B919DD0AE428F5]) [    ] o.a.s.c.CoreDescriptor Created CoreDescriptor: {name=collection1, config=solrconfig.xml, loadOnStartup=true, schema=schema.xml, configSetProperties=configsetprops.json, transient=false, dataDir=data\, configSet=collection1}
   [junit4]   2> 2151163 INFO  (TEST-DistributedMLTComponentTest.test-seed#[38B919DD0AE428F5]) [    ] o.a.s.c.CorePropertiesLocator Found core collection1 in C:\Users\jenkins\workspace\Lucene-Solr-6.x-Windows\solr\build\solr-core\test\J1\temp\solr.handler.component.DistributedMLTComponentTest_38B919DD0AE428F5-001\tempDir-001\shard0\cores\collection1
   [junit4]   2> 2151163 INFO  (TEST-DistributedMLTComponentTest.test-seed#[38B919DD0AE428F5]) [    ] o.a.s.c.CorePropertiesLocator Found 1 core definitions
   [junit4]   2> 2151163 INFO  (TEST-DistributedMLTComponentTest.test-seed#[38B919DD0AE428F5]) [    ] o.a.s.s.SolrDispatchFilter user.dir=C:\Users\jenkins\workspace\Lucene-Solr-6.x-Windows\solr\build\solr-core\test\J1
   [junit4]   2> 2151163 INFO  (TEST-DistributedMLTComponentTest.test-seed#[38B919DD0AE428F5]) [    ] o.a.s.s.SolrDispatchFilter SolrDispatchFilter.init() done
   [junit4]   2> 2151163 INFO  (coreLoadExecutor-7903-thread-1) [    ] o.a.s.c.SolrResourceLoader new SolrResourceLoader for directory: 'C:\Users\jenkins\workspace\Lucene-Solr-6.x-Windows\solr\core\src\test-files\solr\collection1'
   [junit4]   2> 2151164 INFO  (coreLoadExecutor-7903-thread-1) [    ] o.a.s.c.SolrResourceLoader JNDI not configured for solr (NoInitialContextEx)
   [junit4]   2> 2151164 INFO  (coreLoadExecutor-7903-thread-1) [    ] o.a.s.c.SolrResourceLoader solr home defaulted to 'solr/' (could not find system property or JNDI)
   [junit4]   2> 2151164 INFO  (coreLoadExecutor-7903-thread-1) [    ] o.a.s.c.SolrResourceLoader Adding 'file:/C:/Users/jenkins/workspace/Lucene-Solr-6.x-Windows/solr/core/src/test-files/solr/collection1/lib/classes/' to classloader
   [junit4]   2> 2151164 INFO  (coreLoadExecutor-7903-thread-1) [    ] o.a.s.c.SolrResourceLoader Adding 'file:/C:/Users/jenkins/workspace/Lucene-Solr-6.x-Windows/solr/core/src/test-files/solr/collection1/lib/README' to classloader
   [junit4]   2> 2151229 INFO  (coreLoadExecutor-7903-thread-1) [    ] o.a.s.c.SolrConfig current version of requestparams : -1
   [junit4]   2> 2151235 WARN  (coreLoadExecutor-7903-thread-1) [    ] o.a.s.c.Config Beginning with Solr 5.5, <mergePolicy> is deprecated, use <mergePolicyFactory> instead.
   [junit4]   2> 2151236 INFO  (coreLoadExecutor-7903-thread-1) [    ] o.a.s.c.SolrConfig Using Lucene MatchVersion: 6.1.0
   [junit4]   2> 2151251 INFO  (coreLoadExecutor-7903-thread-1) [    ] o.a.s.c.SolrConfig Loaded SolrConfig: solrconfig.xml
   [junit4]   2> 2151257 INFO  (coreLoadExecutor-7903-thread-1) [    ] o.a.s.s.IndexSchema [collection1] Schema name=test
   [junit4]   2> 2151321 INFO  (coreLoadExecutor-7903-thread-1) [    ] o.a.s.s.OpenExchangeRatesOrgProvider Initialized with rates=open-exchange-rates.json, refreshInterval=1440.
   [junit4]   2> 2151330 INFO  (coreLoadExecutor-7903-thread-1) [    ] o.a.s.s.IndexSchema default search field in schema is text
   [junit4]   2> 2151331 INFO  (coreLoadExecutor-7903-thread-1) [    ] o.a.s.s.IndexSchema unique key field: id
   [junit4]   2> 2151336 INFO  (coreLoadExecutor-7903-thread-1) [    ] o.a.s.s.FileExchangeRateProvider Reloading exchange rates from file currency.xml
   [junit4]   2> 2151338 INFO  (coreLoadExecutor-7903-thread-1) [    ] o.a.s.s.FileExchangeRateProvider Reloading exchange rates from file currency.xml
   [junit4]   2> 2151340 INFO  (coreLoadExecutor-7903-thread-1) [    ] o.a.s.s.OpenExchangeRatesOrgProvider Reloading exchange rates from open-exchange-rates.json
   [junit4]   2> 2151340 INFO  (coreLoadExecutor-7903-thread-1) [    ] o.a.s.s.OpenExchangeRatesOrgProvider Reloading exchange rates from open-exchange-rates.json
   [junit4]   2> 2151349 INFO  (coreLoadExecutor-7903-thread-1) [    ] o.a.s.c.ConfigSetProperties Did not find ConfigSet properties, assuming default properties: Can't find resource 'configsetprops.json' in classpath or 'C:\Users\jenkins\workspace\Lucene-Solr-6.x-Windows\solr\core\src\test-files\solr\collection1'
   [junit4]   2> 2151349 INFO  (coreLoadExecutor-7903-thread-1) [    ] o.a.s.c.CoreContainer Creating SolrCore 'collection1' using configuration from configset C:\Users\jenkins\workspace\Lucene-Solr-6.x-Windows\solr\core\src\test-files\solr\collection1
   [junit4]   2> 2151350 INFO  (coreLoadExecutor-7903-thread-1) [    x:collection1] o.a.s.c.SolrCore org.apache.solr.core.MockDirectoryFactory
   [junit4]   2> 2151350 INFO  (coreLoadExecutor-7903-thread-1) [    x:collection1] o.a.s.c.SolrCore [[collection1] ] Opening new SolrCore at [C:\Users\jenkins\workspace\Lucene-Solr-6.x-Windows\solr\core\src\test-files\solr\collection1], dataDir=[C:\Users\jenkins\workspace\Lucene-Solr-6.x-Windows\solr\build\solr-core\test\J1\temp\solr.handler.component.DistributedMLTComponentTest_38B919DD0AE428F5-001\tempDir-001\shard0\cores\collection1\data\]
   [junit4]   2> 2151350 INFO  (coreLoadExecutor-7903-thread-1) [    x:collection1] o.a.s.c.JmxMonitoredMap JMX monitoring is enabled. Adding Solr mbeans to JMX Server: com.sun.jmx.mbeanserver.JmxMBeanServer@17cc58f
   [junit4]   2> 2151352 INFO  (coreLoadExecutor-7903-thread-1) [    x:collection1] o.a.s.c.CachingDirectoryFactory return new directory for C:\Users\jenkins\workspace\Lucene-Solr-6.x-Windows\solr\build\solr-core\test\J1\temp\solr.handler.component.DistributedMLTComponentTest_38B919DD0AE428F5-001\tempDir-001\shard0\cores\collection1\data\
   [junit4]   2> 2151353 INFO  (coreLoadExecutor-7903-thread-1) [    x:collection1] o.a.s.c.SolrCore New index directory detected: old=null new=C:\Users\jenkins\workspace\Lucene-Solr-6.x-Windows\solr\build\solr-core\test\J1\temp\solr.handler.component.DistributedMLTComponentTest_38B919DD0AE428F5-001\tempDir-001\shard0\cores\collection1\data\index/
   [junit4]   2> 2151353 WARN  (coreLoadExecutor-7903-thread-1) [    x:collection1] o.a.s.c.SolrCore [collection1] Solr index directory 'C:\Users\jenkins\workspace\Lucene-Solr-6.x-Windows\solr\build\solr-core\test\J1\temp\solr.handler.component.DistributedMLTComponentTest_38B919DD0AE428F5-001\tempDir-001\shard0\cores\collection1\data\index' doesn't exist. Creating new index...
   [junit4]   2> 2151354 INFO  (coreLoadExecutor-7903-thread-1) [    x:collection1] o.a.s.c.CachingDirectoryFactory return new directory for C:\Users\jenkins\workspace\Lucene-Solr-6.x-Windows\solr\build\solr-core\test\J1\temp\solr.handler.component.DistributedMLTComponentTest_38B919DD0AE428F5-001\tempDir-001\shard0\cores\collection1\data\index
   [junit4]   2> 2151354 INFO  (coreLoadExecutor-7903-thread-1) [    x:collection1] o.a.s.u.RandomMergePolicy RandomMergePolicy wrapping class org.apache.lucene.index.LogByteSizeMergePolicy: [LogByteSizeMergePolicy: minMergeSize=1677721, mergeFactor=34, maxMergeSize=2147483648, maxMergeSizeForForcedMerge=9223372036854775807, calibrateSizeByDeletes=true, maxMergeDocs=2147483647, maxCFSSegmentSizeMB=8.796093022207999E12, noCFSRatio=0.2969515504259035]
   [junit4]   2> 2151354 INFO  (coreLoadExecutor-7903-thread-1) [    x:collection1] o.a.s.c.SolrDeletionPolicy SolrDeletionPolicy.onCommit: commits: num=1
   [junit4]   2> 	commit{dir=MockDirectoryWrapper(RAMDirectory@1d249f lockFactory=org.apache.lucene.store.SingleInstanceLockFactory@3f0af0),segFN=segments_1,generation=1}
   [junit4]   2> 2151354 INFO  (coreLoadExecutor-7903-thread-1) [    x:collection1] o.a.s.c.SolrDeletionPolicy newest commit generation = 1
   [junit4]   2> 2151358 INFO  (coreLoadExecutor-7903-thread-1) [    x:collection1] o.a.s.u.p.UpdateRequestProcessorChain creating updateRequestProcessorChain "dedupe"
   [junit4]   2> 2151358 INFO  (coreLoadExecutor-7903-thread-1) [    x:collection1] o.a.s.u.p.UpdateRequestProcessorChain inserting DistributedUpdateProcessorFactory into updateRequestProcessorChain "dedupe"
   [junit4]   2> 2151358 INFO  (coreLoadExecutor-7903-thread-1) [    x:collection1] o.a.s.u.p.UpdateRequestProcessorChain creating updateRequestProcessorChain "dedupe-allfields"
   [junit4]   2> 2151358 INFO  (coreLoadExecutor-7903-thread-1) [    x:collection1] o.a.s.u.p.UpdateRequestProcessorChain inserting DistributedUpdateProcessorFactory into updateRequestProcessorChain "dedupe-allfields"
   [junit4]   2> 2151358 INFO  (coreLoadExecutor-7903-thread-1) [    x:collection1] o.a.s.u.p.UpdateRequestProcessorChain creating updateRequestProcessorChain "stored_sig"
   [junit4]   2> 2151358 INFO  (coreLoadExecutor-7903-thread-1) [    x:collection1] o.a.s.u.p.UpdateRequestProcessorChain inserting DistributedUpdateProcessorFactory into updateRequestProcessorChain "stored_sig"
   [junit4]   2> 2151358 INFO  (coreLoadExecutor-7903-thread-1) [    x:collection1] o.a.s.u.p.UpdateRequestProcessorChain creating updateRequestProcessorChain "uniq-fields"
   [junit4]   2> 2151359 INFO  (coreLoadExecutor-7903-thread-1) [    x:collection1] o.a.s.u.p.UpdateRequestProcessorChain inserting DistributedUpdateProcessorFactory into updateRequestProcessorChain "uniq-fields"
   [junit4]   2> 2151367 INFO  (coreLoadExecutor-7903-thread-1) [    x:collection1] o.a.s.u.p.UpdateRequestProcessorChain creating updateRequestProcessorChain "distrib-dup-test-chain-explicit"
   [junit4]   2> 2151367 INFO  (coreLoadExecutor-7903-thread-1) [    x:collection1] o.a.s.u.p.UpdateRequestProcessorChain creating updateRequestProcessorChain "distrib-dup-test-chain-implicit"
   [junit4]   2> 2151367 INFO  (coreLoadExecutor-7903-thread-1) [    x:collection1] o.a.s.u.p.UpdateRequestProcessorChain inserting DistributedUpdateProcessorFactory into updateRequestProcessorChain "distrib-dup-test-chain-implicit"
   [junit4]   2> 2151367 INFO  (coreLoadExecutor-7903-thread-1) [    x:collection1] o.a.s.c.SolrCore no updateRequestProcessorChain defined as default, creating implicit default
   [junit4]   2> 2151367 INFO  (OldIndexDirectoryCleanupThreadForCore-collection1) [    x:collection1] o.a.s.c.SolrCore Looking for old index directories to cleanup for core collection1 in C:\Users\jenkins\workspace\Lucene-Solr-6.x-Windows\solr\build\solr-core\test\J1\temp\solr.handler.component.DistributedMLTComponentTest_38B919DD0AE428F5-001\tempDir-001\shard0\cores\collection1\data\
   [junit4]   2> 2151368 WARN  (OldIndexDirectoryCleanupThreadForCore-collection1) [    x:collection1] o.a.s.c.DirectoryFactory C:\Users\jenkins\workspace\Lucene-Solr-6.x-Windows\solr\build\solr-core\test\J1\temp\solr.handler.component.DistributedMLTComponentTest_38B919DD0AE428F5-001\tempDir-001\shard0\cores\collection1\data\ does not point to a valid data directory; skipping clean-up of old index directories.
   [junit4]   2> 2151373 INFO  (coreLoadExecutor-7903-thread-1) [    x:collection1] o.a.s.h.l.XMLLoader xsltCacheLifetimeSeconds=60
   [junit4]   2> 2151375 INFO  (coreLoadExecutor-7903-thread-1) [    x:collection1] o.a.s.h.l.XMLLoader xsltCacheLifetimeSeconds=60
   [junit4]   2> 2151377 INFO  (coreLoadExecutor-7903-thread-1) [    x:collection1] o.a.s.h.l.XMLLoader xsltCacheLifetimeSeconds=60
   [junit4]   2> 2151378 INFO  (coreLoadExecutor-7903-thread-1) [    x:collection1] o.a.s.h.l.XMLLoader xsltCacheLifetimeSeconds=60
   [junit4]   2> 2151399 INFO  (coreLoadExecutor-7903-thread-1) [    x:collection1] o.a.s.c.PluginBag requestHandler : 'lazy' created with startup=lazy 
   [junit4]   2> 2151401 INFO  (coreLoadExecutor-7903-thread-1) [    x:collection1] o.a.s.c.RequestHandlers Registered paths: /admin/mbeans,standard,spellCheckCompRH,lazy,/update/json/docs,/admin/luke,/export,spellCheckWithWordbreak_Direct,tvrh,/get,/admin/properties,/update/json,mltrh,/admin/threads,/search-facet-def,/update/csv,/sql,/graph,/search-facet-invariants,/admin/segments,spellCheckCompRH1,/mlt,/admin/system,/replication,dismax,defaults,/config,/stream,/schema,/admin/plugins,/admin/logging,spellCheckWithWordbreak,mock,/admin/ping,/update,/admin/file,/terms,spellCheckCompRH_Direct,/debug/dump
   [junit4]   2> 2151401 INFO  (coreLoadExecutor-7903-thread-1) [    x:collection1] o.a.s.c.SolrCore Using default statsCache cache: org.apache.solr.search.stats.LocalStatsCache
   [junit4]   2> 2151402 INFO  (coreLoadExecutor-7903-thread-1) [    x:collection1] o.a.s.u.UpdateHandler Using UpdateLog implementation: org.apache.solr.update.UpdateLog
   [junit4]   2> 2151402 INFO  (coreLoadExecutor-7903-thread-1) [    x:collection1] o.a.s.u.UpdateLog Initializing UpdateLog: dataDir= defaultSyncLevel=FLUSH numRecordsToKeep=100 maxNumLogsToKeep=10 numVersionBuckets=65536
   [junit4]   2> 2151403 INFO  (coreLoadExecutor-7903-thread-1) [    x:collection1] o.a.s.u.CommitTracker Hard AutoCommit: disabled
   [junit4]   2> 2151403 INFO  (coreLoadExecutor-7903-thread-1) [    x:collection1] o.a.s.u.CommitTracker Soft AutoCommit: disabled
   [junit4]   2> 2151404 INFO  (coreLoadExecutor-7903-thread-1) [    x:collection1] o.a.s.u.RandomMergePolicy RandomMergePolicy wrapping class org.apache.lucene.index.TieredMergePolicy: [TieredMergePolicy: maxMergeAtOnce=35, maxMergeAtOnceExplicit=15, maxMergedSegmentMB=44.859375, floorSegmentMB=0.634765625, forceMergeDeletesPctAllowed=20.978501812830604, segmentsPerTier=18.0, maxCFSSegmentSizeMB=8.796093022207999E12, noCFSRatio=0.4747013979229491
   [junit4]   2> 2151404 INFO  (coreLoadExecutor-7903-thread-1) [    x:collection1] o.a.s.c.SolrDeletionPolicy SolrDeletionPolicy.onInit: commits: num=1
   [junit4]   2> 	commit{dir=MockDirectoryWrapper(RAMDirectory@1d249f lockFactory=org.apache.lucene.store.SingleInstanceLockFactory@3f0af0),segFN=segments_1,generation=1}
   [junit4]   2> 2151404 INFO  (coreLoadExecutor-7903-thread-1) [    x:collection1] o.a.s.c.SolrDeletionPolicy newest commit generation = 1
   [junit4]   2> 2151405 INFO  (coreLoadExecutor-7903-thread-1) [    x:collection1] o.a.s.s.SolrIndexSearcher Opening [Searcher@11236be[collection1] main]
   [junit4]   2> 2151405 INFO  (coreLoadExecutor-7903-thread-1) [    x:collection1] o.a.s.r.RestManager Initializing RestManager with initArgs: {storageIO=org.apache.solr.rest.ManagedResourceStorage$InMemoryStorageIO}
   [junit4]   2> 2151405 INFO  (coreLoadExecutor-7903-thread-1) [    x:collection1] o.a.s.r.ManagedResourceStorage Reading _rest_managed.json using InMemoryStorage
   [junit4]   2> 2151405 INFO  (coreLoadExecutor-7903-thread-1) [    x:collection1] o.a.s.r.RestManager Initializing 0 registered ManagedResources
   [junit4]   2> 2151405 INFO  (coreLoadExecutor-7903-thread-1) [    x:collection1] o.a.s.h.c.SpellCheckComponent Initializing spell checkers
   [junit4]   2> 2151426 INFO  (coreLoadExecutor-7903-thread-1) [    x:collection1] o.a.s.s.DirectSolrSpellChecker init: {name=direct,classname=DirectSolrSpellChecker,field=lowerfilt,minQueryLength=3}
   [junit4]   2> 2151484 INFO  (coreLoadExecutor-7903-thread-1) [    x:collection1] o.a.s.h.ReplicationHandler Commits will be reserved for  10000
   [junit4]   2> 2151485 INFO  (searcherExecutor-7904-thread-1-processing-x:collection1) [    x:collection1] o.a.s.h.c.SpellCheckComponent Loading spell index for spellchecker: default
   [junit4]   2> 2151485 INFO  (searcherExecutor-7904-thread-1-processing-x:collection1) [    x:collection1] o.a.s.h.c.SpellCheckComponent Loading spell index for spellchecker: direct
   [junit4]   2> 2151485 INFO  (searcherExecutor-7904-thread-1-processing-x:collection1) [    x:collection1] o.a.s.h.c.SpellCheckComponent Loading spell index for spellchecker: wordbreak
   [junit4]   2> 2151485 INFO  (searcherExecutor-7904-thread-1-processing-x:collection1) [    x:collection1] o.a.s.h.c.SpellCheckComponent Loading spell index for spellchecker: multipleFields
   [junit4]   2> 2151485 INFO  (coreLoadExecutor-7903-thread-1) [    x:collection1] o.a.s.u.UpdateLog Looking up max value of version field to seed version buckets
   [junit4]   2> 2151485 INFO  (coreLoadExecutor-7903-thread-1) [    x:collection1] o.a.s.u.VersionInfo Refreshing highest value of _version_ for 65536 version buckets from index
   [junit4]   2> 2151485 INFO  (coreLoadExecutor-7903-thread-1) [    x:collection1] o.a.s.u.VersionInfo No terms found for _version_, cannot seed version bucket highest value from index
   [junit4]   2> 2151485 INFO  (coreLoadExecutor-7903-thread-1) [    x:collection1] o.a.s.u.UpdateLog Could not find max version in index or recent updates, using new clock 1535962077943824384
   [junit4]   2> 2151485 INFO  (searcherExecutor-7904-thread-1-processing-x:collection1) [    x:collection1] o.a.s.h.c.SpellCheckComponent Loading spell index for spellchecker: jarowinkler
   [junit4]   2> 2151486 INFO  (searcherExecutor-7904-thread-1-processing-x:collection1) [    x:collection1] o.a.s.h.c.SpellCheckComponent Loading spell index for spellchecker: external
   [junit4]   2> 2151486 INFO  (searcherExecutor-7904-thread-1-processing-x:collection1) [    x:collection1] o.a.s.h.c.SpellCheckComponent Loading spell index for spellchecker: freq
   [junit4]   2> 2151486 INFO  (searcherExecutor-7904-thread-1-processing-x:collection1) [    x:collection1] o.a.s.h.c.SpellCheckComponent Loading spell index for spellchecker: fqcn
   [junit4]   2> 2151487 INFO  (searcherExecutor-7904-thread-1-processing-x:collection1) [    x:collection1] o.a.s.h.c.SpellCheckComponent Loading spell index for spellchecker: perDict
   [junit4]   2> 2151487 INFO  (coreLoadExecutor-7903-thread-1) [    x:collection1] o.a.s.u.UpdateLog Took 1.0ms to seed version buckets with highest version 1535962077943824384
   [junit4]   2> 2151487 INFO  (coreLoadExecutor-7903-thread-1) [    x:collection1] o.a.s.c.CoreContainer registering core: collection1
   [junit4]   2> 2151487 INFO  (searcherExecutor-7904-thread-1-processing-x:collection1) [    x:collection1] o.a.s.c.SolrCore [collection1] Registered new searcher Searcher@11236be[collection1] main{ExitableDirectoryReader(UninvertingDirectoryReader())}
   [junit4]   2> 2152143 INFO  (TEST-DistributedMLTComponentTest.test-seed#[38B919DD0AE428F5]) [    ] o.a.s.SolrTestCaseJ4 Writing core.properties file to C:\Users\jenkins\workspace\Lucene-Solr-6.x-Windows\solr\build\solr-core\test\J1\temp\solr.handler.component.DistributedMLTComponentTest_38B919DD0AE428F5-001\tempDir-001\shard1\cores\collection1
   [junit4]   2> 2152146 INFO  (TEST-DistributedMLTComponentTest.test-seed#[38B919DD0AE428F5]) [    ] o.e.j.s.Server jetty-9.3.8.v20160314
   [junit4]   2> 2152147 INFO  (TEST-DistributedMLTComponentTest.test-seed#[38B919DD0AE428F5]) [    ] o.e.j.s.h.ContextHandler Started o.e.j.s.ServletContextHandler@89a21b{/,null,AVAILABLE}
   [junit4]   2> 2152147 INFO  (TEST-DistributedMLTComponentTest.test-seed#[38B919DD0AE428F5]) [    ] o.e.j.s.ServerConnector Started ServerConnector@82d27b{HTTP/1.1,[http/1.1]}{127.0.0.1:63252}
   [junit4]   2> 2152147 INFO  (TEST-DistributedMLTComponentTest.test-seed#[38B919DD0AE428F5]) [    ] o.e.j.s.Server Started @2156378ms
   [junit4]   2> 2152148 INFO  (TEST-DistributedMLTComponentTest.test-seed#[38B919DD0AE428F5]) [    ] o.a.s.c.s.e.JettySolrRunner Jetty properties: {hostContext=/, hostPort=63252, coreRootDirectory=C:\Users\jenkins\workspace\Lucene-Solr-6.x-Windows\solr\build\solr-core\test\J1\temp\solr.handler.component.DistributedMLTComponentTest_38B919DD0AE428F5-001\tempDir-001\shard1\cores}
   [junit4]   2> 2152148 INFO  (TEST-DistributedMLTComponentTest.test-seed#[38B919DD0AE428F5]) [    ] o.a.s.s.SolrDispatchFilter SolrDispatchFilter.init(): sun.misc.Launcher$AppClassLoader@1d16e93
   [junit4]   2> 2152148 INFO  (TEST-DistributedMLTComponentTest.test-seed#[38B919DD0AE428F5]) [    ] o.a.s.c.SolrResourceLoader new SolrResourceLoader for directory: 'C:\Users\jenkins\workspace\Lucene-Solr-6.x-Windows\solr\build\solr-core\test\J1\temp\solr.handler.component.DistributedMLTComponentTest_38B919DD0AE428F5-001\tempDir-001\shard1'
   [junit4]   2> 2152148 INFO  (TEST-DistributedMLTComponentTest.test-seed#[38B919DD0AE428F5]) [    ] o.a.s.c.SolrResourceLoader JNDI not configured for solr (NoInitialContextEx)
   [junit4]   2> 2152148 INFO  (TEST-DistributedMLTComponentTest.test-seed#[38B919DD0AE428F5]) [    ] o.a.s.c.SolrResourceLoader solr home defaulted to 'solr/' (could not find system property or JNDI)
   [junit4]   2> 2152149 INFO  (TEST-DistributedMLTComponentTest.test-seed#[38B919DD0AE428F5]) [    ] o.a.s.c.SolrXmlConfig Loading container configuration from C:\Users\jenkins\workspace\Lucene-Solr-6.x-Windows\solr\build\solr-core\test\J1\temp\solr.handler.component.DistributedMLTComponentTest_38B919DD0AE428F5-001\tempDir-001\shard1\solr.xml
   [junit4]   2> 2152164 INFO  (TEST-DistributedMLTComponentTest.test-seed#[38B919DD0AE428F5]) [    ] o.a.s.c.CorePropertiesLocator Config-defined core root directory: C:\Users\jenkins\workspace\Lucene-Solr-6.x-Windows\solr\build\solr-core\test\J1\temp\solr.handler.component.DistributedMLTComponentTest_38B919DD0AE428F5-001\tempDir-001\shard1\cores
   [junit4]   2> 2152164 INFO  (TEST-DistributedMLTComponentTest.test-seed#[38B919DD0AE428F5]) [    ] o.a.s.c.CoreContainer New CoreContainer 25011558
   [junit4]   2> 2152164 INFO  (TEST-DistributedMLTComponentTest.test-seed#[38B919DD0AE428F5]) [    ] o.a.s.c.CoreContainer Loading cores into CoreContainer [instanceDir=C:\Users\jenkins\workspace\Lucene-Solr-6.x-Windows\solr\build\solr-core\test\J1\temp\solr.handler.component.DistributedMLTComponentTest_38B919DD0AE428F5-001\tempDir-001\shard1]
   [junit4]   2> 2152164 WARN  (TEST-DistributedMLTComponentTest.test-seed#[38B919DD0AE428F5]) [    ] o.a.s.c.CoreContainer Couldn't add files from C:\Users\jenkins\workspace\Lucene-Solr-6.x-Windows\solr\build\solr-core\test\J1\temp\solr.handler.component.DistributedMLTComponentTest_38B919DD0AE428F5-001\tempDir-001\shard1\lib to classpath: C:\Users\jenkins\workspace\Lucene-Solr-6.x-Windows\solr\build\solr-core\test\J1\temp\solr.handler.component.DistributedMLTComponentTest_38B919DD0AE428F5-001\tempDir-001\shard1\lib
   [junit4]   2> 2152164 INFO  (TEST-DistributedMLTComponentTest.test-seed#[38B919DD0AE428F5]) [    ] o.a.s.h.c.HttpShardHandlerFactory created with socketTimeout : 90000,urlScheme : ,connTimeout : 15000,maxConnectionsPerHost : 20,maxConnections : 10000,corePoolSize : 0,maximumPoolSize : 2147483647,maxThreadIdleTime : 5,sizeOfQueue : -1,fairnessPolicy : false,useRetries : false,
   [junit4]   2> 2152168 INFO  (TEST-DistributedMLTComponentTest.test-seed#[38B919DD0AE428F5]) [    ] o.a.s.u.UpdateShardHandler Creating UpdateShardHandler HTTP client with params: socketTimeout=340000&connTimeout=45000&retry=true
   [junit4]   2> 2152169 INFO  (TEST-DistributedMLTComponentTest.test-seed#[38B919DD0AE428F5]) [    ] o.a.s.l.LogWatcher SLF4J impl is org.slf4j.impl.Log4jLoggerFactory
   [junit4]   2> 2152169 INFO  (TEST-DistributedMLTComponentTest.test-seed#[38B919DD0AE428F5]) [    ] o.a.s.l.LogWatcher Registering Log Listener [Log4j (org.slf4j.impl.Log4jLoggerFactory)]
   [junit4]   2> 2152169 INFO  (TEST-DistributedMLTComponentTest.test-seed#[38B919DD0AE428F5]) [    ] o.a.s.c.CoreContainer Security conf doesn't exist. Skipping setup for authorization module.
   [junit4]   2> 2152169 INFO  (TEST-DistributedMLTComponentTest.test-seed#[38B919DD0AE428F5]) [    ] o.a.s.c.CoreContainer No authentication plugin used.
   [junit4]   2> 2152170 INFO  (TEST-DistributedMLTComponentTest.test-seed#[38B919DD0AE428F5]) [    ] o.a.s.c.CorePropertiesLocator Looking for core definitions underneath C:\Users\jenkins\workspace\Lucene-Solr-6.x-Windows\solr\build\solr-core\test\J1\temp\solr.handler.component.DistributedMLTComponentTest_38B919DD0AE428F5-001\tempDir-001\shard1\cores
   [junit4]   2> 2152172 INFO  (TEST-DistributedMLTComponentTest.test-seed#[38B919DD0AE428F5]) [    ] o.a.s.c.CoreDescriptor Created CoreDescriptor: {name=collection1, config=solrconfig.xml, loadOnStartup=true, schema=schema.xml, configSetProperties=configsetprops.json, transient=false, dataDir=data\, configSet=collection1}
   [junit4]   2> 2152172 INFO  (TEST-DistributedMLTComponentTest.test-seed#[38B919DD0AE428F5]) [    ] o.a.s.c.CorePropertiesLocator Found core collection1 in C:\Users\jenkins\workspace\Lucene-Solr-6.x-Windows\solr\build\solr-core\test\J1\temp\solr.handler.component.DistributedMLTComponentTest_38B919DD0AE428F5-001\tempDir-001\shard1\cores\collection1
   [junit4]   2> 2152172 INFO  (TEST-DistributedMLTComponentTest.test-seed#[38B919DD0AE428F5]) [    ] o.a.s.c.CorePropertiesLocator Found 1 core definitions
   [junit4]   2> 2152173 INFO  (TEST-DistributedMLTComponentTest.test-seed#[38B919DD0AE428F5]) [    ] o.a.s.s.SolrDispatchFilter user.dir=C:\Users\jenkins\workspace\Lucene-Solr-6.x-Windows\solr\build\solr-core\test\J1
   [junit4]   2> 2152173 INFO  (TEST-DistributedMLTComponentTest.test-seed#[38B919DD0AE428F5]) [    ] o.a.s.s.SolrDispatchFilter SolrDispatchFilter.init() done
   [junit4]   2> 2152174 INFO  (coreLoadExecutor-7914-thread-1) [    ] o.a.s.c.SolrResourceLoader new SolrResourceLoader for directory: 'C:\Users\jenkins\workspace\Lucene-Solr-6.x-Windows\solr\core\src\test-files\solr\collection1'
   [junit4]   2> 2152174 INFO  (coreLoadExecutor-7914-thread-1) [    ] o.a.s.c.SolrResourceLoader JNDI not configured for solr (NoInitialContextEx)
   [junit4]   2> 2152174 INFO  (coreLoadExecutor-7914-thread-1) [    ] o.a.s.c.SolrResourceLoader solr home defaulted to 'solr/' (could not find system property or JNDI)
   [junit4]   2> 2152174 INFO  (coreLoadExecutor-7914-thread-1) [    ] o.a.s.c.SolrResourceLoader Adding 'file:/C:/Users/jenkins/workspace/Lucene-Solr-6.x-Windows/solr/core/src/test-files/solr/collection1/lib/classes/' to classloader
   [junit4]   2> 2152174 INFO  (coreLoadExecutor-7914-thread-1) [    ] o.a.s.c.SolrResourceLoader Adding 'file:/C:/Users/jenkins/workspace/Lucene-Solr-6.x-Windows/solr/core/src/test-files/solr/collection1/lib/README' to classloader
   [junit4]   2> 2152235 INFO  (coreLoadExecutor-7914-thread-1) [    ] o.a.s.c.SolrConfig current version of requestparams : -1
   [junit4]   2> 2152241 WARN  (coreLoadExecutor-7914-thread-1) [    ] o.a.s.c.Config Beginning with Solr 5.5, <mergePolicy> is deprecated, use <mergePolicyFactory> instead.
   [junit4]   2> 2152244 INFO  (coreLoadExecutor-7914-thread-1) [    ] o.a.s.c.SolrConfig Using Lucene MatchVersion: 6.1.0
   [junit4]   2> 2152259 INFO  (coreLoadExecutor-7914-thread-1) [    ] o.a.s.c.SolrConfig Loaded SolrConfig: solrconfig.xml
   [junit4]   2> 2152280 INFO  (coreLoadExecutor-7914-thread-1) [    ] o.a.s.s.IndexSchema [collection1] Schema name=test
   [junit4]   2> 2152342 INFO  (coreLoadExecutor-7914-thread-1) [    ] o.a.s.s.OpenExchangeRatesOrgProvider Initialized with rates=open-exchange-rates.json, refreshInterval=1440.
   [junit4]   2> 2152352 INFO  (coreLoadExecutor-7914-thread-1) [    ] o.a.s.s.IndexSchema default search field in schema is text
   [junit4]   2> 2152352 INFO  (coreLoadExecutor-7914-thread-1) [    ] o.a.s.s.IndexSchema unique key field: id
   [junit4]   2> 2152357 INFO  (coreLoadExecutor-7914-thread-1) [    ] o.a.s.s.FileExchangeRateProvider Reloading exchange rates from file currency.xml
   [junit4]   2> 2152359 INFO  (coreLoadExecutor-7914-thread-1) [    ] o.a.s.s.FileExchangeRateProvider Reloading exchange rates from file currency.xml
   [junit4]   2> 2152361 INFO  (coreLoadExecutor-7914-thread-1) [    ] o.a.s.s.OpenExchangeRatesOrgProvider Reloading exchange rates from open-exchange-rates.json
   [junit4]   2> 2152361 INFO  (coreLoadExecutor-7914-thread-1) [    ] o.a.s.s.OpenExchangeRatesOrgProvider Reloading exchange rates from open-exchange-rates.json
   [junit4]   2> 2152369 INFO  (coreLoadExecutor-7914-thread-1) [    ] o.a.s.c.ConfigSetProperties Did not find ConfigSet properties, assuming default properties: Can't find resource 'configsetprops.json' in classpath or 'C:\Users\jenkins\workspace\Lucene-Solr-6.x-Windows\solr\core\src\test-files\solr\collection1'
   [junit4]   2> 2152370 INFO  (coreLoadExecutor-7914-thread-1) [    ] o.a.s.c.CoreContainer Creating SolrCore 'collection1' using configuration from configset C:\Users\jenkins\workspace\Lucene-Solr-6.x-Windows\solr\core\src\test-files\solr\collection1
   [junit4]   2> 2152370 INFO  (coreLoadExecutor-7914-thread-1) [    x:collection1] o.a.s.c.SolrCore org.apache.solr.core.MockDirectoryFactory
   [junit4]   2> 2152370 INFO  (coreLoadExecutor-7914-thread-1) [    x:collection1] o.a.s.c.SolrCore [[collection1] ] Opening new SolrCore at [C:\Users\jenkins\workspace\Lucene-Solr-6.x-Windows\solr\core\src\test-files\solr\collection1], dataDir=[C:\Users\jenkins\workspace\Lucene-Solr-6.x-Windows\solr\build\solr-core\test\J1\temp\solr.handler.component.DistributedMLTComponentTest_38B919DD0AE428F5-001\tempDir-001\shard1\cores\collection1\data\]
   [junit4]   2> 2152370 INFO  (coreLoadExecutor-7914-thread-1) [    x:collection1] o.a.s.c.JmxMonitoredMap JMX monitoring is enabled. Adding Solr mbeans to JMX Server: com.sun.jmx.mbeanserver.JmxMBeanServer@17cc58f
   [junit4]   2> 2152373 INFO  (coreLoadExecutor-7914-thread-1) [    x:collection1] o.a.s.c.CachingDirectoryFactory return new directory for C:\Users\jenkins\workspace\Lucene-Solr-6.x-Windows\solr\build\solr-core\test\J1\temp\solr.handler.component.DistributedMLTComponentTest_38B919DD0AE428F5-001\tempDir-001\shard1\cores\collection1\data\
   [junit4]   2> 2152374 INFO  (coreLoadExecutor-7914-thread-1) [    x:collection1] o.a.s.c.SolrCore New index directory detected: old=null new=C:\Users\jenkins\workspace\Lucene-Solr-6.x-Windows\solr\build\solr-core\test\J1\temp\solr.handler.component.DistributedMLTComponentTest_38B919DD0AE428F5-001\tempDir-001\shard1\cores\collection1\data\index/
   [junit4]   2> 2152374 WARN  (coreLoadExecutor-7914-thread-1) [    x:collection1] o.a.s.c.SolrCore [collection1] Solr index directory 'C:\Users\jenkins\workspace\Lucene-Solr-6.x-Windows\solr\build\solr-core\test\J1\temp\solr.handler.component.DistributedMLTComponentTest_38B919DD0AE428F5-001\tempDir-001\shard1\cores\collection1\data\index' doesn't exist. Creating new index...
   [junit4]   2> 2152374 INFO  (coreLoadExecutor-7914-thread-1) [    x:collection1] o.a.s.c.CachingDirectoryFactory return new directory for C:\Users\jenkins\workspace\Lucene-Solr-6.x-Windows\solr\build\solr-core\test\J1\temp\solr.handler.component.DistributedMLTComponentTest_38B919DD0AE428F5-001\tempDir-001\shard1\cores\collection1\data\index
   [junit4]   2> 2152375 INFO  (coreLoadExecutor-7914-thread-1) [    x:collection1] o.a.s.u.RandomMergePolicy RandomMergePolicy wrapping class org.apache.lucene.index.LogByteSizeMergePolicy: [LogByteSizeMergePolicy: minMergeSize=1677721, mergeFactor=34, maxMergeSize=2147483648, maxMergeSizeForForcedMerge=9223372036854775807, calibrateSizeByDeletes=true, maxMergeDocs=2147483647, maxCFSSegmentSizeMB=8.796093022207999E12, noCFSRatio=0.2969515504259035]
   [junit4]   2> 2152375 INFO  (coreLoadExecutor-7914-thread-1) [    x:collection1] o.a.s.c.SolrDeletionPolicy SolrDeletionPolicy.onCommit: commits: num=1
   [junit4]   2> 	commit{dir=MockDirectoryWrapper(RAMDirectory@6de565 lockFactory=org.apache.lucene.store.SingleInstanceLockFactory@1b5d5ff),segFN=segments_1,generation=1}
   [junit4]   2> 2152375 INFO  (coreLoadExecutor-7914-thread-1) [    x:collection1] o.a.s.c.SolrDeletionPolicy newest commit generation = 1
   [junit4]   2> 2152378 INFO  (coreLoadExecutor-7914-thread-1) [    x:collection1] o.a.s.u.p.UpdateRequestProcessorChain creating updateRequestProcessorChain "dedupe"
   [junit4]   2> 2152378 INFO  (coreLoadExecutor-7914-thread-1) [    x:collection1] o.a.s.u.p.UpdateRequestProcessorChain inserting DistributedUpdateProcessorFactory into updateRequestProcessorChain "dedupe"
   [junit4]   2> 2152378 INFO  (coreLoadExecutor-7914-thread-1) [    x:collection1] o.a.s.u.p.UpdateRequestProcessorChain creating updateRequestProcessorChain "dedupe-allfields"
   [junit4]   2> 2152378 INFO  (coreLoadExecutor-7914-thread-1) [    x:collection1] o.a.s.u.p.UpdateRequestProcessorChain inserting DistributedUpdateProcessorFactory into updateRequestProcessorChain "dedupe-allfields"
   [junit4]   2> 2152378 INFO  (coreLoadExecutor-7914-thread-1) [    x:collection1] o.a.s.u.p.UpdateRequestProcessorChain creating updateRequestProcessorChain "stored_sig"
   [junit4]   2> 2152379 INFO  (coreLoadExecutor-7914-thread-1) [    x:collection1] o.a.s.u.p.UpdateRequestProcessorChain inserting DistributedUpdateProcessorFactory into updateRequestProcessorChain "stored_sig"
   [junit4]   2> 2152379 INFO  (coreLoadExecutor-7914-thread-1) [    x:collection1] o.a.s.u.p.UpdateRequestProcessorChain creating updateRequestProcessorChain "uniq-fields"
   [junit4]   2> 2152379 INFO  (coreLoadExecutor-7914-thread-1) [    x:collection1] o.a.s.u.p.UpdateRequestProcessorChain inserting DistributedUpdateProcessorFactory into updateRequestProcessorChain "uniq-fields"
   [junit4]   2> 2152379 INFO  (coreLoadExecutor-7914-thread-1) [    x:collection1] o.a.s.u.p.UpdateRequestProcessorChain creating updateRequestProcessorChain "distrib-dup-test-chain-explicit"
   [junit4]   2> 2152379 INFO  (coreLoadExecutor-7914-thread-1) [    x:collection1] o.a.s.u.p.UpdateRequestProcessorChain creating updateRequestProcessorChain "distrib-dup-test-chain-implicit"
   [junit4]   2> 2152379 INFO  (coreLoadExecutor-7914-thread-1) [    x:collection1] o.a.s.u.p.UpdateRequestProcessorChain inserting DistributedUpdateProcessorFactory into updateRequestProcessorChain "distrib-dup-test-chain-implicit"
   [junit4]   2> 2152379 INFO  (coreLoadExecutor-7914-thread-1) [    x:collection1] o.a.s.c.SolrCore no updateRequestProcessorChain defined as default, creating implicit default
   [junit4]   2> 2152381 INFO  (OldIndexDirectoryCleanupThreadForCore-collection1) [    x:collection1] o.a.s.c.SolrCore Looking for old index directories to cleanup for core collection1 in C:\Users\jenkins\workspace\Lucene-Solr-6.x-Windows\solr\build\solr-core\test\J1\temp\solr.handler.component.DistributedMLTComponentTest_38B919DD0AE428F5-001\tempDir-001\shard1\cores\collection1\data\
   [junit4]   2> 2152381 WARN  (OldIndexDirectoryCleanupThreadForCore-collection1) [    x:collection1] o.a.s.c.DirectoryFactory C:\Users\jenkins\workspace\Lucene-Solr-6.x-Windows\solr\build\solr-core\test\J1\temp\solr.handler.component.DistributedMLTComponentTest_38B919DD0AE428F5-001\tempDir-001\shard1\cores\collection1\data\ does not point to a valid data directory; skipping clean-up of old index directories.
   [junit4]   2> 2152385 INFO  (coreLoadExecutor-7914-thread-1) [    x:collection1] o.a.s.h.l.XMLLoader xsltCacheLifetimeSeconds=60
   [junit4]   2> 2152387 INFO  (coreLoadExecutor-7914-thread-1) [    x:collection1] o.a.s.h.l.XMLLoader xsltCacheLifetimeSeconds=60
   [junit4]   2> 2152388 INFO  (coreLoadExecutor-7914-thread-1) [    x:collection1] o.a.s.h.l.XMLLoader xsltCacheLifetimeSeconds=60
   [junit4]   2> 2152389 INFO  (coreLoadExecutor-7914-thread-1) [    x:collection1] o.a.s.h.l.XMLLoader xsltCacheLifetimeSeconds=60
   [junit4]   2> 2152395 INFO  (coreLoadExecutor-7914-thread-1) [    x:collection1] o.a.s.c.PluginBag requestHandler : 'lazy' created with startup=lazy 
   [junit4]   2> 2152396 INFO  (coreLoadExecutor-7914-thread-1) [    x:collection1] o.a.s.c.RequestHandlers Registered paths: /admin/mbeans,standard,spellCheckCompRH,lazy,/update/json/docs,/admin/luke,/export,spellCheckWithWordbreak_Direct,tvrh,/get,/admin/properties,/update/json,mltrh,/admin/threads,/search-facet-def,/update/csv,/sql,/graph,/search-facet-invariants,/admin/segments,spellCheckCompRH1,/mlt,/admin/system,/replication,dismax,defaults,/config,/stream,/schema,/admin/plugins,/admin/logging,spellCheckWithWordbreak,mock,/admin/ping,/update,/admin/file,/terms,spellCheckCompRH_Direct,/debug/dump
   [junit4]   2> 2152397 INFO  (coreLoadExecutor-7914-thread-1) [    x:collection1] o.a.s.c.SolrCore Using default statsCache cache: org.apache.solr.search.stats.LocalStatsCache
   [junit4]   2> 2152397 INFO  (coreLoadExecutor-7914-thread-1) [    x:collection1] o.a.s.u.UpdateHandler Using UpdateLog implementation: org.apache.solr.update.UpdateLog
   [junit4]   2> 2152397 INFO  (coreLoadExecutor-7914-thread-1) [    x:collection1] o.a.s.u.UpdateLog Initializing UpdateLog: dataDir= defaultSyncLevel=FLUSH numRecordsToKeep=100 maxNumLogsToKeep=10 numVersionBuckets=65536
   [junit4]   2> 2152398 INFO  (coreLoadExecutor-7914-thread-1) [    x:collection1] o.a.s.u.CommitTracker Hard AutoCommit: disabled
   [junit4]   2> 2152399 INFO  (coreLoadExecutor-7914-thread-1) [    x:collection1] o.a.s.u.CommitTracker Soft AutoCommit: disabled
   [junit4]   2> 2152399 INFO  (coreLoadExecutor-7914-thread-1) [    x:collection1] o.a.s.u.RandomMergePolicy RandomMergePolicy wrapping class org.apache.lucene.index.TieredMergePolicy: [TieredMergePolicy: maxMergeAtOnce=35, maxMergeAtOnceExplicit=15, maxMergedSegmentMB=44.859375, floorSegmentMB=0.634765625, forceMergeDeletesPctAllowed=20.978501812830604, segmentsPerTier=18.0, maxCFSSegmentSizeMB=8.796093022207999E12, noCFSRatio=0.4747013979229491
   [junit4]   2> 2152400 INFO  (coreLoadExecutor-7914-thread-1) [    x:collection1] o.a.s.c.SolrDeletionPolicy SolrDeletionPolicy.onInit: commits: num=1
   [junit4]   2> 	commit{dir=MockDirectoryWrapper(RAMDirectory@6de565 lockFactory=org.apache.lucene.store.SingleInstanceLockFactory@1b5d5ff),segFN=segments_1,generation=1}
   [junit4]   2> 2152400 INFO  (coreLoadExecutor-7914-thread-1) [    x:collection1] o.a.s.c.SolrDeletionPolicy newest commit generation = 1
   [junit4]   2> 2152400 INFO  (coreLoadExecutor-7914-thread-1) [    x:collection1] o.a.s.s.SolrIndexSearcher Opening [Searcher@2f52de[collection1] main]
   [junit4]   2> 2152400 INFO  (coreLoadExecutor-7914-thread-1) [    x:collection1] o.a.s.r.RestManager Initializing RestManager with initArgs: {storageIO=org.apache.solr.rest.ManagedResourceStorage$InMemoryStorageIO}
   [junit4]   2> 2152400 INFO  (coreLoadExecutor-7914-thread-1) [    x:collection1] o.a.s.r.ManagedResourceStorage Reading _rest_managed.json using InMemoryStorage
   [junit4]   2> 2152400 INFO  (coreLoadExecutor-7914-thread-1) [    x:collection1] o.a.s.r.RestManager Initializing 0 registered ManagedResources
   [junit4]   2> 2152400 INFO  (coreLoadExecutor-7914-thread-1) [    x:collection1] o.a.s.h.c.SpellCheckComponent Initializing spell checkers
   [junit4]   2> 2152423 INFO  (coreLoadExecutor-7914-thread-1) [    x:collection1] o.a.s.s.DirectSolrSpellChecker init: {name=direct,classname=DirectSolrSpellChecker,field=lowerfilt,minQueryLength=3}
   [junit4]   2> 2152493 INFO  (coreLoadExecutor-7914-thread-1) [    x:collection1] o.a.s.h.ReplicationHandler Commits will be reserved for  10000
   [junit4]   2> 2152493 INFO  (searcherExecutor-7915-thread-1-processing-x:collection1) [    x:collection1] o.a.s.h.c.SpellCheckComponent Loading spell index for spellchecker: default
   [junit4]   2> 2152494 INFO  (coreLoadExecutor-7914-thread-1) [    x:collection1] o.a.s.u.UpdateLog Looking up max value of version field to seed version buckets
   [junit4]   2> 2152494 INFO  (coreLoadExecutor-7914-thread-1) [    x:collection1] o.a.s.u.VersionInfo Refreshing highest value of _version_ for 65536 version buckets from index
   [junit4]   2> 2152494 INFO  (searcherExecutor-7915-thread-1-processing-x:collection1) [    x:collection1] o.a.s.h.c.SpellCheckComponent Loading spell index for spellchecker: direct
   [junit4]   2> 2152494 INFO  (coreLoadExecutor-7914-thread-1) [    x:collection1] o.a.s.u.VersionInfo No terms found for _version_, cannot seed version bucket highest value from index
   [junit4]   2> 2152494 INFO  (searcherExecutor-7915-thread-1-processing-x:collection1) [    x:collection1] o.a.s.h.c.SpellCheckComponent Loading spell index for spellchecker: wordbreak
   [junit4]   2> 2152494 INFO  (coreLoadExecutor-7914-thread-1) [    x:collection1] o.a.s.u.UpdateLog Could not find max version in index or recent updates, using new clock 1535962079001837568
   [junit4]   2> 2152494 INFO  (searcherExecutor-7915-thread-1-processing-x:collection1) [    x:collection1] o.a.s.h.c.SpellCheckComponent Loading spell index for spellchecker: multipleFields
   [junit4]   2> 2152494 INFO  (searcherExecutor-7915-thread-1-processing-x:collection1) [    x:collection1] o.a.s.h.c.SpellCheckComponent Loading spell index for spellchecker: jarowinkler
   [junit4]   2> 2152495 INFO  (searcherExecutor-7915-thread-1-processing-x:collection1) [    x:collection1] o.a.s.h.c.SpellCheckComponent Loading spell index for spellchecker: external
   [junit4]   2> 2152496 INFO  (searcherExecutor-7915-thread-1-processing-x:collection1) [    x:collection1] o.a.s.h.c.SpellCheckComponent Loading spell index for spellchecker: freq
   [junit4]   2> 2152496 INFO  (searcherExecutor-7915-thread-1-processing-x:collection1) [    x:collection1] o.a.s.h.c.SpellCheckComponent Loading spell index for spellchecker: fqcn
   [junit4]   2> 2152496 INFO  (coreLoadExecutor-7914-thread-1) [    x:collection1] o.a.s.u.UpdateLog Took 2.0ms to seed version buckets with highest version 1535962079001837568
   [junit4]   2> 2152496 INFO  (searcherExecutor-7915-thread-1-processing-x:collection1) [    x:collection1] o.a.s.h.c.SpellCheckComponent Loading spell index for spellchecker: perDict
   [junit4]   2> 2152496 INFO  (coreLoadExecutor-7914-thread-1) [    x:collection1] o.a.s.c.CoreContainer registering core: collection1
   [junit4]   2> 2152497 INFO  (searcherExecutor-7915-thread-1-processing-x:collection1) [    x:collection1] o.a.s.c.SolrCore [collection1] Registered new searcher Searcher@2f52de[collection1] main{ExitableDirectoryReader(UninvertingDirectoryReader())}
   [junit4]   2> 2153176 INFO  (TEST-DistributedMLTComponentTest.test-seed#[38B919DD0AE428F5]) [    ] o.a.s.SolrTestCaseJ4 Writing core.properties file to C:\Users\jenkins\workspace\Lucene-Solr-6.x-Windows\solr\build\solr-core\test\J1\temp\solr.handler.component.DistributedMLTComponentTest_38B919DD0AE428F5-001\tempDir-001\shard2\cores\collection1
   [junit4]   2> 2153179 INFO  (TEST-DistributedMLTComponentTest.test-seed#[38B919DD0AE428F5]) [    ] o.e.j.s.Server jetty-9.3.8.v20160314
   [junit4]   2> 2153179 INFO  (TEST-DistributedMLTComponentTest.test-seed#[38B919DD0AE428F5]) [    ] o.e.j.s.h.ContextHandler Started o.e.j.s.ServletContextHandler@66c2e9{/,null,AVAILABLE}
   [junit4]   2> 2153180 INFO  (TEST-DistributedMLTComponentTest.test-seed#[38B919DD0AE428F5]) [    ] o.e.j.s.ServerConnector Started ServerConnector@192fb87{HTTP/1.1,[http/1.1]}{127.0.0.1:63255}
   [junit4]   2> 2153180 INFO  (TEST-DistributedMLTComponentTest.test-seed#[38B919DD0AE428F5]) [    ] o.e.j.s.Server Started @2157410ms
   [junit4]   2> 2153180 INFO  (TEST-DistributedMLTComponentTest.test-seed#[38B919DD0AE428F5]) [    ] o.a.s.c.s.e.JettySolrRunner Jetty properties: {hostContext=/, hostPort=63255, coreRootDirectory=C:\Users\jenkins\workspace\Lucene-Solr-6.x-Windows\solr\build\solr-core\test\J1\temp\solr.handler.component.DistributedMLTComponentTest_38B919DD0AE428F5-001\tempDir-001\shard2\cores}
   [junit4]   2> 2153181 INFO  (TEST-DistributedMLTComponentTest.test-seed#[38B919DD0AE428F5]) [    ] o.a.s.s.SolrDispatchFilter SolrDispatchFilter.init(): sun.misc.Launcher$AppClassLoader@1d16e93
   [junit4]   2> 2153181 INFO  (TEST-DistributedMLTComponentTest.test-seed#[38B919DD0AE428F5]) [    ] o.a.s.c.SolrResourceLoader new SolrResourceLoader for directory: 'C:\Users\jenkins\workspace\Lucene-Solr-6.x-Windows\solr\build\solr-core\test\J1\temp\solr.handler.component.DistributedMLTComponentTest_38B919DD0AE428F5-001\tempDir-001\shard2'
   [junit4]   2> 2153181 INFO  (TEST-DistributedMLTComponentTest.test-seed#[38B919DD0AE428F5]) [    ] o.a.s.c.SolrResourceLoader JNDI not configured for solr (NoInitialContextEx)
   [junit4]   2> 2153181 INFO  (TEST-DistributedMLTComponentTest.test-seed#[38B919DD0AE428F5]) [    ] o.a.s.c.SolrResourceLoader solr home defaulted to 'solr/' (could not find system property or JNDI)
   [junit4]   2> 2153182 INFO  (TEST-DistributedMLTComponentTest.test-seed#[38B919DD0AE428F5]) [    ] o.a.s.c.SolrXmlConfig Loading container configuration from C:\Users\jenkins\workspace\Lucene-Solr-6.x-Windows\solr\build\solr-core\test\J1\temp\solr.handler.component.DistributedMLTComponentTest_38B919DD0AE428F5-001\tempDir-001\shard2\solr.xml
   [junit4]   2> 2153186 INFO  (TEST-DistributedMLTComponentTest.test-seed#[38B919DD0AE428F5]) [    ] o.a.s.c.CorePropertiesLocator Config-defined core root directory: C:\Users\jenkins\workspace\Lucene-Solr-6.x-Windows\solr\build\solr-core\test\J1\temp\solr.handler.component.DistributedMLTComponentTest_38B919DD0AE428F5-001\tempDir-001\shard2\cores
   [junit4]   2> 2153186 INFO  (TEST-DistributedMLTComponentTest.test-seed#[38B919DD0AE428F5]) [    ] o.a.s.c.CoreContainer New CoreContainer 28857429
   [junit4]   2> 2153186 INFO  (TEST-DistributedMLTComponentTest.test-seed#[38B919DD0AE428F5]) [    ] o.a.s.c.CoreContainer Loading cores into CoreContainer [instanceDir=C:\Users\jenkins\workspace\Lucene-Solr-6.x-Windows\solr\build\solr-core\test\J1\temp\solr.handler.component.DistributedMLTComponentTest_38B919DD0AE428F5-001\tempDir-001\shard2]
   [junit4]   2> 2153191 WARN  (TEST-DistributedMLTComponentTest.test-seed#[38B919DD0AE428F5]) [    ] o.a.s.c.CoreContainer Couldn't add files from C:\Users\jenkins\workspace\Lucene-Solr-6.x-Windows\solr\build\solr-core\test\J1\temp\solr.handler.component.DistributedMLTComponentTest_38B919DD0AE428F5-001\tempDir-001\shard2\lib to classpath: C:\Users\jenkins\workspace\Lucene-Solr-6.x-Windows\solr\build\solr-core\test\J1\temp\solr.handler.component.DistributedMLTComponentTest_38B919DD0AE428F5-001\tempDir-001\shard2\lib
   [junit4]   2> 2153191 INFO  (TEST-DistributedMLTComponentTest.test-seed#[38B919DD0AE428F5]) [    ] o.a.s.h.c.HttpShardHandlerFactory created with socketTimeout : 90000,urlScheme : ,connTimeout : 15000,maxConnectionsPerHost : 20,maxConnections : 10000,corePoolSize : 0,maximumPoolSize : 2147483647,maxThreadIdleTime : 5,sizeOfQueue : -1,fairnessPolicy : false,useRetries : false,
   [junit4]   2> 2153195 INFO  (TEST-DistributedMLTComponentTest.test-seed#[38B919DD0AE428F5]) [    ] o.a.s.u.UpdateShardHandler Creating UpdateShardHandler HTTP client with params: socketTimeout=340000&connTimeout=45000&retry=true
   [junit4]   2> 2153195 INFO  (TEST-DistributedMLTComponentTest.test-seed#[38B919DD0AE428F5]) [    ] o.a.s.l.LogWatcher SLF4J impl is org.slf4j.impl.Log4jLoggerFactory
   [junit4]   2> 2153195 INFO  (TEST-DistributedMLTComponentTest.test-seed#[38B919DD0AE428F5]) [    ] o.a.s.l.LogWatcher Registering Log Listener [Log4j (org.slf4j.impl.Log4jLoggerFactory)]
   [junit4]   2> 2153196 INFO  (TEST-DistributedMLTComponentTest.test-seed#[38B919DD0AE428F5]) [    ] o.a.s.c.CoreContainer Security conf doesn't exist. Skipping setup for authorization module.
   [junit4]   2> 2153196 INFO  (TEST-DistributedMLTComponentTest.test-seed#[38B919DD0AE428F5]) [    ] o.a.s.c.CoreContainer No authentication plugin used.
   [junit4]   2> 2153196 INFO  (TEST-DistributedMLTComponentTest.test-seed#[38B919DD0AE428F5]) [    ] o.a.s.c.CorePropertiesLocator Looking for core definitions underneath C:\Users\jenkins\workspace\Lucene-Solr-6.x-Windows\solr\build\solr-core\test\J1\temp\solr.handler.component.DistributedMLTComponentTest_38B919DD0AE428F5-001\tempDir-001\shard2\cores
   [junit4]   2> 2153197 INFO  (TEST-DistributedMLTComponentTest.test-seed#[38B919DD0AE428F5]) [    ] o.a.s.c.CoreDescriptor Created CoreDescriptor: {name=collection1, config=solrconfig.xml, loadOnStartup=true, schema=schema.xml, configSetProperties=configsetprops.json, transient=false, dataDir=data\, configSet=collection1}
   [junit4]   2> 2153197 INFO  (TEST-DistributedMLTComponentTest.test-seed#[38B919DD0AE428F5]) [    ] o.a.s.c.CorePropertiesLocator Found core collection1 in C:\Users\jenkins\workspace\Lucene-Solr-6.x-Windows\solr\build\solr-core\test\J1\temp\solr.handler.component.DistributedMLTComponentTest_38B919DD0AE428F5-001\tempDir-001\shard2\cores\collection1
   [junit4]   2> 2153197 INFO  (TEST-DistributedMLTComponentTest.test-seed#[38B919DD0AE428F5]) [    ] o.a.s.c.CorePropertiesLocator Found 1 core definitions
   [junit4]   2> 2153198 INFO  (TEST-DistributedMLTComponentTest.test-seed#[38B919DD0AE428F5]) [    ] o.a.s.s.SolrDispatchFilter user.dir=C:\Users\jenkins\workspace\Lucene-Solr-6.x-Windows\solr\build\solr-core\test\J1
   [junit4]   2> 2153198 INFO  (TEST-DistributedMLTComponentTest.test-seed#[38B919DD0AE428F5]) [    ] o.a.s.s.SolrDispatchFilter SolrDispatchFilter.init() done
   [junit4]   2> 2153199 INFO  (coreLoadExecutor-7925-thread-1) [    ] o.a.s.c.SolrResourceLoader new SolrResourceLoader for directory: 'C:\Users\jenkins\workspace\Lucene-Solr-6.x-Windows\solr\core\src\test-files\solr\collection1'
   [junit4]   2> 2153199 INFO  (coreLoadExecutor-7925-thread-1) [    ] o.a.s.c.SolrResourceLoader JNDI not configured for solr (NoInitialContextEx)
   [junit4]   2> 2153199 INFO  (coreLoadExecutor-7925-thread-1) [    ] o.a.s.c.SolrResourceLoader solr home defaulted to 'solr/' (could not find system property or JNDI)
   [junit4]   2> 2153200 INFO  (coreLoadExecutor-7925-thread-1) [    ] o.a.s.c.SolrResourceLoader Adding 'file:/C:/Users/jenkins/workspace/Lucene-Solr-6.x-Windows/solr/core/src/test-files/solr/collection1/lib/classes/' to classloader
   [junit4]   2> 2153200 INFO  (coreLoadExecutor-7925-thread-1) [    ] o.a.s.c.SolrResourceLoader Adding 'file:/C:/Users/jenkins/workspace/Lucene-Solr-6.x-Windows/solr/core/src/test-files/solr/collection1/lib/README' to classloader
   [junit4]   2> 2153267 INFO  (coreLoadExecutor-7925-thread-1) [    ] o.a.s.c.SolrConfig current version of requestparams : -1
   [junit4]   2> 2153273 WARN  (coreLoadExecutor-7925-thread-1) [    ] o.a.s.c.Config Beginning with Solr 5.5, <mergePolicy> is deprecated, use <mergePolicyFactory> instead.
   [junit4]   2> 2153274 INFO  (coreLoadExecutor-7925-thread-1) [    ] o.a.s.c.SolrConfig Using Lucene MatchVersion: 6.1.0
   [junit4]   2> 2153294 INFO  (coreLoadExecutor-7925-thread-1) [    ] o.a.s.c.SolrConfig Loaded SolrConfig: solrconfig.xml
   [junit4]   2> 2153303 INFO  (coreLoadExecutor-7925-thread-1) [    ] o.a.s.s.IndexSchema [collection1] Schema name=test
   [junit4]   2> 2153412 INFO  (coreLoadExecutor-7925-thread-1) [    ] o.a.s.s.OpenExchangeRatesOrgProvider Initialized with rates=open-exchange-rates.json, refreshInterval=1440.
   [junit4]   2> 2153422 INFO  (coreLoadExecutor-7925-thread-1) [    ] o.a.s.s.IndexSchema default search field in schema is text
   [junit4]   2> 2153423 INFO  (coreLoadExecutor-7925-thread-1) [    ] o.a.s.s.IndexSchema unique key field: id
   [junit4]   2> 2153428 INFO  (coreLoadExecutor-7925-thread-1) [    ] o.a.s.s.FileExchangeRateProvider Reloading exchange rates from file currency.xml
   [junit4]   2> 2153432 INFO  (coreLoadExecutor-7925-thread-1) [    ] o.a.s.s.FileExchangeRateProvider Reloading exchange rates from file currency.xml
   [junit4]   2> 2153434 INFO  (coreLoadExecutor-7925-thread-1) [    ] o.a.s.s.OpenExchangeRatesOrgProvider Reloading exchange rates from open-exchange-rates.json
   [junit4]   2> 2153434 INFO  (coreLoadExecutor-7925-thread-1) [    ] o.a.s.s.OpenExchangeRatesOrgProvider Reloading exchange rates from open-exchange-rates.json
   [junit4]   2> 2153446 INFO  (coreLoadExecutor-7925-thread-1) [    ] o.a.s.c.ConfigSetProperties Did not find ConfigSet properties, assuming default properties: Can't find resource 'configsetprops.json' in classpath or 'C:\Users\jenkins\workspace\Lucene-Solr-6.x-Windows\solr\core\src\test-files\solr\collection1'
   [junit4]   2> 2153446 INFO  (coreLoadExecutor-7925-thread-1) [    ] o.a.s.c.CoreContainer Creating SolrCore 'collection1' using configuration from configset C:\Users\jenkins\workspace\Lucene-Solr-6.x-Windows\solr\core\src\test-files\solr\collection1
   [junit4]   2> 2153446 INFO  (coreLoadExecutor-7925-thread-1) [    x:collection1] o.a.s.c.SolrCore org.apache.solr.core.MockDirectoryFactory
   [junit4]   2> 2153446 INFO  (coreLoadExecutor-7925-thread-1) [    x:collection1] o.a.s.c.SolrCore [[collection1] ] Opening new SolrCore at [C:\Users\jenkins\workspace\Lucene-Solr-6.x-Windows\solr\core\src\test-files\solr\collection1], dataDir=[C:\Users\jenkins\workspace\Lucene-Solr-6.x-Windows\solr\build\solr-core\test\J1\temp\solr.handler.component.DistributedMLTComponentTest_38B919DD0AE428F5-001\tempDir-001\shard2\cores\collection1\data\]
   [junit4]   2> 2153447 INFO  (coreLoadExecutor-7925-thread-1) [    x:collection1] o.a.s.c.JmxMonitoredMap JMX monitoring is enabled. Adding Solr mbeans to JMX Server: com.sun.jmx.mbeanserver.JmxMBeanServer@17cc58f
   [junit4]   2> 2153452 INFO  (coreLoadExecutor-7925-thread-1) [    x:collection1] o.a.s.c.CachingDirectoryFactory return new directory for C:\Users\jenkins\workspace\Lucene-Solr-6.x-Windows\solr\build\solr-core\test\J1\temp\solr.handler.component.DistributedMLTComponentTest_38B919DD0AE428F5-001\tempDir-001\shard2\cores\collection1\data\
   [junit4]   2> 2153453 INFO  (coreLoadExecutor-7925-thread-1) [    x:collection1] o.a.s.c.SolrCore New index directory detected: old=null new=C:\Users\jenkins\workspace\Lucene-Solr-6.x-Windows\solr\build\solr-core\test\J1\temp\solr.handler.component.DistributedMLTComponentTest_38B919DD0AE428F5-001\tempDir-001\shard2\cores\collection1\data\index/
   [junit4]   2> 2153453 WARN  (coreLoadExecutor-7925-thread-1) [    x:collection1] o.a.s.c.SolrCore [collection1] Solr index directory 'C:\Users\jenkins\workspace\Lucene-Solr-6.x-Windows\solr\build\solr-core\test\J1\temp\solr.handler.component.DistributedMLTComponentTest_38B919DD0AE428F5-001\tempDir-001\shard2\cores\collection1\data\index' doesn't exist. Creating new index...
   [junit4]   2> 2153454 INFO  (coreLoadExecutor-7925-thread-1) [    x:collection1] o.a.s.c.CachingDirectoryFactory return new directory for C:\Users\jenkins\workspace\Lucene-Solr-6.x-Windows\solr\build\solr-core\test\J1\temp\solr.handler.component.DistributedMLTComponentTest_38B919DD0AE428F5-001\tempDir-001\shard2\cores\collection1\data\index
   [junit4]   2> 2153454 INFO  (coreLoadExecutor-7925-thread-1) [    x:collection1] o.a.s.u.RandomMergePolicy RandomMergePolicy wrapping class org.apache.lucene.index.LogByteSizeMergePolicy: [LogByteSizeMergePolicy: minMergeSize=1677721, mergeFactor=34, maxMergeSize=2147483648, maxMergeSizeForForcedMerge=9223372036854775807, calibrateSizeByDeletes=true, maxMergeDocs=2147483647, maxCFSSegmentSizeMB=8.796093022207999E12, noCFSRatio=0.2969515504259035]
   [junit4]   2> 2153458 INFO  (coreLoadExecutor-7925-thread-1) [    x:collection1] o.a.s.c.SolrDeletionPolicy SolrDeletionPolicy.onCommit: commits: num=1
   [junit4]   2> 	commit{dir=MockDirectoryWrapper(RAMDirectory@1b905e9 lockFactory=org.apache.lucene.store.SingleInstanceLockFactory@82573f),segFN=segments_1,generation=1}
   [junit4]   2> 2153458 INFO  (coreLoadExecutor-7925-thread-1) [    x:collection1] o.a.s.c.SolrDeletionPolicy newest commit generation = 1
   [junit4]   2> 2153462 INFO  (coreLoadExecutor-7925-thread-1) [    x:collection1] o.a.s.u.p.UpdateRequestProcessorChain creating updateRequestProcessorChain "dedupe"
   [junit4]   2> 2153462 INFO  (coreLoadExecutor-7925-thread-1) [    x:collection1] o.a.s.u.p.UpdateRequestProcessorChain inserting Distributed

[...truncated too long message...]

isShutdown=true
   [junit4]   2> 2155246 INFO  (coreCloseExecutor-7937-thread-1) [    x:collection1] o.a.s.c.CachingDirectoryFactory Closing directory: C:\Users\jenkins\workspace\Lucene-Solr-6.x-Windows\solr\build\solr-core\test\J1\temp\solr.handler.component.DistributedMLTComponentTest_38B919DD0AE428F5-001\tempDir-001\shard2\cores\collection1\data\
   [junit4]   2> 2155246 INFO  (coreCloseExecutor-7937-thread-1) [    x:collection1] o.a.s.c.CachingDirectoryFactory looking to close C:\Users\jenkins\workspace\Lucene-Solr-6.x-Windows\solr\build\solr-core\test\J1\temp\solr.handler.component.DistributedMLTComponentTest_38B919DD0AE428F5-001\tempDir-001\shard2\cores\collection1\data\index [CachedDir<<refCount=0;path=C:\Users\jenkins\workspace\Lucene-Solr-6.x-Windows\solr\build\solr-core\test\J1\temp\solr.handler.component.DistributedMLTComponentTest_38B919DD0AE428F5-001\tempDir-001\shard2\cores\collection1\data\index;done=false>>]
   [junit4]   2> 2155246 INFO  (coreCloseExecutor-7937-thread-1) [    x:collection1] o.a.s.c.CachingDirectoryFactory Closing directory, CoreContainer#isShutdown=true
   [junit4]   2> 2155246 INFO  (coreCloseExecutor-7937-thread-1) [    x:collection1] o.a.s.c.CachingDirectoryFactory Closing directory: C:\Users\jenkins\workspace\Lucene-Solr-6.x-Windows\solr\build\solr-core\test\J1\temp\solr.handler.component.DistributedMLTComponentTest_38B919DD0AE428F5-001\tempDir-001\shard2\cores\collection1\data\index
   [junit4]   2> 2155248 INFO  (TEST-DistributedMLTComponentTest.test-seed#[38B919DD0AE428F5]) [    ] o.e.j.s.h.ContextHandler Stopped o.e.j.s.ServletContextHandler@66c2e9{/,null,UNAVAILABLE}
   [junit4]   2> 2155274 INFO  (SUITE-DistributedMLTComponentTest-seed#[38B919DD0AE428F5]-worker) [    ] o.a.s.SolrTestCaseJ4 ###deleteCore
   [junit4]   2> NOTE: test params are: codec=Asserting(Lucene60): {range_facet_l_dv=PostingsFormat(name=MockRandom), _version_=TestBloomFilteredLucenePostings(BloomFilteringPostingsFormat(Lucene50(blocksize=128))), lowerfilt1=FST50, lowerfilt1and2=FSTOrd50, multiDefault=FSTOrd50, intDefault=TestBloomFilteredLucenePostings(BloomFilteringPostingsFormat(Lucene50(blocksize=128))), lowerfilt=FSTOrd50, id=PostingsFormat(name=MockRandom), range_facet_i_dv=FSTOrd50, range_facet_l=FSTOrd50, timestamp=FSTOrd50}, docValues:{range_facet_l_dv=DocValuesFormat(name=Memory), range_facet_i_dv=DocValuesFormat(name=Lucene54), timestamp=DocValuesFormat(name=Lucene54)}, maxPointsInLeafNode=1643, maxMBSortInHeap=7.6212929507516485, sim=RandomSimilarity(queryNorm=false,coord=yes): {}, locale=mt-MT, timezone=Asia/Vladivostok
   [junit4]   2> NOTE: Windows 10 10.0 x86/Oracle Corporation 1.8.0_92 (32-bit)/cpus=3,threads=1,free=205456640,total=536870912
   [junit4]   2> NOTE: All tests run in this JVM: [StatsComponentTest, MultiThreadedOCPTest, HdfsThreadLeakTest, SolrCloudExampleTest, TestFieldCacheReopen, TestDistribDocBasedVersion, BaseCdcrDistributedZkTest, TestFieldTypeCollectionResource, TestDistributedGrouping, DeleteInactiveReplicaTest, AsyncCallRequestStatusResponseTest, TestShortCircuitedRequests, DistributedTermsComponentTest, RankQueryTest, AliasIntegrationTest, ZkSolrClientTest, CollectionReloadTest, TestMiniSolrCloudClusterSSL, TestSolrJ, TestAddFieldRealTimeGet, TestRecovery, TestObjectReleaseTracker, ConnectionReuseTest, TestAuthorizationFramework, NumericFieldsTest, BasicFunctionalityTest, HdfsDirectoryFactoryTest, TestBulkSchemaAPI, UpdateRequestProcessorFactoryTest, ShardSplitTest, SignatureUpdateProcessorFactoryTest, SolrCoreCheckLockOnStartupTest, DateFieldTest, TestIndexSearcher, TestSubQueryTransformerDistrib, DistributedQueryComponentCustomSortTest, BlockJoinFacetDistribTest, LeaderInitiatedRecoveryOnShardRestartTest, SpellPossibilityIteratorTest, OverriddenZkACLAndCredentialsProvidersTest, TestXmlQParser, TestSortingResponseWriter, MultiTermTest, TestCollationFieldDocValues, DirectUpdateHandlerOptimizeTest, TestBM25SimilarityFactory, TestConfigSetProperties, TestSimpleTrackingShardHandler, TestShardHandlerFactory, TestStressUserVersions, TestFilteredDocIdSet, TestFoldingMultitermQuery, TestNoOpRegenerator, LeaderElectionIntegrationTest, TestNRTOpen, TestSolrDeletionPolicy2, TestGraphMLResponseWriter, DistribDocExpirationUpdateProcessorTest, SearchHandlerTest, BinaryUpdateRequestHandlerTest, TestTolerantUpdateProcessorRandomCloud, BigEndianAscendingWordDeserializerTest, OverseerTaskQueueTest, TestRangeQuery, TestHdfsUpdateLog, DistributedFacetPivotSmallTest, TestReplicaProperties, TestInfoStreamLogging, MinimalSchemaTest, SuggesterTSTTest, IndexSchemaRuntimeFieldTest, ChaosMonkeySafeLeaderTest, FieldMutatingUpdateProcessorTest, CollectionTooManyReplicasTest, SuggesterWFSTTest, TestDistribIDF, TestLeaderInitiatedRecoveryThread, TestDFISimilarityFactory, TestRequestStatusCollectionAPI, TestLegacyFieldCache, CacheHeaderTest, TestCloudPivotFacet, OpenCloseCoreStressTest, CopyFieldTest, CdcrVersionReplicationTest, TestStressLiveNodes, TestCollationField, QueryParsingTest, HighlighterConfigTest, DistributedSuggestComponentTest, TestTrie, TestRandomRequestDistribution, HLLUtilTest, ZkNodePropsTest, TestDocBasedVersionConstraints, CleanupOldIndexTest, CoreAdminHandlerTest, DistanceFunctionTest, TestConfigOverlay, DebugComponentTest, SortByFunctionTest, TestDistributedMissingSort, FullHLLTest, RequestLoggingTest, TestBulkSchemaConcurrent, TestFastWriter, FileUtilsTest, LukeRequestHandlerTest, TestSerializedLuceneMatchVersion, TestQueryWrapperFilter, TestSQLHandler, DeleteReplicaTest, TestSearcherReuse, WordBreakSolrSpellCheckerTest, TestValueSourceCache, LeaderFailoverAfterPartitionTest, TestTrackingShardHandlerFactory, HdfsChaosMonkeyNothingIsSafeTest, BasicZkTest, HdfsRestartWhileUpdatingTest, ParsingFieldUpdateProcessorsTest, TestAuthenticationFramework, TestSolrFieldCacheMBean, DateRangeFieldTest, HdfsRecoverLeaseTest, DirectoryFactoryTest, WrapperMergePolicyFactoryTest, TestBadConfig, TestFiltering, CollectionsAPIDistributedZkTest, TestCopyFieldCollectionResource, TestManagedResourceStorage, BasicDistributedZk2Test, DateMathParserTest, BlockDirectoryTest, SegmentsInfoRequestHandlerTest, ConfigSetsAPITest, SharedFSAutoReplicaFailoverUtilsTest, TestSchemaNameResource, TestCustomDocTransformer, TestJettySolrRunner, TestMaxScoreQueryParser, TestSchemaSimilarityResource, BadIndexSchemaTest, BlockJoinFacetSimpleTest, TestSmileRequest, TestIndexingPerformance, TestSolrQueryParser, SolrPluginUtilsTest, JSONWriterTest, UniqFieldsUpdateProcessorFactoryTest, TestPHPSerializedResponseWriter, TestComponentsName, TestLFUCache, TestFastOutputStream, OpenExchangeRatesOrgProviderTest, TestSystemIdResolver, DOMUtilTest, TestUtils, DistributedMLTComponentTest]
   [junit4]   2> NOTE: reproduce with: ant test  -Dtestcase=DistributedMLTComponentTest -Dtests.seed=38B919DD0AE428F5 -Dtests.slow=true -Dtests.locale=mt-MT -Dtests.timezone=Asia/Vladivostok -Dtests.asserts=true -Dtests.file.encoding=UTF-8
   [junit4] ERROR   0.00s J1 | DistributedMLTComponentTest (suite) <<<
   [junit4]    > Throwable #1: java.io.IOException: Could not remove the following files (in the order of attempts):
   [junit4]    >    C:\Users\jenkins\workspace\Lucene-Solr-6.x-Windows\solr\build\solr-core\test\J1\temp\solr.handler.component.DistributedMLTComponentTest_38B919DD0AE428F5-001\tempDir-001\shard2\collection1: java.nio.file.DirectoryNotEmptyException: C:\Users\jenkins\workspace\Lucene-Solr-6.x-Windows\solr\build\solr-core\test\J1\temp\solr.handler.component.DistributedMLTComponentTest_38B919DD0AE428F5-001\tempDir-001\shard2\collection1
   [junit4]    >    C:\Users\jenkins\workspace\Lucene-Solr-6.x-Windows\solr\build\solr-core\test\J1\temp\solr.handler.component.DistributedMLTComponentTest_38B919DD0AE428F5-001\tempDir-001\shard2: java.nio.file.DirectoryNotEmptyException: C:\Users\jenkins\workspace\Lucene-Solr-6.x-Windows\solr\build\solr-core\test\J1\temp\solr.handler.component.DistributedMLTComponentTest_38B919DD0AE428F5-001\tempDir-001\shard2
   [junit4]    >    C:\Users\jenkins\workspace\Lucene-Solr-6.x-Windows\solr\build\solr-core\test\J1\temp\solr.handler.component.DistributedMLTComponentTest_38B919DD0AE428F5-001\tempDir-001: java.nio.file.DirectoryNotEmptyException: C:\Users\jenkins\workspace\Lucene-Solr-6.x-Windows\solr\build\solr-core\test\J1\temp\solr.handler.component.DistributedMLTComponentTest_38B919DD0AE428F5-001\tempDir-001
   [junit4]    > 	at __randomizedtesting.SeedInfo.seed([38B919DD0AE428F5]:0)
   [junit4]    > 	at org.apache.lucene.util.IOUtils.rm(IOUtils.java:323)
   [junit4]    > 	at java.lang.Thread.run(Thread.java:745)
   [junit4] Completed [442/612 (1!)] on J1 in 6.49s, 1 test, 1 error <<< FAILURES!

[...truncated 584 lines...]
BUILD FAILED
C:\Users\jenkins\workspace\Lucene-Solr-6.x-Windows\build.xml:740: The following error occurred while executing this line:
C:\Users\jenkins\workspace\Lucene-Solr-6.x-Windows\build.xml:684: The following error occurred while executing this line:
C:\Users\jenkins\workspace\Lucene-Solr-6.x-Windows\build.xml:59: The following error occurred while executing this line:
C:\Users\jenkins\workspace\Lucene-Solr-6.x-Windows\solr\build.xml:233: The following error occurred while executing this line:
C:\Users\jenkins\workspace\Lucene-Solr-6.x-Windows\solr\common-build.xml:531: The following error occurred while executing this line:
C:\Users\jenkins\workspace\Lucene-Solr-6.x-Windows\lucene\common-build.xml:1427: The following error occurred while executing this line:
C:\Users\jenkins\workspace\Lucene-Solr-6.x-Windows\lucene\common-build.xml:984: There were test failures: 612 suites (10 ignored), 2564 tests, 1 suite-level error, 124 ignored (80 assumptions) [seed: 38B919DD0AE428F5]

Total time: 79 minutes 32 seconds
Build step 'Invoke Ant' marked build as failure
Archiving artifacts
[WARNINGS] Skipping publisher since build result is FAILURE
Recording test results
Email was triggered for: Failure - Any
Sending email for trigger: Failure - Any



Mime
View raw message