lucene-dev mailing list archives

Site index · List index
Message view « Date » · « Thread »
Top « Date » · « Thread »
From Policeman Jenkins Server <jenk...@thetaphi.de>
Subject [JENKINS] Lucene-Solr-6.x-Solaris (64bit/jdk1.8.0) - Build # 211 - Still Failing!
Date Mon, 20 Jun 2016 22:45:56 GMT
Build: http://jenkins.thetaphi.de/job/Lucene-Solr-6.x-Solaris/211/
Java: 64bit/jdk1.8.0 -XX:-UseCompressedOops -XX:+UseConcMarkSweepGC

1 tests failed.
FAILED:  org.apache.solr.cloud.CustomCollectionTest.test

Error Message:
Error from server at http://127.0.0.1:57433: collection already exists: implicitcollwithShardField

Stack Trace:
org.apache.solr.client.solrj.impl.HttpSolrClient$RemoteSolrException: Error from server at http://127.0.0.1:57433: collection already exists: implicitcollwithShardField
	at __randomizedtesting.SeedInfo.seed([D2F15B8E2C84D2D6:5AA564548278BF2E]:0)
	at org.apache.solr.client.solrj.impl.HttpSolrClient.executeMethod(HttpSolrClient.java:590)
	at org.apache.solr.client.solrj.impl.HttpSolrClient.request(HttpSolrClient.java:259)
	at org.apache.solr.client.solrj.impl.HttpSolrClient.request(HttpSolrClient.java:248)
	at org.apache.solr.client.solrj.impl.LBHttpSolrClient.doRequest(LBHttpSolrClient.java:403)
	at org.apache.solr.client.solrj.impl.LBHttpSolrClient.request(LBHttpSolrClient.java:356)
	at org.apache.solr.client.solrj.impl.CloudSolrClient.sendRequest(CloudSolrClient.java:1228)
	at org.apache.solr.client.solrj.impl.CloudSolrClient.requestWithRetryOnStaleState(CloudSolrClient.java:998)
	at org.apache.solr.client.solrj.impl.CloudSolrClient.request(CloudSolrClient.java:934)
	at org.apache.solr.client.solrj.SolrClient.request(SolrClient.java:1219)
	at org.apache.solr.cloud.AbstractFullDistribZkTestBase.createCollection(AbstractFullDistribZkTestBase.java:1599)
	at org.apache.solr.cloud.AbstractFullDistribZkTestBase.createCollection(AbstractFullDistribZkTestBase.java:1553)
	at org.apache.solr.cloud.CustomCollectionTest.testCustomCollectionsAPI(CustomCollectionTest.java:285)
	at org.apache.solr.cloud.CustomCollectionTest.test(CustomCollectionTest.java:99)
	at sun.reflect.NativeMethodAccessorImpl.invoke0(Native Method)
	at sun.reflect.NativeMethodAccessorImpl.invoke(NativeMethodAccessorImpl.java:62)
	at sun.reflect.DelegatingMethodAccessorImpl.invoke(DelegatingMethodAccessorImpl.java:43)
	at java.lang.reflect.Method.invoke(Method.java:498)
	at com.carrotsearch.randomizedtesting.RandomizedRunner.invoke(RandomizedRunner.java:1764)
	at com.carrotsearch.randomizedtesting.RandomizedRunner$8.evaluate(RandomizedRunner.java:871)
	at com.carrotsearch.randomizedtesting.RandomizedRunner$9.evaluate(RandomizedRunner.java:907)
	at com.carrotsearch.randomizedtesting.RandomizedRunner$10.evaluate(RandomizedRunner.java:921)
	at org.apache.solr.BaseDistributedSearchTestCase$ShardsRepeatRule$ShardsFixedStatement.callStatement(BaseDistributedSearchTestCase.java:992)
	at org.apache.solr.BaseDistributedSearchTestCase$ShardsRepeatRule$ShardsStatement.evaluate(BaseDistributedSearchTestCase.java:967)
	at com.carrotsearch.randomizedtesting.rules.SystemPropertiesRestoreRule$1.evaluate(SystemPropertiesRestoreRule.java:57)
	at org.apache.lucene.util.TestRuleSetupTeardownChained$1.evaluate(TestRuleSetupTeardownChained.java:49)
	at org.apache.lucene.util.AbstractBeforeAfterRule$1.evaluate(AbstractBeforeAfterRule.java:45)
	at org.apache.lucene.util.TestRuleThreadAndTestName$1.evaluate(TestRuleThreadAndTestName.java:48)
	at org.apache.lucene.util.TestRuleIgnoreAfterMaxFailures$1.evaluate(TestRuleIgnoreAfterMaxFailures.java:64)
	at org.apache.lucene.util.TestRuleMarkFailure$1.evaluate(TestRuleMarkFailure.java:47)
	at com.carrotsearch.randomizedtesting.rules.StatementAdapter.evaluate(StatementAdapter.java:36)
	at com.carrotsearch.randomizedtesting.ThreadLeakControl$StatementRunner.run(ThreadLeakControl.java:367)
	at com.carrotsearch.randomizedtesting.ThreadLeakControl.forkTimeoutingTask(ThreadLeakControl.java:809)
	at com.carrotsearch.randomizedtesting.ThreadLeakControl$3.evaluate(ThreadLeakControl.java:460)
	at com.carrotsearch.randomizedtesting.RandomizedRunner.runSingleTest(RandomizedRunner.java:880)
	at com.carrotsearch.randomizedtesting.RandomizedRunner$5.evaluate(RandomizedRunner.java:781)
	at com.carrotsearch.randomizedtesting.RandomizedRunner$6.evaluate(RandomizedRunner.java:816)
	at com.carrotsearch.randomizedtesting.RandomizedRunner$7.evaluate(RandomizedRunner.java:827)
	at com.carrotsearch.randomizedtesting.rules.StatementAdapter.evaluate(StatementAdapter.java:36)
	at com.carrotsearch.randomizedtesting.rules.SystemPropertiesRestoreRule$1.evaluate(SystemPropertiesRestoreRule.java:57)
	at org.apache.lucene.util.AbstractBeforeAfterRule$1.evaluate(AbstractBeforeAfterRule.java:45)
	at com.carrotsearch.randomizedtesting.rules.StatementAdapter.evaluate(StatementAdapter.java:36)
	at org.apache.lucene.util.TestRuleStoreClassName$1.evaluate(TestRuleStoreClassName.java:41)
	at com.carrotsearch.randomizedtesting.rules.NoShadowingOrOverridesOnMethodsRule$1.evaluate(NoShadowingOrOverridesOnMethodsRule.java:40)
	at com.carrotsearch.randomizedtesting.rules.NoShadowingOrOverridesOnMethodsRule$1.evaluate(NoShadowingOrOverridesOnMethodsRule.java:40)
	at com.carrotsearch.randomizedtesting.rules.StatementAdapter.evaluate(StatementAdapter.java:36)
	at com.carrotsearch.randomizedtesting.rules.StatementAdapter.evaluate(StatementAdapter.java:36)
	at com.carrotsearch.randomizedtesting.rules.StatementAdapter.evaluate(StatementAdapter.java:36)
	at org.apache.lucene.util.TestRuleAssertionsRequired$1.evaluate(TestRuleAssertionsRequired.java:53)
	at org.apache.lucene.util.TestRuleMarkFailure$1.evaluate(TestRuleMarkFailure.java:47)
	at org.apache.lucene.util.TestRuleIgnoreAfterMaxFailures$1.evaluate(TestRuleIgnoreAfterMaxFailures.java:64)
	at org.apache.lucene.util.TestRuleIgnoreTestSuites$1.evaluate(TestRuleIgnoreTestSuites.java:54)
	at com.carrotsearch.randomizedtesting.rules.StatementAdapter.evaluate(StatementAdapter.java:36)
	at com.carrotsearch.randomizedtesting.ThreadLeakControl$StatementRunner.run(ThreadLeakControl.java:367)
	at java.lang.Thread.run(Thread.java:745)




Build Log:
[...truncated 11981 lines...]
   [junit4] Suite: org.apache.solr.cloud.CustomCollectionTest
   [junit4]   2> Creating dataDir: /export/home/jenkins/workspace/Lucene-Solr-6.x-Solaris/solr/build/solr-core/test/J0/temp/solr.cloud.CustomCollectionTest_D2F15B8E2C84D2D6-001/init-core-data-001
   [junit4]   2> 2167903 INFO  (SUITE-CustomCollectionTest-seed#[D2F15B8E2C84D2D6]-worker) [    ] o.a.s.SolrTestCaseJ4 Randomized ssl (false) and clientAuth (false) via: @org.apache.solr.SolrTestCaseJ4$SuppressSSL(bugUrl=https://issues.apache.org/jira/browse/SOLR-5776)
   [junit4]   2> 2167903 INFO  (SUITE-CustomCollectionTest-seed#[D2F15B8E2C84D2D6]-worker) [    ] o.a.s.BaseDistributedSearchTestCase Setting hostContext system property: /
   [junit4]   2> 2167906 INFO  (TEST-CustomCollectionTest.test-seed#[D2F15B8E2C84D2D6]) [    ] o.a.s.c.ZkTestServer STARTING ZK TEST SERVER
   [junit4]   2> 2167906 INFO  (Thread-8735) [    ] o.a.s.c.ZkTestServer client port:0.0.0.0/0.0.0.0:0
   [junit4]   2> 2167906 INFO  (Thread-8735) [    ] o.a.s.c.ZkTestServer Starting server
   [junit4]   2> 2168008 INFO  (TEST-CustomCollectionTest.test-seed#[D2F15B8E2C84D2D6]) [    ] o.a.s.c.ZkTestServer start zk server on port:42550
   [junit4]   2> 2168008 INFO  (TEST-CustomCollectionTest.test-seed#[D2F15B8E2C84D2D6]) [    ] o.a.s.c.c.SolrZkClient Using default ZkCredentialsProvider
   [junit4]   2> 2168008 INFO  (TEST-CustomCollectionTest.test-seed#[D2F15B8E2C84D2D6]) [    ] o.a.s.c.c.ConnectionManager Waiting for client to connect to ZooKeeper
   [junit4]   2> 2168010 INFO  (zkCallback-2531-thread-1) [    ] o.a.s.c.c.ConnectionManager Watcher org.apache.solr.common.cloud.ConnectionManager@5bcf7e52 name:ZooKeeperConnection Watcher:127.0.0.1:42550 got event WatchedEvent state:SyncConnected type:None path:null path:null type:None
   [junit4]   2> 2168011 INFO  (TEST-CustomCollectionTest.test-seed#[D2F15B8E2C84D2D6]) [    ] o.a.s.c.c.ConnectionManager Client is connected to ZooKeeper
   [junit4]   2> 2168011 INFO  (TEST-CustomCollectionTest.test-seed#[D2F15B8E2C84D2D6]) [    ] o.a.s.c.c.SolrZkClient Using default ZkACLProvider
   [junit4]   2> 2168011 INFO  (TEST-CustomCollectionTest.test-seed#[D2F15B8E2C84D2D6]) [    ] o.a.s.c.c.SolrZkClient makePath: /solr
   [junit4]   2> 2168015 INFO  (TEST-CustomCollectionTest.test-seed#[D2F15B8E2C84D2D6]) [    ] o.a.s.c.c.SolrZkClient Using default ZkCredentialsProvider
   [junit4]   2> 2168015 INFO  (TEST-CustomCollectionTest.test-seed#[D2F15B8E2C84D2D6]) [    ] o.a.s.c.c.ConnectionManager Waiting for client to connect to ZooKeeper
   [junit4]   2> 2168016 INFO  (zkCallback-2532-thread-1) [    ] o.a.s.c.c.ConnectionManager Watcher org.apache.solr.common.cloud.ConnectionManager@28523b5e name:ZooKeeperConnection Watcher:127.0.0.1:42550/solr got event WatchedEvent state:SyncConnected type:None path:null path:null type:None
   [junit4]   2> 2168016 INFO  (TEST-CustomCollectionTest.test-seed#[D2F15B8E2C84D2D6]) [    ] o.a.s.c.c.ConnectionManager Client is connected to ZooKeeper
   [junit4]   2> 2168016 INFO  (TEST-CustomCollectionTest.test-seed#[D2F15B8E2C84D2D6]) [    ] o.a.s.c.c.SolrZkClient Using default ZkACLProvider
   [junit4]   2> 2168016 INFO  (TEST-CustomCollectionTest.test-seed#[D2F15B8E2C84D2D6]) [    ] o.a.s.c.c.SolrZkClient makePath: /collections/collection1
   [junit4]   2> 2168019 INFO  (TEST-CustomCollectionTest.test-seed#[D2F15B8E2C84D2D6]) [    ] o.a.s.c.c.SolrZkClient makePath: /collections/collection1/shards
   [junit4]   2> 2168021 INFO  (TEST-CustomCollectionTest.test-seed#[D2F15B8E2C84D2D6]) [    ] o.a.s.c.c.SolrZkClient makePath: /collections/control_collection
   [junit4]   2> 2168024 INFO  (TEST-CustomCollectionTest.test-seed#[D2F15B8E2C84D2D6]) [    ] o.a.s.c.c.SolrZkClient makePath: /collections/control_collection/shards
   [junit4]   2> 2168026 INFO  (TEST-CustomCollectionTest.test-seed#[D2F15B8E2C84D2D6]) [    ] o.a.s.c.AbstractZkTestCase put /export/home/jenkins/workspace/Lucene-Solr-6.x-Solaris/solr/core/src/test-files/solr/collection1/conf/solrconfig-tlog.xml to /configs/conf1/solrconfig.xml
   [junit4]   2> 2168026 INFO  (TEST-CustomCollectionTest.test-seed#[D2F15B8E2C84D2D6]) [    ] o.a.s.c.c.SolrZkClient makePath: /configs/conf1/solrconfig.xml
   [junit4]   2> 2168029 INFO  (TEST-CustomCollectionTest.test-seed#[D2F15B8E2C84D2D6]) [    ] o.a.s.c.AbstractZkTestCase put /export/home/jenkins/workspace/Lucene-Solr-6.x-Solaris/solr/core/src/test-files/solr/collection1/conf/schema.xml to /configs/conf1/schema.xml
   [junit4]   2> 2168030 INFO  (TEST-CustomCollectionTest.test-seed#[D2F15B8E2C84D2D6]) [    ] o.a.s.c.c.SolrZkClient makePath: /configs/conf1/schema.xml
   [junit4]   2> 2168032 INFO  (TEST-CustomCollectionTest.test-seed#[D2F15B8E2C84D2D6]) [    ] o.a.s.c.AbstractZkTestCase put /export/home/jenkins/workspace/Lucene-Solr-6.x-Solaris/solr/core/src/test-files/solr/collection1/conf/solrconfig.snippet.randomindexconfig.xml to /configs/conf1/solrconfig.snippet.randomindexconfig.xml
   [junit4]   2> 2168032 INFO  (TEST-CustomCollectionTest.test-seed#[D2F15B8E2C84D2D6]) [    ] o.a.s.c.c.SolrZkClient makePath: /configs/conf1/solrconfig.snippet.randomindexconfig.xml
   [junit4]   2> 2168035 INFO  (TEST-CustomCollectionTest.test-seed#[D2F15B8E2C84D2D6]) [    ] o.a.s.c.AbstractZkTestCase put /export/home/jenkins/workspace/Lucene-Solr-6.x-Solaris/solr/core/src/test-files/solr/collection1/conf/stopwords.txt to /configs/conf1/stopwords.txt
   [junit4]   2> 2168035 INFO  (TEST-CustomCollectionTest.test-seed#[D2F15B8E2C84D2D6]) [    ] o.a.s.c.c.SolrZkClient makePath: /configs/conf1/stopwords.txt
   [junit4]   2> 2168037 INFO  (TEST-CustomCollectionTest.test-seed#[D2F15B8E2C84D2D6]) [    ] o.a.s.c.AbstractZkTestCase put /export/home/jenkins/workspace/Lucene-Solr-6.x-Solaris/solr/core/src/test-files/solr/collection1/conf/protwords.txt to /configs/conf1/protwords.txt
   [junit4]   2> 2168038 INFO  (TEST-CustomCollectionTest.test-seed#[D2F15B8E2C84D2D6]) [    ] o.a.s.c.c.SolrZkClient makePath: /configs/conf1/protwords.txt
   [junit4]   2> 2168040 INFO  (TEST-CustomCollectionTest.test-seed#[D2F15B8E2C84D2D6]) [    ] o.a.s.c.AbstractZkTestCase put /export/home/jenkins/workspace/Lucene-Solr-6.x-Solaris/solr/core/src/test-files/solr/collection1/conf/currency.xml to /configs/conf1/currency.xml
   [junit4]   2> 2168040 INFO  (TEST-CustomCollectionTest.test-seed#[D2F15B8E2C84D2D6]) [    ] o.a.s.c.c.SolrZkClient makePath: /configs/conf1/currency.xml
   [junit4]   2> 2168042 INFO  (TEST-CustomCollectionTest.test-seed#[D2F15B8E2C84D2D6]) [    ] o.a.s.c.AbstractZkTestCase put /export/home/jenkins/workspace/Lucene-Solr-6.x-Solaris/solr/core/src/test-files/solr/collection1/conf/enumsConfig.xml to /configs/conf1/enumsConfig.xml
   [junit4]   2> 2168043 INFO  (TEST-CustomCollectionTest.test-seed#[D2F15B8E2C84D2D6]) [    ] o.a.s.c.c.SolrZkClient makePath: /configs/conf1/enumsConfig.xml
   [junit4]   2> 2168045 INFO  (TEST-CustomCollectionTest.test-seed#[D2F15B8E2C84D2D6]) [    ] o.a.s.c.AbstractZkTestCase put /export/home/jenkins/workspace/Lucene-Solr-6.x-Solaris/solr/core/src/test-files/solr/collection1/conf/open-exchange-rates.json to /configs/conf1/open-exchange-rates.json
   [junit4]   2> 2168045 INFO  (TEST-CustomCollectionTest.test-seed#[D2F15B8E2C84D2D6]) [    ] o.a.s.c.c.SolrZkClient makePath: /configs/conf1/open-exchange-rates.json
   [junit4]   2> 2168048 INFO  (TEST-CustomCollectionTest.test-seed#[D2F15B8E2C84D2D6]) [    ] o.a.s.c.AbstractZkTestCase put /export/home/jenkins/workspace/Lucene-Solr-6.x-Solaris/solr/core/src/test-files/solr/collection1/conf/mapping-ISOLatin1Accent.txt to /configs/conf1/mapping-ISOLatin1Accent.txt
   [junit4]   2> 2168048 INFO  (TEST-CustomCollectionTest.test-seed#[D2F15B8E2C84D2D6]) [    ] o.a.s.c.c.SolrZkClient makePath: /configs/conf1/mapping-ISOLatin1Accent.txt
   [junit4]   2> 2168050 INFO  (TEST-CustomCollectionTest.test-seed#[D2F15B8E2C84D2D6]) [    ] o.a.s.c.AbstractZkTestCase put /export/home/jenkins/workspace/Lucene-Solr-6.x-Solaris/solr/core/src/test-files/solr/collection1/conf/old_synonyms.txt to /configs/conf1/old_synonyms.txt
   [junit4]   2> 2168050 INFO  (TEST-CustomCollectionTest.test-seed#[D2F15B8E2C84D2D6]) [    ] o.a.s.c.c.SolrZkClient makePath: /configs/conf1/old_synonyms.txt
   [junit4]   2> 2168052 INFO  (TEST-CustomCollectionTest.test-seed#[D2F15B8E2C84D2D6]) [    ] o.a.s.c.AbstractZkTestCase put /export/home/jenkins/workspace/Lucene-Solr-6.x-Solaris/solr/core/src/test-files/solr/collection1/conf/synonyms.txt to /configs/conf1/synonyms.txt
   [junit4]   2> 2168053 INFO  (TEST-CustomCollectionTest.test-seed#[D2F15B8E2C84D2D6]) [    ] o.a.s.c.c.SolrZkClient makePath: /configs/conf1/synonyms.txt
   [junit4]   2> 2168265 INFO  (TEST-CustomCollectionTest.test-seed#[D2F15B8E2C84D2D6]) [    ] o.a.s.SolrTestCaseJ4 Writing core.properties file to /export/home/jenkins/workspace/Lucene-Solr-6.x-Solaris/solr/build/solr-core/test/J0/temp/solr.cloud.CustomCollectionTest_D2F15B8E2C84D2D6-001/control-001/cores/collection1
   [junit4]   2> 2168267 INFO  (TEST-CustomCollectionTest.test-seed#[D2F15B8E2C84D2D6]) [    ] o.e.j.s.Server jetty-9.3.8.v20160314
   [junit4]   2> 2168268 INFO  (TEST-CustomCollectionTest.test-seed#[D2F15B8E2C84D2D6]) [    ] o.e.j.s.h.ContextHandler Started o.e.j.s.ServletContextHandler@2061ed21{/,null,AVAILABLE}
   [junit4]   2> 2168271 INFO  (TEST-CustomCollectionTest.test-seed#[D2F15B8E2C84D2D6]) [    ] o.e.j.s.ServerConnector Started ServerConnector@76ab9f45{HTTP/1.1,[http/1.1]}{127.0.0.1:38716}
   [junit4]   2> 2168271 INFO  (TEST-CustomCollectionTest.test-seed#[D2F15B8E2C84D2D6]) [    ] o.e.j.s.Server Started @2173343ms
   [junit4]   2> 2168271 INFO  (TEST-CustomCollectionTest.test-seed#[D2F15B8E2C84D2D6]) [    ] o.a.s.c.s.e.JettySolrRunner Jetty properties: {solr.data.dir=/export/home/jenkins/workspace/Lucene-Solr-6.x-Solaris/solr/build/solr-core/test/J0/temp/solr.cloud.CustomCollectionTest_D2F15B8E2C84D2D6-001/tempDir-001/control/data, hostContext=/, hostPort=38716, coreRootDirectory=/export/home/jenkins/workspace/Lucene-Solr-6.x-Solaris/solr/build/solr-core/test/J0/../../../../../../../../../../export/home/jenkins/workspace/Lucene-Solr-6.x-Solaris/solr/build/solr-core/test/J0/temp/solr.cloud.CustomCollectionTest_D2F15B8E2C84D2D6-001/control-001/cores}
   [junit4]   2> 2168271 INFO  (TEST-CustomCollectionTest.test-seed#[D2F15B8E2C84D2D6]) [    ] o.a.s.s.SolrDispatchFilter SolrDispatchFilter.init(): sun.misc.Launcher$AppClassLoader@6d06d69c
   [junit4]   2> 2168271 INFO  (TEST-CustomCollectionTest.test-seed#[D2F15B8E2C84D2D6]) [    ] o.a.s.c.SolrResourceLoader new SolrResourceLoader for directory: '/export/home/jenkins/workspace/Lucene-Solr-6.x-Solaris/solr/build/solr-core/test/J0/temp/solr.cloud.CustomCollectionTest_D2F15B8E2C84D2D6-001/control-001'
   [junit4]   2> 2168271 INFO  (TEST-CustomCollectionTest.test-seed#[D2F15B8E2C84D2D6]) [    ] o.a.s.c.SolrResourceLoader JNDI not configured for solr (NoInitialContextEx)
   [junit4]   2> 2168271 INFO  (TEST-CustomCollectionTest.test-seed#[D2F15B8E2C84D2D6]) [    ] o.a.s.c.SolrResourceLoader solr home defaulted to 'solr/' (could not find system property or JNDI)
   [junit4]   2> 2168271 INFO  (TEST-CustomCollectionTest.test-seed#[D2F15B8E2C84D2D6]) [    ] o.a.s.c.c.SolrZkClient Using default ZkCredentialsProvider
   [junit4]   2> 2168272 INFO  (TEST-CustomCollectionTest.test-seed#[D2F15B8E2C84D2D6]) [    ] o.a.s.c.c.ConnectionManager Waiting for client to connect to ZooKeeper
   [junit4]   2> 2168273 INFO  (zkCallback-2533-thread-1) [    ] o.a.s.c.c.ConnectionManager Watcher org.apache.solr.common.cloud.ConnectionManager@800246f name:ZooKeeperConnection Watcher:127.0.0.1:42550/solr got event WatchedEvent state:SyncConnected type:None path:null path:null type:None
   [junit4]   2> 2168273 INFO  (TEST-CustomCollectionTest.test-seed#[D2F15B8E2C84D2D6]) [    ] o.a.s.c.c.ConnectionManager Client is connected to ZooKeeper
   [junit4]   2> 2168274 INFO  (TEST-CustomCollectionTest.test-seed#[D2F15B8E2C84D2D6]) [    ] o.a.s.c.c.SolrZkClient Using default ZkACLProvider
   [junit4]   2> 2168275 INFO  (TEST-CustomCollectionTest.test-seed#[D2F15B8E2C84D2D6]) [    ] o.a.s.s.SolrDispatchFilter Loading solr.xml from SolrHome (not found in ZooKeeper)
   [junit4]   2> 2168275 INFO  (TEST-CustomCollectionTest.test-seed#[D2F15B8E2C84D2D6]) [    ] o.a.s.c.SolrXmlConfig Loading container configuration from /export/home/jenkins/workspace/Lucene-Solr-6.x-Solaris/solr/build/solr-core/test/J0/temp/solr.cloud.CustomCollectionTest_D2F15B8E2C84D2D6-001/control-001/solr.xml
   [junit4]   2> 2168279 INFO  (TEST-CustomCollectionTest.test-seed#[D2F15B8E2C84D2D6]) [    ] o.a.s.c.CorePropertiesLocator Config-defined core root directory: /export/home/jenkins/workspace/Lucene-Solr-6.x-Solaris/solr/build/solr-core/test/J0/../../../../../../../../../../export/home/jenkins/workspace/Lucene-Solr-6.x-Solaris/solr/build/solr-core/test/J0/temp/solr.cloud.CustomCollectionTest_D2F15B8E2C84D2D6-001/control-001/cores
   [junit4]   2> 2168279 INFO  (TEST-CustomCollectionTest.test-seed#[D2F15B8E2C84D2D6]) [    ] o.a.s.c.CoreContainer New CoreContainer 983589652
   [junit4]   2> 2168279 INFO  (TEST-CustomCollectionTest.test-seed#[D2F15B8E2C84D2D6]) [    ] o.a.s.c.CoreContainer Loading cores into CoreContainer [instanceDir=/export/home/jenkins/workspace/Lucene-Solr-6.x-Solaris/solr/build/solr-core/test/J0/temp/solr.cloud.CustomCollectionTest_D2F15B8E2C84D2D6-001/control-001]
   [junit4]   2> 2168279 WARN  (TEST-CustomCollectionTest.test-seed#[D2F15B8E2C84D2D6]) [    ] o.a.s.c.CoreContainer Couldn't add files from /export/home/jenkins/workspace/Lucene-Solr-6.x-Solaris/solr/build/solr-core/test/J0/temp/solr.cloud.CustomCollectionTest_D2F15B8E2C84D2D6-001/control-001/lib to classpath: /export/home/jenkins/workspace/Lucene-Solr-6.x-Solaris/solr/build/solr-core/test/J0/temp/solr.cloud.CustomCollectionTest_D2F15B8E2C84D2D6-001/control-001/lib
   [junit4]   2> 2168280 INFO  (TEST-CustomCollectionTest.test-seed#[D2F15B8E2C84D2D6]) [    ] o.a.s.h.c.HttpShardHandlerFactory created with socketTimeout : 90000,urlScheme : ,connTimeout : 15000,maxConnectionsPerHost : 20,maxConnections : 10000,corePoolSize : 0,maximumPoolSize : 2147483647,maxThreadIdleTime : 5,sizeOfQueue : -1,fairnessPolicy : false,useRetries : false,
   [junit4]   2> 2168281 INFO  (TEST-CustomCollectionTest.test-seed#[D2F15B8E2C84D2D6]) [    ] o.a.s.u.UpdateShardHandler Creating UpdateShardHandler HTTP client with params: socketTimeout=340000&connTimeout=45000&retry=true
   [junit4]   2> 2168281 INFO  (TEST-CustomCollectionTest.test-seed#[D2F15B8E2C84D2D6]) [    ] o.a.s.l.LogWatcher SLF4J impl is org.slf4j.impl.Log4jLoggerFactory
   [junit4]   2> 2168281 INFO  (TEST-CustomCollectionTest.test-seed#[D2F15B8E2C84D2D6]) [    ] o.a.s.l.LogWatcher Registering Log Listener [Log4j (org.slf4j.impl.Log4jLoggerFactory)]
   [junit4]   2> 2168281 INFO  (TEST-CustomCollectionTest.test-seed#[D2F15B8E2C84D2D6]) [    ] o.a.s.c.ZkContainer Zookeeper client=127.0.0.1:42550/solr
   [junit4]   2> 2168281 INFO  (TEST-CustomCollectionTest.test-seed#[D2F15B8E2C84D2D6]) [    ] o.a.s.c.ZkController zkHost includes chroot
   [junit4]   2> 2168281 INFO  (TEST-CustomCollectionTest.test-seed#[D2F15B8E2C84D2D6]) [    ] o.a.s.c.c.SolrZkClient Using default ZkCredentialsProvider
   [junit4]   2> 2168282 INFO  (TEST-CustomCollectionTest.test-seed#[D2F15B8E2C84D2D6]) [    ] o.a.s.c.c.ConnectionManager Waiting for client to connect to ZooKeeper
   [junit4]   2> 2168283 INFO  (zkCallback-2536-thread-1) [    ] o.a.s.c.c.ConnectionManager Watcher org.apache.solr.common.cloud.ConnectionManager@21b9ccb7 name:ZooKeeperConnection Watcher:127.0.0.1:42550 got event WatchedEvent state:SyncConnected type:None path:null path:null type:None
   [junit4]   2> 2168284 INFO  (TEST-CustomCollectionTest.test-seed#[D2F15B8E2C84D2D6]) [    ] o.a.s.c.c.ConnectionManager Client is connected to ZooKeeper
   [junit4]   2> 2168285 INFO  (TEST-CustomCollectionTest.test-seed#[D2F15B8E2C84D2D6]) [    ] o.a.s.c.c.SolrZkClient Using default ZkACLProvider
   [junit4]   2> 2168287 INFO  (TEST-CustomCollectionTest.test-seed#[D2F15B8E2C84D2D6]) [n:127.0.0.1:38716_    ] o.a.s.c.ZkController Added new OnReconnect listener org.apache.solr.cloud.ZkController$$Lambda$62/1471472280@59128cbe
   [junit4]   2> 2168287 INFO  (TEST-CustomCollectionTest.test-seed#[D2F15B8E2C84D2D6]) [n:127.0.0.1:38716_    ] o.a.s.c.c.ConnectionManager Waiting for client to connect to ZooKeeper
   [junit4]   2> 2168288 INFO  (zkCallback-2537-thread-1-processing-n:127.0.0.1:38716_) [n:127.0.0.1:38716_    ] o.a.s.c.c.ConnectionManager Watcher org.apache.solr.common.cloud.ConnectionManager@73ebc645 name:ZooKeeperConnection Watcher:127.0.0.1:42550/solr got event WatchedEvent state:SyncConnected type:None path:null path:null type:None
   [junit4]   2> 2168289 INFO  (TEST-CustomCollectionTest.test-seed#[D2F15B8E2C84D2D6]) [n:127.0.0.1:38716_    ] o.a.s.c.c.ConnectionManager Client is connected to ZooKeeper
   [junit4]   2> 2168291 INFO  (TEST-CustomCollectionTest.test-seed#[D2F15B8E2C84D2D6]) [n:127.0.0.1:38716_    ] o.a.s.c.c.SolrZkClient makePath: /overseer/queue
   [junit4]   2> 2168294 INFO  (TEST-CustomCollectionTest.test-seed#[D2F15B8E2C84D2D6]) [n:127.0.0.1:38716_    ] o.a.s.c.c.SolrZkClient makePath: /overseer/collection-queue-work
   [junit4]   2> 2168299 INFO  (TEST-CustomCollectionTest.test-seed#[D2F15B8E2C84D2D6]) [n:127.0.0.1:38716_    ] o.a.s.c.c.SolrZkClient makePath: /overseer/collection-map-running
   [junit4]   2> 2168301 INFO  (TEST-CustomCollectionTest.test-seed#[D2F15B8E2C84D2D6]) [n:127.0.0.1:38716_    ] o.a.s.c.c.SolrZkClient makePath: /overseer/collection-map-completed
   [junit4]   2> 2168304 INFO  (TEST-CustomCollectionTest.test-seed#[D2F15B8E2C84D2D6]) [n:127.0.0.1:38716_    ] o.a.s.c.c.SolrZkClient makePath: /overseer/collection-map-failure
   [junit4]   2> 2168306 INFO  (TEST-CustomCollectionTest.test-seed#[D2F15B8E2C84D2D6]) [n:127.0.0.1:38716_    ] o.a.s.c.c.SolrZkClient makePath: /live_nodes
   [junit4]   2> 2168308 INFO  (TEST-CustomCollectionTest.test-seed#[D2F15B8E2C84D2D6]) [n:127.0.0.1:38716_    ] o.a.s.c.c.SolrZkClient makePath: /aliases.json
   [junit4]   2> 2168310 INFO  (TEST-CustomCollectionTest.test-seed#[D2F15B8E2C84D2D6]) [n:127.0.0.1:38716_    ] o.a.s.c.c.SolrZkClient makePath: /clusterstate.json
   [junit4]   2> 2168312 INFO  (TEST-CustomCollectionTest.test-seed#[D2F15B8E2C84D2D6]) [n:127.0.0.1:38716_    ] o.a.s.c.c.SolrZkClient makePath: /security.json
   [junit4]   2> 2168313 INFO  (TEST-CustomCollectionTest.test-seed#[D2F15B8E2C84D2D6]) [n:127.0.0.1:38716_    ] o.a.s.c.c.ZkStateReader Updating cluster state from ZooKeeper... 
   [junit4]   2> 2168314 INFO  (TEST-CustomCollectionTest.test-seed#[D2F15B8E2C84D2D6]) [n:127.0.0.1:38716_    ] o.a.s.c.c.ZkStateReader Loaded empty cluster properties
   [junit4]   2> 2168315 INFO  (TEST-CustomCollectionTest.test-seed#[D2F15B8E2C84D2D6]) [n:127.0.0.1:38716_    ] o.a.s.c.c.ZkStateReader Updated live nodes from ZooKeeper... (0) -> (0)
   [junit4]   2> 2168318 INFO  (TEST-CustomCollectionTest.test-seed#[D2F15B8E2C84D2D6]) [n:127.0.0.1:38716_    ] o.a.s.c.c.SolrZkClient makePath: /overseer_elect
   [junit4]   2> 2168320 INFO  (TEST-CustomCollectionTest.test-seed#[D2F15B8E2C84D2D6]) [n:127.0.0.1:38716_    ] o.a.s.c.c.SolrZkClient makePath: /overseer_elect/election
   [junit4]   2> 2168322 INFO  (TEST-CustomCollectionTest.test-seed#[D2F15B8E2C84D2D6]) [n:127.0.0.1:38716_    ] o.a.s.c.Overseer Overseer (id=null) closing
   [junit4]   2> 2168322 INFO  (TEST-CustomCollectionTest.test-seed#[D2F15B8E2C84D2D6]) [n:127.0.0.1:38716_    ] o.a.s.c.LeaderElector Joined leadership election with path: /overseer_elect/election/96106016236961796-127.0.0.1:38716_-n_0000000000
   [junit4]   2> 2168323 INFO  (TEST-CustomCollectionTest.test-seed#[D2F15B8E2C84D2D6]) [n:127.0.0.1:38716_    ] o.a.s.c.OverseerElectionContext I am going to be the leader 127.0.0.1:38716_
   [junit4]   2> 2168323 INFO  (TEST-CustomCollectionTest.test-seed#[D2F15B8E2C84D2D6]) [n:127.0.0.1:38716_    ] o.a.s.c.c.SolrZkClient makePath: /overseer_elect/leader
   [junit4]   2> 2168325 INFO  (TEST-CustomCollectionTest.test-seed#[D2F15B8E2C84D2D6]) [n:127.0.0.1:38716_    ] o.a.s.c.Overseer Overseer (id=96106016236961796-127.0.0.1:38716_-n_0000000000) starting
   [junit4]   2> 2168327 INFO  (TEST-CustomCollectionTest.test-seed#[D2F15B8E2C84D2D6]) [n:127.0.0.1:38716_    ] o.a.s.c.c.SolrZkClient makePath: /overseer/queue-work
   [junit4]   2> 2168336 INFO  (TEST-CustomCollectionTest.test-seed#[D2F15B8E2C84D2D6]) [n:127.0.0.1:38716_    ] o.a.s.c.OverseerAutoReplicaFailoverThread Starting OverseerAutoReplicaFailoverThread autoReplicaFailoverWorkLoopDelay=10000 autoReplicaFailoverWaitAfterExpiration=10000 autoReplicaFailoverBadNodeExpiration=60000
   [junit4]   2> 2168336 INFO  (OverseerStateUpdate-96106016236961796-127.0.0.1:38716_-n_0000000000) [n:127.0.0.1:38716_    ] o.a.s.c.Overseer Starting to work on the main queue
   [junit4]   2> 2168337 INFO  (OverseerCollectionConfigSetProcessor-96106016236961796-127.0.0.1:38716_-n_0000000000) [n:127.0.0.1:38716_    ] o.a.s.c.OverseerTaskProcessor Process current queue of overseer operations
   [junit4]   2> 2168337 INFO  (TEST-CustomCollectionTest.test-seed#[D2F15B8E2C84D2D6]) [n:127.0.0.1:38716_    ] o.a.s.c.ZkController Register node as live in ZooKeeper:/live_nodes/127.0.0.1:38716_
   [junit4]   2> 2168338 INFO  (TEST-CustomCollectionTest.test-seed#[D2F15B8E2C84D2D6]) [n:127.0.0.1:38716_    ] o.a.s.c.c.SolrZkClient makePath: /live_nodes/127.0.0.1:38716_
   [junit4]   2> 2168340 INFO  (OverseerStateUpdate-96106016236961796-127.0.0.1:38716_-n_0000000000) [n:127.0.0.1:38716_    ] o.a.s.c.c.ZkStateReader Updated live nodes from ZooKeeper... (0) -> (0)
   [junit4]   2> 2168340 INFO  (zkCallback-2537-thread-1-processing-n:127.0.0.1:38716_) [n:127.0.0.1:38716_    ] o.a.s.c.c.ZkStateReader A live node change: [WatchedEvent state:SyncConnected type:NodeChildrenChanged path:/live_nodes], has occurred - updating... (live nodes size: [0])
   [junit4]   2> 2168341 INFO  (zkCallback-2537-thread-1-processing-n:127.0.0.1:38716_) [n:127.0.0.1:38716_    ] o.a.s.c.c.ZkStateReader Updated live nodes from ZooKeeper... (0) -> (1)
   [junit4]   2> 2168375 INFO  (TEST-CustomCollectionTest.test-seed#[D2F15B8E2C84D2D6]) [n:127.0.0.1:38716_    ] o.a.s.c.CoreContainer Security conf doesn't exist. Skipping setup for authorization module.
   [junit4]   2> 2168375 INFO  (TEST-CustomCollectionTest.test-seed#[D2F15B8E2C84D2D6]) [n:127.0.0.1:38716_    ] o.a.s.c.CoreContainer No authentication plugin used.
   [junit4]   2> 2168376 INFO  (TEST-CustomCollectionTest.test-seed#[D2F15B8E2C84D2D6]) [n:127.0.0.1:38716_    ] o.a.s.c.CorePropertiesLocator Looking for core definitions underneath /export/home/jenkins/workspace/Lucene-Solr-6.x-Solaris/solr/build/solr-core/test/J0/../../../../../../../../../../export/home/jenkins/workspace/Lucene-Solr-6.x-Solaris/solr/build/solr-core/test/J0/temp/solr.cloud.CustomCollectionTest_D2F15B8E2C84D2D6-001/control-001/cores
   [junit4]   2> 2168377 INFO  (TEST-CustomCollectionTest.test-seed#[D2F15B8E2C84D2D6]) [n:127.0.0.1:38716_    ] o.a.s.c.CoreDescriptor Created CoreDescriptor: {name=collection1, config=solrconfig.xml, transient=false, schema=schema.xml, loadOnStartup=true, configSetProperties=configsetprops.json, collection=control_collection, coreNodeName=, dataDir=data/, shard=}
   [junit4]   2> 2168377 INFO  (TEST-CustomCollectionTest.test-seed#[D2F15B8E2C84D2D6]) [n:127.0.0.1:38716_    ] o.a.s.c.CorePropertiesLocator Found core collection1 in /export/home/jenkins/workspace/Lucene-Solr-6.x-Solaris/solr/build/solr-core/test/J0/../../../../../../../../../../export/home/jenkins/workspace/Lucene-Solr-6.x-Solaris/solr/build/solr-core/test/J0/temp/solr.cloud.CustomCollectionTest_D2F15B8E2C84D2D6-001/control-001/cores/collection1
   [junit4]   2> 2168377 INFO  (TEST-CustomCollectionTest.test-seed#[D2F15B8E2C84D2D6]) [n:127.0.0.1:38716_    ] o.a.s.c.CorePropertiesLocator Found 1 core definitions
   [junit4]   2> 2168378 INFO  (TEST-CustomCollectionTest.test-seed#[D2F15B8E2C84D2D6]) [n:127.0.0.1:38716_    ] o.a.s.s.SolrDispatchFilter user.dir=/export/home/jenkins/workspace/Lucene-Solr-6.x-Solaris/solr/build/solr-core/test/J0
   [junit4]   2> 2168378 INFO  (TEST-CustomCollectionTest.test-seed#[D2F15B8E2C84D2D6]) [n:127.0.0.1:38716_    ] o.a.s.s.SolrDispatchFilter SolrDispatchFilter.init() done
   [junit4]   2> 2168379 INFO  (coreLoadExecutor-6578-thread-1-processing-n:127.0.0.1:38716_) [n:127.0.0.1:38716_ c:control_collection   x:collection1] o.a.s.c.ZkController publishing state=down
   [junit4]   2> 2168379 INFO  (coreLoadExecutor-6578-thread-1-processing-n:127.0.0.1:38716_) [n:127.0.0.1:38716_ c:control_collection   x:collection1] o.a.s.c.ZkController numShards not found on descriptor - reading it from system property
   [junit4]   2> 2168380 INFO  (coreLoadExecutor-6578-thread-1-processing-n:127.0.0.1:38716_) [n:127.0.0.1:38716_ c:control_collection   x:collection1] o.a.s.c.ZkController Collection control_collection not visible yet, but flagging it so a watch is registered when it becomes visible
   [junit4]   2> 2168380 INFO  (OverseerStateUpdate-96106016236961796-127.0.0.1:38716_-n_0000000000) [n:127.0.0.1:38716_    ] o.a.s.c.Overseer processMessage: queueSize: 1, message = {
   [junit4]   2>   "core":"collection1",
   [junit4]   2>   "roles":null,
   [junit4]   2>   "base_url":"http://127.0.0.1:38716",
   [junit4]   2>   "node_name":"127.0.0.1:38716_",
   [junit4]   2>   "numShards":"1",
   [junit4]   2>   "state":"down",
   [junit4]   2>   "shard":null,
   [junit4]   2>   "collection":"control_collection",
   [junit4]   2>   "operation":"state"} current state version: 0
   [junit4]   2> 2168381 INFO  (OverseerStateUpdate-96106016236961796-127.0.0.1:38716_-n_0000000000) [n:127.0.0.1:38716_    ] o.a.s.c.o.ReplicaMutator Update state numShards=1 message={
   [junit4]   2>   "core":"collection1",
   [junit4]   2>   "roles":null,
   [junit4]   2>   "base_url":"http://127.0.0.1:38716",
   [junit4]   2>   "node_name":"127.0.0.1:38716_",
   [junit4]   2>   "numShards":"1",
   [junit4]   2>   "state":"down",
   [junit4]   2>   "shard":null,
   [junit4]   2>   "collection":"control_collection",
   [junit4]   2>   "operation":"state"}
   [junit4]   2> 2168381 INFO  (coreLoadExecutor-6578-thread-1-processing-n:127.0.0.1:38716_) [n:127.0.0.1:38716_ c:control_collection   x:collection1] o.a.s.c.c.ZkStateReader Deleting data for [control_collection]
   [junit4]   2> 2168381 INFO  (OverseerStateUpdate-96106016236961796-127.0.0.1:38716_-n_0000000000) [n:127.0.0.1:38716_    ] o.a.s.c.o.ClusterStateMutator building a new cName: control_collection
   [junit4]   2> 2168383 INFO  (OverseerStateUpdate-96106016236961796-127.0.0.1:38716_-n_0000000000) [n:127.0.0.1:38716_    ] o.a.s.c.o.ReplicaMutator Assigning new node to shard shard=shard1
   [junit4]   2> 2168383 INFO  (coreLoadExecutor-6578-thread-1-processing-n:127.0.0.1:38716_) [n:127.0.0.1:38716_ c:control_collection   x:collection1] o.a.s.c.ZkController look for our core node name
   [junit4]   2> 2168385 INFO  (zkCallback-2537-thread-1-processing-n:127.0.0.1:38716_) [n:127.0.0.1:38716_    ] o.a.s.c.c.ZkStateReader A cluster state change: [WatchedEvent state:SyncConnected type:NodeDataChanged path:/clusterstate.json], has occurred - updating... (live nodes size: [1])
   [junit4]   2> 2169385 INFO  (coreLoadExecutor-6578-thread-1-processing-n:127.0.0.1:38716_) [n:127.0.0.1:38716_ c:control_collection   x:collection1] o.a.s.c.ZkController waiting to find shard id in clusterstate for collection1
   [junit4]   2> 2169385 INFO  (coreLoadExecutor-6578-thread-1-processing-n:127.0.0.1:38716_) [n:127.0.0.1:38716_ c:control_collection   x:collection1] o.a.s.c.ZkController Check for collection zkNode:control_collection
   [junit4]   2> 2169385 INFO  (coreLoadExecutor-6578-thread-1-processing-n:127.0.0.1:38716_) [n:127.0.0.1:38716_ c:control_collection   x:collection1] o.a.s.c.ZkController Collection zkNode exists
   [junit4]   2> 2169385 INFO  (coreLoadExecutor-6578-thread-1-processing-n:127.0.0.1:38716_) [n:127.0.0.1:38716_ c:control_collection   x:collection1] o.a.s.c.c.ZkStateReader Load collection config from: [/collections/control_collection]
   [junit4]   2> 2169386 INFO  (coreLoadExecutor-6578-thread-1-processing-n:127.0.0.1:38716_) [n:127.0.0.1:38716_ c:control_collection   x:collection1] o.a.s.c.c.ZkStateReader path=[/collections/control_collection] [configName]=[conf1] specified config exists in ZooKeeper
   [junit4]   2> 2169387 INFO  (coreLoadExecutor-6578-thread-1-processing-n:127.0.0.1:38716_) [n:127.0.0.1:38716_ c:control_collection   x:collection1] o.a.s.c.SolrResourceLoader new SolrResourceLoader for directory: '/export/home/jenkins/workspace/Lucene-Solr-6.x-Solaris/solr/build/solr-core/test/J0/temp/solr.cloud.CustomCollectionTest_D2F15B8E2C84D2D6-001/control-001/cores/collection1'
   [junit4]   2> 2169387 INFO  (coreLoadExecutor-6578-thread-1-processing-n:127.0.0.1:38716_) [n:127.0.0.1:38716_ c:control_collection   x:collection1] o.a.s.c.SolrResourceLoader JNDI not configured for solr (NoInitialContextEx)
   [junit4]   2> 2169387 INFO  (coreLoadExecutor-6578-thread-1-processing-n:127.0.0.1:38716_) [n:127.0.0.1:38716_ c:control_collection   x:collection1] o.a.s.c.SolrResourceLoader solr home defaulted to 'solr/' (could not find system property or JNDI)
   [junit4]   2> 2169388 INFO  (coreLoadExecutor-6578-thread-1-processing-n:127.0.0.1:38716_) [n:127.0.0.1:38716_ c:control_collection   x:collection1] o.a.s.c.Config loaded config solrconfig.xml with version 0 
   [junit4]   2> 2169410 INFO  (coreLoadExecutor-6578-thread-1-processing-n:127.0.0.1:38716_) [n:127.0.0.1:38716_ c:control_collection   x:collection1] o.a.s.c.SolrConfig current version of requestparams : -1
   [junit4]   2> 2169421 INFO  (coreLoadExecutor-6578-thread-1-processing-n:127.0.0.1:38716_) [n:127.0.0.1:38716_ c:control_collection   x:collection1] o.a.s.c.SolrConfig Using Lucene MatchVersion: 6.2.0
   [junit4]   2> 2169428 INFO  (coreLoadExecutor-6578-thread-1-processing-n:127.0.0.1:38716_) [n:127.0.0.1:38716_ c:control_collection   x:collection1] o.a.s.c.SolrConfig Loaded SolrConfig: solrconfig.xml
   [junit4]   2> 2169433 INFO  (coreLoadExecutor-6578-thread-1-processing-n:127.0.0.1:38716_) [n:127.0.0.1:38716_ c:control_collection   x:collection1] o.a.s.s.IndexSchema [collection1] Schema name=test
   [junit4]   2> 2169512 INFO  (coreLoadExecutor-6578-thread-1-processing-n:127.0.0.1:38716_) [n:127.0.0.1:38716_ c:control_collection   x:collection1] o.a.s.s.OpenExchangeRatesOrgProvider Initialized with rates=open-exchange-rates.json, refreshInterval=1440.
   [junit4]   2> 2169517 INFO  (coreLoadExecutor-6578-thread-1-processing-n:127.0.0.1:38716_) [n:127.0.0.1:38716_ c:control_collection   x:collection1] o.a.s.s.IndexSchema default search field in schema is text
   [junit4]   2> 2169518 INFO  (coreLoadExecutor-6578-thread-1-processing-n:127.0.0.1:38716_) [n:127.0.0.1:38716_ c:control_collection   x:collection1] o.a.s.s.IndexSchema unique key field: id
   [junit4]   2> 2169530 INFO  (coreLoadExecutor-6578-thread-1-processing-n:127.0.0.1:38716_) [n:127.0.0.1:38716_ c:control_collection   x:collection1] o.a.s.s.FileExchangeRateProvider Reloading exchange rates from file currency.xml
   [junit4]   2> 2169532 INFO  (coreLoadExecutor-6578-thread-1-processing-n:127.0.0.1:38716_) [n:127.0.0.1:38716_ c:control_collection   x:collection1] o.a.s.s.FileExchangeRateProvider Reloading exchange rates from file currency.xml
   [junit4]   2> 2169534 INFO  (coreLoadExecutor-6578-thread-1-processing-n:127.0.0.1:38716_) [n:127.0.0.1:38716_ c:control_collection   x:collection1] o.a.s.s.OpenExchangeRatesOrgProvider Reloading exchange rates from open-exchange-rates.json
   [junit4]   2> 2169535 INFO  (coreLoadExecutor-6578-thread-1-processing-n:127.0.0.1:38716_) [n:127.0.0.1:38716_ c:control_collection   x:collection1] o.a.s.s.OpenExchangeRatesOrgProvider Reloading exchange rates from open-exchange-rates.json
   [junit4]   2> 2169537 INFO  (coreLoadExecutor-6578-thread-1-processing-n:127.0.0.1:38716_) [n:127.0.0.1:38716_ c:control_collection   x:collection1] o.a.s.c.ConfigSetProperties Did not find ConfigSet properties, assuming default properties: Can't find resource 'configsetprops.json' in classpath or '/configs/conf1', cwd=/export/home/jenkins/workspace/Lucene-Solr-6.x-Solaris/solr/build/solr-core/test/J0
   [junit4]   2> 2169537 INFO  (coreLoadExecutor-6578-thread-1-processing-n:127.0.0.1:38716_) [n:127.0.0.1:38716_ c:control_collection   x:collection1] o.a.s.c.CoreContainer Creating SolrCore 'collection1' using configuration from collection control_collection
   [junit4]   2> 2169537 INFO  (coreLoadExecutor-6578-thread-1-processing-n:127.0.0.1:38716_) [n:127.0.0.1:38716_ c:control_collection s:shard1 r:core_node1 x:collection1] o.a.s.c.SolrCore org.apache.solr.core.MockDirectoryFactory
   [junit4]   2> 2169538 INFO  (coreLoadExecutor-6578-thread-1-processing-n:127.0.0.1:38716_) [n:127.0.0.1:38716_ c:control_collection s:shard1 r:core_node1 x:collection1] o.a.s.c.SolrCore [[collection1] ] Opening new SolrCore at [/export/home/jenkins/workspace/Lucene-Solr-6.x-Solaris/solr/build/solr-core/test/J0/temp/solr.cloud.CustomCollectionTest_D2F15B8E2C84D2D6-001/control-001/cores/collection1], dataDir=[/export/home/jenkins/workspace/Lucene-Solr-6.x-Solaris/solr/build/solr-core/test/J0/../../../../../../../../../../export/home/jenkins/workspace/Lucene-Solr-6.x-Solaris/solr/build/solr-core/test/J0/temp/solr.cloud.CustomCollectionTest_D2F15B8E2C84D2D6-001/control-001/cores/collection1/data/]
   [junit4]   2> 2169538 INFO  (coreLoadExecutor-6578-thread-1-processing-n:127.0.0.1:38716_) [n:127.0.0.1:38716_ c:control_collection s:shard1 r:core_node1 x:collection1] o.a.s.c.JmxMonitoredMap JMX monitoring is enabled. Adding Solr mbeans to JMX Server: com.sun.jmx.mbeanserver.JmxMBeanServer@3e2e7a83
   [junit4]   2> 2169538 INFO  (coreLoadExecutor-6578-thread-1-processing-n:127.0.0.1:38716_) [n:127.0.0.1:38716_ c:control_collection s:shard1 r:core_node1 x:collection1] o.a.s.c.CachingDirectoryFactory return new directory for /export/home/jenkins/workspace/Lucene-Solr-6.x-Solaris/solr/build/solr-core/test/J0/../../../../../../../../../../export/home/jenkins/workspace/Lucene-Solr-6.x-Solaris/solr/build/solr-core/test/J0/temp/solr.cloud.CustomCollectionTest_D2F15B8E2C84D2D6-001/control-001/cores/collection1/data
   [junit4]   2> 2169538 INFO  (coreLoadExecutor-6578-thread-1-processing-n:127.0.0.1:38716_) [n:127.0.0.1:38716_ c:control_collection s:shard1 r:core_node1 x:collection1] o.a.s.c.SolrCore New index directory detected: old=null new=/export/home/jenkins/workspace/Lucene-Solr-6.x-Solaris/solr/build/solr-core/test/J0/../../../../../../../../../../export/home/jenkins/workspace/Lucene-Solr-6.x-Solaris/solr/build/solr-core/test/J0/temp/solr.cloud.CustomCollectionTest_D2F15B8E2C84D2D6-001/control-001/cores/collection1/data/index/
   [junit4]   2> 2169538 WARN  (coreLoadExecutor-6578-thread-1-processing-n:127.0.0.1:38716_) [n:127.0.0.1:38716_ c:control_collection s:shard1 r:core_node1 x:collection1] o.a.s.c.SolrCore [collection1] Solr index directory '/export/home/jenkins/workspace/Lucene-Solr-6.x-Solaris/solr/build/solr-core/test/J0/../../../../../../../../../../export/home/jenkins/workspace/Lucene-Solr-6.x-Solaris/solr/build/solr-core/test/J0/temp/solr.cloud.CustomCollectionTest_D2F15B8E2C84D2D6-001/control-001/cores/collection1/data/index' doesn't exist. Creating new index...
   [junit4]   2> 2169539 INFO  (coreLoadExecutor-6578-thread-1-processing-n:127.0.0.1:38716_) [n:127.0.0.1:38716_ c:control_collection s:shard1 r:core_node1 x:collection1] o.a.s.c.CachingDirectoryFactory return new directory for /export/home/jenkins/workspace/Lucene-Solr-6.x-Solaris/solr/build/solr-core/test/J0/../../../../../../../../../../export/home/jenkins/workspace/Lucene-Solr-6.x-Solaris/solr/build/solr-core/test/J0/temp/solr.cloud.CustomCollectionTest_D2F15B8E2C84D2D6-001/control-001/cores/collection1/data/index
   [junit4]   2> 2169539 INFO  (coreLoadExecutor-6578-thread-1-processing-n:127.0.0.1:38716_) [n:127.0.0.1:38716_ c:control_collection s:shard1 r:core_node1 x:collection1] o.a.s.u.RandomMergePolicy RandomMergePolicy wrapping class org.apache.lucene.index.LogDocMergePolicy: [LogDocMergePolicy: minMergeSize=1000, mergeFactor=33, maxMergeSize=9223372036854775807, maxMergeSizeForForcedMerge=9223372036854775807, calibrateSizeByDeletes=true, maxMergeDocs=2147483647, maxCFSSegmentSizeMB=8.796093022207999E12, noCFSRatio=0.1646601734203209]
   [junit4]   2> 2169539 INFO  (coreLoadExecutor-6578-thread-1-processing-n:127.0.0.1:38716_) [n:127.0.0.1:38716_ c:control_collection s:shard1 r:core_node1 x:collection1] o.a.s.c.SolrDeletionPolicy SolrDeletionPolicy.onCommit: commits: num=1
   [junit4]   2> 	commit{dir=MockDirectoryWrapper(RAMDirectory@1af4adc3 lockFactory=org.apache.lucene.store.SingleInstanceLockFactory@666b09ca),segFN=segments_1,generation=1}
   [junit4]   2> 2169539 INFO  (coreLoadExecutor-6578-thread-1-processing-n:127.0.0.1:38716_) [n:127.0.0.1:38716_ c:control_collection s:shard1 r:core_node1 x:collection1] o.a.s.c.SolrDeletionPolicy newest commit generation = 1
   [junit4]   2> 2169539 INFO  (OldIndexDirectoryCleanupThreadForCore-collection1) [n:127.0.0.1:38716_ c:control_collection s:shard1 r:core_node1 x:collection1] o.a.s.c.SolrCore Looking for old index directories to cleanup for core collection1 in /export/home/jenkins/workspace/Lucene-Solr-6.x-Solaris/solr/build/solr-core/test/J0/../../../../../../../../../../export/home/jenkins/workspace/Lucene-Solr-6.x-Solaris/solr/build/solr-core/test/J0/temp/solr.cloud.CustomCollectionTest_D2F15B8E2C84D2D6-001/control-001/cores/collection1/data/
   [junit4]   2> 2169540 WARN  (OldIndexDirectoryCleanupThreadForCore-collection1) [n:127.0.0.1:38716_ c:control_collection s:shard1 r:core_node1 x:collection1] o.a.s.c.DirectoryFactory /export/home/jenkins/workspace/Lucene-Solr-6.x-Solaris/solr/build/solr-core/test/J0/../../../../../../../../../../export/home/jenkins/workspace/Lucene-Solr-6.x-Solaris/solr/build/solr-core/test/J0/temp/solr.cloud.CustomCollectionTest_D2F15B8E2C84D2D6-001/control-001/cores/collection1/data/ does not point to a valid data directory; skipping clean-up of old index directories.
   [junit4]   2> 2169542 INFO  (coreLoadExecutor-6578-thread-1-processing-n:127.0.0.1:38716_) [n:127.0.0.1:38716_ c:control_collection s:shard1 r:core_node1 x:collection1] o.a.s.u.p.UpdateRequestProcessorChain creating updateRequestProcessorChain "nodistrib"
   [junit4]   2> 2169542 INFO  (coreLoadExecutor-6578-thread-1-processing-n:127.0.0.1:38716_) [n:127.0.0.1:38716_ c:control_collection s:shard1 r:core_node1 x:collection1] o.a.s.u.p.UpdateRequestProcessorChain creating updateRequestProcessorChain "dedupe"
   [junit4]   2> 2169542 INFO  (coreLoadExecutor-6578-thread-1-processing-n:127.0.0.1:38716_) [n:127.0.0.1:38716_ c:control_collection s:shard1 r:core_node1 x:collection1] o.a.s.u.p.UpdateRequestProcessorChain inserting DistributedUpdateProcessorFactory into updateRequestProcessorChain "dedupe"
   [junit4]   2> 2169542 INFO  (coreLoadExecutor-6578-thread-1-processing-n:127.0.0.1:38716_) [n:127.0.0.1:38716_ c:control_collection s:shard1 r:core_node1 x:collection1] o.a.s.u.p.UpdateRequestProcessorChain creating updateRequestProcessorChain "stored_sig"
   [junit4]   2> 2169543 INFO  (coreLoadExecutor-6578-thread-1-processing-n:127.0.0.1:38716_) [n:127.0.0.1:38716_ c:control_collection s:shard1 r:core_node1 x:collection1] o.a.s.u.p.UpdateRequestProcessorChain inserting DistributedUpdateProcessorFactory into updateRequestProcessorChain "stored_sig"
   [junit4]   2> 2169543 INFO  (coreLoadExecutor-6578-thread-1-processing-n:127.0.0.1:38716_) [n:127.0.0.1:38716_ c:control_collection s:shard1 r:core_node1 x:collection1] o.a.s.u.p.UpdateRequestProcessorChain creating updateRequestProcessorChain "distrib-dup-test-chain-explicit"
   [junit4]   2> 2169543 INFO  (coreLoadExecutor-6578-thread-1-processing-n:127.0.0.1:38716_) [n:127.0.0.1:38716_ c:control_collection s:shard1 r:core_node1 x:collection1] o.a.s.u.p.UpdateRequestProcessorChain creating updateRequestProcessorChain "distrib-dup-test-chain-implicit"
   [junit4]   2> 2169543 INFO  (coreLoadExecutor-6578-thread-1-processing-n:127.0.0.1:38716_) [n:127.0.0.1:38716_ c:control_collection s:shard1 r:core_node1 x:collection1] o.a.s.u.p.UpdateRequestProcessorChain inserting DistributedUpdateProcessorFactory into updateRequestProcessorChain "distrib-dup-test-chain-implicit"
   [junit4]   2> 2169543 INFO  (coreLoadExecutor-6578-thread-1-processing-n:127.0.0.1:38716_) [n:127.0.0.1:38716_ c:control_collection s:shard1 r:core_node1 x:collection1] o.a.s.c.SolrCore no updateRequestProcessorChain defined as default, creating implicit default
   [junit4]   2> 2169543 WARN  (coreLoadExecutor-6578-thread-1-processing-n:127.0.0.1:38716_) [n:127.0.0.1:38716_ c:control_collection s:shard1 r:core_node1 x:collection1] o.a.s.c.RequestHandlers INVALID paramSet a in requestHandler {type = requestHandler,name = /dump,class = DumpRequestHandler,args = {defaults={a=A,b=B}}}
   [junit4]   2> 2169545 INFO  (coreLoadExecutor-6578-thread-1-processing-n:127.0.0.1:38716_) [n:127.0.0.1:38716_ c:control_collection s:shard1 r:core_node1 x:collection1] o.a.s.h.l.XMLLoader xsltCacheLifetimeSeconds=60
   [junit4]   2> 2169546 INFO  (coreLoadExecutor-6578-thread-1-processing-n:127.0.0.1:38716_) [n:127.0.0.1:38716_ c:control_collection s:shard1 r:core_node1 x:collection1] o.a.s.h.l.XMLLoader xsltCacheLifetimeSeconds=60
   [junit4]   2> 2169548 INFO  (coreLoadExecutor-6578-thread-1-processing-n:127.0.0.1:38716_) [n:127.0.0.1:38716_ c:control_collection s:shard1 r:core_node1 x:collection1] o.a.s.h.l.XMLLoader xsltCacheLifetimeSeconds=60
   [junit4]   2> 2169549 INFO  (coreLoadExecutor-6578-thread-1-processing-n:127.0.0.1:38716_) [n:127.0.0.1:38716_ c:control_collection s:shard1 r:core_node1 x:collection1] o.a.s.h.l.XMLLoader xsltCacheLifetimeSeconds=60
   [junit4]   2> 2169553 INFO  (coreLoadExecutor-6578-thread-1-processing-n:127.0.0.1:38716_) [n:127.0.0.1:38716_ c:control_collection s:shard1 r:core_node1 x:collection1] o.a.s.c.RequestHandlers Registered paths: /admin/mbeans,standard,/update/json/docs,/admin/luke,/export,/get,/admin/properties,/update/json,/admin/threads,/dump,/update/csv,/sql,/graph,/admin/segments,/admin/system,/replication,/config,/stream,/schema,/admin/plugins,/admin/logging,/admin/ping,/update,/admin/file
   [junit4]   2> 2169553 INFO  (coreLoadExecutor-6578-thread-1-processing-n:127.0.0.1:38716_) [n:127.0.0.1:38716_ c:control_collection s:shard1 r:core_node1 x:collection1] o.a.s.c.SolrCore Using default statsCache cache: org.apache.solr.search.stats.LocalStatsCache
   [junit4]   2> 2169554 INFO  (coreLoadExecutor-6578-thread-1-processing-n:127.0.0.1:38716_) [n:127.0.0.1:38716_ c:control_collection s:shard1 r:core_node1 x:collection1] o.a.s.u.UpdateHandler Using UpdateLog implementation: org.apache.solr.update.UpdateLog
   [junit4]   2> 2169554 INFO  (coreLoadExecutor-6578-thread-1-processing-n:127.0.0.1:38716_) [n:127.0.0.1:38716_ c:control_collection s:shard1 r:core_node1 x:collection1] o.a.s.u.UpdateLog Initializing UpdateLog: dataDir= defaultSyncLevel=FLUSH numRecordsToKeep=100 maxNumLogsToKeep=10 numVersionBuckets=65536
   [junit4]   2> 2169555 INFO  (coreLoadExecutor-6578-thread-1-processing-n:127.0.0.1:38716_) [n:127.0.0.1:38716_ c:control_collection s:shard1 r:core_node1 x:collection1] o.a.s.u.CommitTracker Hard AutoCommit: disabled
   [junit4]   2> 2169555 INFO  (coreLoadExecutor-6578-thread-1-processing-n:127.0.0.1:38716_) [n:127.0.0.1:38716_ c:control_collection s:shard1 r:core_node1 x:collection1] o.a.s.u.CommitTracker Soft AutoCommit: disabled
   [junit4]   2> 2169556 INFO  (coreLoadExecutor-6578-thread-1-processing-n:127.0.0.1:38716_) [n:127.0.0.1:38716_ c:control_collection s:shard1 r:core_node1 x:collection1] o.a.s.u.RandomMergePolicy RandomMergePolicy wrapping class org.apache.lucene.index.LogDocMergePolicy: [LogDocMergePolicy: minMergeSize=1000, mergeFactor=25, maxMergeSize=9223372036854775807, maxMergeSizeForForcedMerge=9223372036854775807, calibrateSizeByDeletes=false, maxMergeDocs=2147483647, maxCFSSegmentSizeMB=8.796093022207999E12, noCFSRatio=0.0]
   [junit4]   2> 2169556 INFO  (coreLoadExecutor-6578-thread-1-processing-n:127.0.0.1:38716_) [n:127.0.0.1:38716_ c:control_collection s:shard1 r:core_node1 x:collection1] o.a.s.c.SolrDeletionPolicy SolrDeletionPolicy.onInit: commits: num=1
   [junit4]   2> 	commit{dir=MockDirectoryWrapper(RAMDirectory@1af4adc3 lockFactory=org.apache.lucene.store.SingleInstanceLockFactory@666b09ca),segFN=segments_1,generation=1}
   [junit4]   2> 2169556 INFO  (coreLoadExecutor-6578-thread-1-processing-n:127.0.0.1:38716_) [n:127.0.0.1:38716_ c:control_collection s:shard1 r:core_node1 x:collection1] o.a.s.c.SolrDeletionPolicy newest commit generation = 1
   [junit4]   2> 2169556 INFO  (coreLoadExecutor-6578-thread-1-processing-n:127.0.0.1:38716_) [n:127.0.0.1:38716_ c:control_collection s:shard1 r:core_node1 x:collection1] o.a.s.s.SolrIndexSearcher Opening [Searcher@4e83f7b1[collection1] main]
   [junit4]   2> 2169556 INFO  (coreLoadExecutor-6578-thread-1-processing-n:127.0.0.1:38716_) [n:127.0.0.1:38716_ c:control_collection s:shard1 r:core_node1 x:collection1] o.a.s.c.c.ZkStateReader Load collection config from: [/collections/control_collection]
   [junit4]   2> 2169558 INFO  (coreLoadExecutor-6578-thread-1-processing-n:127.0.0.1:38716_) [n:127.0.0.1:38716_ c:control_collection s:shard1 r:core_node1 x:collection1] o.a.s.c.c.ZkStateReader path=[/collections/control_collection] [configName]=[conf1] specified config exists in ZooKeeper
   [junit4]   2> 2169559 INFO  (coreLoadExecutor-6578-thread-1-processing-n:127.0.0.1:38716_) [n:127.0.0.1:38716_ c:control_collection s:shard1 r:core_node1 x:collection1] o.a.s.r.ManagedResourceStorage Setting up ZooKeeper-based storage for the RestManager with znodeBase: /configs/conf1
   [junit4]   2> 2169559 INFO  (coreLoadExecutor-6578-thread-1-processing-n:127.0.0.1:38716_) [n:127.0.0.1:38716_ c:control_collection s:shard1 r:core_node1 x:collection1] o.a.s.r.ManagedResourceStorage Configured ZooKeeperStorageIO with znodeBase: /configs/conf1
   [junit4]   2> 2169559 INFO  (coreLoadExecutor-6578-thread-1-processing-n:127.0.0.1:38716_) [n:127.0.0.1:38716_ c:control_collection s:shard1 r:core_node1 x:collection1] o.a.s.r.RestManager Initializing RestManager with initArgs: {}
   [junit4]   2> 2169559 INFO  (coreLoadExecutor-6578-thread-1-processing-n:127.0.0.1:38716_) [n:127.0.0.1:38716_ c:control_collection s:shard1 r:core_node1 x:collection1] o.a.s.r.ManagedResourceStorage Reading _rest_managed.json using ZooKeeperStorageIO:path=/configs/conf1
   [junit4]   2> 2169560 INFO  (coreLoadExecutor-6578-thread-1-processing-n:127.0.0.1:38716_) [n:127.0.0.1:38716_ c:control_collection s:shard1 r:core_node1 x:collection1] o.a.s.r.ManagedResourceStorage No data found for znode /configs/conf1/_rest_managed.json
   [junit4]   2> 2169560 INFO  (coreLoadExecutor-6578-thread-1-processing-n:127.0.0.1:38716_) [n:127.0.0.1:38716_ c:control_collection s:shard1 r:core_node1 x:collection1] o.a.s.r.ManagedResourceStorage Loaded null at path _rest_managed.json using ZooKeeperStorageIO:path=/configs/conf1
   [junit4]   2> 2169560 INFO  (coreLoadExecutor-6578-thread-1-processing-n:127.0.0.1:38716_) [n:127.0.0.1:38716_ c:control_collection s:shard1 r:core_node1 x:collection1] o.a.s.r.RestManager Initializing 0 registered ManagedResources
   [junit4]   2> 2169560 INFO  (coreLoadExecutor-6578-thread-1-processing-n:127.0.0.1:38716_) [n:127.0.0.1:38716_ c:control_collection s:shard1 r:core_node1 x:collection1] o.a.s.h.ReplicationHandler Commits will be reserved for  10000
   [junit4]   2> 2169561 INFO  (searcherExecutor-6579-thread-1-processing-n:127.0.0.1:38716_ x:collection1 s:shard1 c:control_collection r:core_node1) [n:127.0.0.1:38716_ c:control_collection s:shard1 r:core_node1 x:collection1] o.a.s.c.SolrCore [collection1] Registered new searcher Searcher@4e83f7b1[collection1] main{ExitableDirectoryReader(UninvertingDirectoryReader())}
   [junit4]   2> 2169561 INFO  (coreLoadExecutor-6578-thread-1-processing-n:127.0.0.1:38716_) [n:127.0.0.1:38716_ c:control_collection s:shard1 r:core_node1 x:collection1] o.a.s.u.UpdateLog Looking up max value of version field to seed version buckets
   [junit4]   2> 2169561 INFO  (coreLoadExecutor-6578-thread-1-processing-n:127.0.0.1:38716_) [n:127.0.0.1:38716_ c:control_collection s:shard1 r:core_node1 x:collection1] o.a.s.u.VersionInfo Refreshing highest value of _version_ for 65536 version buckets from index
   [junit4]   2> 2169561 INFO  (coreLoadExecutor-6578-thread-1-processing-n:127.0.0.1:38716_) [n:127.0.0.1:38716_ c:control_collection s:shard1 r:core_node1 x:collection1] o.a.s.u.VersionInfo No terms found for _version_, cannot seed version bucket highest value from index
   [junit4]   2> 2169561 INFO  (coreLoadExecutor-6578-thread-1-processing-n:127.0.0.1:38716_) [n:127.0.0.1:38716_ c:control_collection s:shard1 r:core_node1 x:collection1] o.a.s.u.UpdateLog Could not find max version in index or recent updates, using new clock 1537696261525733376
   [junit4]   2> 2169563 INFO  (coreLoadExecutor-6578-thread-1-processing-n:127.0.0.1:38716_) [n:127.0.0.1:38716_ c:control_collection s:shard1 r:core_node1 x:collection1] o.a.s.u.UpdateLog Took 1.0ms to seed version buckets with highest version 1537696261525733376
   [junit4]   2> 2169563 INFO  (coreLoadExecutor-6578-thread-1-processing-n:127.0.0.1:38716_) [n:127.0.0.1:38716_ c:control_collection s:shard1 r:core_node1 x:collection1] o.a.s.c.ZkController watch zkdir /configs/conf1
   [junit4]   2> 2169563 INFO  (coreLoadExecutor-6578-thread-1-processing-n:127.0.0.1:38716_) [n:127.0.0.1:38716_ c:control_collection s:shard1 r:core_node1 x:collection1] o.a.s.c.CoreContainer registering core: collection1
   [junit4]   2> 2169564 INFO  (coreZkRegister-6572-thread-1-processing-n:127.0.0.1:38716_ x:collection1 s:shard1 c:control_collection r:core_node1) [n:127.0.0.1:38716_ c:control_collection s:shard1 r:core_node1 x:collection1] o.a.s.c.ZkController Register replica - core:collection1 address:http://127.0.0.1:38716 collection:control_collection shard:shard1
   [junit4]   2> 2169565 INFO  (coreZkRegister-6572-thread-1-processing-n:127.0.0.1:38716_ x:collection1 s:shard1 c:control_collection r:core_node1) [n:127.0.0.1:38716_ c:control_collection s:shard1 r:core_node1 x:collection1] o.a.s.c.c.SolrZkClient makePath: /collections/control_collection/leader_elect/shard1/election
   [junit4]   2> 2169571 INFO  (coreZkRegister-6572-thread-1-processing-n:127.0.0.1:38716_ x:collection1 s:shard1 c:control_collection r:core_node1) [n:127.0.0.1:38716_ c:control_collection s:shard1 r:core_node1 x:collection1] o.a.s.c.LeaderElector Joined leadership election with path: /collections/control_collection/leader_elect/shard1/election/96106016236961796-core_node1-n_0000000000
   [junit4]   2> 2169571 INFO  (coreZkRegister-6572-thread-1-processing-n:127.0.0.1:38716_ x:collection1 s:shard1 c:control_collection r:core_node1) [n:127.0.0.1:38716_ c:control_collection s:shard1 r:core_node1 x:collection1] o.a.s.c.ShardLeaderElectionContext Running the leader process for shard=shard1 and weAreReplacement=false and leaderVoteWait=180000
   [junit4]   2> 2169574 INFO  (coreZkRegister-6572-thread-1-processing-n:127.0.0.1:38716_ x:collection1 s:shard1 c:control_collection r:core_node1) [n:127.0.0.1:38716_ c:control_collection s:shard1 r:core_node1 x:collection1] o.a.s.c.ShardLeaderElectionContext Enough replicas found to continue.
   [junit4]   2> 2169574 INFO  (coreZkRegister-6572-thread-1-processing-n:127.0.0.1:38716_ x:collection1 s:shard1 c:control_collection r:core_node1) [n:127.0.0.1:38716_ c:control_collection s:shard1 r:core_node1 x:collection1] o.a.s.c.ShardLeaderElectionContext I may be the new leader - try and sync
   [junit4]   2> 2169574 INFO  (coreZkRegister-6572-thread-1-processing-n:127.0.0.1:38716_ x:collection1 s:shard1 c:control_collection r:core_node1) [n:127.0.0.1:38716_ c:control_collection s:shard1 r:core_node1 x:collection1] o.a.s.c.SyncStrategy Sync replicas to http://127.0.0.1:38716/collection1/
   [junit4]   2> 2169574 INFO  (coreZkRegister-6572-thread-1-processing-n:127.0.0.1:38716_ x:collection1 s:shard1 c:control_collection r:core_node1) [n:127.0.0.1:38716_ c:control_collection s:shard1 r:core_node1 x:collection1] o.a.s.c.SyncStrategy Sync Success - now sync replicas to me
   [junit4]   2> 2169574 INFO  (coreZkRegister-6572-thread-1-processing-n:127.0.0.1:38716_ x:collection1 s:shard1 c:control_collection r:core_node1) [n:127.0.0.1:38716_ c:control_collection s:shard1 r:core_node1 x:collection1] o.a.s.c.SyncStrategy http://127.0.0.1:38716/collection1/ has no replicas
   [junit4]   2> 2169575 INFO  (OverseerStateUpdate-96106016236961796-127.0.0.1:38716_-n_0000000000) [n:127.0.0.1:38716_    ] o.a.s.c.Overseer processMessage: queueSize: 1, message = {
   [junit4]   2>   "operation":"leader",
   [junit4]   2>   "shard":"shard1",
   [junit4]   2>   "collection":"control_collection"} current state version: 1
   [junit4]   2> 2169576 INFO  (coreZkRegister-6572-thread-1-processing-n:127.0.0.1:38716_ x:collection1 s:shard1 c:control_collection r:core_node1) [n:127.0.0.1:38716_ c:control_collection s:shard1 r:core_node1 x:collection1] o.a.s.c.c.SolrZkClient makePath: /collections/control_collection/leaders/shard1
   [junit4]   2> 2169580 INFO  (coreZkRegister-6572-thread-1-processing-n:127.0.0.1:38716_ x:collection1 s:shard1 c:control_collection r:core_node1) [n:127.0.0.1:38716_ c:control_collection s:shard1 r:core_node1 x:collection1] o.a.s.c.ShardLeaderElectionContextBase Creating leader registration node /collections/control_collection/leaders/shard1/leader after winning as /collections/control_collection/leader_elect/shard1/election/96106016236961796-core_node1-n_0000000000
   [junit4]   2> 2169583 INFO  (coreZkRegister-6572-thread-1-processing-n:127.0.0.1:38716_ x:collection1 s:shard1 c:control_collection r:core_node1) [n:127.0.0.1:38716_ c:control_collection s:shard1 r:core_node1 x:collection1] o.a.s.c.ShardLeaderElectionContext I am the new leader: http://127.0.0.1:38716/collection1/ shard1
   [junit4]   2> 2169585 INFO  (OverseerStateUpdate-96106016236961796-127.0.0.1:38716_-n_0000000000) [n:127.0.0.1:38716_    ] o.a.s.c.Overseer processMessage: queueSize: 1, message = {
   [junit4]   2>   "operation":"leader",
   [junit4]   2>   "shard":"shard1",
   [junit4]   2>   "collection":"control_collection",
   [junit4]   2>   "base_url":"http://127.0.0.1:38716",
   [junit4]   2>   "core":"collection1",
   [junit4]   2>   "state":"active"} current state version: 1
   [junit4]   2> 2169688 INFO  (zkCallback-2537-thread-1-processing-n:127.0.0.1:38716_) [n:127.0.0.1:38716_    ] o.a.s.c.c.ZkStateReader A cluster state change: [WatchedEvent state:SyncConnected type:NodeDataChanged path:/clusterstate.json], has occurred - updating... (live nodes size: [1])
   [junit4]   2> 2169736 INFO  (coreZkRegister-6572-thread-1-processing-n:127.0.0.1:38716_ x:collection1 s:shard1 c:control_collection r:core_node1) [n:127.0.0.1:38716_ c:control_collection s:shard1 r:core_node1 x:collection1] o.a.s.c.ZkController We are http://127.0.0.1:38716/collection1/ and leader is http://127.0.0.1:38716/collection1/
   [junit4]   2> 2169737 INFO  (coreZkRegister-6572-thread-1-processing-n:127.0.0.1:38716_ x:collection1 s:shard1 c:control_collection r:core_node1) [n:127.0.0.1:38716_ c:control_collection s:shard1 r:core_node1 x:collection1] o.a.s.c.ZkController No LogReplay needed for core=collection1 baseURL=http://127.0.0.1:38716
   [junit4]   2> 2169737 INFO  (coreZkRegister-6572-thread-1-processing-n:127.0.0.1:38716_ x:collection1 s:shard1 c:control_collection r:core_node1) [n:127.0.0.1:38716_ c:control_collection s:shard1 r:core_node1 x:collection1] o.a.s.c.ZkController I am the leader, no recovery necessary
   [junit4]   2> 2169737 INFO  (coreZkRegister-6572-thread-1-processing-n:127.0.0.1:38716_ x:collection1 s:shard1 c:control_collection r:core_node1) [n:127.0.0.1:38716_ c:control_collection s:shard1 r:core_node1 x:collection1] o.a.s.c.ZkController publishing state=active
   [junit4]   2> 2169737 INFO  (coreZkRegister-6572-thread-1-processing-n:127.0.0.1:38716_ x:collection1 s:shard1 c:control_collection r:core_node1) [n:127.0.0.1:38716_ c:control_collection s:shard1 r:core_node1 x:collection1] o.a.s.c.ZkController numShards not found on descriptor - reading it from system property
   [junit4]   2> 2169742 INFO  (OverseerStateUpdate-96106016236961796-127.0.0.1:38716_-n_0000000000) [n:127.0.0.1:38716_    ] o.a.s.c.Overseer processMessage: queueSize: 1, message = {
   [junit4]   2>   "core":"collection1",
   [junit4]   2>   "core_node_name":"core_node1",
   [junit4]   2>   "roles":null,
   [junit4]   2>   "base_url":"http://127.0.0.1:38716",
   [junit4]   2>   "node_name":"127.0.0.1:38716_",
   [junit4]   2>   "numShards":"1",
   [junit4]   2>   "state":"active",
   [junit4]   2>   "shard":"shard1",
   [junit4]   2>   "collection":"control_collection",
   [junit4]   2>   "operation":"state"} current state version: 2
   [junit4]   2> 2169742 INFO  (OverseerStateUpdate-96106016236961796-127.0.0.1:38716_-n_0000000000) [n:127.0.0.1:38716_    ] o.a.s.c.o.ReplicaMutator Update state numShards=1 message={
   [junit4]   2>   "core":"collection1",
   [junit4]   2>   "core_node_name":"core_node1",
   [junit4]   2>   "roles":null,
   [junit4]   2>   "base_url":"http://127.0.0.1:38716",
   [junit4]   2>   "node_name":"127.0.0.1:38716_",
   [junit4]   2>   "numShards":"1",
   [junit4]   2>   "state":"active",
   [junit4]   2>   "shard":"shard1",
   [junit4]   2>   "collection":"control_collection",
   [junit4]   2>   "operation":"state"}
   [junit4]   2> 2169849 INFO  (zkCallback-2537-thread-3-processing-n:127.0.0.1:38716_) [n:127.0.0.1:38716_    ] o.a.s.c.c.ZkStateReader A cluster state change: [WatchedEvent state:SyncConnected type:NodeDataChanged path:/clusterstate.json], has occurred - updating... (live nodes size: [1])
   [junit4]   2> 2169883 INFO  (TEST-CustomCollectionTest.test-seed#[D2F15B8E2C84D2D6]) [    ] o.a.s.c.s.i.CloudSolrClient Final constructed zkHost string: 127.0.0.1:42550/solr
   [junit4]   2> 2169883 INFO  (TEST-CustomCollectionTest.test-seed#[D2F15B8E2C84D2D6]) [    ] o.a.s.c.c.SolrZkClient Using default ZkCredentialsProvider
   [junit4]   2> 2169884 INFO  (TEST-CustomCollectionTest.test-seed#[D2F15B8E2C84D2D6]) [    ] o.a.s.c.c.ConnectionManager Waiting for client to connect to ZooKeeper
   [junit4]   2> 2169885 INFO  (zkCallback-2541-thread-1) [    ] o.a.s.c.c.ConnectionManager Watcher org.apache.solr.common.cloud.ConnectionManager@9c6dab3 name:ZooKeeperConnection Watcher:127.0.0.1:42550/solr got event WatchedEvent state:SyncConnected type:None path:null path:null type:None
   [junit4]   2> 2169885 INFO  (TEST-CustomCollectionTest.test-seed#[D2F15B8E2C84D2D6]) [    ] o.a.s.c.c.ConnectionManager Client is connected to ZooKeeper
   [junit4]   2> 2169886 INFO  (TEST-CustomCollectionTest.test-seed#[D2F15B8E2C84D2D6]) [    ] o.a.s.c.c.SolrZkClient Using default ZkACLProvider
   [junit4]   2> 2169886 INFO  (TEST-CustomCollectionTest.test-seed#[D2F15B8E2C84D2D6]) [    ] o.a.s.c.c.ZkStateReader Updating cluster state from ZooKeeper... 
   [junit4]   2> 2169887 INFO  (TEST-CustomCollectionTest.test-seed#[D2F15B8E2C84D2D6]) [    ] o.a.s.c.c.ZkStateReader Loaded empty cluster properties
   [junit4]   2> 2169888 INFO  (TEST-CustomCollectionTest.test-seed#[D2F15B8E2C84D2D6]) [    ] o.a.s.c.c.ZkStateReader Updated live nodes from ZooKeeper... (0) -> (1)
   [junit4]   2> 2169890 INFO  (TEST-CustomCollectionTest.test-seed#[D2F15B8E2C84D2D6]) [    ] o.a.s.c.ChaosMonkey monkey: init - expire sessions:false cause connection loss:false
   [junit4]   2> 2169890 INFO  (TEST-CustomCollectionTest.test-seed#[D2F15B8E2C84D2D6]) [    ] o.a.s.c.AbstractFullDistribZkTestBase Creating collection1 with stateFormat=2
   [junit4]   2> 2169890 INFO  (TEST-CustomCollectionTest.test-seed#[D2F15B8E2C84D2D6]) [    ] o.a.s.c.c.SolrZkClient Using default ZkCredentialsProvider
   [junit4]   2> 2169890 INFO  (TEST-CustomCollectionTest.test-seed#[D2F15B8E2C84D2D6]) [    ] o.a.s.c.c.ConnectionManager Waiting for client to connect to ZooKeeper
   [junit4]   2> 2169892 INFO  (zkCallback-2542-thread-1) [    ] o.a.s.c.c.ConnectionManager Watcher org.apache.solr.common.cloud.ConnectionManager@43c79cf3 name:ZooKeeperConnection Watcher:127.0.0.1:42550/solr got event WatchedEvent state:SyncConnected type:None path:null path:null type:None
   [junit4]   2> 2169892 INFO  (TEST-CustomCollectionTest.test-seed#[D2F15B8E2C84D2D6]) [    ] o.a.s.c.c.ConnectionManager Client is connected to ZooKeeper
   [junit4]   2> 2169892 INFO  (TEST-CustomCollectionTest.test-seed#[D2F15B8E2C84D2D6]) [    ] o.a.s.c.c.SolrZkClient Using default ZkACLProvider
   [junit4]   2> 2169905 INFO  (OverseerStateUpdate-96106016236961796-127.0.0.1:38716_-n_0000000000) [n:127.0.0.1:38716_    ] o.a.s.c.Overseer processMessage: queueSize: 1, message = {
   [junit4]   2>   "operation":"create",
   [junit4]   2>   "name":"collection1",
   [junit4]   2>   "numShards":"2",
   [junit4]   2>   "stateFormat":"2"} current state version: 3
   [junit4]   2> 2169905 INFO  (OverseerStateUpdate-96106016236961796-127.0.0.1:38716_-n_0000000000) [n:127.0.0.1:38716_    ] o.a.s.c.o.ClusterStateMutator building a new cName: collection1
   [junit4]   2> 2170009 INFO  (OverseerStateUpdate-96106016236961796-127.0.0.1:38716_-n_0000000000) [n:127.0.0.1:38716_    ] o.a.s.c.o.ZkStateWriter going to create_collection /collections/collection1/state.json
   [junit4]   2> 2170072 INFO  (TEST-CustomCollectionTest.test-seed#[D2F15B8E2C84D2D6]) [    ] o.a.s.SolrTestCaseJ4 Writing core.properties file to /export/home/jenkins/workspace/Lucene-Solr-6.x-Solaris/solr/build/solr-core/test/J0/temp/solr.cloud.CustomCollectionTest_D2F15B8E2C84D2D6-001/shard-1-001/cores/collection1
   [junit4]   2> 2170072 INFO  (TEST-CustomCollectionTest.test-seed#[D2F15B8E2C84D2D6]) [    ] o.a.s.c.AbstractFullDistribZkTestBase create jetty 1 in directory /export/home/jenkins/workspace/Lucene-Solr-6.x-Solaris/solr/build/solr-core/test/J0/temp/solr.cloud.CustomCollectionTest_D2F15B8E2C84D2D6-001/shard-1-001
   [junit4]   2> 2170073 INFO  (TEST-CustomCollectionTest.test-seed#[D2F15B8E2C84D2D6]) [    ] o.e.j.s.Server jetty-9.3.8.v20160314
   [junit4]   2> 2170075 INFO  (TEST-CustomCollectionTest.test-seed#[D2F15B8E2C84D2D6]) [    ] o.e.j.s.h.ContextHandler Started o.e.j.s.ServletContextHandler@648eef7e{/,null,AVAILABLE}
   [junit4]   2> 2170075 INFO  (TEST-CustomCollectionTest.test-seed#[D2F15B8E2C84D2D6]) [    ] o.e.j.s.ServerConnector Started ServerConnector@27c737b8{HTTP/1.1,[http/1.1]}{127.0.0.1:39451}
   [junit4]   2> 2170075 INFO  (TEST-CustomCollectionTest.test-seed#[D2F15B8E2C84D2D6]) [    ] o.e.j.s.Server Started @2175148ms
   [junit4]   2> 2170075 INFO  (TEST-CustomCollectionTest.test-seed#[D2F15B8E2C84D2D6]) [    ] o.a.s.c.s.e.JettySolrRunner Jetty properties: {solr.data.dir=/export/home/jenkins/workspace/Lucene-Solr-6.x-Solaris/solr/build/solr-core/test/J0/temp/solr.cloud.CustomCollectionTest_D2F15B8E2C84D2D6-001/tempDir-001/jetty1, solrconfig=solrconfig.xml, hostContext=/, hostPort=39451, coreRootDirectory=/export/home/jenkins/workspace/Lucene-Solr-6.x-Solaris/solr/build/solr-core/test/J0/../../../../../../../../../../export/home/jenkins/workspace/Lucene-Solr-6.x-Solaris/solr/build/solr-core/test/J0/temp/solr.cloud.CustomCollectionTest_D2F15B8E2C84D2D6-001/shard-1-001/cores}
   [junit4]   2> 2170075 INFO  (TEST-CustomCollectionTest.test-seed#[D2F15B8E2C84D2D6]) [    ] o.a.s.s.SolrDispatchFilter SolrDispatchFilter.init(): sun.misc.Launcher$AppClassLoader@6d06d69c
   [junit4]   2> 2170076 INFO  (TEST-CustomCollectionTest.test-seed#[D2F15B8E2C84D2D6]) [    ] o.a.s.c.SolrResourceLoader new SolrResourceLoader for directory: '/export/home/jenkins/workspace/Lucene-Solr-6.x-Solaris/solr/build/solr-core/test/J0/temp/solr.cloud.CustomCollectionTest_D2F15B8E2C84D2D6-001/shard-1-001'
   [junit4]   2> 2170076 INFO  (TEST-CustomCollectionTest.test-seed#[D2F15B8E2C84D2D6]) [    ] o.a.s.c.SolrResourceLoader JNDI not configured for solr (NoInitialContextEx)
   [junit4]   2> 2170076 INFO  (TEST-CustomCollectionTest.test-seed#[D2F15B8E2C84D2D6]) [    ] o.a.s.c.SolrResourceLoader solr home defaulted to 'solr/' (could not find system property or JNDI)
   [junit4]   2> 2170076 INFO  (TEST-CustomCollectionTest.test-seed#[D2F15B8E2C84D2D6]) [    ] o.a.s.c.c.SolrZkClient Using default ZkCredentialsProvider
   [junit4]   2> 2170076 INFO  (TEST-CustomCollectionTest.test-seed#[D2F15B8E2C84D2D6]) [    ] o.a.s.c.c.ConnectionManager Waiting for client to connect to ZooKeeper
   [junit4]   2> 2170078 INFO  (zkCallback-2543-thread-1) [    ] o.a.s.c.c.ConnectionManager Watcher org.apache.solr.common.cloud.ConnectionManager@60f6aae0 name:ZooKeeperConnection Watcher:127.0.0.1:42550/solr got event WatchedEvent state:SyncConnected type:None path:null path:null type:None
   [junit4]   2> 2170078 INFO  (TEST-CustomCollectionTest.test-seed#[D2F15B8E2C84D2D6]) [    ] o.a.s.c.c.ConnectionManager Client is connected to ZooKeeper
   [junit4]   2> 2170078 INFO  (TEST-CustomCollectionTest.test-seed#[D2F15B8E2C84D2D6]) [    ] o.a.s.c.c.SolrZkClient Using default ZkACLProvider
   [junit4]   2> 2170080 INFO  (TEST-CustomCollectionTest.test-seed#[D2F15B8E2C84D2D6]) [    ] o.a.s.s.SolrDispatchFilter Loading solr.xml from SolrHome (not found in ZooKeeper)
   [junit4]   2> 2170080 INFO  (TEST-CustomCollectionTest.test-seed#[D2F15B8E2C84D2D6]) [    ] o.a.s.c.SolrXmlConfig Loading container configuration from /export/home/jenkins/workspace/Lucene-Solr-6.x-Solaris/solr/build/solr-core/test/J0/temp/solr.cloud.CustomCollectionTest_D2F15B8E2C84D2D6-001/shard-1-001/solr.xml
   [junit4]   2> 2170084 INFO  (TEST-CustomCollectionTest.test-seed#[D2F15B8E2C84D2D6]) [    ] o.a.s.c.CorePropertiesLocator Config-defined core root directory: /export/home/jenkins/workspace/Lucene-Solr-6.x-Solaris/solr/build/solr-core/test/J0/../../../../../../../../../../export/home/jenkins/workspace/Lucene-Solr-6.x-Solaris/solr/build/solr-core/test/J0/temp/solr.cloud.CustomCollectionTest_D2F15B8E2C84D2D6-001/shard-1-001/cores
   [junit4]   2> 2170084 INFO  (TEST-CustomCollectionTest.test-seed#[D2F15B8E2C84D2D6]) [    ] o.a.s.c.CoreContainer New CoreContainer 1638506307
   [junit4]   2> 2170084 INFO  (TEST-CustomCollectionTest.test-seed#[D2F15B8E2C84D2D6]) [    ] o.a.s.c.CoreContainer Loading cores into CoreContainer [instanceDir=/export/home/jenkins/workspace/Lucene-Solr-6.x-Solaris/solr/build/solr-core/test/J0/temp/solr.cloud.CustomCollectionTest_D2F15B8E2C84D2D6-001/shard-1-001]
   [junit4]   2> 2170084 WARN  (TEST-CustomCollectionTest.test-seed#[D2F15B8E2C84D2D6]) [    ] o.a.s.c.CoreContainer Couldn't add files from /export/home/jenkins/workspace/Lucene-Solr-6.x-Solaris/solr/build/solr-core/test/J0/temp/solr.cloud.CustomCollectionTest_D2F15B8E2C84D2D6-001/shard-1-001/lib to classpath: /export/home/jenkins/workspace/Lucene-Solr-6.x-Solaris/solr/build/solr-core/test/J0/temp/solr.cloud.CustomCollectionTest_D2F15B8E2C84D2D6-001/shard-1-001/lib
   [junit4]   2> 2170084 INFO  (TEST-CustomCollectionTest.test-seed#[D2F15B8E2C84D2D6]) [    ] o.a.s.h.c.HttpShardHandlerFactory created with socketTimeout : 90000,urlScheme : ,connTimeout : 15000,maxConnectionsPerHost : 20,maxConnections : 10000,corePoolSize : 0,maximumPoolSize : 2147483647,maxThreadIdleTime : 5,sizeOfQueue : -1,fairnessPolicy : false,useRetries : false,
   [junit4]   2> 2170085 INFO  (TEST-CustomCollectionTest.test-seed#[D2F15B8E2C84D2D6]) [    ] o.a.s.u.UpdateShardHandler Creating UpdateShardHandler HTTP client with params: socketTimeout=340000&connTimeout=45000&retry=true
   [junit4]   2> 2170086 INFO  (TEST-CustomCollectionTest.test-seed#[D2F15B8E2C84D2D6]) [    ] o.a.s.l.LogWatcher SLF4J impl is org.slf4j.impl.Log4jLoggerFactory
   [junit4]   2> 2170086 INFO  (TEST-CustomCollectionTest.test-seed#[D2F15B8E2C84D2D6]) [    ] o.a.s.l.LogWatcher Registering Log Listener [Log4j (org.slf4j.impl.Log4jLoggerFactory)]
   [junit4]   2> 2170086 INFO  (TEST-CustomCollectionTest.test-seed#[D2F15B8E2C84D2D6]) [    ] o.a.s.c.ZkContainer Zookeeper client=127.0.0.1:42550/solr
   [junit4]   2> 2170086 INFO  (TEST-CustomCollectionTest.test-seed#[D2F15B8E2C84D2D6]) [    ] o.a.s.c.ZkController zkHost includes chroot
   [junit4]   2> 2170086 INFO  (TEST-CustomCollectionTest.test-seed#[D2F15B8E2C84D2D6]) [    ] o.a.s.c.c.SolrZkClient Using default ZkCredentialsProvider
   [junit4]   2> 2170087 INFO  (TEST-CustomCollectionTest.test-seed#[D2F15B8E2C84D2D6]) [    ] o.a.s.c.c.ConnectionManager Waiting for client to connect to ZooKeeper
   [junit4]   2> 2170088 INFO  (zkCallback-2546-thread-1) [    ] o.a.s.c.c.ConnectionManager Watcher org.apache.solr.common.cloud.ConnectionManager@7c08370f name:ZooKeeperConnection Watcher:127.0.0.1:42550 got event WatchedEvent state:SyncConnected type:None path:null path:null type:None
   [junit4]   2> 2170089 INFO  (TEST-CustomCollectionTest.test-seed#[D2F15B8E2C84D2D6]) [    ] o.a.s.c.c.ConnectionManager Client is connected to ZooKeeper
   [junit4]   2> 2170089 INFO  (TEST-CustomCollectionTest.test-seed#[D2F15B8E2C84D2D6]) [    ] o.a.s.c.c.SolrZkClient Using default ZkACLProvider
   [junit4]   2> 2170090 INFO  (TEST-CustomCollectionTest.test-seed#[D2F15B8E2C84D2D6]) [n:127.0.0.1:39451_    ] o.a.s.c.ZkController Added new OnReconnect listener org.apache.solr.cloud.ZkController$$Lambda$62/1471472280@393a461d
   [junit4]   2> 2170091 INFO  (TEST-CustomCollectionTest.test-seed#[D2F15B8E2C84D2D6]) [n:127.0.0.1:39451_    ] o.a.s.c.c.ConnectionManager Waiting for client to connect to ZooKeeper
   [junit4]   2> 2170092 INFO  (zkCallback-2547-thread-1-processing-n:127.0.0.1:39451_) [n:127.0.0.1:39451_    ] o.a.s.c.c.ConnectionManager Watcher org.apache.solr.common.cloud.ConnectionManager@6deafd03 name:ZooKeeperConnection Watcher:127.0.0.1:42550/solr got event WatchedEvent state:SyncConnected type:None path:null path:null type:None
   [junit4]   2> 2170092 INFO  (TEST-CustomCollectionTest.test-seed#[D2F15B8E2C84D2D6]) [n:127.0.0.1:39451_    ] o.a.s.c.c.ConnectionManager Client is connected to ZooKeeper
   [junit4]   2> 2170101 INFO  (TEST-CustomCollectionTest.test-seed#[D2F15B8E2C84D2D6]) [n:127.0.0.1:39451_    ] o.a.s.c.c.ZkStateReader Updating cluster state from ZooKeeper... 
   [junit4]   2> 2170103 INFO  (TEST-CustomCollectionTest.test-seed#[D2F15B8E2C84D2D6]) [n:127.0.0.1:39451_    ] o.a.s.c.c.ZkStateReader Loaded empty cluster properties
   [junit4]   2> 2170104 INFO  (TEST-CustomCollectionTest.test-seed#[D2F15B8E2C84D2D6]) [n:127.0.0.1:39451_    ] o.a.s.c.c.ZkStateReader Updated live nodes from ZooKeeper... (0) -> (1)
   [junit4]   2> 2170107 INFO  (TEST-CustomCollectionTest.test-seed#[D2F15B8E2C84D2D6]) [n:127.0.0.1:39451_    ] o.a.s.c.Overseer Overseer (id=null) closing
   [junit4]   2> 2170108 INFO  (TEST-CustomCollectionTest.test-seed#[D2F15B8E2C84D2D6]) [n:127.0.0.1:39451_    ] o.a.s.c.LeaderElector Joined leadership election with path: /overseer_elect/election/96106016236961801-127.0.0.1:39451_-n_0000000001
   [junit4]   2> 2170109 INFO  (TEST-CustomCollectionTest.test-seed#[D2F15B8E2C84D2D6]) [n:127.0.0.1:39451_    ] o.a.s.c.LeaderElector Watching path /overseer_elect/election/96106016236961796-127.0.0.1:38716_-n_0000000000 to know if I could be the leader
   [junit4]   2> 2170109 INFO  (TEST-CustomCollectionTest.test-seed#[D2F15B8E2C84D2D6]) [n:127.0.0.1:39451_    ] o.a.s.c.ZkController Publish node=127.0.0.1:39451_ as DOWN
   [junit4]   2> 2170112 INFO  (OverseerStateUpdate-96106016236961796-127.0.0.1:38716_-n_0000000000) [n:127.0.0.1:38716_    ] o.a.s.c.Overseer processMessage: queueSize: 1, message = {
   [junit4]   2>   "operation":"downnode",
   [junit4]   2>   "node_name":"127.0.0.1:39451_"} current state version: 3
   [junit4]   2> 2170113 INFO  (OverseerStateUpdate-96106016236961796-127.0.0.1:38716_-n_0000000000) [n:127.0.0.1:38716_    ] o.a.s.c.o.NodeMutator DownNode state invoked for node: 127.0.0.1:39451_
   [junit4]   2> 2170114 INFO  (zkCallback-2537-thread-2-processing-n:127.0.0.1:38716_) [n:127.0.0.1:38716_    ] o.a.s.c.c.ZkStateReader A cluster state change: [WatchedEvent state:SyncConnected type:NodeDataChanged path:/clusterstate.json], has occurred - updating... (live nodes size: [1])
   [junit4]   2> 2170114 INFO  (zkCallback-2541-thread-1) [    ] o.a.s.c.c.ZkStateReader A cluster state change: [WatchedEvent state:SyncConnected type:NodeDataChanged path:/clusterstate.json], has occurred - updating... (live nodes size: [1])
   [junit4]   2> 2170115 INFO  (zkCallback-2547-thread-1-processing-n:127.0.0.1:39451_) [n:127.0.0.1:39451_    ] o.a.s.c.c.ZkStateReader A cluster state change: [WatchedEvent state:SyncConnected type:NodeDataChanged path:/clusterstate.json], has occurred - updating... (live nodes size: [1])
   [junit4]   2> 2170220 INFO  (OverseerStateUpdate-96106016236961796-127.0.0.1:38716_-n_0000000000) [n:127.0.0.1:38716_    ] o.a.s.c.o.ZkStateWriter going to update_collection /collections/collection1/state.json version: 0
   [junit4]   2> 2171117 INFO  (TEST-CustomCollectionTest.test-seed#[D2F15B8E2C84D2D6]) [n:127.0.0.1:39451_    ] o.a.s.c.ZkController Register node as live in ZooKeeper:/live_nodes/127.0.0.1:39451_
   [junit4]   2> 2171118 INFO  (TEST-CustomCollectionTest.test-seed#[D2F15B8E2C84D2D6]) [n:127.0.0.1:39451_    ] o.a.s.c.c.SolrZkClient makePath: /live_nodes/127.0.0.1:39451_
   [junit4]   2> 2171120 INFO  (zkCallback-2541-thread-1) [    ] o.a.s.c.c.ZkStateReader A live node change: [WatchedEvent state:SyncConnected type:NodeChildrenChanged path:/live_nodes], has occurred - updating... (live nodes size: [1])
   [junit4]   2> 2171120 INFO  (zkCallback-2537-thread-2-processing-n:127.0.0.1:38716_) [n:127.0.0.1:38716_    ] o.a.s.c.c.ZkStateReader A live node change: [WatchedEvent state:SyncConnected type:NodeChildrenChanged path:/live_nodes], has occurred - updating... (live nodes size: [1])
   [junit4]   2> 2171121 INFO  (zkCallback-2547-thread-1-processing-n:127.0.0.1:39451_) [n:127.0.0.1:39451_    ] o.a.s.c.c.ZkStateReader A live node change: [WatchedEvent state:SyncConnected type:NodeChildrenChanged path:/live_nodes], has occurred - updating... (live nodes size: [1])
   [junit4]   2> 2171121 INFO  (zkCallback-2541-thread-1) [    ] o.a.s.c.c.ZkStateReader Updated live nodes from ZooKeeper... (1) -> (2)
   [junit4]   2> 2171121 INFO  (zkCallback-2537-thread-2-processing-n:127.0.0.1:38716_) [n:127.0.0.1:38716_    ] o.a.s.c.c.ZkStateReader Updated live nodes from ZooKeeper... (1) -> (2)
   [junit4]   2> 2171122 INFO  (zkCallback-2547-thread-1-processing-n:127.0.0.1:39451_) [n:127.0.0.1:39451_    ] o.a.s.c.c.ZkStateReader Updated live nodes from ZooKeeper... (1) -> (2)
   [junit4]   2> 2171136 INFO  (TEST-CustomCollectionTest.test-seed#[D2F15B8E2C84D2D6]) [n:127.0.0.1:39451_    ] o.a.s.c.CoreContainer Security conf doesn't exist. Skipping setup for authorization module.
   [junit4]   2> 2171136 INFO  (TEST-CustomCollectionTest.test-seed#[D2F15B8E2C84D2D6]) [n:127.0.0.1:39451_    ] o.a.s.c.CoreContainer No authentication plugin used.
   [junit4]   2> 2171137 INFO  (TEST-CustomCollectionTest.test-seed#[D2F15B8E2C84D2D6]) [n:127.0.0.1:39451_    ] o.a.s.c.CorePropertiesLocator Looking for core definitions underneath /export/home/jenkins/workspace/Lucene-Solr-6.x-Solaris/solr/build/solr-core/test/J0/../../../../../../../../../../export/home/jenkins/workspace/Lucene-Solr-6.x-Solaris/solr/build/solr-core/test/J0/temp/solr.cloud.CustomCollectionTest_D2F15B8E2C84D2D6-001/shard-1-001/cores
   [junit4]   2> 2171138 INFO  (TEST-CustomCollectionTest.test-seed#[D2F15B8E2C84D2D6]) [n:127.0.0.1:39451_    ] o.a.s.c.CoreDescriptor Created CoreDescriptor: {name=collection1, config=solrconfig.xml, transient=false, schema=schema.xml, loadOnStartup=true, configSetProperties=configsetprops.json, collection=collection1, coreNodeName=, dataDir=data/, shard=}
   [junit4]   2> 2171138 INFO  (TEST-CustomCollectionTest.test-seed#[D2F15B8E2C84D2D6]) [n:127.0.0.1:39451_    ] o.a.s.c.CorePropertiesLocator Found core collection1 in /export/home/jenkins/workspace/Lucene-Solr-6.x-Solaris/solr/build/solr-core/test/J0/../../../../../../../../../../export/home/jenkins/workspace/Lucene-Solr-6.x-Solaris/solr/build/solr-core/test/J0/temp/solr.cloud.CustomCollectionTest_D2F15B8E2C84D2D6-001/shard-1-001/cores/collection1
   [junit4]   2> 2171138 INFO  (TEST-CustomCollectionTest.test-seed#[D2F15B8E2C84D2D6]) [n:127.0.0.1:39451_    ] o.a.s.c.CorePropertiesLocator Found 1 core definitions
   [junit4]   2> 2171139 INFO  (TEST-CustomCollectionTest.test-seed#[D2F15B8E2C84D2D6]) [n:127.0.0.1:39451_    ] o.a.s.s.SolrDispatchFilter user.dir=/export/home/jenkins/workspace/Lucene-Solr-6.x-Solaris/solr/build/solr-core/test/J0
   [junit4]   2> 2171139 INFO  (TEST-CustomCollectionTest.test-seed#[D2F15B8E2C84D2D6]) [n:127.0.0.1:39451_    ] o.a.s.s.SolrDispatchFilter SolrDispatchFilter.init() done
   [junit4]   2> 2171140 INFO  (coreLoadExecutor-6589-thread-1-processing-n:127.0.0.1:39451_) [n:127.0.0.1:39451_ c:collection1   x:collection1] o.a.s.c.ZkController publishing state=down
   [junit4]   2> 2171140 INFO  (coreLoadExecutor-6589-thread-1-processing-n:127.0.0.1:39451_) [n:127.0.0.1:39451_ c:collection1   x:collection1] o.a.s.c.ZkController numShards not found on descriptor - reading it from system property
   [junit4]   2> 2171142 INFO  (coreLoadExecutor-6589-thread-1-processing-n:127.0.0.1:39451_) [n:127.0.0.1:39451_ c:collection1   x:collection1] o.a.s.c.ZkController Registering watch for collection collection1
   [junit4]   2> 2171142 INFO  (OverseerStateUpdate-96106016236961796-127.0.0.1:38716_-n_0000000000) [n:127.0.0.1:38716_    ] o.a.s.c.Overseer processMessage: queueSize: 1, message = {
   [junit4]   2>   "core":"collection1",
   [junit4]   2>   "roles":null,
   [junit4]   2>   "base_url":"http://127.0.0.1:39451",
   [junit4]   2>   "node_name":"127.0.0.1:39451_",
   [junit4]   2>   "numShards":"2",
   [junit4]   2>   "state":"down",
   [junit4]   2>   "shard":null,
   [junit4]   2>   "collection":"collection1",
   [junit4]   2>   "operation":"state"} current state version: 4
   [junit4]   2> 2171142 INFO  (OverseerStateUpdate-96106016236961796-127.0.0.1:38716_-n_0000000000) [n:127.0.0.1:38716_    ] o.a.s.c.o.ReplicaMutator Update state numShards=2 message={
   [junit4]   2>   "core":"collection1",
   [junit4]   2>   "roles":null,
   [junit4]   2>   "base_url":"http://127.0.0.1:39451",
   [junit4]   2>   "node_name":"127.0.0.1:39451_",
   [junit4]   2>   "numShards":"2",
   [junit4]   2>   "state":"down",
   [junit4]   2>   "shard":null,
   [junit4]   2>   "collection":"collection1",
   [junit4]   2>   "operation":"state"}
   [junit4]   2> 2171142 INFO  (OverseerStateUpdate-96106016236961796-127.0.0.1:38716_-n_0000000000) [n:127.0.0.1:38716_    ] o.a.s.c.o.ReplicaMutator Collection already exists with numShards=2
   [junit4]   2> 2171142 INFO  (OverseerStateUpdate-96106016236961796-127.0.0.1:38716_-n_0000000000) [n:127.0.0.1:38716_    ] o.a.s.c.o.ReplicaMutator Assigning new node to shard shard=shard2
   [junit4]   2> 2171144 INFO  (coreLoadExecutor-6589-thread-1-processing-n:127.0.0.1:39451_) [n:127.0.0.1:39451_ c:collection1   x:collection1] o.a.s.c.c.ZkStateReader Add data for [collection1] ver [1]
   [junit4]   2> 2171144 INFO  (coreLoadExecutor-6589-thread-1-processing-n:127.0.0.1:39451_) [n:127.0.0.1:39451_ c:collection1   x:collection1] o.a.s.c.ZkController look for our core node name
   [junit4]   2> 2171269 INFO  (OverseerStateUpdate-96106016236961796-127.0.0.1:38716_-n_0000000000) [n:127.0.0.1:38716_    ] o.a.s.c.o.ZkStateWriter going to update_collection /collections/collection1/state.json version: 1
   [junit4]   2> 2171270 INFO  (zkCallback-2547-thread-1-processing-n:127.0.0.1:39451_) [n:127.0.0.1:39451_    ] o.a.s.c.c.ZkStateReader A cluster state change: [WatchedEvent state:SyncConnected type:NodeDataChanged path:/collections/collection1/state.json] for collection [collection1] has occurred - updating... (live nodes size: [2])
   [junit4]   2> 2171271 INFO  (zkCallback-2547-thread-1-processing-n:127.0.0.1:39451_) [n:127.0.0.1:39451_    ] o.a.s.c.c.ZkStateReader Updating data for [collection1] from [1] to [2]
   [junit4]   2> 2172145 INFO  (coreLoadExecutor-6589-thread-1-processing-n:127.0.0.1:39451_) [n:127.0.0.1:39451_ c:collection1   x:collection1] o.a.s.c.ZkController waiting to find shard id in clusterstate for collection1
   [junit4]   2> 2172145 INFO  (coreLoadExecutor-6589-thread-1-processing-n:127.0.0.1:39451_) [n:127.0.0.1:39451_ c:collection1   x:collection1] o.a.s.c.ZkController Check for collection zkNode:collection1
   [junit4]   2> 2172146 INFO  (coreLoadExecutor-6589-thread-1-processing-n:127.0.0.1:39451_) [n:127.0.0.1:39451_ c:collection1   x:collection1] o.a.s.c.ZkController Collection zkNode exists
   [junit4]   2> 2172146 INFO  (coreLoadExecutor-6589-thread-1-processing-n:127.0.0.1:39451_) [n:127.0.0.1:39451_ c:collection1   x:collection1] o.a.s.c.c.ZkStateReader Load collection config from: [/collections/collection1]
   [junit4]   2> 2172147 INFO  (coreLoadExecutor-6589-thread-1-processing-n:127.0.0.1:39451_) [n:127.0.0.1:39451_ c:collection1   x:collection1] o.a.s.c.c.ZkStateReader path=[/collections/collection1] [configName]=[conf1] specified config exists in ZooKeeper
   [junit4]   2> 2172147 INFO  (coreLoadExecutor-6589-thread-1-processing-n:127.0.0.1:39451_) [n:127.0.0.1:39451_ c:collection1   x:collection1] o.a.s.c.SolrResourceLoader new SolrResourceLoader for directory: '/export/home/jenkins/workspace/Lucene-Solr-6.x-Solaris/solr/build/solr-core/test/J0/temp/solr.cloud.CustomCollectionTest_D2F15B8E2C84D2D6-001/shard-1-001/cores/collection1'
   [junit4]   2> 2172147 INFO  (coreLoadExecutor-6589-thread-1-processing-n:127.0.0.1:39451_) [n:127.0.0.1:39451_ c:collection1   x:collection1] o.a.s.c.SolrResourceLoader JNDI not configured for solr (NoInitialContextEx)
   [junit4]   2> 2172147 INFO  (coreLoadExecutor-6589-thread-1-processing-n:127.0.0.1:39451_) [n:127.0.0.1:39451_ c:collection1   x:collection1] o.a.s.c.SolrResourceLoader solr home defaulted to 'solr/' (could not find system property or JNDI)
   [junit4]   2> 2172149 INFO  (coreLoadExecutor-6589-thread-1-processing-n:127.0.0.1:39451_) [n:127.0.0.1:39451_ c:collection1   x:collection1] o.a.s.c.Config loaded config solrconfig.xml with version 0 
   [junit4]   2> 2172154 INFO  (coreLoadExecutor-6589-thread-1-processing-n:127.0.0.1:39451_) [n:127.0.0.1:39451_ c:collection1   x:collection1] o.a.s.c.SolrConfig current version of requestparams : -1
   [junit4]   2> 2172157 INFO  (coreLoadExecutor-6589-thread-1-processing-n:127.0.0.1:39451_) [n:127.0.0.1:39451_ c:collection1   x:collection1] o.a.s.c.SolrConfig Using Lucene MatchVersion: 6.2.0
   [junit4]   2> 2172164 INFO  (coreLoadExecutor-6589-thread-1-processing-n:127.0.0.1:39451_) [n:127.0.0.1:39451_ c:collection1   x:collection1] o.a.s.c.SolrConfig Loaded SolrConfig: solrconfig.xml
   [junit4]   2> 2172168 INFO  (coreLoadExecutor-6589-thread-1-processing-n:127.0.0.1:39451_) [n:127.0.0.1:39451_ c:collection1   x:collection1] o.a.s.s.IndexSchema [collection1] Schema name=test
   [junit4]   2> 2172248 INFO  (coreLoadExecutor-6589-thread-1-processing-n:127.0.0.1:39451_) [n:127.0.0.1:39451_ c:collection1   x:collection1] o.a.s.s.OpenExchangeRatesOrgProvider Initialized with rates=open-exchange-rates.json, refreshInterval=1440.
   [junit4]   2> 2172255 INFO  (coreLoadExecutor-6589-thread-1-processing-n:127

[...truncated too long message...]

ROR    215s J0 | CustomCollectionTest.test <<<
   [junit4]    > Throwable #1: org.apache.solr.client.solrj.impl.HttpSolrClient$RemoteSolrException: Error from server at http://127.0.0.1:57433: collection already exists: implicitcollwithShardField
   [junit4]    > 	at __randomizedtesting.SeedInfo.seed([D2F15B8E2C84D2D6:5AA564548278BF2E]:0)
   [junit4]    > 	at org.apache.solr.client.solrj.impl.HttpSolrClient.executeMethod(HttpSolrClient.java:590)
   [junit4]    > 	at org.apache.solr.client.solrj.impl.HttpSolrClient.request(HttpSolrClient.java:259)
   [junit4]    > 	at org.apache.solr.client.solrj.impl.HttpSolrClient.request(HttpSolrClient.java:248)
   [junit4]    > 	at org.apache.solr.client.solrj.impl.LBHttpSolrClient.doRequest(LBHttpSolrClient.java:403)
   [junit4]    > 	at org.apache.solr.client.solrj.impl.LBHttpSolrClient.request(LBHttpSolrClient.java:356)
   [junit4]    > 	at org.apache.solr.client.solrj.impl.CloudSolrClient.sendRequest(CloudSolrClient.java:1228)
   [junit4]    > 	at org.apache.solr.client.solrj.impl.CloudSolrClient.requestWithRetryOnStaleState(CloudSolrClient.java:998)
   [junit4]    > 	at org.apache.solr.client.solrj.impl.CloudSolrClient.request(CloudSolrClient.java:934)
   [junit4]    > 	at org.apache.solr.client.solrj.SolrClient.request(SolrClient.java:1219)
   [junit4]    > 	at org.apache.solr.cloud.AbstractFullDistribZkTestBase.createCollection(AbstractFullDistribZkTestBase.java:1599)
   [junit4]    > 	at org.apache.solr.cloud.AbstractFullDistribZkTestBase.createCollection(AbstractFullDistribZkTestBase.java:1553)
   [junit4]    > 	at org.apache.solr.cloud.CustomCollectionTest.testCustomCollectionsAPI(CustomCollectionTest.java:285)
   [junit4]    > 	at org.apache.solr.cloud.CustomCollectionTest.test(CustomCollectionTest.java:99)
   [junit4]    > 	at org.apache.solr.BaseDistributedSearchTestCase$ShardsRepeatRule$ShardsFixedStatement.callStatement(BaseDistributedSearchTestCase.java:992)
   [junit4]    > 	at org.apache.solr.BaseDistributedSearchTestCase$ShardsRepeatRule$ShardsStatement.evaluate(BaseDistributedSearchTestCase.java:967)
   [junit4]    > 	at java.lang.Thread.run(Thread.java:745)
   [junit4]   2> 2383226 INFO  (SUITE-CustomCollectionTest-seed#[D2F15B8E2C84D2D6]-worker) [    ] o.a.s.SolrTestCaseJ4 ###deleteCore
   [junit4]   2> NOTE: leaving temporary files on disk at: /export/home/jenkins/workspace/Lucene-Solr-6.x-Solaris/solr/build/solr-core/test/J0/temp/solr.cloud.CustomCollectionTest_D2F15B8E2C84D2D6-001
   [junit4]   2> Jun 20, 2016 10:27:24 PM com.carrotsearch.randomizedtesting.ThreadLeakControl checkThreadLeaks
   [junit4]   2> WARNING: Will linger awaiting termination of 1 leaked thread(s).
   [junit4]   2> NOTE: test params are: codec=Asserting(Lucene62): {other_tl1=PostingsFormat(name=Memory doPackFST= false), range_facet_l_dv=PostingsFormat(name=MockRandom), multiDefault=PostingsFormat(name=LuceneFixedGap), intDefault=PostingsFormat(name=Memory doPackFST= false), a_i1=PostingsFormat(name=LuceneFixedGap), range_facet_l=PostingsFormat(name=LuceneFixedGap), _version_=PostingsFormat(name=Memory doPackFST= false), a_t=PostingsFormat(name=LuceneFixedGap), id=PostingsFormat(name=MockRandom), range_facet_i_dv=PostingsFormat(name=LuceneFixedGap), text=PostingsFormat(name=Asserting), _route_=PostingsFormat(name=Asserting), timestamp=PostingsFormat(name=LuceneFixedGap)}, docValues:{range_facet_l_dv=DocValuesFormat(name=Asserting), range_facet_i_dv=DocValuesFormat(name=Direct), timestamp=DocValuesFormat(name=Direct)}, maxPointsInLeafNode=499, maxMBSortInHeap=6.759069970670639, sim=RandomSimilarity(queryNorm=false,coord=yes): {}, locale=es-BO, timezone=Africa/Bujumbura
   [junit4]   2> NOTE: SunOS 5.11 amd64/Oracle Corporation 1.8.0_92 (64-bit)/cpus=3,threads=1,free=145743528,total=518979584
   [junit4]   2> NOTE: All tests run in this JVM: [TestDistributedSearch, HdfsBasicDistributedZk2Test, TestCollapseQParserPlugin, TestXmlQParser, TestFieldCacheReopen, TestEmbeddedSolrServerConstructors, TestSolrDeletionPolicy1, CircularListTest, TestDFRSimilarityFactory, TestFastLRUCache, TestCollectionAPI, SolrRequestParserTest, TestObjectReleaseTracker, TestCodecSupport, OverseerCollectionConfigSetProcessorTest, SystemInfoHandlerTest, TestHashQParserPlugin, OverseerTest, TestAnalyzedSuggestions, TestRemoteStreaming, TestRawResponseWriter, TestShardHandlerFactory, TestWordDelimiterFilterFactory, PolyFieldTest, XsltUpdateRequestHandlerTest, IndexSchemaTest, TestConfigSetsAPIExclusivity, TestUseDocValuesAsStored, ZkStateReaderTest, TimeZoneUtilsTest, CurrencyFieldXmlFileTest, TestMinMaxOnMultiValuedField, TestNamedUpdateProcessors, BlockDirectoryTest, TestRuleBasedAuthorizationPlugin, MoreLikeThisHandlerTest, TestRecoveryHdfs, AddBlockUpdateTest, DistributedFacetPivotLongTailTest, TestConfigSetProperties, DistributedQueryComponentCustomSortTest, TestComponentsName, TestCollationFieldDocValues, DocValuesTest, TestTrackingShardHandlerFactory, MBeansHandlerTest, HdfsUnloadDistributedZkTest, PreAnalyzedFieldTest, TestSchemaVersionResource, TestSchemaResource, TestCSVLoader, TestFieldCacheSort, TestCloudInspectUtil, TestMiniSolrCloudClusterBase, TestNRTOpen, TestStressReorder, TestBulkSchemaConcurrent, TestQueryWrapperFilter, HLLUtilTest, TestHdfsUpdateLog, TestDocTermOrds, RequestLoggingTest, TestRandomRequestDistribution, HardAutoCommitTest, BlockJoinFacetDistribTest, CdcrReplicationDistributedZkTest, ShardRoutingTest, CursorMarkTest, TestFileDictionaryLookup, DistributedSuggestComponentTest, TestLuceneMatchVersion, TestDynamicFieldResource, AddSchemaFieldsUpdateProcessorFactoryTest, TestHashPartitioner, TestDynamicLoading, TestShortCircuitedRequests, PathHierarchyTokenizerFactoryTest, TestSmileRequest, TestSQLHandler, CursorPagingTest, WrapperMergePolicyFactoryTest, TestPostingsSolrHighlighter, DistribCursorPagingTest, TestRequestStatusCollectionAPI, DeleteLastCustomShardedReplicaTest, BlockJoinFacetSimpleTest, PingRequestHandlerTest, UUIDFieldTest, TestSort, TestLFUCache, CloudExitableDirectoryReaderTest, TestUpdate, UUIDUpdateProcessorFallbackTest, TestSurroundQueryParser, TestNumericTerms64, TestSolrQueryResponse, HdfsThreadLeakTest, TestDocumentBuilder, TestQuerySenderNoQuery, StatelessScriptUpdateProcessorFactoryTest, TestLockTree, StressHdfsTest, SegmentsInfoRequestHandlerTest, TestNoOpRegenerator, TestPseudoReturnFields, DocExpirationUpdateProcessorFactoryTest, DeleteShardTest, HdfsCollectionsAPIDistributedZkTest, TestSolrQueryParserDefaultOperatorResource, DistribJoinFromCollectionTest, TestDownShardTolerantSearch, RequiredFieldsTest, TestLRUCache, AnalysisAfterCoreReloadTest, TestSortByMinMaxFunction, ConnectionManagerTest, TestExactStatsCache, EnumFieldTest, TestDefaultSearchFieldResource, ActionThrottleTest, TestHighlightDedupGrouping, TestDFISimilarityFactory, TestChildDocTransformer, TestSearchPerf, AnalyticsMergeStrategyTest, HdfsDirectoryFactoryTest, SharedFSAutoReplicaFailoverTest, TestJmxIntegration, TestLeaderElectionZkExpiry, OutOfBoxZkACLAndCredentialsProvidersTest, TestManagedSynonymFilterFactory, TermsComponentTest, ReturnFieldsTest, ExternalFileFieldSortTest, TestTolerantUpdateProcessorRandomCloud, TestExpandComponent, RegexBoostProcessorTest, LeaderElectionTest, TestFieldTypeResource, BooleanFieldTest, TestSolrDynamicMBean, CdcrUpdateLogTest, ClusterStateUpdateTest, SaslZkACLProviderTest, PrimitiveFieldTypeTest, TestReplicaProperties, TestSolrConfigHandlerConcurrent, TestUniqueKeyFieldResource, LeaderInitiatedRecoveryOnCommitTest, BasicDistributedZkTest, BasicDistributedZk2Test, CollectionsAPIDistributedZkTest, TestReplicationHandler, PeerSyncTest, BasicFunctionalityTest, DirectUpdateHandlerTest, TestBadConfig, SoftAutoCommitTest, SpellCheckCollatorTest, SuggesterTSTTest, SpatialFilterTest, NoCacheHeaderTest, SolrCoreCheckLockOnStartupTest, QueryEqualityTest, IndexBasedSpellCheckerTest, DisMaxRequestHandlerTest, StandardRequestHandlerTest, DirectSolrSpellCheckerTest, TestReversedWildcardFilterFactory, DocumentAnalysisRequestHandlerTest, TestOmitPositions, XmlUpdateRequestHandlerTest, RequestHandlersTest, TermVectorComponentTest, TestArbitraryIndexDir, TestCollationField, UpdateRequestProcessorFactoryTest, JsonLoaderTest, SearchHandlerTest, EchoParamsTest, TestLMDirichletSimilarityFactory, TestLMJelinekMercerSimilarityFactory, TestBM25SimilarityFactory, TestJmxMonitoredMap, URLClassifyProcessorTest, ChaosMonkeyNothingIsSafeTest, CdcrRequestHandlerTest, CollectionStateFormat2Test, CollectionsAPIAsyncDistributedZkTest, ConcurrentDeleteAndCreateCollectionTest, CreateCollectionCleanupTest, CustomCollectionTest]
   [junit4] Completed [463/615 (1!)] on J0 in 215.87s, 1 test, 1 error <<< FAILURES!

[...truncated 483 lines...]
BUILD FAILED
/export/home/jenkins/workspace/Lucene-Solr-6.x-Solaris/build.xml:740: The following error occurred while executing this line:
/export/home/jenkins/workspace/Lucene-Solr-6.x-Solaris/build.xml:684: The following error occurred while executing this line:
/export/home/jenkins/workspace/Lucene-Solr-6.x-Solaris/build.xml:59: The following error occurred while executing this line:
/export/home/jenkins/workspace/Lucene-Solr-6.x-Solaris/solr/build.xml:233: The following error occurred while executing this line:
/export/home/jenkins/workspace/Lucene-Solr-6.x-Solaris/solr/common-build.xml:530: The following error occurred while executing this line:
/export/home/jenkins/workspace/Lucene-Solr-6.x-Solaris/lucene/common-build.xml:1427: The following error occurred while executing this line:
/export/home/jenkins/workspace/Lucene-Solr-6.x-Solaris/lucene/common-build.xml:984: There were test failures: 615 suites (10 ignored), 2591 tests, 1 error, 87 ignored (72 assumptions) [seed: D2F15B8E2C84D2D6]

Total time: 82 minutes 6 seconds
Build step 'Invoke Ant' marked build as failure
Archiving artifacts
[WARNINGS] Skipping publisher since build result is FAILURE
Recording test results
Email was triggered for: Failure - Any
Sending email for trigger: Failure - Any



Mime
View raw message