lucene-dev mailing list archives

Site index · List index
Message view « Date » · « Thread »
Top « Date » · « Thread »
From Apache Jenkins Server <jenk...@builds.apache.org>
Subject [JENKINS] Lucene-Solr-NightlyTests-6.x - Build # 86 - Still Failing
Date Tue, 07 Jun 2016 17:19:20 GMT
Build: https://builds.apache.org/job/Lucene-Solr-NightlyTests-6.x/86/

5 tests failed.
FAILED:  org.apache.lucene.codecs.lucene50.TestLucene50StoredFieldsFormat.testBigDocuments

Error Message:
Java heap space

Stack Trace:
java.lang.OutOfMemoryError: Java heap space
	at __randomizedtesting.SeedInfo.seed([99D71B43BB1A02A:F8B72BEB889D0E0D]:0)
	at org.apache.lucene.codecs.compressing.CompressingStoredFieldsReader.readField(CompressingStoredFieldsReader.java:214)
	at org.apache.lucene.codecs.compressing.CompressingStoredFieldsReader.visitDocument(CompressingStoredFieldsReader.java:595)
	at org.apache.lucene.index.CodecReader.document(CodecReader.java:88)
	at org.apache.lucene.index.BaseCompositeReader.document(BaseCompositeReader.java:118)
	at org.apache.lucene.index.IndexReader.document(IndexReader.java:368)
	at org.apache.lucene.index.BaseStoredFieldsFormatTestCase.testBigDocuments(BaseStoredFieldsFormatTestCase.java:719)
	at sun.reflect.NativeMethodAccessorImpl.invoke0(Native Method)
	at sun.reflect.NativeMethodAccessorImpl.invoke(NativeMethodAccessorImpl.java:62)
	at sun.reflect.DelegatingMethodAccessorImpl.invoke(DelegatingMethodAccessorImpl.java:43)
	at java.lang.reflect.Method.invoke(Method.java:498)
	at com.carrotsearch.randomizedtesting.RandomizedRunner.invoke(RandomizedRunner.java:1764)
	at com.carrotsearch.randomizedtesting.RandomizedRunner$8.evaluate(RandomizedRunner.java:871)
	at com.carrotsearch.randomizedtesting.RandomizedRunner$9.evaluate(RandomizedRunner.java:907)
	at com.carrotsearch.randomizedtesting.RandomizedRunner$10.evaluate(RandomizedRunner.java:921)
	at org.apache.lucene.util.TestRuleSetupTeardownChained$1.evaluate(TestRuleSetupTeardownChained.java:49)
	at org.apache.lucene.util.AbstractBeforeAfterRule$1.evaluate(AbstractBeforeAfterRule.java:45)
	at org.apache.lucene.util.TestRuleThreadAndTestName$1.evaluate(TestRuleThreadAndTestName.java:48)
	at org.apache.lucene.util.TestRuleIgnoreAfterMaxFailures$1.evaluate(TestRuleIgnoreAfterMaxFailures.java:64)
	at org.apache.lucene.util.TestRuleMarkFailure$1.evaluate(TestRuleMarkFailure.java:47)
	at com.carrotsearch.randomizedtesting.rules.StatementAdapter.evaluate(StatementAdapter.java:36)
	at com.carrotsearch.randomizedtesting.ThreadLeakControl$StatementRunner.run(ThreadLeakControl.java:367)
	at com.carrotsearch.randomizedtesting.ThreadLeakControl.forkTimeoutingTask(ThreadLeakControl.java:809)
	at com.carrotsearch.randomizedtesting.ThreadLeakControl$3.evaluate(ThreadLeakControl.java:460)
	at com.carrotsearch.randomizedtesting.RandomizedRunner.runSingleTest(RandomizedRunner.java:880)
	at com.carrotsearch.randomizedtesting.RandomizedRunner$5.evaluate(RandomizedRunner.java:781)
	at com.carrotsearch.randomizedtesting.RandomizedRunner$6.evaluate(RandomizedRunner.java:816)
	at com.carrotsearch.randomizedtesting.RandomizedRunner$7.evaluate(RandomizedRunner.java:827)
	at org.apache.lucene.util.AbstractBeforeAfterRule$1.evaluate(AbstractBeforeAfterRule.java:45)
	at com.carrotsearch.randomizedtesting.rules.StatementAdapter.evaluate(StatementAdapter.java:36)
	at org.apache.lucene.util.TestRuleStoreClassName$1.evaluate(TestRuleStoreClassName.java:41)
	at com.carrotsearch.randomizedtesting.rules.NoShadowingOrOverridesOnMethodsRule$1.evaluate(NoShadowingOrOverridesOnMethodsRule.java:40)
	at com.carrotsearch.randomizedtesting.rules.NoShadowingOrOverridesOnMethodsRule$1.evaluate(NoShadowingOrOverridesOnMethodsRule.java:40)


FAILED:  org.apache.lucene.index.TestIndexWriterMaxDocs.testAddTooManyIndexesDir

Error Message:
GC overhead limit exceeded

Stack Trace:
java.lang.OutOfMemoryError: GC overhead limit exceeded
	at __randomizedtesting.SeedInfo.seed([99D71B43BB1A02A:B916F69BA420CC60]:0)
	at java.util.Arrays.copyOfRange(Arrays.java:3664)
	at java.lang.String.<init>(String.java:207)
	at java.lang.StringBuilder.toString(StringBuilder.java:407)
	at org.apache.lucene.store.MockIndexInputWrapper.toString(MockIndexInputWrapper.java:215)
	at java.lang.String.valueOf(String.java:2994)
	at java.lang.StringBuilder.append(StringBuilder.java:131)
	at org.apache.lucene.store.BufferedChecksumIndexInput.<init>(BufferedChecksumIndexInput.java:34)
	at org.apache.lucene.store.Directory.openChecksumInput(Directory.java:113)
	at org.apache.lucene.codecs.lucene50.Lucene50SegmentInfoFormat.read(Lucene50SegmentInfoFormat.java:82)
	at org.apache.lucene.index.SegmentInfos.readCommit(SegmentInfos.java:350)
	at org.apache.lucene.index.SegmentInfos.readCommit(SegmentInfos.java:284)
	at org.apache.lucene.index.SegmentInfos$1.doBody(SegmentInfos.java:441)
	at org.apache.lucene.index.SegmentInfos$1.doBody(SegmentInfos.java:438)
	at org.apache.lucene.index.SegmentInfos$FindSegmentsFile.run(SegmentInfos.java:685)
	at org.apache.lucene.index.SegmentInfos$FindSegmentsFile.run(SegmentInfos.java:637)
	at org.apache.lucene.index.SegmentInfos.readLatestCommit(SegmentInfos.java:443)
	at org.apache.lucene.index.IndexWriter.addIndexes(IndexWriter.java:2502)
	at org.apache.lucene.index.TestIndexWriterMaxDocs.testAddTooManyIndexesDir(TestIndexWriterMaxDocs.java:386)
	at sun.reflect.NativeMethodAccessorImpl.invoke0(Native Method)
	at sun.reflect.NativeMethodAccessorImpl.invoke(NativeMethodAccessorImpl.java:62)
	at sun.reflect.DelegatingMethodAccessorImpl.invoke(DelegatingMethodAccessorImpl.java:43)
	at java.lang.reflect.Method.invoke(Method.java:498)
	at com.carrotsearch.randomizedtesting.RandomizedRunner.invoke(RandomizedRunner.java:1764)
	at com.carrotsearch.randomizedtesting.RandomizedRunner$8.evaluate(RandomizedRunner.java:871)
	at com.carrotsearch.randomizedtesting.RandomizedRunner$9.evaluate(RandomizedRunner.java:907)
	at com.carrotsearch.randomizedtesting.RandomizedRunner$10.evaluate(RandomizedRunner.java:921)
	at org.apache.lucene.util.TestRuleSetupTeardownChained$1.evaluate(TestRuleSetupTeardownChained.java:49)
	at org.apache.lucene.util.AbstractBeforeAfterRule$1.evaluate(AbstractBeforeAfterRule.java:45)
	at org.apache.lucene.util.TestRuleThreadAndTestName$1.evaluate(TestRuleThreadAndTestName.java:48)
	at org.apache.lucene.util.TestRuleIgnoreAfterMaxFailures$1.evaluate(TestRuleIgnoreAfterMaxFailures.java:64)
	at org.apache.lucene.util.TestRuleMarkFailure$1.evaluate(TestRuleMarkFailure.java:47)
	at com.carrotsearch.randomizedtesting.rules.StatementAdapter.evaluate(StatementAdapter.java:36)


FAILED:  junit.framework.TestSuite.org.apache.lucene.search.TestBoolean2

Error Message:
GC overhead limit exceeded

Stack Trace:
java.lang.OutOfMemoryError: GC overhead limit exceeded
	at __randomizedtesting.SeedInfo.seed([99D71B43BB1A02A]:0)
	at java.lang.Integer.toString(Integer.java:401)
	at org.apache.lucene.codecs.simpletext.SimpleTextStoredFieldsWriter.startDocument(SimpleTextStoredFieldsWriter.java:81)
	at org.apache.lucene.codecs.StoredFieldsWriter.merge(StoredFieldsWriter.java:97)
	at org.apache.lucene.index.SegmentMerger.mergeFields(SegmentMerger.java:195)
	at org.apache.lucene.index.SegmentMerger.merge(SegmentMerger.java:84)
	at org.apache.lucene.index.IndexWriter.mergeMiddle(IndexWriter.java:4099)
	at org.apache.lucene.index.IndexWriter.merge(IndexWriter.java:3679)
	at org.apache.lucene.index.SerialMergeScheduler.merge(SerialMergeScheduler.java:40)
	at org.apache.lucene.index.IndexWriter.maybeMerge(IndexWriter.java:1946)
	at org.apache.lucene.index.IndexWriter.doAfterSegmentFlushed(IndexWriter.java:4741)
	at org.apache.lucene.index.DocumentsWriter$MergePendingEvent.process(DocumentsWriter.java:689)
	at org.apache.lucene.index.IndexWriter.processEvents(IndexWriter.java:4779)
	at org.apache.lucene.index.IndexWriter.processEvents(IndexWriter.java:4770)
	at org.apache.lucene.index.IndexWriter.updateDocument(IndexWriter.java:1493)
	at org.apache.lucene.index.IndexWriter.addDocument(IndexWriter.java:1271)
	at org.apache.lucene.index.RandomIndexWriter.addDocument(RandomIndexWriter.java:170)
	at org.apache.lucene.search.TestBoolean2.beforeClass(TestBoolean2.java:138)
	at sun.reflect.NativeMethodAccessorImpl.invoke0(Native Method)
	at sun.reflect.NativeMethodAccessorImpl.invoke(NativeMethodAccessorImpl.java:62)
	at sun.reflect.DelegatingMethodAccessorImpl.invoke(DelegatingMethodAccessorImpl.java:43)
	at java.lang.reflect.Method.invoke(Method.java:498)
	at com.carrotsearch.randomizedtesting.RandomizedRunner.invoke(RandomizedRunner.java:1764)
	at com.carrotsearch.randomizedtesting.RandomizedRunner$6.evaluate(RandomizedRunner.java:811)
	at com.carrotsearch.randomizedtesting.RandomizedRunner$7.evaluate(RandomizedRunner.java:827)
	at org.apache.lucene.util.AbstractBeforeAfterRule$1.evaluate(AbstractBeforeAfterRule.java:45)
	at com.carrotsearch.randomizedtesting.rules.StatementAdapter.evaluate(StatementAdapter.java:36)
	at org.apache.lucene.util.TestRuleStoreClassName$1.evaluate(TestRuleStoreClassName.java:41)
	at com.carrotsearch.randomizedtesting.rules.NoShadowingOrOverridesOnMethodsRule$1.evaluate(NoShadowingOrOverridesOnMethodsRule.java:40)
	at com.carrotsearch.randomizedtesting.rules.NoShadowingOrOverridesOnMethodsRule$1.evaluate(NoShadowingOrOverridesOnMethodsRule.java:40)
	at com.carrotsearch.randomizedtesting.rules.StatementAdapter.evaluate(StatementAdapter.java:36)
	at com.carrotsearch.randomizedtesting.rules.StatementAdapter.evaluate(StatementAdapter.java:36)
	at com.carrotsearch.randomizedtesting.rules.StatementAdapter.evaluate(StatementAdapter.java:36)


FAILED:  junit.framework.TestSuite.org.apache.lucene.search.TestBoolean2

Error Message:


Stack Trace:
java.lang.NullPointerException
	at __randomizedtesting.SeedInfo.seed([99D71B43BB1A02A]:0)
	at org.apache.lucene.search.TestBoolean2.afterClass(TestBoolean2.java:147)
	at sun.reflect.NativeMethodAccessorImpl.invoke0(Native Method)
	at sun.reflect.NativeMethodAccessorImpl.invoke(NativeMethodAccessorImpl.java:62)
	at sun.reflect.DelegatingMethodAccessorImpl.invoke(DelegatingMethodAccessorImpl.java:43)
	at java.lang.reflect.Method.invoke(Method.java:498)
	at com.carrotsearch.randomizedtesting.RandomizedRunner.invoke(RandomizedRunner.java:1764)
	at com.carrotsearch.randomizedtesting.RandomizedRunner$7.evaluate(RandomizedRunner.java:834)
	at org.apache.lucene.util.AbstractBeforeAfterRule$1.evaluate(AbstractBeforeAfterRule.java:45)
	at com.carrotsearch.randomizedtesting.rules.StatementAdapter.evaluate(StatementAdapter.java:36)
	at org.apache.lucene.util.TestRuleStoreClassName$1.evaluate(TestRuleStoreClassName.java:41)
	at com.carrotsearch.randomizedtesting.rules.NoShadowingOrOverridesOnMethodsRule$1.evaluate(NoShadowingOrOverridesOnMethodsRule.java:40)
	at com.carrotsearch.randomizedtesting.rules.NoShadowingOrOverridesOnMethodsRule$1.evaluate(NoShadowingOrOverridesOnMethodsRule.java:40)
	at com.carrotsearch.randomizedtesting.rules.StatementAdapter.evaluate(StatementAdapter.java:36)
	at com.carrotsearch.randomizedtesting.rules.StatementAdapter.evaluate(StatementAdapter.java:36)
	at com.carrotsearch.randomizedtesting.rules.StatementAdapter.evaluate(StatementAdapter.java:36)
	at org.apache.lucene.util.TestRuleAssertionsRequired$1.evaluate(TestRuleAssertionsRequired.java:53)
	at org.apache.lucene.util.TestRuleMarkFailure$1.evaluate(TestRuleMarkFailure.java:47)
	at org.apache.lucene.util.TestRuleIgnoreAfterMaxFailures$1.evaluate(TestRuleIgnoreAfterMaxFailures.java:64)
	at org.apache.lucene.util.TestRuleIgnoreTestSuites$1.evaluate(TestRuleIgnoreTestSuites.java:54)
	at com.carrotsearch.randomizedtesting.rules.StatementAdapter.evaluate(StatementAdapter.java:36)
	at com.carrotsearch.randomizedtesting.ThreadLeakControl$StatementRunner.run(ThreadLeakControl.java:367)
	at java.lang.Thread.run(Thread.java:745)


FAILED:  org.apache.lucene.util.automaton.TestMinimize.testMinimizeHuge

Error Message:
GC overhead limit exceeded

Stack Trace:
java.lang.OutOfMemoryError: GC overhead limit exceeded
	at __randomizedtesting.SeedInfo.seed([99D71B43BB1A02A:3567AE9CA92EB44B]:0)
	at java.lang.Integer.valueOf(Integer.java:832)
	at org.apache.lucene.util.automaton.MinimizationOperations.minimize(MinimizationOperations.java:99)
	at org.apache.lucene.util.automaton.RegExp.toAutomatonInternal(RegExp.java:524)
	at org.apache.lucene.util.automaton.RegExp.toAutomaton(RegExp.java:495)
	at org.apache.lucene.util.automaton.RegExp.toAutomaton(RegExp.java:445)
	at org.apache.lucene.util.automaton.TestMinimize.testMinimizeHuge(TestMinimize.java:68)
	at sun.reflect.NativeMethodAccessorImpl.invoke0(Native Method)
	at sun.reflect.NativeMethodAccessorImpl.invoke(NativeMethodAccessorImpl.java:62)
	at sun.reflect.DelegatingMethodAccessorImpl.invoke(DelegatingMethodAccessorImpl.java:43)
	at java.lang.reflect.Method.invoke(Method.java:498)
	at com.carrotsearch.randomizedtesting.RandomizedRunner.invoke(RandomizedRunner.java:1764)
	at com.carrotsearch.randomizedtesting.RandomizedRunner$8.evaluate(RandomizedRunner.java:871)
	at com.carrotsearch.randomizedtesting.RandomizedRunner$9.evaluate(RandomizedRunner.java:907)
	at com.carrotsearch.randomizedtesting.RandomizedRunner$10.evaluate(RandomizedRunner.java:921)
	at org.apache.lucene.util.TestRuleSetupTeardownChained$1.evaluate(TestRuleSetupTeardownChained.java:49)
	at org.apache.lucene.util.AbstractBeforeAfterRule$1.evaluate(AbstractBeforeAfterRule.java:45)
	at org.apache.lucene.util.TestRuleThreadAndTestName$1.evaluate(TestRuleThreadAndTestName.java:48)
	at org.apache.lucene.util.TestRuleIgnoreAfterMaxFailures$1.evaluate(TestRuleIgnoreAfterMaxFailures.java:64)
	at org.apache.lucene.util.TestRuleMarkFailure$1.evaluate(TestRuleMarkFailure.java:47)
	at com.carrotsearch.randomizedtesting.rules.StatementAdapter.evaluate(StatementAdapter.java:36)
	at com.carrotsearch.randomizedtesting.ThreadLeakControl$StatementRunner.run(ThreadLeakControl.java:367)
	at com.carrotsearch.randomizedtesting.ThreadLeakControl.forkTimeoutingTask(ThreadLeakControl.java:809)
	at com.carrotsearch.randomizedtesting.ThreadLeakControl$3.evaluate(ThreadLeakControl.java:460)
	at com.carrotsearch.randomizedtesting.RandomizedRunner.runSingleTest(RandomizedRunner.java:880)
	at com.carrotsearch.randomizedtesting.RandomizedRunner$5.evaluate(RandomizedRunner.java:781)
	at com.carrotsearch.randomizedtesting.RandomizedRunner$6.evaluate(RandomizedRunner.java:816)
	at com.carrotsearch.randomizedtesting.RandomizedRunner$7.evaluate(RandomizedRunner.java:827)
	at org.apache.lucene.util.AbstractBeforeAfterRule$1.evaluate(AbstractBeforeAfterRule.java:45)
	at com.carrotsearch.randomizedtesting.rules.StatementAdapter.evaluate(StatementAdapter.java:36)
	at org.apache.lucene.util.TestRuleStoreClassName$1.evaluate(TestRuleStoreClassName.java:41)
	at com.carrotsearch.randomizedtesting.rules.NoShadowingOrOverridesOnMethodsRule$1.evaluate(NoShadowingOrOverridesOnMethodsRule.java:40)
	at com.carrotsearch.randomizedtesting.rules.NoShadowingOrOverridesOnMethodsRule$1.evaluate(NoShadowingOrOverridesOnMethodsRule.java:40)




Build Log:
[...truncated 685 lines...]
   [junit4] Suite: org.apache.lucene.search.TestBoolean2
   [junit4]   2> NOTE: test params are: codec=SimpleText, sim=RandomSimilarity(queryNorm=true,coord=crazy):
{field=DFR I(F)3(800.0), field2=IB LL-D1}, locale=ar-SD, timezone=Africa/Mbabane
   [junit4]   2> NOTE: Linux 3.13.0-85-generic amd64/Oracle Corporation 1.8.0_74 (64-bit)/cpus=4,threads=1,free=128946152,total=477626368
   [junit4]   2> NOTE: All tests run in this JVM: [TestSegmentMerger, TestSegmentInfos,
TestRateLimiter, TestBagOfPostings, TestOmitNorms, TestGeoEncodingUtils, TestSparseFixedBitDocIdSet,
TestFSTs, TestRollingBuffer, TestLucene50StoredFieldsFormatHighCompression, TestPolygon2D,
TestNRTReaderCleanup, TestSmallFloat, TestFieldMaskingSpanQuery, TestByteArrayDataInput, TestPayloads,
TestGrowableByteArrayDataOutput, TestRecyclingIntBlockAllocator, TestDocument, TestFieldsReader,
TestSpanMultiTermQueryWrapper, TestSpanNotQuery, TestIndexWriterExceptions, MultiCollectorTest,
TestPrefixInBooleanQuery, TestBoolean2]
   [junit4]   2> NOTE: download the large Jenkins line-docs file by running 'ant get-jenkins-line-docs'
in the lucene directory.
   [junit4]   2> NOTE: reproduce with: ant test  -Dtestcase=TestBoolean2 -Dtests.seed=99D71B43BB1A02A
-Dtests.multiplier=2 -Dtests.nightly=true -Dtests.slow=true -Dtests.linedocsfile=/x1/jenkins/lucene-data/enwiki.random.lines.txt
-Dtests.locale=ar-SD -Dtests.timezone=Africa/Mbabane -Dtests.asserts=true -Dtests.file.encoding=US-ASCII
   [junit4] ERROR   0.00s J1 | TestBoolean2 (suite) <<<
   [junit4]    > Throwable #1: java.lang.OutOfMemoryError: GC overhead limit exceeded
   [junit4]    > 	at __randomizedtesting.SeedInfo.seed([99D71B43BB1A02A]:0)
   [junit4]    > 	at java.lang.Integer.toString(Integer.java:401)
   [junit4]    > 	at org.apache.lucene.codecs.simpletext.SimpleTextStoredFieldsWriter.startDocument(SimpleTextStoredFieldsWriter.java:81)
   [junit4]    > 	at org.apache.lucene.codecs.StoredFieldsWriter.merge(StoredFieldsWriter.java:97)
   [junit4]    > 	at org.apache.lucene.index.SegmentMerger.mergeFields(SegmentMerger.java:195)
   [junit4]    > 	at org.apache.lucene.index.SegmentMerger.merge(SegmentMerger.java:84)
   [junit4]    > 	at org.apache.lucene.index.IndexWriter.mergeMiddle(IndexWriter.java:4099)
   [junit4]    > 	at org.apache.lucene.index.IndexWriter.merge(IndexWriter.java:3679)
   [junit4]    > 	at org.apache.lucene.index.SerialMergeScheduler.merge(SerialMergeScheduler.java:40)
   [junit4]    > 	at org.apache.lucene.index.IndexWriter.maybeMerge(IndexWriter.java:1946)
   [junit4]    > 	at org.apache.lucene.index.IndexWriter.doAfterSegmentFlushed(IndexWriter.java:4741)
   [junit4]    > 	at org.apache.lucene.index.DocumentsWriter$MergePendingEvent.process(DocumentsWriter.java:689)
   [junit4]    > 	at org.apache.lucene.index.IndexWriter.processEvents(IndexWriter.java:4779)
   [junit4]    > 	at org.apache.lucene.index.IndexWriter.processEvents(IndexWriter.java:4770)
   [junit4]    > 	at org.apache.lucene.index.IndexWriter.updateDocument(IndexWriter.java:1493)
   [junit4]    > 	at org.apache.lucene.index.IndexWriter.addDocument(IndexWriter.java:1271)
   [junit4]    > 	at org.apache.lucene.index.RandomIndexWriter.addDocument(RandomIndexWriter.java:170)
   [junit4]    > 	at org.apache.lucene.search.TestBoolean2.beforeClass(TestBoolean2.java:138)Throwable
#2: java.lang.NullPointerException
   [junit4]    > 	at __randomizedtesting.SeedInfo.seed([99D71B43BB1A02A]:0)
   [junit4]    > 	at org.apache.lucene.search.TestBoolean2.afterClass(TestBoolean2.java:147)
   [junit4]    > 	at java.lang.Thread.run(Thread.java:745)
   [junit4] Completed [143/422 (1!)] on J1 in 91.92s, 0 tests, 2 errors <<< FAILURES!

[...truncated 66 lines...]
   [junit4] Suite: org.apache.lucene.index.TestIndexWriterMaxDocs
   [junit4]   2> NOTE: download the large Jenkins line-docs file by running 'ant get-jenkins-line-docs'
in the lucene directory.
   [junit4]   2> NOTE: reproduce with: ant test  -Dtestcase=TestIndexWriterMaxDocs -Dtests.method=testAddTooManyIndexesDir
-Dtests.seed=99D71B43BB1A02A -Dtests.multiplier=2 -Dtests.nightly=true -Dtests.slow=true -Dtests.linedocsfile=/x1/jenkins/lucene-data/enwiki.random.lines.txt
-Dtests.locale=es-AR -Dtests.timezone=America/St_Vincent -Dtests.asserts=true -Dtests.file.encoding=US-ASCII
   [junit4] ERROR   80.6s J1 | TestIndexWriterMaxDocs.testAddTooManyIndexesDir <<<
   [junit4]    > Throwable #1: java.lang.OutOfMemoryError: GC overhead limit exceeded
   [junit4]    > 	at __randomizedtesting.SeedInfo.seed([99D71B43BB1A02A:B916F69BA420CC60]:0)
   [junit4]    > 	at java.util.Arrays.copyOfRange(Arrays.java:3664)
   [junit4]    > 	at java.lang.String.<init>(String.java:207)
   [junit4]    > 	at java.lang.StringBuilder.toString(StringBuilder.java:407)
   [junit4]    > 	at org.apache.lucene.store.MockIndexInputWrapper.toString(MockIndexInputWrapper.java:215)
   [junit4]    > 	at java.lang.String.valueOf(String.java:2994)
   [junit4]    > 	at java.lang.StringBuilder.append(StringBuilder.java:131)
   [junit4]    > 	at org.apache.lucene.store.BufferedChecksumIndexInput.<init>(BufferedChecksumIndexInput.java:34)
   [junit4]    > 	at org.apache.lucene.store.Directory.openChecksumInput(Directory.java:113)
   [junit4]    > 	at org.apache.lucene.codecs.lucene50.Lucene50SegmentInfoFormat.read(Lucene50SegmentInfoFormat.java:82)
   [junit4]    > 	at org.apache.lucene.index.SegmentInfos.readCommit(SegmentInfos.java:350)
   [junit4]    > 	at org.apache.lucene.index.SegmentInfos.readCommit(SegmentInfos.java:284)
   [junit4]    > 	at org.apache.lucene.index.SegmentInfos$1.doBody(SegmentInfos.java:441)
   [junit4]    > 	at org.apache.lucene.index.SegmentInfos$1.doBody(SegmentInfos.java:438)
   [junit4]    > 	at org.apache.lucene.index.SegmentInfos$FindSegmentsFile.run(SegmentInfos.java:685)
   [junit4]    > 	at org.apache.lucene.index.SegmentInfos$FindSegmentsFile.run(SegmentInfos.java:637)
   [junit4]    > 	at org.apache.lucene.index.SegmentInfos.readLatestCommit(SegmentInfos.java:443)
   [junit4]    > 	at org.apache.lucene.index.IndexWriter.addIndexes(IndexWriter.java:2502)
   [junit4]    > 	at org.apache.lucene.index.TestIndexWriterMaxDocs.testAddTooManyIndexesDir(TestIndexWriterMaxDocs.java:386)
   [junit4] IGNOR/A 0.00s J1 | TestIndexWriterMaxDocs.testExactlyAtTrueLimit
   [junit4]    > Assumption #1: 'monster' test group is disabled (@Monster(value=takes
over two hours))
   [junit4]   2> NOTE: leaving temporary files on disk at: /x1/jenkins/jenkins-slave/workspace/Lucene-Solr-NightlyTests-6.x/lucene/build/core/test/J1/temp/lucene.index.TestIndexWriterMaxDocs_99D71B43BB1A02A-001
   [junit4]   2> NOTE: test params are: codec=Lucene60, sim=RandomSimilarity(queryNorm=false,coord=crazy):
{}, locale=es-AR, timezone=America/St_Vincent
   [junit4]   2> NOTE: Linux 3.13.0-85-generic amd64/Oracle Corporation 1.8.0_74 (64-bit)/cpus=4,threads=1,free=78538328,total=477626368
   [junit4]   2> NOTE: All tests run in this JVM: [TestSegmentMerger, TestSegmentInfos,
TestRateLimiter, TestBagOfPostings, TestOmitNorms, TestGeoEncodingUtils, TestSparseFixedBitDocIdSet,
TestFSTs, TestRollingBuffer, TestLucene50StoredFieldsFormatHighCompression, TestPolygon2D,
TestNRTReaderCleanup, TestSmallFloat, TestFieldMaskingSpanQuery, TestByteArrayDataInput, TestPayloads,
TestGrowableByteArrayDataOutput, TestRecyclingIntBlockAllocator, TestDocument, TestFieldsReader,
TestSpanMultiTermQueryWrapper, TestSpanNotQuery, TestIndexWriterExceptions, MultiCollectorTest,
TestPrefixInBooleanQuery, TestBoolean2, TestSynonymQuery, TestSetOnce, TestSimilarityBase,
TestPositionIncrement, TestBlockPostingsFormat3, TestLegacyNumericUtils, TestSameTokenSamePosition,
TestIndexWriterNRTIsCurrent, TestFieldReuse, TestSnapshotDeletionPolicy, TestIndexWriterMaxDocs]
   [junit4] Completed [165/422 (2!)] on J1 in 81.95s, 21 tests, 1 error, 1 skipped <<<
FAILURES!

[...truncated 224 lines...]
   [junit4] Suite: org.apache.lucene.util.automaton.TestMinimize
   [junit4]   2> NOTE: download the large Jenkins line-docs file by running 'ant get-jenkins-line-docs'
in the lucene directory.
   [junit4]   2> NOTE: reproduce with: ant test  -Dtestcase=TestMinimize -Dtests.method=testMinimizeHuge
-Dtests.seed=99D71B43BB1A02A -Dtests.multiplier=2 -Dtests.nightly=true -Dtests.slow=true -Dtests.linedocsfile=/x1/jenkins/lucene-data/enwiki.random.lines.txt
-Dtests.locale=uk -Dtests.timezone=Pacific/Niue -Dtests.asserts=true -Dtests.file.encoding=US-ASCII
   [junit4] ERROR   26.2s J1 | TestMinimize.testMinimizeHuge <<<
   [junit4]    > Throwable #1: java.lang.OutOfMemoryError: GC overhead limit exceeded
   [junit4]    > 	at __randomizedtesting.SeedInfo.seed([99D71B43BB1A02A:3567AE9CA92EB44B]:0)
   [junit4]    > 	at java.lang.Integer.valueOf(Integer.java:832)
   [junit4]    > 	at org.apache.lucene.util.automaton.MinimizationOperations.minimize(MinimizationOperations.java:99)
   [junit4]    > 	at org.apache.lucene.util.automaton.RegExp.toAutomatonInternal(RegExp.java:524)
   [junit4]    > 	at org.apache.lucene.util.automaton.RegExp.toAutomaton(RegExp.java:495)
   [junit4]    > 	at org.apache.lucene.util.automaton.RegExp.toAutomaton(RegExp.java:445)
   [junit4]    > 	at org.apache.lucene.util.automaton.TestMinimize.testMinimizeHuge(TestMinimize.java:68)
   [junit4]   2> NOTE: test params are: codec=Asserting(Lucene60): {}, docValues:{}, maxPointsInLeafNode=1534,
maxMBSortInHeap=5.530434848905285, sim=RandomSimilarity(queryNorm=true,coord=yes): {}, locale=uk,
timezone=Pacific/Niue
   [junit4]   2> NOTE: Linux 3.13.0-85-generic amd64/Oracle Corporation 1.8.0_74 (64-bit)/cpus=4,threads=1,free=94313880,total=477626368
   [junit4]   2> NOTE: All tests run in this JVM: [TestSegmentMerger, TestSegmentInfos,
TestRateLimiter, TestBagOfPostings, TestOmitNorms, TestGeoEncodingUtils, TestSparseFixedBitDocIdSet,
TestFSTs, TestRollingBuffer, TestLucene50StoredFieldsFormatHighCompression, TestPolygon2D,
TestNRTReaderCleanup, TestSmallFloat, TestFieldMaskingSpanQuery, TestByteArrayDataInput, TestPayloads,
TestGrowableByteArrayDataOutput, TestRecyclingIntBlockAllocator, TestDocument, TestFieldsReader,
TestSpanMultiTermQueryWrapper, TestSpanNotQuery, TestIndexWriterExceptions, MultiCollectorTest,
TestPrefixInBooleanQuery, TestBoolean2, TestSynonymQuery, TestSetOnce, TestSimilarityBase,
TestPositionIncrement, TestBlockPostingsFormat3, TestLegacyNumericUtils, TestSameTokenSamePosition,
TestIndexWriterNRTIsCurrent, TestFieldReuse, TestSnapshotDeletionPolicy, TestIndexWriterMaxDocs,
TestStressAdvance, TestMultiCollector, TestNeedsScores, TestBytesRefArray, TestReqExclBulkScorer,
TestIndexWriterDeleteByQuery, TestSpanCollection, TestRollback, TestScorerPerf, TestBytesRefAttImpl,
TestAssertions, TestOperations, Test2BSortedDocValuesOrds, TestSimpleExplanations, TestNumericUtils,
TestTopFieldCollector, TestPostingsOffsets, TestHugeRamFile, TestFlex, TestBooleanScorer,
TestTragicIndexWriterDeadlock, TestRamUsageEstimator, TestNRTReaderWithThreads, TestStressNRT,
TestRoaringDocIdSet, TestCachingTokenFilter, TestPrefixRandom, TestOmitPositions, TestLucene50FieldInfoFormat,
TestBooleanCoord, TestRAMDirectory, TestLevenshteinAutomata, TestMathUtil, TestPersistentSnapshotDeletionPolicy,
TestAtomicUpdate, TestDirectoryReaderReopen, TestSearchWithThreads, TestSearchAfter, TestConcurrentMergeScheduler,
TestNeverDelete, TestTopDocsMerge, TestStressIndexing, TestMinimize]
   [junit4] Completed [234/422 (3!)] on J1 in 31.35s, 3 tests, 1 error <<< FAILURES!

[...truncated 353 lines...]
   [junit4] Suite: org.apache.lucene.codecs.lucene50.TestLucene50StoredFieldsFormat
   [junit4]   2> NOTE: download the large Jenkins line-docs file by running 'ant get-jenkins-line-docs'
in the lucene directory.
   [junit4]   2> NOTE: reproduce with: ant test  -Dtestcase=TestLucene50StoredFieldsFormat
-Dtests.method=testBigDocuments -Dtests.seed=99D71B43BB1A02A -Dtests.multiplier=2 -Dtests.nightly=true
-Dtests.slow=true -Dtests.linedocsfile=/x1/jenkins/lucene-data/enwiki.random.lines.txt -Dtests.locale=sr
-Dtests.timezone=America/Merida -Dtests.asserts=true -Dtests.file.encoding=US-ASCII
   [junit4] ERROR   17.3s J1 | TestLucene50StoredFieldsFormat.testBigDocuments <<<
   [junit4]    > Throwable #1: java.lang.OutOfMemoryError: Java heap space
   [junit4]    > 	at __randomizedtesting.SeedInfo.seed([99D71B43BB1A02A:F8B72BEB889D0E0D]:0)
   [junit4]    > 	at org.apache.lucene.codecs.compressing.CompressingStoredFieldsReader.readField(CompressingStoredFieldsReader.java:214)
   [junit4]    > 	at org.apache.lucene.codecs.compressing.CompressingStoredFieldsReader.visitDocument(CompressingStoredFieldsReader.java:595)
   [junit4]    > 	at org.apache.lucene.index.CodecReader.document(CodecReader.java:88)
   [junit4]    > 	at org.apache.lucene.index.BaseCompositeReader.document(BaseCompositeReader.java:118)
   [junit4]    > 	at org.apache.lucene.index.IndexReader.document(IndexReader.java:368)
   [junit4]    > 	at org.apache.lucene.index.BaseStoredFieldsFormatTestCase.testBigDocuments(BaseStoredFieldsFormatTestCase.java:719)
   [junit4]   2> NOTE: leaving temporary files on disk at: /x1/jenkins/jenkins-slave/workspace/Lucene-Solr-NightlyTests-6.x/lucene/build/core/test/J1/temp/lucene.codecs.lucene50.TestLucene50StoredFieldsFormat_99D71B43BB1A02A-001
   [junit4]   2> NOTE: test params are: codec=Asserting(Lucene60): {}, docValues:{}, maxPointsInLeafNode=123,
maxMBSortInHeap=7.297796134640578, sim=RandomSimilarity(queryNorm=false,coord=yes): {id=DFR
I(ne)Z(0.3)}, locale=sr, timezone=America/Merida
   [junit4]   2> NOTE: Linux 3.13.0-85-generic amd64/Oracle Corporation 1.8.0_74 (64-bit)/cpus=4,threads=1,free=127913480,total=477626368
   [junit4]   2> NOTE: All tests run in this JVM: [TestSegmentMerger, TestSegmentInfos,
TestRateLimiter, TestBagOfPostings, TestOmitNorms, TestGeoEncodingUtils, TestSparseFixedBitDocIdSet,
TestFSTs, TestRollingBuffer, TestLucene50StoredFieldsFormatHighCompression, TestPolygon2D,
TestNRTReaderCleanup, TestSmallFloat, TestFieldMaskingSpanQuery, TestByteArrayDataInput, TestPayloads,
TestGrowableByteArrayDataOutput, TestRecyclingIntBlockAllocator, TestDocument, TestFieldsReader,
TestSpanMultiTermQueryWrapper, TestSpanNotQuery, TestIndexWriterExceptions, MultiCollectorTest,
TestPrefixInBooleanQuery, TestBoolean2, TestSynonymQuery, TestSetOnce, TestSimilarityBase,
TestPositionIncrement, TestBlockPostingsFormat3, TestLegacyNumericUtils, TestSameTokenSamePosition,
TestIndexWriterNRTIsCurrent, TestFieldReuse, TestSnapshotDeletionPolicy, TestIndexWriterMaxDocs,
TestStressAdvance, TestMultiCollector, TestNeedsScores, TestBytesRefArray, TestReqExclBulkScorer,
TestIndexWriterDeleteByQuery, TestSpanCollection, TestRollback, TestScorerPerf, TestBytesRefAttImpl,
TestAssertions, TestOperations, Test2BSortedDocValuesOrds, TestSimpleExplanations, TestNumericUtils,
TestTopFieldCollector, TestPostingsOffsets, TestHugeRamFile, TestFlex, TestBooleanScorer,
TestTragicIndexWriterDeadlock, TestRamUsageEstimator, TestNRTReaderWithThreads, TestStressNRT,
TestRoaringDocIdSet, TestCachingTokenFilter, TestPrefixRandom, TestOmitPositions, TestLucene50FieldInfoFormat,
TestBooleanCoord, TestRAMDirectory, TestLevenshteinAutomata, TestMathUtil, TestPersistentSnapshotDeletionPolicy,
TestAtomicUpdate, TestDirectoryReaderReopen, TestSearchWithThreads, TestSearchAfter, TestConcurrentMergeScheduler,
TestNeverDelete, TestTopDocsMerge, TestStressIndexing, TestMinimize, TestArrayUtil, TestBufferedIndexInput,
TestTermsEnum, TestCodecHoldsOpenFiles, TestNGramPhraseQuery, TestScoreCachingWrappingScorer,
TestIntsRef, TestTermdocPerf, TestIndexCommit, Test2BPostingsBytes, TestPositiveScoresOnlyCollector,
TestIOUtils, Test2BNumericDocValues, Test2BPagedBytes, TestLucene50CompoundFormat, TestLucene50SegmentInfoFormat,
TestLucene50StoredFieldsFormat]
   [junit4] Completed [344/422 (4!)] on J1 in 28.95s, 17 tests, 1 error <<< FAILURES!

[...truncated 313 lines...]
   [junit4] JVM J1: stdout was not empty, see: /x1/jenkins/jenkins-slave/workspace/Lucene-Solr-NightlyTests-6.x/lucene/build/core/test/temp/junit4-J1-20160607_161609_749.sysout
   [junit4] >>> JVM J1 emitted unexpected output (verbatim) ----
   [junit4] java.lang.OutOfMemoryError: GC overhead limit exceeded
   [junit4] Dumping heap to /x1/jenkins/jenkins-slave/workspace/Lucene-Solr-NightlyTests-6.x/heapdumps/java_pid4932.hprof
...
   [junit4] Heap dump file created [424110994 bytes in 0.472 secs]
   [junit4] <<< JVM J1: EOF ----

[...truncated 13 lines...]
BUILD FAILED
/x1/jenkins/jenkins-slave/workspace/Lucene-Solr-NightlyTests-6.x/build.xml:747: The following
error occurred while executing this line:
/x1/jenkins/jenkins-slave/workspace/Lucene-Solr-NightlyTests-6.x/build.xml:684: The following
error occurred while executing this line:
/x1/jenkins/jenkins-slave/workspace/Lucene-Solr-NightlyTests-6.x/build.xml:59: The following
error occurred while executing this line:
/x1/jenkins/jenkins-slave/workspace/Lucene-Solr-NightlyTests-6.x/lucene/build.xml:50: The
following error occurred while executing this line:
/x1/jenkins/jenkins-slave/workspace/Lucene-Solr-NightlyTests-6.x/lucene/common-build.xml:1427:
The following error occurred while executing this line:
/x1/jenkins/jenkins-slave/workspace/Lucene-Solr-NightlyTests-6.x/lucene/common-build.xml:984:
There were test failures: 422 suites (1 ignored), 3585 tests, 2 suite-level errors, 3 errors,
42 ignored (38 assumptions) [seed: 99D71B43BB1A02A]

Total time: 62 minutes 37 seconds
Build step 'Invoke Ant' marked build as failure
Archiving artifacts
No prior successful build to compare, so performing full copy of artifacts
Recording test results
Email was triggered for: Failure - Any
Sending email for trigger: Failure - Any




Mime
View raw message