lucene-dev mailing list archives

Site index · List index
Message view « Date » · « Thread »
Top « Date » · « Thread »
From Policeman Jenkins Server <jenk...@thetaphi.de>
Subject [JENKINS] Lucene-Solr-6.x-Solaris (64bit/jdk1.8.0) - Build # 212 - Still Failing!
Date Tue, 21 Jun 2016 09:06:35 GMT
Build: http://jenkins.thetaphi.de/job/Lucene-Solr-6.x-Solaris/212/
Java: 64bit/jdk1.8.0 -XX:-UseCompressedOops -XX:+UseSerialGC

1 tests failed.
FAILED:  org.apache.solr.update.HardAutoCommitTest.testCommitWithin

Error Message:
Exception during query

Stack Trace:
java.lang.RuntimeException: Exception during query
	at __randomizedtesting.SeedInfo.seed([B05E198F182A8480:A8C76F79B046A95]:0)
	at org.apache.solr.SolrTestCaseJ4.assertQ(SolrTestCaseJ4.java:781)
	at org.apache.solr.update.HardAutoCommitTest.testCommitWithin(HardAutoCommitTest.java:99)
	at sun.reflect.NativeMethodAccessorImpl.invoke0(Native Method)
	at sun.reflect.NativeMethodAccessorImpl.invoke(NativeMethodAccessorImpl.java:62)
	at sun.reflect.DelegatingMethodAccessorImpl.invoke(DelegatingMethodAccessorImpl.java:43)
	at java.lang.reflect.Method.invoke(Method.java:498)
	at com.carrotsearch.randomizedtesting.RandomizedRunner.invoke(RandomizedRunner.java:1764)
	at com.carrotsearch.randomizedtesting.RandomizedRunner$8.evaluate(RandomizedRunner.java:871)
	at com.carrotsearch.randomizedtesting.RandomizedRunner$9.evaluate(RandomizedRunner.java:907)
	at com.carrotsearch.randomizedtesting.RandomizedRunner$10.evaluate(RandomizedRunner.java:921)
	at com.carrotsearch.randomizedtesting.rules.SystemPropertiesRestoreRule$1.evaluate(SystemPropertiesRestoreRule.java:57)
	at org.apache.lucene.util.TestRuleSetupTeardownChained$1.evaluate(TestRuleSetupTeardownChained.java:49)
	at org.apache.lucene.util.AbstractBeforeAfterRule$1.evaluate(AbstractBeforeAfterRule.java:45)
	at org.apache.lucene.util.TestRuleThreadAndTestName$1.evaluate(TestRuleThreadAndTestName.java:48)
	at org.apache.lucene.util.TestRuleIgnoreAfterMaxFailures$1.evaluate(TestRuleIgnoreAfterMaxFailures.java:64)
	at org.apache.lucene.util.TestRuleMarkFailure$1.evaluate(TestRuleMarkFailure.java:47)
	at com.carrotsearch.randomizedtesting.rules.StatementAdapter.evaluate(StatementAdapter.java:36)
	at com.carrotsearch.randomizedtesting.ThreadLeakControl$StatementRunner.run(ThreadLeakControl.java:367)
	at com.carrotsearch.randomizedtesting.ThreadLeakControl.forkTimeoutingTask(ThreadLeakControl.java:809)
	at com.carrotsearch.randomizedtesting.ThreadLeakControl$3.evaluate(ThreadLeakControl.java:460)
	at com.carrotsearch.randomizedtesting.RandomizedRunner.runSingleTest(RandomizedRunner.java:880)
	at com.carrotsearch.randomizedtesting.RandomizedRunner$5.evaluate(RandomizedRunner.java:781)
	at com.carrotsearch.randomizedtesting.RandomizedRunner$6.evaluate(RandomizedRunner.java:816)
	at com.carrotsearch.randomizedtesting.RandomizedRunner$7.evaluate(RandomizedRunner.java:827)
	at com.carrotsearch.randomizedtesting.rules.StatementAdapter.evaluate(StatementAdapter.java:36)
	at com.carrotsearch.randomizedtesting.rules.SystemPropertiesRestoreRule$1.evaluate(SystemPropertiesRestoreRule.java:57)
	at org.apache.lucene.util.AbstractBeforeAfterRule$1.evaluate(AbstractBeforeAfterRule.java:45)
	at com.carrotsearch.randomizedtesting.rules.StatementAdapter.evaluate(StatementAdapter.java:36)
	at org.apache.lucene.util.TestRuleStoreClassName$1.evaluate(TestRuleStoreClassName.java:41)
	at com.carrotsearch.randomizedtesting.rules.NoShadowingOrOverridesOnMethodsRule$1.evaluate(NoShadowingOrOverridesOnMethodsRule.java:40)
	at com.carrotsearch.randomizedtesting.rules.NoShadowingOrOverridesOnMethodsRule$1.evaluate(NoShadowingOrOverridesOnMethodsRule.java:40)
	at com.carrotsearch.randomizedtesting.rules.StatementAdapter.evaluate(StatementAdapter.java:36)
	at com.carrotsearch.randomizedtesting.rules.StatementAdapter.evaluate(StatementAdapter.java:36)
	at com.carrotsearch.randomizedtesting.rules.StatementAdapter.evaluate(StatementAdapter.java:36)
	at org.apache.lucene.util.TestRuleAssertionsRequired$1.evaluate(TestRuleAssertionsRequired.java:53)
	at org.apache.lucene.util.TestRuleMarkFailure$1.evaluate(TestRuleMarkFailure.java:47)
	at org.apache.lucene.util.TestRuleIgnoreAfterMaxFailures$1.evaluate(TestRuleIgnoreAfterMaxFailures.java:64)
	at org.apache.lucene.util.TestRuleIgnoreTestSuites$1.evaluate(TestRuleIgnoreTestSuites.java:54)
	at com.carrotsearch.randomizedtesting.rules.StatementAdapter.evaluate(StatementAdapter.java:36)
	at com.carrotsearch.randomizedtesting.ThreadLeakControl$StatementRunner.run(ThreadLeakControl.java:367)
	at java.lang.Thread.run(Thread.java:745)
Caused by: java.lang.RuntimeException: REQUEST FAILED: xpath=//result[@numFound=1]
	xml response was: <?xml version="1.0" encoding="UTF-8"?>
<response>
<lst name="responseHeader"><int name="status">0</int><int name="QTime">0</int></lst><result name="response" numFound="0" start="0"></result>
</response>

	request was:q=id:529&qt=standard&start=0&rows=20&version=2.2
	at org.apache.solr.SolrTestCaseJ4.assertQ(SolrTestCaseJ4.java:774)
	... 40 more




Build Log:
[...truncated 10515 lines...]
   [junit4] Suite: org.apache.solr.update.HardAutoCommitTest
   [junit4]   2> Creating dataDir: /export/home/jenkins/workspace/Lucene-Solr-6.x-Solaris/solr/build/solr-core/test/J0/temp/solr.update.HardAutoCommitTest_B05E198F182A8480-001/init-core-data-001
   [junit4]   2> 21225 INFO  (SUITE-HardAutoCommitTest-seed#[B05E198F182A8480]-worker) [    ] o.a.s.SolrTestCaseJ4 Randomized ssl (false) and clientAuth (false) via: @org.apache.solr.util.RandomizeSSL(reason=, value=NaN, ssl=NaN, clientAuth=NaN)
   [junit4]   2> 21226 INFO  (SUITE-HardAutoCommitTest-seed#[B05E198F182A8480]-worker) [    ] o.a.s.SolrTestCaseJ4 ####initCore
   [junit4]   2> 21226 INFO  (SUITE-HardAutoCommitTest-seed#[B05E198F182A8480]-worker) [    ] o.a.s.c.SolrResourceLoader new SolrResourceLoader for directory: '/export/home/jenkins/workspace/Lucene-Solr-6.x-Solaris/solr/core/src/test-files/solr/collection1'
   [junit4]   2> 21226 INFO  (SUITE-HardAutoCommitTest-seed#[B05E198F182A8480]-worker) [    ] o.a.s.c.SolrResourceLoader JNDI not configured for solr (NoInitialContextEx)
   [junit4]   2> 21226 INFO  (SUITE-HardAutoCommitTest-seed#[B05E198F182A8480]-worker) [    ] o.a.s.c.SolrResourceLoader using system property solr.solr.home: /export/home/jenkins/workspace/Lucene-Solr-6.x-Solaris/solr/core/src/test-files/solr
   [junit4]   2> 21227 INFO  (SUITE-HardAutoCommitTest-seed#[B05E198F182A8480]-worker) [    ] o.a.s.c.SolrResourceLoader Adding 'file:/export/home/jenkins/workspace/Lucene-Solr-6.x-Solaris/solr/core/src/test-files/solr/collection1/lib/classes/' to classloader
   [junit4]   2> 21227 INFO  (SUITE-HardAutoCommitTest-seed#[B05E198F182A8480]-worker) [    ] o.a.s.c.SolrResourceLoader Adding 'file:/export/home/jenkins/workspace/Lucene-Solr-6.x-Solaris/solr/core/src/test-files/solr/collection1/lib/README' to classloader
   [junit4]   2> 21252 INFO  (SUITE-HardAutoCommitTest-seed#[B05E198F182A8480]-worker) [    ] o.a.s.c.SolrConfig current version of requestparams : -1
   [junit4]   2> 21270 INFO  (SUITE-HardAutoCommitTest-seed#[B05E198F182A8480]-worker) [    ] o.a.s.c.SolrConfig Using Lucene MatchVersion: 6.2.0
   [junit4]   2> 21301 INFO  (SUITE-HardAutoCommitTest-seed#[B05E198F182A8480]-worker) [    ] o.a.s.c.SolrConfig Loaded SolrConfig: solrconfig.xml
   [junit4]   2> 21311 INFO  (SUITE-HardAutoCommitTest-seed#[B05E198F182A8480]-worker) [    ] o.a.s.s.IndexSchema [null] Schema name=test
   [junit4]   2> 21433 INFO  (SUITE-HardAutoCommitTest-seed#[B05E198F182A8480]-worker) [    ] o.a.s.s.OpenExchangeRatesOrgProvider Initialized with rates=open-exchange-rates.json, refreshInterval=1440.
   [junit4]   2> 21441 INFO  (SUITE-HardAutoCommitTest-seed#[B05E198F182A8480]-worker) [    ] o.a.s.s.IndexSchema default search field in schema is text
   [junit4]   2> 21441 INFO  (SUITE-HardAutoCommitTest-seed#[B05E198F182A8480]-worker) [    ] o.a.s.s.IndexSchema unique key field: id
   [junit4]   2> 21450 INFO  (SUITE-HardAutoCommitTest-seed#[B05E198F182A8480]-worker) [    ] o.a.s.s.FileExchangeRateProvider Reloading exchange rates from file currency.xml
   [junit4]   2> 21452 INFO  (SUITE-HardAutoCommitTest-seed#[B05E198F182A8480]-worker) [    ] o.a.s.s.FileExchangeRateProvider Reloading exchange rates from file currency.xml
   [junit4]   2> 21454 INFO  (SUITE-HardAutoCommitTest-seed#[B05E198F182A8480]-worker) [    ] o.a.s.s.OpenExchangeRatesOrgProvider Reloading exchange rates from open-exchange-rates.json
   [junit4]   2> 21454 INFO  (SUITE-HardAutoCommitTest-seed#[B05E198F182A8480]-worker) [    ] o.a.s.s.OpenExchangeRatesOrgProvider Reloading exchange rates from open-exchange-rates.json
   [junit4]   2> 21454 INFO  (SUITE-HardAutoCommitTest-seed#[B05E198F182A8480]-worker) [    ] o.a.s.c.SolrResourceLoader JNDI not configured for solr (NoInitialContextEx)
   [junit4]   2> 21454 INFO  (SUITE-HardAutoCommitTest-seed#[B05E198F182A8480]-worker) [    ] o.a.s.c.SolrResourceLoader using system property solr.solr.home: /export/home/jenkins/workspace/Lucene-Solr-6.x-Solaris/solr/core/src/test-files/solr
   [junit4]   2> 21454 INFO  (SUITE-HardAutoCommitTest-seed#[B05E198F182A8480]-worker) [    ] o.a.s.c.SolrResourceLoader new SolrResourceLoader for directory: '/export/home/jenkins/workspace/Lucene-Solr-6.x-Solaris/solr/core/src/test-files/solr'
   [junit4]   2> 21454 INFO  (SUITE-HardAutoCommitTest-seed#[B05E198F182A8480]-worker) [    ] o.a.s.c.SolrResourceLoader JNDI not configured for solr (NoInitialContextEx)
   [junit4]   2> 21454 INFO  (SUITE-HardAutoCommitTest-seed#[B05E198F182A8480]-worker) [    ] o.a.s.c.SolrResourceLoader using system property solr.solr.home: /export/home/jenkins/workspace/Lucene-Solr-6.x-Solaris/solr/core/src/test-files/solr
   [junit4]   2> 21455 INFO  (SUITE-HardAutoCommitTest-seed#[B05E198F182A8480]-worker) [    ] o.a.s.c.CoreContainer New CoreContainer 1926672781
   [junit4]   2> 21455 INFO  (SUITE-HardAutoCommitTest-seed#[B05E198F182A8480]-worker) [    ] o.a.s.c.CoreContainer Loading cores into CoreContainer [instanceDir=/export/home/jenkins/workspace/Lucene-Solr-6.x-Solaris/solr/core/src/test-files/solr]
   [junit4]   2> 21455 WARN  (SUITE-HardAutoCommitTest-seed#[B05E198F182A8480]-worker) [    ] o.a.s.c.CoreContainer Couldn't add files from /export/home/jenkins/workspace/Lucene-Solr-6.x-Solaris/solr/core/src/test-files/solr/lib to classpath: /export/home/jenkins/workspace/Lucene-Solr-6.x-Solaris/solr/core/src/test-files/solr/lib
   [junit4]   2> 21456 INFO  (SUITE-HardAutoCommitTest-seed#[B05E198F182A8480]-worker) [    ] o.a.s.h.c.HttpShardHandlerFactory created with socketTimeout : 600000,connTimeout : 60000,maxConnectionsPerHost : 20,maxConnections : 10000,corePoolSize : 0,maximumPoolSize : 2147483647,maxThreadIdleTime : 5,sizeOfQueue : -1,fairnessPolicy : false,useRetries : false,
   [junit4]   2> 21463 INFO  (SUITE-HardAutoCommitTest-seed#[B05E198F182A8480]-worker) [    ] o.a.s.u.UpdateShardHandler Creating UpdateShardHandler HTTP client with params: socketTimeout=30000&connTimeout=30000&retry=true
   [junit4]   2> 21465 INFO  (SUITE-HardAutoCommitTest-seed#[B05E198F182A8480]-worker) [    ] o.a.s.l.LogWatcher SLF4J impl is org.slf4j.impl.Log4jLoggerFactory
   [junit4]   2> 21465 INFO  (SUITE-HardAutoCommitTest-seed#[B05E198F182A8480]-worker) [    ] o.a.s.l.LogWatcher Registering Log Listener [Log4j (org.slf4j.impl.Log4jLoggerFactory)]
   [junit4]   2> 21465 INFO  (SUITE-HardAutoCommitTest-seed#[B05E198F182A8480]-worker) [    ] o.a.s.c.CoreContainer Security conf doesn't exist. Skipping setup for authorization module.
   [junit4]   2> 21465 INFO  (SUITE-HardAutoCommitTest-seed#[B05E198F182A8480]-worker) [    ] o.a.s.c.CoreContainer No authentication plugin used.
   [junit4]   2> 21465 INFO  (SUITE-HardAutoCommitTest-seed#[B05E198F182A8480]-worker) [    ] o.a.s.c.CoreDescriptor Created CoreDescriptor: {name=collection1, config=solrconfig.xml, transient=false, schema=schema.xml, loadOnStartup=true, configSetProperties=configsetprops.json, collection=collection1, dataDir=/export/home/jenkins/workspace/Lucene-Solr-6.x-Solaris/solr/build/solr-core/test/J0/temp/solr.update.HardAutoCommitTest_B05E198F182A8480-001/init-core-data-001, shard=shard1}
   [junit4]   2> 21471 INFO  (coreLoadExecutor-93-thread-1) [    ] o.a.s.c.SolrResourceLoader new SolrResourceLoader for directory: '/export/home/jenkins/workspace/Lucene-Solr-6.x-Solaris/solr/core/src/test-files/solr/collection1'
   [junit4]   2> 21472 INFO  (coreLoadExecutor-93-thread-1) [    ] o.a.s.c.SolrResourceLoader JNDI not configured for solr (NoInitialContextEx)
   [junit4]   2> 21472 INFO  (coreLoadExecutor-93-thread-1) [    ] o.a.s.c.SolrResourceLoader using system property solr.solr.home: /export/home/jenkins/workspace/Lucene-Solr-6.x-Solaris/solr/core/src/test-files/solr
   [junit4]   2> 21472 INFO  (coreLoadExecutor-93-thread-1) [    ] o.a.s.c.SolrResourceLoader Adding 'file:/export/home/jenkins/workspace/Lucene-Solr-6.x-Solaris/solr/core/src/test-files/solr/collection1/lib/classes/' to classloader
   [junit4]   2> 21472 INFO  (coreLoadExecutor-93-thread-1) [    ] o.a.s.c.SolrResourceLoader Adding 'file:/export/home/jenkins/workspace/Lucene-Solr-6.x-Solaris/solr/core/src/test-files/solr/collection1/lib/README' to classloader
   [junit4]   2> 21508 INFO  (coreLoadExecutor-93-thread-1) [    ] o.a.s.c.SolrConfig current version of requestparams : -1
   [junit4]   2> 21525 INFO  (coreLoadExecutor-93-thread-1) [    ] o.a.s.c.SolrConfig Using Lucene MatchVersion: 6.2.0
   [junit4]   2> 21552 INFO  (coreLoadExecutor-93-thread-1) [    ] o.a.s.c.SolrConfig Loaded SolrConfig: solrconfig.xml
   [junit4]   2> 21562 INFO  (coreLoadExecutor-93-thread-1) [    ] o.a.s.s.IndexSchema [collection1] Schema name=test
   [junit4]   2> 21675 INFO  (coreLoadExecutor-93-thread-1) [    ] o.a.s.s.OpenExchangeRatesOrgProvider Initialized with rates=open-exchange-rates.json, refreshInterval=1440.
   [junit4]   2> 21684 INFO  (coreLoadExecutor-93-thread-1) [    ] o.a.s.s.IndexSchema default search field in schema is text
   [junit4]   2> 21685 INFO  (coreLoadExecutor-93-thread-1) [    ] o.a.s.s.IndexSchema unique key field: id
   [junit4]   2> 21691 INFO  (coreLoadExecutor-93-thread-1) [    ] o.a.s.s.FileExchangeRateProvider Reloading exchange rates from file currency.xml
   [junit4]   2> 21693 INFO  (coreLoadExecutor-93-thread-1) [    ] o.a.s.s.FileExchangeRateProvider Reloading exchange rates from file currency.xml
   [junit4]   2> 21695 INFO  (coreLoadExecutor-93-thread-1) [    ] o.a.s.s.OpenExchangeRatesOrgProvider Reloading exchange rates from open-exchange-rates.json
   [junit4]   2> 21695 INFO  (coreLoadExecutor-93-thread-1) [    ] o.a.s.s.OpenExchangeRatesOrgProvider Reloading exchange rates from open-exchange-rates.json
   [junit4]   2> 21697 INFO  (coreLoadExecutor-93-thread-1) [    ] o.a.s.c.ConfigSetProperties Did not find ConfigSet properties, assuming default properties: Can't find resource 'configsetprops.json' in classpath or '/export/home/jenkins/workspace/Lucene-Solr-6.x-Solaris/solr/core/src/test-files/solr/collection1'
   [junit4]   2> 21697 INFO  (coreLoadExecutor-93-thread-1) [    ] o.a.s.c.CoreContainer Creating SolrCore 'collection1' using configuration from instancedir /export/home/jenkins/workspace/Lucene-Solr-6.x-Solaris/solr/core/src/test-files/solr/collection1
   [junit4]   2> 21697 INFO  (coreLoadExecutor-93-thread-1) [    x:collection1] o.a.s.c.SolrCore org.apache.solr.core.MockDirectoryFactory
   [junit4]   2> 21697 INFO  (coreLoadExecutor-93-thread-1) [    x:collection1] o.a.s.c.SolrCore [[collection1] ] Opening new SolrCore at [/export/home/jenkins/workspace/Lucene-Solr-6.x-Solaris/solr/core/src/test-files/solr/collection1], dataDir=[/export/home/jenkins/workspace/Lucene-Solr-6.x-Solaris/solr/build/solr-core/test/J0/temp/solr.update.HardAutoCommitTest_B05E198F182A8480-001/init-core-data-001/]
   [junit4]   2> 21697 INFO  (coreLoadExecutor-93-thread-1) [    x:collection1] o.a.s.c.JmxMonitoredMap No JMX servers found, not exposing Solr information with JMX.
   [junit4]   2> 21698 INFO  (coreLoadExecutor-93-thread-1) [    x:collection1] o.a.s.c.CachingDirectoryFactory return new directory for /export/home/jenkins/workspace/Lucene-Solr-6.x-Solaris/solr/build/solr-core/test/J0/temp/solr.update.HardAutoCommitTest_B05E198F182A8480-001/init-core-data-001
   [junit4]   2> 21698 INFO  (coreLoadExecutor-93-thread-1) [    x:collection1] o.a.s.c.SolrCore New index directory detected: old=null new=/export/home/jenkins/workspace/Lucene-Solr-6.x-Solaris/solr/build/solr-core/test/J0/temp/solr.update.HardAutoCommitTest_B05E198F182A8480-001/init-core-data-001/index/
   [junit4]   2> 21698 WARN  (coreLoadExecutor-93-thread-1) [    x:collection1] o.a.s.c.SolrCore [collection1] Solr index directory '/export/home/jenkins/workspace/Lucene-Solr-6.x-Solaris/solr/build/solr-core/test/J0/temp/solr.update.HardAutoCommitTest_B05E198F182A8480-001/init-core-data-001/index' doesn't exist. Creating new index...
   [junit4]   2> 21698 INFO  (coreLoadExecutor-93-thread-1) [    x:collection1] o.a.s.c.CachingDirectoryFactory return new directory for /export/home/jenkins/workspace/Lucene-Solr-6.x-Solaris/solr/build/solr-core/test/J0/temp/solr.update.HardAutoCommitTest_B05E198F182A8480-001/init-core-data-001/index
   [junit4]   2> 21698 INFO  (coreLoadExecutor-93-thread-1) [    x:collection1] o.a.s.u.RandomMergePolicy RandomMergePolicy wrapping class org.apache.lucene.index.TieredMergePolicy: [TieredMergePolicy: maxMergeAtOnce=29, maxMergeAtOnceExplicit=34, maxMergedSegmentMB=10.47265625, floorSegmentMB=1.63671875, forceMergeDeletesPctAllowed=22.732659336624046, segmentsPerTier=38.0, maxCFSSegmentSizeMB=8.796093022207999E12, noCFSRatio=1.0
   [junit4]   2> 21699 INFO  (coreLoadExecutor-93-thread-1) [    x:collection1] o.a.s.c.SolrDeletionPolicy SolrDeletionPolicy.onCommit: commits: num=1
   [junit4]   2> 	commit{dir=MockDirectoryWrapper(RAMDirectory@ef77358 lockFactory=org.apache.lucene.store.SingleInstanceLockFactory@230f9e0),segFN=segments_1,generation=1}
   [junit4]   2> 21699 INFO  (coreLoadExecutor-93-thread-1) [    x:collection1] o.a.s.c.SolrDeletionPolicy newest commit generation = 1
   [junit4]   2> 21699 INFO  (OldIndexDirectoryCleanupThreadForCore-collection1) [    x:collection1] o.a.s.c.SolrCore Looking for old index directories to cleanup for core collection1 in /export/home/jenkins/workspace/Lucene-Solr-6.x-Solaris/solr/build/solr-core/test/J0/temp/solr.update.HardAutoCommitTest_B05E198F182A8480-001/init-core-data-001/
   [junit4]   2> 21703 INFO  (coreLoadExecutor-93-thread-1) [    x:collection1] o.a.s.u.p.UpdateRequestProcessorChain creating updateRequestProcessorChain "dedupe"
   [junit4]   2> 21703 INFO  (coreLoadExecutor-93-thread-1) [    x:collection1] o.a.s.u.p.UpdateRequestProcessorChain inserting DistributedUpdateProcessorFactory into updateRequestProcessorChain "dedupe"
   [junit4]   2> 21703 INFO  (coreLoadExecutor-93-thread-1) [    x:collection1] o.a.s.u.p.UpdateRequestProcessorChain creating updateRequestProcessorChain "dedupe-allfields"
   [junit4]   2> 21703 INFO  (coreLoadExecutor-93-thread-1) [    x:collection1] o.a.s.u.p.UpdateRequestProcessorChain inserting DistributedUpdateProcessorFactory into updateRequestProcessorChain "dedupe-allfields"
   [junit4]   2> 21703 INFO  (coreLoadExecutor-93-thread-1) [    x:collection1] o.a.s.u.p.UpdateRequestProcessorChain creating updateRequestProcessorChain "stored_sig"
   [junit4]   2> 21703 INFO  (coreLoadExecutor-93-thread-1) [    x:collection1] o.a.s.u.p.UpdateRequestProcessorChain inserting DistributedUpdateProcessorFactory into updateRequestProcessorChain "stored_sig"
   [junit4]   2> 21703 INFO  (coreLoadExecutor-93-thread-1) [    x:collection1] o.a.s.u.p.UpdateRequestProcessorChain creating updateRequestProcessorChain "uniq-fields"
   [junit4]   2> 21704 INFO  (coreLoadExecutor-93-thread-1) [    x:collection1] o.a.s.u.p.UpdateRequestProcessorChain inserting DistributedUpdateProcessorFactory into updateRequestProcessorChain "uniq-fields"
   [junit4]   2> 21704 INFO  (coreLoadExecutor-93-thread-1) [    x:collection1] o.a.s.u.p.UpdateRequestProcessorChain creating updateRequestProcessorChain "distrib-dup-test-chain-explicit"
   [junit4]   2> 21704 INFO  (coreLoadExecutor-93-thread-1) [    x:collection1] o.a.s.u.p.UpdateRequestProcessorChain creating updateRequestProcessorChain "distrib-dup-test-chain-implicit"
   [junit4]   2> 21704 INFO  (coreLoadExecutor-93-thread-1) [    x:collection1] o.a.s.u.p.UpdateRequestProcessorChain inserting DistributedUpdateProcessorFactory into updateRequestProcessorChain "distrib-dup-test-chain-implicit"
   [junit4]   2> 21704 INFO  (coreLoadExecutor-93-thread-1) [    x:collection1] o.a.s.c.SolrCore no updateRequestProcessorChain defined as default, creating implicit default
   [junit4]   2> 21706 INFO  (coreLoadExecutor-93-thread-1) [    x:collection1] o.a.s.h.l.XMLLoader xsltCacheLifetimeSeconds=60
   [junit4]   2> 21707 INFO  (coreLoadExecutor-93-thread-1) [    x:collection1] o.a.s.h.l.XMLLoader xsltCacheLifetimeSeconds=60
   [junit4]   2> 21708 INFO  (coreLoadExecutor-93-thread-1) [    x:collection1] o.a.s.h.l.XMLLoader xsltCacheLifetimeSeconds=60
   [junit4]   2> 21709 INFO  (coreLoadExecutor-93-thread-1) [    x:collection1] o.a.s.h.l.XMLLoader xsltCacheLifetimeSeconds=60
   [junit4]   2> 21711 INFO  (coreLoadExecutor-93-thread-1) [    x:collection1] o.a.s.c.PluginBag requestHandler : 'lazy' created with startup=lazy 
   [junit4]   2> 21711 INFO  (coreLoadExecutor-93-thread-1) [    x:collection1] o.a.s.c.RequestHandlers Registered paths: /admin/mbeans,standard,spellCheckCompRH,lazy,/update/json/docs,/admin/luke,/export,spellCheckWithWordbreak_Direct,tvrh,/get,/admin/properties,/update/json,mltrh,/admin/threads,/search-facet-def,/update/csv,/sql,/graph,/search-facet-invariants,/admin/segments,spellCheckCompRH1,/mlt,/admin/system,/replication,dismax,defaults,/config,/stream,/schema,/admin/plugins,/admin/logging,spellCheckWithWordbreak,mock,/admin/ping,/update,/admin/file,/terms,spellCheckCompRH_Direct,/debug/dump
   [junit4]   2> 21712 INFO  (coreLoadExecutor-93-thread-1) [    x:collection1] o.a.s.c.SolrCore Using default statsCache cache: org.apache.solr.search.stats.LocalStatsCache
   [junit4]   2> 21712 INFO  (coreLoadExecutor-93-thread-1) [    x:collection1] o.a.s.u.UpdateHandler Using UpdateLog implementation: org.apache.solr.update.UpdateLog
   [junit4]   2> 21714 INFO  (coreLoadExecutor-93-thread-1) [    x:collection1] o.a.s.u.UpdateLog Initializing UpdateLog: dataDir= defaultSyncLevel=FLUSH numRecordsToKeep=100 maxNumLogsToKeep=10 numVersionBuckets=65536
   [junit4]   2> 21721 INFO  (coreLoadExecutor-93-thread-1) [    x:collection1] o.a.s.u.CommitTracker Hard AutoCommit: disabled
   [junit4]   2> 21721 INFO  (coreLoadExecutor-93-thread-1) [    x:collection1] o.a.s.u.CommitTracker Soft AutoCommit: disabled
   [junit4]   2> 21722 INFO  (coreLoadExecutor-93-thread-1) [    x:collection1] o.a.s.u.RandomMergePolicy RandomMergePolicy wrapping class org.apache.lucene.index.TieredMergePolicy: [TieredMergePolicy: maxMergeAtOnce=34, maxMergeAtOnceExplicit=36, maxMergedSegmentMB=96.7265625, floorSegmentMB=0.9541015625, forceMergeDeletesPctAllowed=29.92439262900202, segmentsPerTier=16.0, maxCFSSegmentSizeMB=8.796093022207999E12, noCFSRatio=1.0
   [junit4]   2> 21722 INFO  (coreLoadExecutor-93-thread-1) [    x:collection1] o.a.s.c.SolrDeletionPolicy SolrDeletionPolicy.onInit: commits: num=1
   [junit4]   2> 	commit{dir=MockDirectoryWrapper(RAMDirectory@ef77358 lockFactory=org.apache.lucene.store.SingleInstanceLockFactory@230f9e0),segFN=segments_1,generation=1}
   [junit4]   2> 21722 INFO  (coreLoadExecutor-93-thread-1) [    x:collection1] o.a.s.c.SolrDeletionPolicy newest commit generation = 1
   [junit4]   2> 21722 INFO  (coreLoadExecutor-93-thread-1) [    x:collection1] o.a.s.s.SolrIndexSearcher Opening [Searcher@543cd082[collection1] main]
   [junit4]   2> 21723 INFO  (coreLoadExecutor-93-thread-1) [    x:collection1] o.a.s.r.RestManager Initializing RestManager with initArgs: {storageIO=org.apache.solr.rest.ManagedResourceStorage$InMemoryStorageIO}
   [junit4]   2> 21723 INFO  (coreLoadExecutor-93-thread-1) [    x:collection1] o.a.s.r.ManagedResourceStorage Reading _rest_managed.json using InMemoryStorage
   [junit4]   2> 21723 INFO  (coreLoadExecutor-93-thread-1) [    x:collection1] o.a.s.r.RestManager Initializing 0 registered ManagedResources
   [junit4]   2> 21723 INFO  (coreLoadExecutor-93-thread-1) [    x:collection1] o.a.s.h.c.SpellCheckComponent Initializing spell checkers
   [junit4]   2> 21762 INFO  (coreLoadExecutor-93-thread-1) [    x:collection1] o.a.s.s.DirectSolrSpellChecker init: {name=direct,classname=DirectSolrSpellChecker,field=lowerfilt,minQueryLength=3}
   [junit4]   2> 21831 INFO  (coreLoadExecutor-93-thread-1) [    x:collection1] o.a.s.h.ReplicationHandler Commits will be reserved for  10000
   [junit4]   2> 21831 INFO  (searcherExecutor-94-thread-1-processing-x:collection1) [    x:collection1] o.a.s.h.c.SpellCheckComponent Loading spell index for spellchecker: default
   [junit4]   2> 21831 INFO  (coreLoadExecutor-93-thread-1) [    x:collection1] o.a.s.u.UpdateLog Looking up max value of version field to seed version buckets
   [junit4]   2> 21831 INFO  (coreLoadExecutor-93-thread-1) [    x:collection1] o.a.s.u.VersionInfo Refreshing highest value of _version_ for 65536 version buckets from index
   [junit4]   2> 21832 INFO  (coreLoadExecutor-93-thread-1) [    x:collection1] o.a.s.u.VersionInfo No terms found for _version_, cannot seed version bucket highest value from index
   [junit4]   2> 21832 INFO  (coreLoadExecutor-93-thread-1) [    x:collection1] o.a.s.u.UpdateLog Could not find max version in index or recent updates, using new clock 1537732579338223616
   [junit4]   2> 21832 INFO  (searcherExecutor-94-thread-1-processing-x:collection1) [    x:collection1] o.a.s.h.c.SpellCheckComponent Loading spell index for spellchecker: direct
   [junit4]   2> 21832 INFO  (searcherExecutor-94-thread-1-processing-x:collection1) [    x:collection1] o.a.s.h.c.SpellCheckComponent Loading spell index for spellchecker: wordbreak
   [junit4]   2> 21833 INFO  (searcherExecutor-94-thread-1-processing-x:collection1) [    x:collection1] o.a.s.h.c.SpellCheckComponent Loading spell index for spellchecker: multipleFields
   [junit4]   2> 21833 INFO  (coreLoadExecutor-93-thread-1) [    x:collection1] o.a.s.u.UpdateLog Took 2.0ms to seed version buckets with highest version 1537732579338223616
   [junit4]   2> 21833 INFO  (searcherExecutor-94-thread-1-processing-x:collection1) [    x:collection1] o.a.s.h.c.SpellCheckComponent Loading spell index for spellchecker: jarowinkler
   [junit4]   2> 21833 INFO  (coreLoadExecutor-93-thread-1) [    x:collection1] o.a.s.c.CoreContainer registering core: collection1
   [junit4]   2> 21834 INFO  (searcherExecutor-94-thread-1-processing-x:collection1) [    x:collection1] o.a.s.h.c.SpellCheckComponent Loading spell index for spellchecker: external
   [junit4]   2> 21835 INFO  (searcherExecutor-94-thread-1-processing-x:collection1) [    x:collection1] o.a.s.h.c.SpellCheckComponent Loading spell index for spellchecker: freq
   [junit4]   2> 21835 INFO  (SUITE-HardAutoCommitTest-seed#[B05E198F182A8480]-worker) [    ] o.a.s.SolrTestCaseJ4 ####initCore end
   [junit4]   2> 21835 INFO  (searcherExecutor-94-thread-1-processing-x:collection1) [    x:collection1] o.a.s.h.c.SpellCheckComponent Loading spell index for spellchecker: fqcn
   [junit4]   2> 21836 INFO  (searcherExecutor-94-thread-1-processing-x:collection1) [    x:collection1] o.a.s.h.c.SpellCheckComponent Loading spell index for spellchecker: perDict
   [junit4]   2> 21836 INFO  (searcherExecutor-94-thread-1-processing-x:collection1) [    x:collection1] o.a.s.c.SolrCore [collection1] Registered new searcher Searcher@543cd082[collection1] main{ExitableDirectoryReader(UninvertingDirectoryReader())}
   [junit4]   2> 21837 INFO  (TEST-HardAutoCommitTest.testCommitWithin-seed#[B05E198F182A8480]) [    ] o.a.s.SolrTestCaseJ4 ###Starting testCommitWithin
   [junit4]   2> 21840 INFO  (TEST-HardAutoCommitTest.testCommitWithin-seed#[B05E198F182A8480]) [    ] o.a.s.u.p.LogUpdateProcessorFactory [collection1]  webapp=null path=null params={}{deleteByQuery=*:* (-1537732579343466496)} 0 3
   [junit4]   2> 21843 INFO  (TEST-HardAutoCommitTest.testCommitWithin-seed#[B05E198F182A8480]) [    ] o.a.s.c.SolrResourceLoader new SolrResourceLoader for directory: '/export/home/jenkins/workspace/Lucene-Solr-6.x-Solaris/solr/core/src/test-files/solr/collection1'
   [junit4]   2> 21843 INFO  (TEST-HardAutoCommitTest.testCommitWithin-seed#[B05E198F182A8480]) [    ] o.a.s.c.SolrResourceLoader JNDI not configured for solr (NoInitialContextEx)
   [junit4]   2> 21843 INFO  (TEST-HardAutoCommitTest.testCommitWithin-seed#[B05E198F182A8480]) [    ] o.a.s.c.SolrResourceLoader using system property solr.solr.home: /export/home/jenkins/workspace/Lucene-Solr-6.x-Solaris/solr/core/src/test-files/solr
   [junit4]   2> 21844 INFO  (TEST-HardAutoCommitTest.testCommitWithin-seed#[B05E198F182A8480]) [    ] o.a.s.c.SolrResourceLoader Adding 'file:/export/home/jenkins/workspace/Lucene-Solr-6.x-Solaris/solr/core/src/test-files/solr/collection1/lib/classes/' to classloader
   [junit4]   2> 21844 INFO  (TEST-HardAutoCommitTest.testCommitWithin-seed#[B05E198F182A8480]) [    ] o.a.s.c.SolrResourceLoader Adding 'file:/export/home/jenkins/workspace/Lucene-Solr-6.x-Solaris/solr/core/src/test-files/solr/collection1/lib/README' to classloader
   [junit4]   2> 21893 INFO  (TEST-HardAutoCommitTest.testCommitWithin-seed#[B05E198F182A8480]) [    ] o.a.s.c.SolrConfig current version of requestparams : -1
   [junit4]   2> 21901 INFO  (TEST-HardAutoCommitTest.testCommitWithin-seed#[B05E198F182A8480]) [    ] o.a.s.c.SolrConfig Using Lucene MatchVersion: 6.2.0
   [junit4]   2> 22016 INFO  (TEST-HardAutoCommitTest.testCommitWithin-seed#[B05E198F182A8480]) [    ] o.a.s.c.SolrConfig Loaded SolrConfig: solrconfig.xml
   [junit4]   2> 22022 INFO  (TEST-HardAutoCommitTest.testCommitWithin-seed#[B05E198F182A8480]) [    ] o.a.s.s.IndexSchema [collection1] Schema name=test
   [junit4]   2> 22170 INFO  (TEST-HardAutoCommitTest.testCommitWithin-seed#[B05E198F182A8480]) [    ] o.a.s.s.OpenExchangeRatesOrgProvider Initialized with rates=open-exchange-rates.json, refreshInterval=1440.
   [junit4]   2> 22175 INFO  (TEST-HardAutoCommitTest.testCommitWithin-seed#[B05E198F182A8480]) [    ] o.a.s.s.IndexSchema default search field in schema is text
   [junit4]   2> 22176 INFO  (TEST-HardAutoCommitTest.testCommitWithin-seed#[B05E198F182A8480]) [    ] o.a.s.s.IndexSchema unique key field: id
   [junit4]   2> 22182 INFO  (TEST-HardAutoCommitTest.testCommitWithin-seed#[B05E198F182A8480]) [    ] o.a.s.s.FileExchangeRateProvider Reloading exchange rates from file currency.xml
   [junit4]   2> 22184 INFO  (TEST-HardAutoCommitTest.testCommitWithin-seed#[B05E198F182A8480]) [    ] o.a.s.s.FileExchangeRateProvider Reloading exchange rates from file currency.xml
   [junit4]   2> 22185 INFO  (TEST-HardAutoCommitTest.testCommitWithin-seed#[B05E198F182A8480]) [    ] o.a.s.s.OpenExchangeRatesOrgProvider Reloading exchange rates from open-exchange-rates.json
   [junit4]   2> 22186 INFO  (TEST-HardAutoCommitTest.testCommitWithin-seed#[B05E198F182A8480]) [    ] o.a.s.s.OpenExchangeRatesOrgProvider Reloading exchange rates from open-exchange-rates.json
   [junit4]   2> 22187 INFO  (TEST-HardAutoCommitTest.testCommitWithin-seed#[B05E198F182A8480]) [    ] o.a.s.c.ConfigSetProperties Did not find ConfigSet properties, assuming default properties: Can't find resource 'configsetprops.json' in classpath or '/export/home/jenkins/workspace/Lucene-Solr-6.x-Solaris/solr/core/src/test-files/solr/collection1'
   [junit4]   2> 22187 INFO  (TEST-HardAutoCommitTest.testCommitWithin-seed#[B05E198F182A8480]) [    ] o.a.s.c.CoreContainer Reloading SolrCore 'collection1' using configuration from instancedir /export/home/jenkins/workspace/Lucene-Solr-6.x-Solaris/solr/core/src/test-files/solr/collection1
   [junit4]   2> 22187 INFO  (TEST-HardAutoCommitTest.testCommitWithin-seed#[B05E198F182A8480]) [    x:collection1] o.a.s.c.SolrCore [[collection1] ] Opening new SolrCore at [/export/home/jenkins/workspace/Lucene-Solr-6.x-Solaris/solr/core/src/test-files/solr/collection1], dataDir=[/export/home/jenkins/workspace/Lucene-Solr-6.x-Solaris/solr/build/solr-core/test/J0/temp/solr.update.HardAutoCommitTest_B05E198F182A8480-001/init-core-data-001/]
   [junit4]   2> 22188 INFO  (TEST-HardAutoCommitTest.testCommitWithin-seed#[B05E198F182A8480]) [    x:collection1] o.a.s.c.JmxMonitoredMap No JMX servers found, not exposing Solr information with JMX.
   [junit4]   2> 22188 INFO  (TEST-HardAutoCommitTest.testCommitWithin-seed#[B05E198F182A8480]) [    x:collection1] o.a.s.c.SolrCore New index directory detected: old=null new=/export/home/jenkins/workspace/Lucene-Solr-6.x-Solaris/solr/build/solr-core/test/J0/temp/solr.update.HardAutoCommitTest_B05E198F182A8480-001/init-core-data-001/index/
   [junit4]   2> 22188 INFO  (OldIndexDirectoryCleanupThreadForCore-collection1) [    x:collection1] o.a.s.c.SolrCore Looking for old index directories to cleanup for core collection1 in /export/home/jenkins/workspace/Lucene-Solr-6.x-Solaris/solr/build/solr-core/test/J0/temp/solr.update.HardAutoCommitTest_B05E198F182A8480-001/init-core-data-001/
   [junit4]   2> 22192 INFO  (TEST-HardAutoCommitTest.testCommitWithin-seed#[B05E198F182A8480]) [    x:collection1] o.a.s.u.p.UpdateRequestProcessorChain creating updateRequestProcessorChain "dedupe"
   [junit4]   2> 22193 INFO  (TEST-HardAutoCommitTest.testCommitWithin-seed#[B05E198F182A8480]) [    x:collection1] o.a.s.u.p.UpdateRequestProcessorChain inserting DistributedUpdateProcessorFactory into updateRequestProcessorChain "dedupe"
   [junit4]   2> 22193 INFO  (TEST-HardAutoCommitTest.testCommitWithin-seed#[B05E198F182A8480]) [    x:collection1] o.a.s.u.p.UpdateRequestProcessorChain creating updateRequestProcessorChain "dedupe-allfields"
   [junit4]   2> 22193 INFO  (TEST-HardAutoCommitTest.testCommitWithin-seed#[B05E198F182A8480]) [    x:collection1] o.a.s.u.p.UpdateRequestProcessorChain inserting DistributedUpdateProcessorFactory into updateRequestProcessorChain "dedupe-allfields"
   [junit4]   2> 22193 INFO  (TEST-HardAutoCommitTest.testCommitWithin-seed#[B05E198F182A8480]) [    x:collection1] o.a.s.u.p.UpdateRequestProcessorChain creating updateRequestProcessorChain "stored_sig"
   [junit4]   2> 22193 INFO  (TEST-HardAutoCommitTest.testCommitWithin-seed#[B05E198F182A8480]) [    x:collection1] o.a.s.u.p.UpdateRequestProcessorChain inserting DistributedUpdateProcessorFactory into updateRequestProcessorChain "stored_sig"
   [junit4]   2> 22193 INFO  (TEST-HardAutoCommitTest.testCommitWithin-seed#[B05E198F182A8480]) [    x:collection1] o.a.s.u.p.UpdateRequestProcessorChain creating updateRequestProcessorChain "uniq-fields"
   [junit4]   2> 22193 INFO  (TEST-HardAutoCommitTest.testCommitWithin-seed#[B05E198F182A8480]) [    x:collection1] o.a.s.u.p.UpdateRequestProcessorChain inserting DistributedUpdateProcessorFactory into updateRequestProcessorChain "uniq-fields"
   [junit4]   2> 22193 INFO  (TEST-HardAutoCommitTest.testCommitWithin-seed#[B05E198F182A8480]) [    x:collection1] o.a.s.u.p.UpdateRequestProcessorChain creating updateRequestProcessorChain "distrib-dup-test-chain-explicit"
   [junit4]   2> 22193 INFO  (TEST-HardAutoCommitTest.testCommitWithin-seed#[B05E198F182A8480]) [    x:collection1] o.a.s.u.p.UpdateRequestProcessorChain creating updateRequestProcessorChain "distrib-dup-test-chain-implicit"
   [junit4]   2> 22193 INFO  (TEST-HardAutoCommitTest.testCommitWithin-seed#[B05E198F182A8480]) [    x:collection1] o.a.s.u.p.UpdateRequestProcessorChain inserting DistributedUpdateProcessorFactory into updateRequestProcessorChain "distrib-dup-test-chain-implicit"
   [junit4]   2> 22194 INFO  (TEST-HardAutoCommitTest.testCommitWithin-seed#[B05E198F182A8480]) [    x:collection1] o.a.s.c.SolrCore no updateRequestProcessorChain defined as default, creating implicit default
   [junit4]   2> 22195 INFO  (TEST-HardAutoCommitTest.testCommitWithin-seed#[B05E198F182A8480]) [    x:collection1] o.a.s.h.l.XMLLoader xsltCacheLifetimeSeconds=60
   [junit4]   2> 22196 INFO  (TEST-HardAutoCommitTest.testCommitWithin-seed#[B05E198F182A8480]) [    x:collection1] o.a.s.h.l.XMLLoader xsltCacheLifetimeSeconds=60
   [junit4]   2> 22197 INFO  (TEST-HardAutoCommitTest.testCommitWithin-seed#[B05E198F182A8480]) [    x:collection1] o.a.s.h.l.XMLLoader xsltCacheLifetimeSeconds=60
   [junit4]   2> 22198 INFO  (TEST-HardAutoCommitTest.testCommitWithin-seed#[B05E198F182A8480]) [    x:collection1] o.a.s.h.l.XMLLoader xsltCacheLifetimeSeconds=60
   [junit4]   2> 22200 INFO  (TEST-HardAutoCommitTest.testCommitWithin-seed#[B05E198F182A8480]) [    x:collection1] o.a.s.c.PluginBag requestHandler : 'lazy' created with startup=lazy 
   [junit4]   2> 22201 INFO  (TEST-HardAutoCommitTest.testCommitWithin-seed#[B05E198F182A8480]) [    x:collection1] o.a.s.c.RequestHandlers Registered paths: /admin/mbeans,standard,spellCheckCompRH,lazy,/update/json/docs,/admin/luke,/export,spellCheckWithWordbreak_Direct,tvrh,/get,/admin/properties,/update/json,mltrh,/admin/threads,/search-facet-def,/update/csv,/sql,/graph,/search-facet-invariants,/admin/segments,spellCheckCompRH1,/mlt,/admin/system,/replication,dismax,defaults,/config,/stream,/schema,/admin/plugins,/admin/logging,spellCheckWithWordbreak,mock,/admin/ping,/update,/admin/file,/terms,spellCheckCompRH_Direct,/debug/dump
   [junit4]   2> 22201 INFO  (TEST-HardAutoCommitTest.testCommitWithin-seed#[B05E198F182A8480]) [    x:collection1] o.a.s.c.SolrCore Using default statsCache cache: org.apache.solr.search.stats.LocalStatsCache
   [junit4]   2> 22201 INFO  (TEST-HardAutoCommitTest.testCommitWithin-seed#[B05E198F182A8480]) [    x:collection1] o.a.s.u.CommitTracker Hard AutoCommit: disabled
   [junit4]   2> 22201 INFO  (TEST-HardAutoCommitTest.testCommitWithin-seed#[B05E198F182A8480]) [    x:collection1] o.a.s.u.CommitTracker Soft AutoCommit: disabled
   [junit4]   2> 22203 INFO  (TEST-HardAutoCommitTest.testCommitWithin-seed#[B05E198F182A8480]) [    x:collection1] o.a.s.s.SolrIndexSearcher Opening [Searcher@6d3e4436[collection1] main]
   [junit4]   2> 22206 INFO  (TEST-HardAutoCommitTest.testCommitWithin-seed#[B05E198F182A8480]) [    x:collection1] o.a.s.r.RestManager Initializing RestManager with initArgs: {storageIO=org.apache.solr.rest.ManagedResourceStorage$InMemoryStorageIO}
   [junit4]   2> 22207 INFO  (TEST-HardAutoCommitTest.testCommitWithin-seed#[B05E198F182A8480]) [    x:collection1] o.a.s.r.ManagedResourceStorage Reading _rest_managed.json using InMemoryStorage
   [junit4]   2> 22207 INFO  (TEST-HardAutoCommitTest.testCommitWithin-seed#[B05E198F182A8480]) [    x:collection1] o.a.s.r.RestManager Initializing 0 registered ManagedResources
   [junit4]   2> 22207 INFO  (TEST-HardAutoCommitTest.testCommitWithin-seed#[B05E198F182A8480]) [    x:collection1] o.a.s.h.c.SpellCheckComponent Initializing spell checkers
   [junit4]   2> 22213 INFO  (TEST-HardAutoCommitTest.testCommitWithin-seed#[B05E198F182A8480]) [    x:collection1] o.a.s.s.DirectSolrSpellChecker init: {name=direct,classname=DirectSolrSpellChecker,field=lowerfilt,minQueryLength=3}
   [junit4]   2> 22219 INFO  (TEST-HardAutoCommitTest.testCommitWithin-seed#[B05E198F182A8480]) [    x:collection1] o.a.s.h.ReplicationHandler Commits will be reserved for  10000
   [junit4]   2> 22219 INFO  (TEST-HardAutoCommitTest.testCommitWithin-seed#[B05E198F182A8480]) [    x:collection1] o.a.s.u.UpdateLog Looking up max value of version field to seed version buckets
   [junit4]   2> 22220 INFO  (searcherExecutor-99-thread-1-processing-x:collection1) [    x:collection1] o.a.s.h.c.SpellCheckComponent Loading spell index for spellchecker: default
   [junit4]   2> 22221 INFO  (searcherExecutor-99-thread-1-processing-x:collection1) [    x:collection1] o.a.s.h.c.SpellCheckComponent Loading spell index for spellchecker: direct
   [junit4]   2> 22221 INFO  (searcherExecutor-99-thread-1-processing-x:collection1) [    x:collection1] o.a.s.h.c.SpellCheckComponent Loading spell index for spellchecker: wordbreak
   [junit4]   2> 22221 INFO  (searcherExecutor-99-thread-1-processing-x:collection1) [    x:collection1] o.a.s.h.c.SpellCheckComponent Loading spell index for spellchecker: multipleFields
   [junit4]   2> 22221 INFO  (searcherExecutor-99-thread-1-processing-x:collection1) [    x:collection1] o.a.s.h.c.SpellCheckComponent Loading spell index for spellchecker: jarowinkler
   [junit4]   2> 22222 INFO  (searcherExecutor-99-thread-1-processing-x:collection1) [    x:collection1] o.a.s.h.c.SpellCheckComponent Loading spell index for spellchecker: external
   [junit4]   2> 22223 INFO  (searcherExecutor-99-thread-1-processing-x:collection1) [    x:collection1] o.a.s.h.c.SpellCheckComponent Loading spell index for spellchecker: freq
   [junit4]   2> 22224 INFO  (searcherExecutor-99-thread-1-processing-x:collection1) [    x:collection1] o.a.s.h.c.SpellCheckComponent Loading spell index for spellchecker: fqcn
   [junit4]   2> 22224 INFO  (TEST-HardAutoCommitTest.testCommitWithin-seed#[B05E198F182A8480]) [    x:collection1] o.a.s.u.VersionInfo Refreshing highest value of _version_ for 65536 version buckets from index
   [junit4]   2> 22224 INFO  (TEST-HardAutoCommitTest.testCommitWithin-seed#[B05E198F182A8480]) [    x:collection1] o.a.s.u.VersionInfo No terms found for _version_, cannot seed version bucket highest value from index
   [junit4]   2> 22225 INFO  (searcherExecutor-99-thread-1-processing-x:collection1) [    x:collection1] o.a.s.h.c.SpellCheckComponent Loading spell index for spellchecker: perDict
   [junit4]   2> 22226 INFO  (searcherExecutor-99-thread-1-processing-x:collection1) [    x:collection1] o.a.s.c.SolrCore [collection1] Registered new searcher Searcher@6d3e4436[collection1] main{ExitableDirectoryReader(UninvertingDirectoryReader())}
   [junit4]   2> 22236 INFO  (TEST-HardAutoCommitTest.testCommitWithin-seed#[B05E198F182A8480]) [    x:collection1] o.a.s.u.UpdateLog Took 16.0ms to seed version buckets with highest version 1537732579343466496
   [junit4]   2> 22236 INFO  (TEST-HardAutoCommitTest.testCommitWithin-seed#[B05E198F182A8480]) [    x:collection1] o.a.s.u.DefaultSolrCoreState Closing old IndexWriter... core=collection1
   [junit4]   2> 22237 INFO  (TEST-HardAutoCommitTest.testCommitWithin-seed#[B05E198F182A8480]) [    x:collection1] o.a.s.u.RandomMergePolicy RandomMergePolicy wrapping class org.apache.lucene.index.TieredMergePolicy: [TieredMergePolicy: maxMergeAtOnce=13, maxMergeAtOnceExplicit=27, maxMergedSegmentMB=86.2275390625, floorSegmentMB=0.7646484375, forceMergeDeletesPctAllowed=3.8295407875258682, segmentsPerTier=14.0, maxCFSSegmentSizeMB=8.796093022207999E12, noCFSRatio=0.46015337558262637
   [junit4]   2> 22238 INFO  (TEST-HardAutoCommitTest.testCommitWithin-seed#[B05E198F182A8480]) [    x:collection1] o.a.s.c.SolrDeletionPolicy SolrDeletionPolicy.onInit: commits: num=1
   [junit4]   2> 	commit{dir=MockDirectoryWrapper(RAMDirectory@ef77358 lockFactory=org.apache.lucene.store.SingleInstanceLockFactory@230f9e0),segFN=segments_1,generation=1}
   [junit4]   2> 22243 INFO  (TEST-HardAutoCommitTest.testCommitWithin-seed#[B05E198F182A8480]) [    x:collection1] o.a.s.c.SolrDeletionPolicy newest commit generation = 1
   [junit4]   2> 22243 INFO  (TEST-HardAutoCommitTest.testCommitWithin-seed#[B05E198F182A8480]) [    x:collection1] o.a.s.u.DefaultSolrCoreState New IndexWriter is ready to be used.
   [junit4]   2> 22244 INFO  (TEST-HardAutoCommitTest.testCommitWithin-seed#[B05E198F182A8480]) [    x:collection1] o.a.s.s.SolrIndexSearcher Opening [Searcher@2680afba[collection1] main]
   [junit4]   2> 22244 INFO  (TEST-HardAutoCommitTest.testCommitWithin-seed#[B05E198F182A8480]) [    x:collection1] o.a.s.c.CoreContainer replacing core: collection1
   [junit4]   2> 22245 INFO  (TEST-HardAutoCommitTest.testCommitWithin-seed#[B05E198F182A8480]) [    x:collection1] o.a.s.c.SolrCore [collection1]  CLOSING SolrCore org.apache.solr.core.SolrCore@6da8c193
   [junit4]   2> 22246 INFO  (TEST-HardAutoCommitTest.testCommitWithin-seed#[B05E198F182A8480]) [    x:collection1] o.a.s.u.DirectUpdateHandler2 closing DirectUpdateHandler2{commits=0,autocommits=0,soft autocommits=0,optimizes=0,rollbacks=0,expungeDeletes=0,docsPending=0,adds=0,deletesById=0,deletesByQuery=1,errors=0,cumulative_adds=0,cumulative_deletesById=0,cumulative_deletesByQuery=1,cumulative_errors=0,transaction_logs_total_size=0,transaction_logs_total_number=0}
   [junit4]   2> 22246 INFO  (TEST-HardAutoCommitTest.testCommitWithin-seed#[B05E198F182A8480]) [    x:collection1] o.a.s.c.SolrCore [collection1] Closing main searcher on request.
   [junit4]   2> 22258 INFO  (searcherExecutor-99-thread-1-processing-x:collection1) [    x:collection1] o.a.s.c.SolrCore [collection1] Registered new searcher Searcher@2680afba[collection1] main{ExitableDirectoryReader(UninvertingDirectoryReader())}
   [junit4]   2> 22260 INFO  (TEST-HardAutoCommitTest.testCommitWithin-seed#[B05E198F182A8480]) [    x:collection1] o.a.s.u.p.LogUpdateProcessorFactory [collection1] {add=[529 (1537732579781771264)]} 0 10
   [junit4]   2> 22262 INFO  (TEST-HardAutoCommitTest.testCommitWithin-seed#[B05E198F182A8480]) [    x:collection1] o.a.s.c.S.Request [collection1]  webapp=null path=null params={q=id:529&qt=standard&start=0&rows=20&version=2.2} hits=0 status=0 QTime=2
   [junit4]   2> 22290 INFO  (TEST-HardAutoCommitTest.testCommitWithin-seed#[B05E198F182A8480]) [    x:collection1] o.a.s.u.p.LogUpdateProcessorFactory [collection1] {add=[530 (1537732579817422848)]} 0 40
   [junit4]   2> 22291 INFO  (TEST-HardAutoCommitTest.testCommitWithin-seed#[B05E198F182A8480]) [    x:collection1] o.a.s.c.S.Request [collection1]  webapp=null path=null params={q=id:530&qt=standard&start=0&rows=20&version=2.2} hits=0 status=0 QTime=1
   [junit4]   2> 22298 INFO  (TEST-HardAutoCommitTest.testCommitWithin-seed#[B05E198F182A8480]) [    x:collection1] o.a.s.u.p.LogUpdateProcessorFactory [collection1] {delete=[529 (-1537732579820568576)]} 0 49
   [junit4]   2> 22299 INFO  (TEST-HardAutoCommitTest.testCommitWithin-seed#[B05E198F182A8480]) [    x:collection1] o.a.s.c.S.Request [collection1]  webapp=null path=null params={q=id:529&qt=standard&start=0&rows=20&version=2.2} hits=0 status=0 QTime=0
   [junit4]   2> 22299 ERROR (TEST-HardAutoCommitTest.testCommitWithin-seed#[B05E198F182A8480]) [    x:collection1] o.a.s.SolrTestCaseJ4 REQUEST FAILED: xpath=//result[@numFound=1]
   [junit4]   2> 	xml response was: <?xml version="1.0" encoding="UTF-8"?>
   [junit4]   2> <response>
   [junit4]   2> <lst name="responseHeader"><int name="status">0</int><int name="QTime">0</int></lst><result name="response" numFound="0" start="0"></result>
   [junit4]   2> </response>
   [junit4]   2> 
   [junit4]   2> 	request was:q=id:529&qt=standard&start=0&rows=20&version=2.2
   [junit4]   2> 22300 ERROR (TEST-HardAutoCommitTest.testCommitWithin-seed#[B05E198F182A8480]) [    x:collection1] o.a.s.SolrTestCaseJ4 REQUEST FAILED: q=id:529&qt=standard&start=0&rows=20&version=2.2:java.lang.RuntimeException: REQUEST FAILED: xpath=//result[@numFound=1]
   [junit4]   2> 	xml response was: <?xml version="1.0" encoding="UTF-8"?>
   [junit4]   2> <response>
   [junit4]   2> <lst name="responseHeader"><int name="status">0</int><int name="QTime">0</int></lst><result name="response" numFound="0" start="0"></result>
   [junit4]   2> </response>
   [junit4]   2> 
   [junit4]   2> 	request was:q=id:529&qt=standard&start=0&rows=20&version=2.2
   [junit4]   2> 	at org.apache.solr.SolrTestCaseJ4.assertQ(SolrTestCaseJ4.java:774)
   [junit4]   2> 	at org.apache.solr.update.HardAutoCommitTest.testCommitWithin(HardAutoCommitTest.java:99)
   [junit4]   2> 	at sun.reflect.NativeMethodAccessorImpl.invoke0(Native Method)
   [junit4]   2> 	at sun.reflect.NativeMethodAccessorImpl.invoke(NativeMethodAccessorImpl.java:62)
   [junit4]   2> 	at sun.reflect.DelegatingMethodAccessorImpl.invoke(DelegatingMethodAccessorImpl.java:43)
   [junit4]   2> 	at java.lang.reflect.Method.invoke(Method.java:498)
   [junit4]   2> 	at com.carrotsearch.randomizedtesting.RandomizedRunner.invoke(RandomizedRunner.java:1764)
   [junit4]   2> 	at com.carrotsearch.randomizedtesting.RandomizedRunner$8.evaluate(RandomizedRunner.java:871)
   [junit4]   2> 	at com.carrotsearch.randomizedtesting.RandomizedRunner$9.evaluate(RandomizedRunner.java:907)
   [junit4]   2> 	at com.carrotsearch.randomizedtesting.RandomizedRunner$10.evaluate(RandomizedRunner.java:921)
   [junit4]   2> 	at com.carrotsearch.randomizedtesting.rules.SystemPropertiesRestoreRule$1.evaluate(SystemPropertiesRestoreRule.java:57)
   [junit4]   2> 	at org.apache.lucene.util.TestRuleSetupTeardownChained$1.evaluate(TestRuleSetupTeardownChained.java:49)
   [junit4]   2> 	at org.apache.lucene.util.AbstractBeforeAfterRule$1.evaluate(AbstractBeforeAfterRule.java:45)
   [junit4]   2> 	at org.apache.lucene.util.TestRuleThreadAndTestName$1.evaluate(TestRuleThreadAndTestName.java:48)
   [junit4]   2> 	at org.apache.lucene.util.TestRuleIgnoreAfterMaxFailures$1.evaluate(TestRuleIgnoreAfterMaxFailures.java:64)
   [junit4]   2> 	at org.apache.lucene.util.TestRuleMarkFailure$1.evaluate(TestRuleMarkFailure.java:47)
   [junit4]   2> 	at com.carrotsearch.randomizedtesting.rules.StatementAdapter.evaluate(StatementAdapter.java:36)
   [junit4]   2> 	at com.carrotsearch.randomizedtesting.ThreadLeakControl$StatementRunner.run(ThreadLeakControl.java:367)
   [junit4]   2> 	at com.carrotsearch.randomizedtesting.ThreadLeakControl.forkTimeoutingTask(ThreadLeakControl.java:809)
   [junit4]   2> 	at com.carrotsearch.randomizedtesting.ThreadLeakControl$3.evaluate(ThreadLeakControl.java:460)
   [junit4]   2> 	at com.carrotsearch.randomizedtesting.RandomizedRunner.runSingleTest(RandomizedRunner.java:880)
   [junit4]   2> 	at com.carrotsearch.randomizedtesting.RandomizedRunner$5.evaluate(RandomizedRunner.java:781)
   [junit4]   2> 	at com.carrotsearch.randomizedtesting.RandomizedRunner$6.evaluate(RandomizedRunner.java:816)
   [junit4]   2> 	at com.carrotsearch.randomizedtesting.RandomizedRunner$7.evaluate(RandomizedRunner.java:827)
   [junit4]   2> 	at com.carrotsearch.randomizedtesting.rules.StatementAdapter.evaluate(StatementAdapter.java:36)
   [junit4]   2> 	at com.carrotsearch.randomizedtesting.rules.SystemPropertiesRestoreRule$1.evaluate(SystemPropertiesRestoreRule.java:57)
   [junit4]   2> 	at org.apache.lucene.util.AbstractBeforeAfterRule$1.evaluate(AbstractBeforeAfterRule.java:45)
   [junit4]   2> 	at com.carrotsearch.randomizedtesting.rules.StatementAdapter.evaluate(StatementAdapter.java:36)
   [junit4]   2> 	at org.apache.lucene.util.TestRuleStoreClassName$1.evaluate(TestRuleStoreClassName.java:41)
   [junit4]   2> 	at com.carrotsearch.randomizedtesting.rules.NoShadowingOrOverridesOnMethodsRule$1.evaluate(NoShadowingOrOverridesOnMethodsRule.java:40)
   [junit4]   2> 	at com.carrotsearch.randomizedtesting.rules.NoShadowingOrOverridesOnMethodsRule$1.evaluate(NoShadowingOrOverridesOnMethodsRule.java:40)
   [junit4]   2> 	at com.carrotsearch.randomizedtesting.rules.StatementAdapter.evaluate(StatementAdapter.java:36)
   [junit4]   2> 	at com.carrotsearch.randomizedtesting.rules.StatementAdapter.evaluate(StatementAdapter.java:36)
   [junit4]   2> 	at com.carrotsearch.randomizedtesting.rules.StatementAdapter.evaluate(StatementAdapter.java:36)
   [junit4]   2> 	at org.apache.lucene.util.TestRuleAssertionsRequired$1.evaluate(TestRuleAssertionsRequired.java:53)
   [junit4]   2> 	at org.apache.lucene.util.TestRuleMarkFailure$1.evaluate(TestRuleMarkFailure.java:47)
   [junit4]   2> 	at org.apache.lucene.util.TestRuleIgnoreAfterMaxFailures$1.evaluate(TestRuleIgnoreAfterMaxFailures.java:64)
   [junit4]   2> 	at org.apache.lucene.util.TestRuleIgnoreTestSuites$1.evaluate(TestRuleIgnoreTestSuites.java:54)
   [junit4]   2> 	at com.carrotsearch.randomizedtesting.rules.StatementAdapter.evaluate(StatementAdapter.java:36)
   [junit4]   2> 	at com.carrotsearch.randomizedtesting.ThreadLeakControl$StatementRunner.run(ThreadLeakControl.java:367)
   [junit4]   2> 	at java.lang.Thread.run(Thread.java:745)
   [junit4]   2> 
   [junit4]   2> 22311 INFO  (TEST-HardAutoCommitTest.testCommitWithin-seed#[B05E198F182A8480]) [    x:collection1] o.a.s.SolrTestCaseJ4 ###Ending testCommitWithin
   [junit4]   2> NOTE: reproduce with: ant test  -Dtestcase=HardAutoCommitTest -Dtests.method=testCommitWithin -Dtests.seed=B05E198F182A8480 -Dtests.slow=true -Dtests.locale=is-IS -Dtests.timezone=America/Jujuy -Dtests.asserts=true -Dtests.file.encoding=UTF-8
   [junit4] ERROR   0.48s J0 | HardAutoCommitTest.testCommitWithin <<<
   [junit4]    > Throwable #1: java.lang.RuntimeException: Exception during query
   [junit4]    > 	at __randomizedtesting.SeedInfo.seed([B05E198F182A8480:A8C76F79B046A95]:0)
   [junit4]    > 	at org.apache.solr.SolrTestCaseJ4.assertQ(SolrTestCaseJ4.java:781)
   [junit4]    > 	at org.apache.solr.update.HardAutoCommitTest.testCommitWithin(HardAutoCommitTest.java:99)
   [junit4]    > 	at java.lang.Thread.run(Thread.java:745)
   [junit4]    > Caused by: java.lang.RuntimeException: REQUEST FAILED: xpath=//result[@numFound=1]
   [junit4]    > 	xml response was: <?xml version="1.0" encoding="UTF-8"?>
   [junit4]    > <response>
   [junit4]    > <lst name="responseHeader"><int name="status">0</int><int name="QTime">0</int></lst><result name="response" numFound="0" start="0"></result>
   [junit4]    > </response>
   [junit4]    > 	request was:q=id:529&qt=standard&start=0&rows=20&version=2.2
   [junit4]    > 	at org.apache.solr.SolrTestCaseJ4.assertQ(SolrTestCaseJ4.java:774)
   [junit4]    > 	... 40 more
   [junit4]   2> 22313 INFO  (SUITE-HardAutoCommitTest-seed#[B05E198F182A8480]-worker) [    x:collection1] o.a.s.SolrTestCaseJ4 ###deleteCore
   [junit4]   2> 22313 INFO  (SUITE-HardAutoCommitTest-seed#[B05E198F182A8480]-worker) [    x:collection1] o.a.s.c.CoreContainer Shutting down CoreContainer instance=1926672781
   [junit4]   2> 22314 INFO  (coreCloseExecutor-103-thread-1-processing-x:collection1) [    x:collection1] o.a.s.c.SolrCore [collection1]  CLOSING SolrCore org.apache.solr.core.SolrCore@361a38f8
   [junit4]   2> 22314 INFO  (coreCloseExecutor-103-thread-1-processing-x:collection1) [    x:collection1] o.a.s.u.DirectUpdateHandler2 closing DirectUpdateHandler2{commits=0,autocommits=0,soft autocommits=0,optimizes=0,rollbacks=0,expungeDeletes=0,docsPending=2,adds=2,deletesById=1,deletesByQuery=0,errors=0,cumulative_adds=2,cumulative_deletesById=1,cumulative_deletesByQuery=0,cumulative_errors=0,transaction_logs_total_size=0,transaction_logs_total_number=0}
   [junit4]   2> 22314 INFO  (coreCloseExecutor-103-thread-1-processing-x:collection1) [    x:collection1] o.a.s.u.SolrCoreState Closing SolrCoreState
   [junit4]   2> 22314 INFO  (coreCloseExecutor-103-thread-1-processing-x:collection1) [    x:collection1] o.a.s.u.DefaultSolrCoreState SolrCoreState ref count has reached 0 - closing IndexWriter
   [junit4]   2> 22314 INFO  (coreCloseExecutor-103-thread-1-processing-x:collection1) [    x:collection1] o.a.s.u.DefaultSolrCoreState closing IndexWriter with IndexWriterCloser
   [junit4]   2> 22314 INFO  (coreCloseExecutor-103-thread-1-processing-x:collection1) [    x:collection1] o.a.s.u.DirectUpdateHandler2 Committing on IndexWriter close.
   [junit4]   2> 22330 INFO  (coreCloseExecutor-103-thread-1-processing-x:collection1) [    x:collection1] o.a.s.c.SolrDeletionPolicy SolrDeletionPolicy.onCommit: commits: num=2
   [junit4]   2> 	commit{dir=MockDirectoryWrapper(RAMDirectory@ef77358 lockFactory=org.apache.lucene.store.SingleInstanceLockFactory@230f9e0),segFN=segments_1,generation=1}
   [junit4]   2> 	commit{dir=MockDirectoryWrapper(RAMDirectory@ef77358 lockFactory=org.apache.lucene.store.SingleInstanceLockFactory@230f9e0),segFN=segments_2,generation=2}
   [junit4]   2> 22331 INFO  (coreCloseExecutor-103-thread-1-processing-x:collection1) [    x:collection1] o.a.s.c.SolrDeletionPolicy newest commit generation = 2
   [junit4]   2> 22332 INFO  (coreCloseExecutor-103-thread-1-processing-x:collection1) [    x:collection1] o.a.s.c.SolrCore [collection1] Closing main searcher on request.
   [junit4]   2> 22332 INFO  (coreCloseExecutor-103-thread-1-processing-x:collection1) [    x:collection1] o.a.s.c.CachingDirectoryFactory Closing MockDirectoryFactory - 2 directories currently being tracked
   [junit4]   2> 22332 INFO  (coreCloseExecutor-103-thread-1-processing-x:collection1) [    x:collection1] o.a.s.c.CachingDirectoryFactory looking to close /export/home/jenkins/workspace/Lucene-Solr-6.x-Solaris/solr/build/solr-core/test/J0/temp/solr.update.HardAutoCommitTest_B05E198F182A8480-001/init-core-data-001/index [CachedDir<<refCount=0;path=/export/home/jenkins/workspace/Lucene-Solr-6.x-Solaris/solr/build/solr-core/test/J0/temp/solr.update.HardAutoCommitTest_B05E198F182A8480-001/init-core-data-001/index;done=false>>]
   [junit4]   2> 22333 INFO  (coreCloseExecutor-103-thread-1-processing-x:collection1) [    x:collection1] o.a.s.c.CachingDirectoryFactory Closing directory, CoreContainer#isShutdown=true
   [junit4]   2> 22333 INFO  (coreCloseExecutor-103-thread-1-processing-x:collection1) [    x:collection1] o.a.s.c.CachingDirectoryFactory Closing directory: /export/home/jenkins/workspace/Lucene-Solr-6.x-Solaris/solr/build/solr-core/test/J0/temp/solr.update.HardAutoCommitTest_B05E198F182A8480-001/init-core-data-001/index
   [junit4]   2> 22333 INFO  (coreCloseExecutor-103-thread-1-processing-x:collection1) [    x:collection1] o.a.s.c.CachingDirectoryFactory looking to close /export/home/jenkins/workspace/Lucene-Solr-6.x-Solaris/solr/build/solr-core/test/J0/temp/solr.update.HardAutoCommitTest_B05E198F182A8480-001/init-core-data-001 [CachedDir<<refCount=0;path=/export/home/jenkins/workspace/Lucene-Solr-6.x-Solaris/solr/build/solr-core/test/J0/temp/solr.update.HardAutoCommitTest_B05E198F182A8480-001/init-core-data-001;done=false>>]
   [junit4]   2> 22333 INFO  (coreCloseExecutor-103-thread-1-processing-x:collection1) [    x:collection1] o.a.s.c.CachingDirectoryFactory Closing directory, CoreContainer#isShutdown=true
   [junit4]   2> 22333 INFO  (coreCloseExecutor-103-thread-1-processing-x:collection1) [    x:collection1] o.a.s.c.CachingDirectoryFactory Closing directory: /export/home/jenkins/workspace/Lucene-Solr-6.x-Solaris/solr/build/solr-core/test/J0/temp/solr.update.HardAutoCommitTest_B05E198F182A8480-001/init-core-data-001
   [junit4]   2> NOTE: leaving temporary files on disk at: /export/home/jenkins/workspace/Lucene-Solr-6.x-Solaris/solr/build/solr-core/test/J0/temp/solr.update.HardAutoCommitTest_B05E198F182A8480-001
   [junit4]   2> NOTE: test params are: codec=Asserting(Lucene62): {range_facet_l_dv=Lucene50(blocksize=128), _version_=PostingsFormat(name=Asserting), field_t=BlockTreeOrds(blocksize=128), multiDefault=PostingsFormat(name=Direct), subject=PostingsFormat(name=Direct), intDefault=PostingsFormat(name=Asserting), id=Lucene50(blocksize=128), range_facet_i_dv=PostingsFormat(name=Asserting), text=BlockTreeOrds(blocksize=128), range_facet_l=PostingsFormat(name=Asserting), timestamp=PostingsFormat(name=Asserting)}, docValues:{range_facet_l_dv=DocValuesFormat(name=Lucene54), range_facet_i_dv=DocValuesFormat(name=Lucene54), timestamp=DocValuesFormat(name=Lucene54)}, maxPointsInLeafNode=774, maxMBSortInHeap=6.862992009488546, sim=ClassicSimilarity, locale=is-IS, timezone=America/Jujuy
   [junit4]   2> NOTE: SunOS 5.11 amd64/Oracle Corporation 1.8.0_92 (64-bit)/cpus=3,threads=1,free=19775680,total=75862016
   [junit4]   2> NOTE: All tests run in this JVM: [PolyFieldTest, ReturnFieldsTest, SuggesterFSTTest, TestWordDelimiterFilterFactory, SolrRequestParserTest, TestConfigOverlay, ConcurrentDeleteAndCreateCollectionTest, TestLRUCache, TestXIncludeConfig, HardAutoCommitTest]
   [junit4] Completed [13/615 (1!)] on J0 in 1.14s, 1 test, 1 error <<< FAILURES!

[...truncated 1949 lines...]
BUILD FAILED
/export/home/jenkins/workspace/Lucene-Solr-6.x-Solaris/build.xml:740: The following error occurred while executing this line:
/export/home/jenkins/workspace/Lucene-Solr-6.x-Solaris/build.xml:684: The following error occurred while executing this line:
/export/home/jenkins/workspace/Lucene-Solr-6.x-Solaris/build.xml:59: The following error occurred while executing this line:
/export/home/jenkins/workspace/Lucene-Solr-6.x-Solaris/solr/build.xml:233: The following error occurred while executing this line:
/export/home/jenkins/workspace/Lucene-Solr-6.x-Solaris/solr/common-build.xml:530: The following error occurred while executing this line:
/export/home/jenkins/workspace/Lucene-Solr-6.x-Solaris/lucene/common-build.xml:1427: The following error occurred while executing this line:
/export/home/jenkins/workspace/Lucene-Solr-6.x-Solaris/lucene/common-build.xml:984: There were test failures: 615 suites (10 ignored), 2591 tests, 1 error, 87 ignored (72 assumptions) [seed: B05E198F182A8480]

Total time: 84 minutes 28 seconds
Build step 'Invoke Ant' marked build as failure
Archiving artifacts
[WARNINGS] Skipping publisher since build result is FAILURE
Recording test results
Email was triggered for: Failure - Any
Sending email for trigger: Failure - Any



Mime
View raw message