lucene-dev mailing list archives

Site index · List index
Message view « Date » · « Thread »
Top « Date » · « Thread »
From Policeman Jenkins Server <jenk...@thetaphi.de>
Subject [JENKINS] Lucene-Solr-master-Linux (32bit/jdk1.8.0_92) - Build # 16884 - Still Failing!
Date Wed, 01 Jun 2016 01:31:16 GMT
Build: http://jenkins.thetaphi.de/job/Lucene-Solr-master-Linux/16884/
Java: 32bit/jdk1.8.0_92 -server -XX:+UseConcMarkSweepGC

1 tests failed.
FAILED:  org.apache.solr.util.SolrPluginUtilsTest.testInvokeSetters

Error Message:
argument type mismatch

Stack Trace:
java.lang.IllegalArgumentException: argument type mismatch
	at __randomizedtesting.SeedInfo.seed([D7085877C52128C4:BE17F37730174A6F]:0)
	at sun.reflect.NativeMethodAccessorImpl.invoke0(Native Method)
	at sun.reflect.NativeMethodAccessorImpl.invoke(NativeMethodAccessorImpl.java:62)
	at sun.reflect.DelegatingMethodAccessorImpl.invoke(DelegatingMethodAccessorImpl.java:43)
	at java.lang.reflect.Method.invoke(Method.java:498)
	at org.apache.solr.util.SolrPluginUtils.invokeSetters(SolrPluginUtils.java:1071)
	at org.apache.solr.util.SolrPluginUtilsTest.implTestInvokeSetters(SolrPluginUtilsTest.java:482)
	at org.apache.solr.util.SolrPluginUtilsTest.testInvokeSetters(SolrPluginUtilsTest.java:474)
	at sun.reflect.NativeMethodAccessorImpl.invoke0(Native Method)
	at sun.reflect.NativeMethodAccessorImpl.invoke(NativeMethodAccessorImpl.java:62)
	at sun.reflect.DelegatingMethodAccessorImpl.invoke(DelegatingMethodAccessorImpl.java:43)
	at java.lang.reflect.Method.invoke(Method.java:498)
	at com.carrotsearch.randomizedtesting.RandomizedRunner.invoke(RandomizedRunner.java:1764)
	at com.carrotsearch.randomizedtesting.RandomizedRunner$8.evaluate(RandomizedRunner.java:871)
	at com.carrotsearch.randomizedtesting.RandomizedRunner$9.evaluate(RandomizedRunner.java:907)
	at com.carrotsearch.randomizedtesting.RandomizedRunner$10.evaluate(RandomizedRunner.java:921)
	at com.carrotsearch.randomizedtesting.rules.SystemPropertiesRestoreRule$1.evaluate(SystemPropertiesRestoreRule.java:57)
	at org.apache.lucene.util.TestRuleSetupTeardownChained$1.evaluate(TestRuleSetupTeardownChained.java:49)
	at org.apache.lucene.util.AbstractBeforeAfterRule$1.evaluate(AbstractBeforeAfterRule.java:45)
	at org.apache.lucene.util.TestRuleThreadAndTestName$1.evaluate(TestRuleThreadAndTestName.java:48)
	at org.apache.lucene.util.TestRuleIgnoreAfterMaxFailures$1.evaluate(TestRuleIgnoreAfterMaxFailures.java:64)
	at org.apache.lucene.util.TestRuleMarkFailure$1.evaluate(TestRuleMarkFailure.java:47)
	at com.carrotsearch.randomizedtesting.rules.StatementAdapter.evaluate(StatementAdapter.java:36)
	at com.carrotsearch.randomizedtesting.ThreadLeakControl$StatementRunner.run(ThreadLeakControl.java:367)
	at com.carrotsearch.randomizedtesting.ThreadLeakControl.forkTimeoutingTask(ThreadLeakControl.java:809)
	at com.carrotsearch.randomizedtesting.ThreadLeakControl$3.evaluate(ThreadLeakControl.java:460)
	at com.carrotsearch.randomizedtesting.RandomizedRunner.runSingleTest(RandomizedRunner.java:880)
	at com.carrotsearch.randomizedtesting.RandomizedRunner$5.evaluate(RandomizedRunner.java:781)
	at com.carrotsearch.randomizedtesting.RandomizedRunner$6.evaluate(RandomizedRunner.java:816)
	at com.carrotsearch.randomizedtesting.RandomizedRunner$7.evaluate(RandomizedRunner.java:827)
	at com.carrotsearch.randomizedtesting.rules.StatementAdapter.evaluate(StatementAdapter.java:36)
	at com.carrotsearch.randomizedtesting.rules.SystemPropertiesRestoreRule$1.evaluate(SystemPropertiesRestoreRule.java:57)
	at org.apache.lucene.util.AbstractBeforeAfterRule$1.evaluate(AbstractBeforeAfterRule.java:45)
	at com.carrotsearch.randomizedtesting.rules.StatementAdapter.evaluate(StatementAdapter.java:36)
	at org.apache.lucene.util.TestRuleStoreClassName$1.evaluate(TestRuleStoreClassName.java:41)
	at com.carrotsearch.randomizedtesting.rules.NoShadowingOrOverridesOnMethodsRule$1.evaluate(NoShadowingOrOverridesOnMethodsRule.java:40)
	at com.carrotsearch.randomizedtesting.rules.NoShadowingOrOverridesOnMethodsRule$1.evaluate(NoShadowingOrOverridesOnMethodsRule.java:40)
	at com.carrotsearch.randomizedtesting.rules.StatementAdapter.evaluate(StatementAdapter.java:36)
	at com.carrotsearch.randomizedtesting.rules.StatementAdapter.evaluate(StatementAdapter.java:36)
	at com.carrotsearch.randomizedtesting.rules.StatementAdapter.evaluate(StatementAdapter.java:36)
	at org.apache.lucene.util.TestRuleAssertionsRequired$1.evaluate(TestRuleAssertionsRequired.java:53)
	at org.apache.lucene.util.TestRuleMarkFailure$1.evaluate(TestRuleMarkFailure.java:47)
	at org.apache.lucene.util.TestRuleIgnoreAfterMaxFailures$1.evaluate(TestRuleIgnoreAfterMaxFailures.java:64)
	at org.apache.lucene.util.TestRuleIgnoreTestSuites$1.evaluate(TestRuleIgnoreTestSuites.java:54)
	at com.carrotsearch.randomizedtesting.rules.StatementAdapter.evaluate(StatementAdapter.java:36)
	at com.carrotsearch.randomizedtesting.ThreadLeakControl$StatementRunner.run(ThreadLeakControl.java:367)
	at java.lang.Thread.run(Thread.java:745)




Build Log:
[...truncated 11688 lines...]
   [junit4] Suite: org.apache.solr.util.SolrPluginUtilsTest
   [junit4]   2> Creating dataDir: /home/jenkins/workspace/Lucene-Solr-master-Linux/solr/build/solr-core/test/J1/temp/solr.util.SolrPluginUtilsTest_D7085877C52128C4-001/init-core-data-001
   [junit4]   2> 1374093 INFO  (SUITE-SolrPluginUtilsTest-seed#[D7085877C52128C4]-worker)
[    ] o.a.s.SolrTestCaseJ4 Randomized ssl (true) and clientAuth (true)
   [junit4]   2> 1374095 INFO  (SUITE-SolrPluginUtilsTest-seed#[D7085877C52128C4]-worker)
[    ] o.a.s.SolrTestCaseJ4 ####initCore
   [junit4]   2> 1374095 INFO  (SUITE-SolrPluginUtilsTest-seed#[D7085877C52128C4]-worker)
[    ] o.a.s.c.SolrResourceLoader new SolrResourceLoader for directory: '/home/jenkins/workspace/Lucene-Solr-master-Linux/solr/core/src/test-files/solr/collection1'
   [junit4]   2> 1374095 INFO  (SUITE-SolrPluginUtilsTest-seed#[D7085877C52128C4]-worker)
[    ] o.a.s.c.SolrResourceLoader JNDI not configured for solr (NoInitialContextEx)
   [junit4]   2> 1374095 INFO  (SUITE-SolrPluginUtilsTest-seed#[D7085877C52128C4]-worker)
[    ] o.a.s.c.SolrResourceLoader using system property solr.solr.home: /home/jenkins/workspace/Lucene-Solr-master-Linux/solr/core/src/test-files/solr
   [junit4]   2> 1374095 INFO  (SUITE-SolrPluginUtilsTest-seed#[D7085877C52128C4]-worker)
[    ] o.a.s.c.SolrResourceLoader Adding 'file:/home/jenkins/workspace/Lucene-Solr-master-Linux/solr/core/src/test-files/solr/collection1/lib/classes/'
to classloader
   [junit4]   2> 1374095 INFO  (SUITE-SolrPluginUtilsTest-seed#[D7085877C52128C4]-worker)
[    ] o.a.s.c.SolrResourceLoader Adding 'file:/home/jenkins/workspace/Lucene-Solr-master-Linux/solr/core/src/test-files/solr/collection1/lib/README'
to classloader
   [junit4]   2> 1374113 INFO  (SUITE-SolrPluginUtilsTest-seed#[D7085877C52128C4]-worker)
[    ] o.a.s.c.SolrConfig current version of requestparams : -1
   [junit4]   2> 1374119 WARN  (SUITE-SolrPluginUtilsTest-seed#[D7085877C52128C4]-worker)
[    ] o.a.s.c.Config Beginning with Solr 5.5, <mergePolicy> is deprecated, use <mergePolicyFactory>
instead.
   [junit4]   2> 1374120 INFO  (SUITE-SolrPluginUtilsTest-seed#[D7085877C52128C4]-worker)
[    ] o.a.s.c.SolrConfig Using Lucene MatchVersion: 7.0.0
   [junit4]   2> 1374146 INFO  (SUITE-SolrPluginUtilsTest-seed#[D7085877C52128C4]-worker)
[    ] o.a.s.c.SolrConfig Loaded SolrConfig: solrconfig.xml
   [junit4]   2> 1374150 INFO  (SUITE-SolrPluginUtilsTest-seed#[D7085877C52128C4]-worker)
[    ] o.a.s.s.IndexSchema [null] Schema name=test
   [junit4]   2> 1374214 INFO  (SUITE-SolrPluginUtilsTest-seed#[D7085877C52128C4]-worker)
[    ] o.a.s.s.OpenExchangeRatesOrgProvider Initialized with rates=open-exchange-rates.json,
refreshInterval=1440.
   [junit4]   2> 1374218 INFO  (SUITE-SolrPluginUtilsTest-seed#[D7085877C52128C4]-worker)
[    ] o.a.s.s.IndexSchema default search field in schema is text
   [junit4]   2> 1374219 INFO  (SUITE-SolrPluginUtilsTest-seed#[D7085877C52128C4]-worker)
[    ] o.a.s.s.IndexSchema unique key field: id
   [junit4]   2> 1374221 INFO  (SUITE-SolrPluginUtilsTest-seed#[D7085877C52128C4]-worker)
[    ] o.a.s.s.FileExchangeRateProvider Reloading exchange rates from file currency.xml
   [junit4]   2> 1374222 INFO  (SUITE-SolrPluginUtilsTest-seed#[D7085877C52128C4]-worker)
[    ] o.a.s.s.FileExchangeRateProvider Reloading exchange rates from file currency.xml
   [junit4]   2> 1374223 INFO  (SUITE-SolrPluginUtilsTest-seed#[D7085877C52128C4]-worker)
[    ] o.a.s.s.OpenExchangeRatesOrgProvider Reloading exchange rates from open-exchange-rates.json
   [junit4]   2> 1374223 INFO  (SUITE-SolrPluginUtilsTest-seed#[D7085877C52128C4]-worker)
[    ] o.a.s.s.OpenExchangeRatesOrgProvider Reloading exchange rates from open-exchange-rates.json
   [junit4]   2> 1374224 INFO  (SUITE-SolrPluginUtilsTest-seed#[D7085877C52128C4]-worker)
[    ] o.a.s.c.SolrResourceLoader JNDI not configured for solr (NoInitialContextEx)
   [junit4]   2> 1374224 INFO  (SUITE-SolrPluginUtilsTest-seed#[D7085877C52128C4]-worker)
[    ] o.a.s.c.SolrResourceLoader using system property solr.solr.home: /home/jenkins/workspace/Lucene-Solr-master-Linux/solr/core/src/test-files/solr
   [junit4]   2> 1374224 INFO  (SUITE-SolrPluginUtilsTest-seed#[D7085877C52128C4]-worker)
[    ] o.a.s.c.SolrResourceLoader new SolrResourceLoader for directory: '/home/jenkins/workspace/Lucene-Solr-master-Linux/solr/core/src/test-files/solr'
   [junit4]   2> 1374224 INFO  (SUITE-SolrPluginUtilsTest-seed#[D7085877C52128C4]-worker)
[    ] o.a.s.c.SolrResourceLoader JNDI not configured for solr (NoInitialContextEx)
   [junit4]   2> 1374224 INFO  (SUITE-SolrPluginUtilsTest-seed#[D7085877C52128C4]-worker)
[    ] o.a.s.c.SolrResourceLoader using system property solr.solr.home: /home/jenkins/workspace/Lucene-Solr-master-Linux/solr/core/src/test-files/solr
   [junit4]   2> 1374224 INFO  (SUITE-SolrPluginUtilsTest-seed#[D7085877C52128C4]-worker)
[    ] o.a.s.c.CoreContainer New CoreContainer 20939487
   [junit4]   2> 1374224 INFO  (SUITE-SolrPluginUtilsTest-seed#[D7085877C52128C4]-worker)
[    ] o.a.s.c.CoreContainer Loading cores into CoreContainer [instanceDir=/home/jenkins/workspace/Lucene-Solr-master-Linux/solr/core/src/test-files/solr]
   [junit4]   2> 1374224 WARN  (SUITE-SolrPluginUtilsTest-seed#[D7085877C52128C4]-worker)
[    ] o.a.s.c.CoreContainer Couldn't add files from /home/jenkins/workspace/Lucene-Solr-master-Linux/solr/core/src/test-files/solr/lib
to classpath: /home/jenkins/workspace/Lucene-Solr-master-Linux/solr/core/src/test-files/solr/lib
   [junit4]   2> 1374224 INFO  (SUITE-SolrPluginUtilsTest-seed#[D7085877C52128C4]-worker)
[    ] o.a.s.h.c.HttpShardHandlerFactory created with socketTimeout : 600000,connTimeout :
60000,maxConnectionsPerHost : 20,maxConnections : 10000,corePoolSize : 0,maximumPoolSize :
2147483647,maxThreadIdleTime : 5,sizeOfQueue : -1,fairnessPolicy : false,
   [junit4]   2> 1374226 INFO  (SUITE-SolrPluginUtilsTest-seed#[D7085877C52128C4]-worker)
[    ] o.a.s.u.UpdateShardHandler Creating UpdateShardHandler HTTP client with params: 
   [junit4]   2> 1374226 INFO  (SUITE-SolrPluginUtilsTest-seed#[D7085877C52128C4]-worker)
[    ] o.a.s.l.LogWatcher SLF4J impl is org.slf4j.impl.Log4jLoggerFactory
   [junit4]   2> 1374226 INFO  (SUITE-SolrPluginUtilsTest-seed#[D7085877C52128C4]-worker)
[    ] o.a.s.l.LogWatcher Registering Log Listener [Log4j (org.slf4j.impl.Log4jLoggerFactory)]
   [junit4]   2> 1374226 INFO  (SUITE-SolrPluginUtilsTest-seed#[D7085877C52128C4]-worker)
[    ] o.a.s.c.CoreContainer Security conf doesn't exist. Skipping setup for authorization
module.
   [junit4]   2> 1374226 INFO  (SUITE-SolrPluginUtilsTest-seed#[D7085877C52128C4]-worker)
[    ] o.a.s.c.CoreContainer No authentication plugin used.
   [junit4]   2> 1374227 INFO  (SUITE-SolrPluginUtilsTest-seed#[D7085877C52128C4]-worker)
[    ] o.a.s.c.CoreDescriptor Created CoreDescriptor: {name=collection1, config=solrconfig.xml,
transient=false, schema=schema.xml, loadOnStartup=true, configSetProperties=configsetprops.json,
collection=collection1, dataDir=/home/jenkins/workspace/Lucene-Solr-master-Linux/solr/build/solr-core/test/J1/temp/solr.util.SolrPluginUtilsTest_D7085877C52128C4-001/init-core-data-001,
shard=shard1}
   [junit4]   2> 1374227 INFO  (coreLoadExecutor-5437-thread-1) [    ] o.a.s.c.SolrResourceLoader
new SolrResourceLoader for directory: '/home/jenkins/workspace/Lucene-Solr-master-Linux/solr/core/src/test-files/solr/collection1'
   [junit4]   2> 1374227 INFO  (coreLoadExecutor-5437-thread-1) [    ] o.a.s.c.SolrResourceLoader
JNDI not configured for solr (NoInitialContextEx)
   [junit4]   2> 1374227 INFO  (coreLoadExecutor-5437-thread-1) [    ] o.a.s.c.SolrResourceLoader
using system property solr.solr.home: /home/jenkins/workspace/Lucene-Solr-master-Linux/solr/core/src/test-files/solr
   [junit4]   2> 1374227 INFO  (coreLoadExecutor-5437-thread-1) [    ] o.a.s.c.SolrResourceLoader
Adding 'file:/home/jenkins/workspace/Lucene-Solr-master-Linux/solr/core/src/test-files/solr/collection1/lib/classes/'
to classloader
   [junit4]   2> 1374227 INFO  (coreLoadExecutor-5437-thread-1) [    ] o.a.s.c.SolrResourceLoader
Adding 'file:/home/jenkins/workspace/Lucene-Solr-master-Linux/solr/core/src/test-files/solr/collection1/lib/README'
to classloader
   [junit4]   2> 1374248 INFO  (coreLoadExecutor-5437-thread-1) [    ] o.a.s.c.SolrConfig
current version of requestparams : -1
   [junit4]   2> 1374258 WARN  (coreLoadExecutor-5437-thread-1) [    ] o.a.s.c.Config Beginning
with Solr 5.5, <mergePolicy> is deprecated, use <mergePolicyFactory> instead.
   [junit4]   2> 1374260 INFO  (coreLoadExecutor-5437-thread-1) [    ] o.a.s.c.SolrConfig
Using Lucene MatchVersion: 7.0.0
   [junit4]   2> 1374278 INFO  (coreLoadExecutor-5437-thread-1) [    ] o.a.s.c.SolrConfig
Loaded SolrConfig: solrconfig.xml
   [junit4]   2> 1374281 INFO  (coreLoadExecutor-5437-thread-1) [    ] o.a.s.s.IndexSchema
[collection1] Schema name=test
   [junit4]   2> 1374361 INFO  (coreLoadExecutor-5437-thread-1) [    ] o.a.s.s.OpenExchangeRatesOrgProvider
Initialized with rates=open-exchange-rates.json, refreshInterval=1440.
   [junit4]   2> 1374365 INFO  (coreLoadExecutor-5437-thread-1) [    ] o.a.s.s.IndexSchema
default search field in schema is text
   [junit4]   2> 1374366 INFO  (coreLoadExecutor-5437-thread-1) [    ] o.a.s.s.IndexSchema
unique key field: id
   [junit4]   2> 1374368 INFO  (coreLoadExecutor-5437-thread-1) [    ] o.a.s.s.FileExchangeRateProvider
Reloading exchange rates from file currency.xml
   [junit4]   2> 1374369 INFO  (coreLoadExecutor-5437-thread-1) [    ] o.a.s.s.FileExchangeRateProvider
Reloading exchange rates from file currency.xml
   [junit4]   2> 1374370 INFO  (coreLoadExecutor-5437-thread-1) [    ] o.a.s.s.OpenExchangeRatesOrgProvider
Reloading exchange rates from open-exchange-rates.json
   [junit4]   2> 1374370 INFO  (coreLoadExecutor-5437-thread-1) [    ] o.a.s.s.OpenExchangeRatesOrgProvider
Reloading exchange rates from open-exchange-rates.json
   [junit4]   2> 1374371 INFO  (coreLoadExecutor-5437-thread-1) [    ] o.a.s.c.ConfigSetProperties
Did not find ConfigSet properties, assuming default properties: Can't find resource 'configsetprops.json'
in classpath or '/home/jenkins/workspace/Lucene-Solr-master-Linux/solr/core/src/test-files/solr/collection1'
   [junit4]   2> 1374371 INFO  (coreLoadExecutor-5437-thread-1) [    ] o.a.s.c.CoreContainer
Creating SolrCore 'collection1' using configuration from instancedir /home/jenkins/workspace/Lucene-Solr-master-Linux/solr/core/src/test-files/solr/collection1
   [junit4]   2> 1374371 INFO  (coreLoadExecutor-5437-thread-1) [    x:collection1] o.a.s.c.SolrCore
org.apache.solr.core.MockDirectoryFactory
   [junit4]   2> 1374371 INFO  (coreLoadExecutor-5437-thread-1) [    x:collection1] o.a.s.c.SolrCore
[[collection1] ] Opening new SolrCore at [/home/jenkins/workspace/Lucene-Solr-master-Linux/solr/core/src/test-files/solr/collection1],
dataDir=[/home/jenkins/workspace/Lucene-Solr-master-Linux/solr/build/solr-core/test/J1/temp/solr.util.SolrPluginUtilsTest_D7085877C52128C4-001/init-core-data-001/]
   [junit4]   2> 1374371 INFO  (coreLoadExecutor-5437-thread-1) [    x:collection1] o.a.s.c.JmxMonitoredMap
JMX monitoring is enabled. Adding Solr mbeans to JMX Server: com.sun.jmx.mbeanserver.JmxMBeanServer@1186735
   [junit4]   2> 1374372 INFO  (coreLoadExecutor-5437-thread-1) [    x:collection1] o.a.s.c.CachingDirectoryFactory
return new directory for /home/jenkins/workspace/Lucene-Solr-master-Linux/solr/build/solr-core/test/J1/temp/solr.util.SolrPluginUtilsTest_D7085877C52128C4-001/init-core-data-001
   [junit4]   2> 1374372 INFO  (coreLoadExecutor-5437-thread-1) [    x:collection1] o.a.s.c.SolrCore
New index directory detected: old=null new=/home/jenkins/workspace/Lucene-Solr-master-Linux/solr/build/solr-core/test/J1/temp/solr.util.SolrPluginUtilsTest_D7085877C52128C4-001/init-core-data-001/index/
   [junit4]   2> 1374372 WARN  (coreLoadExecutor-5437-thread-1) [    x:collection1] o.a.s.c.SolrCore
[collection1] Solr index directory '/home/jenkins/workspace/Lucene-Solr-master-Linux/solr/build/solr-core/test/J1/temp/solr.util.SolrPluginUtilsTest_D7085877C52128C4-001/init-core-data-001/index'
doesn't exist. Creating new index...
   [junit4]   2> 1374372 INFO  (coreLoadExecutor-5437-thread-1) [    x:collection1] o.a.s.c.CachingDirectoryFactory
return new directory for /home/jenkins/workspace/Lucene-Solr-master-Linux/solr/build/solr-core/test/J1/temp/solr.util.SolrPluginUtilsTest_D7085877C52128C4-001/init-core-data-001/index
   [junit4]   2> 1374372 INFO  (coreLoadExecutor-5437-thread-1) [    x:collection1] o.a.s.u.RandomMergePolicy
RandomMergePolicy wrapping class org.apache.lucene.index.LogDocMergePolicy: [LogDocMergePolicy:
minMergeSize=1000, mergeFactor=25, maxMergeSize=9223372036854775807, maxMergeSizeForForcedMerge=9223372036854775807,
calibrateSizeByDeletes=false, maxMergeDocs=2147483647, maxCFSSegmentSizeMB=8.796093022207999E12,
noCFSRatio=0.0]
   [junit4]   2> 1374372 INFO  (coreLoadExecutor-5437-thread-1) [    x:collection1] o.a.s.c.SolrDeletionPolicy
SolrDeletionPolicy.onCommit: commits: num=1
   [junit4]   2> 	commit{dir=MockDirectoryWrapper(RAMDirectory@380f4d lockFactory=org.apache.lucene.store.SingleInstanceLockFactory@deee79),segFN=segments_1,generation=1}
   [junit4]   2> 1374372 INFO  (coreLoadExecutor-5437-thread-1) [    x:collection1] o.a.s.c.SolrDeletionPolicy
newest commit generation = 1
   [junit4]   2> 1374373 INFO  (OldIndexDirectoryCleanupThreadForCore-collection1) [  
 x:collection1] o.a.s.c.SolrCore Looking for old index directories to cleanup for core collection1
in /home/jenkins/workspace/Lucene-Solr-master-Linux/solr/build/solr-core/test/J1/temp/solr.util.SolrPluginUtilsTest_D7085877C52128C4-001/init-core-data-001/
   [junit4]   2> 1374376 INFO  (coreLoadExecutor-5437-thread-1) [    x:collection1] o.a.s.u.p.UpdateRequestProcessorChain
creating updateRequestProcessorChain "dedupe"
   [junit4]   2> 1374376 INFO  (coreLoadExecutor-5437-thread-1) [    x:collection1] o.a.s.u.p.UpdateRequestProcessorChain
inserting DistributedUpdateProcessorFactory into updateRequestProcessorChain "dedupe"
   [junit4]   2> 1374376 INFO  (coreLoadExecutor-5437-thread-1) [    x:collection1] o.a.s.u.p.UpdateRequestProcessorChain
creating updateRequestProcessorChain "dedupe-allfields"
   [junit4]   2> 1374376 INFO  (coreLoadExecutor-5437-thread-1) [    x:collection1] o.a.s.u.p.UpdateRequestProcessorChain
inserting DistributedUpdateProcessorFactory into updateRequestProcessorChain "dedupe-allfields"
   [junit4]   2> 1374376 INFO  (coreLoadExecutor-5437-thread-1) [    x:collection1] o.a.s.u.p.UpdateRequestProcessorChain
creating updateRequestProcessorChain "stored_sig"
   [junit4]   2> 1374376 INFO  (coreLoadExecutor-5437-thread-1) [    x:collection1] o.a.s.u.p.UpdateRequestProcessorChain
inserting DistributedUpdateProcessorFactory into updateRequestProcessorChain "stored_sig"
   [junit4]   2> 1374376 INFO  (coreLoadExecutor-5437-thread-1) [    x:collection1] o.a.s.u.p.UpdateRequestProcessorChain
creating updateRequestProcessorChain "uniq-fields"
   [junit4]   2> 1374376 INFO  (coreLoadExecutor-5437-thread-1) [    x:collection1] o.a.s.u.p.UpdateRequestProcessorChain
inserting DistributedUpdateProcessorFactory into updateRequestProcessorChain "uniq-fields"
   [junit4]   2> 1374376 INFO  (coreLoadExecutor-5437-thread-1) [    x:collection1] o.a.s.u.p.UpdateRequestProcessorChain
creating updateRequestProcessorChain "distrib-dup-test-chain-explicit"
   [junit4]   2> 1374376 INFO  (coreLoadExecutor-5437-thread-1) [    x:collection1] o.a.s.u.p.UpdateRequestProcessorChain
creating updateRequestProcessorChain "distrib-dup-test-chain-implicit"
   [junit4]   2> 1374377 INFO  (coreLoadExecutor-5437-thread-1) [    x:collection1] o.a.s.u.p.UpdateRequestProcessorChain
inserting DistributedUpdateProcessorFactory into updateRequestProcessorChain "distrib-dup-test-chain-implicit"
   [junit4]   2> 1374377 INFO  (coreLoadExecutor-5437-thread-1) [    x:collection1] o.a.s.c.SolrCore
no updateRequestProcessorChain defined as default, creating implicit default
   [junit4]   2> 1374378 INFO  (coreLoadExecutor-5437-thread-1) [    x:collection1] o.a.s.h.l.XMLLoader
xsltCacheLifetimeSeconds=60
   [junit4]   2> 1374378 INFO  (coreLoadExecutor-5437-thread-1) [    x:collection1] o.a.s.h.l.XMLLoader
xsltCacheLifetimeSeconds=60
   [junit4]   2> 1374379 INFO  (coreLoadExecutor-5437-thread-1) [    x:collection1] o.a.s.h.l.XMLLoader
xsltCacheLifetimeSeconds=60
   [junit4]   2> 1374379 INFO  (coreLoadExecutor-5437-thread-1) [    x:collection1] o.a.s.h.l.XMLLoader
xsltCacheLifetimeSeconds=60
   [junit4]   2> 1374381 INFO  (coreLoadExecutor-5437-thread-1) [    x:collection1] o.a.s.c.PluginBag
requestHandler : 'lazy' created with startup=lazy 
   [junit4]   2> 1374382 INFO  (coreLoadExecutor-5437-thread-1) [    x:collection1] o.a.s.c.RequestHandlers
Registered paths: /admin/mbeans,standard,spellCheckCompRH,lazy,/update/json/docs,/admin/luke,/export,spellCheckWithWordbreak_Direct,tvrh,/get,/admin/properties,/update/json,mltrh,/admin/threads,/search-facet-def,/update/csv,/sql,/graph,/search-facet-invariants,/admin/segments,spellCheckCompRH1,/mlt,/admin/system,/replication,dismax,defaults,/config,/stream,/schema,/admin/plugins,/admin/logging,spellCheckWithWordbreak,mock,/admin/ping,/update,/admin/file,/terms,spellCheckCompRH_Direct,/debug/dump
   [junit4]   2> 1374382 INFO  (coreLoadExecutor-5437-thread-1) [    x:collection1] o.a.s.c.SolrCore
Using default statsCache cache: org.apache.solr.search.stats.LocalStatsCache
   [junit4]   2> 1374383 INFO  (coreLoadExecutor-5437-thread-1) [    x:collection1] o.a.s.u.UpdateHandler
Using UpdateLog implementation: org.apache.solr.update.UpdateLog
   [junit4]   2> 1374383 INFO  (coreLoadExecutor-5437-thread-1) [    x:collection1] o.a.s.u.UpdateLog
Initializing UpdateLog: dataDir= defaultSyncLevel=FLUSH numRecordsToKeep=100 maxNumLogsToKeep=10
numVersionBuckets=65536
   [junit4]   2> 1374383 INFO  (coreLoadExecutor-5437-thread-1) [    x:collection1] o.a.s.u.CommitTracker
Hard AutoCommit: disabled
   [junit4]   2> 1374383 INFO  (coreLoadExecutor-5437-thread-1) [    x:collection1] o.a.s.u.CommitTracker
Soft AutoCommit: disabled
   [junit4]   2> 1374383 INFO  (coreLoadExecutor-5437-thread-1) [    x:collection1] o.a.s.u.RandomMergePolicy
RandomMergePolicy wrapping class org.apache.lucene.index.TieredMergePolicy: [TieredMergePolicy:
maxMergeAtOnce=20, maxMergeAtOnceExplicit=18, maxMergedSegmentMB=69.306640625, floorSegmentMB=2.02734375,
forceMergeDeletesPctAllowed=26.23881057297586, segmentsPerTier=34.0, maxCFSSegmentSizeMB=8.796093022207999E12,
noCFSRatio=1.0
   [junit4]   2> 1374383 INFO  (coreLoadExecutor-5437-thread-1) [    x:collection1] o.a.s.c.SolrDeletionPolicy
SolrDeletionPolicy.onInit: commits: num=1
   [junit4]   2> 	commit{dir=MockDirectoryWrapper(RAMDirectory@380f4d lockFactory=org.apache.lucene.store.SingleInstanceLockFactory@deee79),segFN=segments_1,generation=1}
   [junit4]   2> 1374383 INFO  (coreLoadExecutor-5437-thread-1) [    x:collection1] o.a.s.c.SolrDeletionPolicy
newest commit generation = 1
   [junit4]   2> 1374384 INFO  (coreLoadExecutor-5437-thread-1) [    x:collection1] o.a.s.s.SolrIndexSearcher
Opening [Searcher@1478ff1[collection1] main]
   [junit4]   2> 1374384 INFO  (coreLoadExecutor-5437-thread-1) [    x:collection1] o.a.s.r.RestManager
Initializing RestManager with initArgs: {storageIO=org.apache.solr.rest.ManagedResourceStorage$InMemoryStorageIO}
   [junit4]   2> 1374384 INFO  (coreLoadExecutor-5437-thread-1) [    x:collection1] o.a.s.r.ManagedResourceStorage
Reading _rest_managed.json using InMemoryStorage
   [junit4]   2> 1374384 INFO  (coreLoadExecutor-5437-thread-1) [    x:collection1] o.a.s.r.RestManager
Initializing 0 registered ManagedResources
   [junit4]   2> 1374384 INFO  (coreLoadExecutor-5437-thread-1) [    x:collection1] o.a.s.h.c.SpellCheckComponent
Initializing spell checkers
   [junit4]   2> 1374425 INFO  (coreLoadExecutor-5437-thread-1) [    x:collection1] o.a.s.s.DirectSolrSpellChecker
init: {name=direct,classname=DirectSolrSpellChecker,field=lowerfilt,minQueryLength=3}
   [junit4]   2> 1374539 INFO  (coreLoadExecutor-5437-thread-1) [    x:collection1] o.a.s.h.ReplicationHandler
Commits will be reserved for  10000
   [junit4]   2> 1374539 INFO  (searcherExecutor-5438-thread-1-processing-x:collection1)
[    x:collection1] o.a.s.h.c.SpellCheckComponent Loading spell index for spellchecker: default
   [junit4]   2> 1374539 INFO  (searcherExecutor-5438-thread-1-processing-x:collection1)
[    x:collection1] o.a.s.h.c.SpellCheckComponent Loading spell index for spellchecker: direct
   [junit4]   2> 1374540 INFO  (searcherExecutor-5438-thread-1-processing-x:collection1)
[    x:collection1] o.a.s.h.c.SpellCheckComponent Loading spell index for spellchecker: wordbreak
   [junit4]   2> 1374540 INFO  (searcherExecutor-5438-thread-1-processing-x:collection1)
[    x:collection1] o.a.s.h.c.SpellCheckComponent Loading spell index for spellchecker: multipleFields
   [junit4]   2> 1374540 INFO  (searcherExecutor-5438-thread-1-processing-x:collection1)
[    x:collection1] o.a.s.h.c.SpellCheckComponent Loading spell index for spellchecker: jarowinkler
   [junit4]   2> 1374540 INFO  (coreLoadExecutor-5437-thread-1) [    x:collection1] o.a.s.u.UpdateLog
Looking up max value of version field to seed version buckets
   [junit4]   2> 1374540 INFO  (coreLoadExecutor-5437-thread-1) [    x:collection1] o.a.s.u.VersionInfo
Refreshing highest value of _version_ for 65536 version buckets from index
   [junit4]   2> 1374540 INFO  (searcherExecutor-5438-thread-1-processing-x:collection1)
[    x:collection1] o.a.s.h.c.SpellCheckComponent Loading spell index for spellchecker: external
   [junit4]   2> 1374540 INFO  (coreLoadExecutor-5437-thread-1) [    x:collection1] o.a.s.u.VersionInfo
No terms found for _version_, cannot seed version bucket highest value from index
   [junit4]   2> 1374540 INFO  (coreLoadExecutor-5437-thread-1) [    x:collection1] o.a.s.u.UpdateLog
Could not find max version in index or recent updates, using new clock 1535895438524153856
   [junit4]   2> 1374540 INFO  (searcherExecutor-5438-thread-1-processing-x:collection1)
[    x:collection1] o.a.s.h.c.SpellCheckComponent Loading spell index for spellchecker: freq
   [junit4]   2> 1374540 INFO  (searcherExecutor-5438-thread-1-processing-x:collection1)
[    x:collection1] o.a.s.h.c.SpellCheckComponent Loading spell index for spellchecker: fqcn
   [junit4]   2> 1374540 INFO  (searcherExecutor-5438-thread-1-processing-x:collection1)
[    x:collection1] o.a.s.h.c.SpellCheckComponent Loading spell index for spellchecker: perDict
   [junit4]   2> 1374541 INFO  (searcherExecutor-5438-thread-1-processing-x:collection1)
[    x:collection1] o.a.s.c.SolrCore [collection1] Registered new searcher Searcher@1478ff1[collection1]
main{ExitableDirectoryReader(UninvertingDirectoryReader())}
   [junit4]   2> 1374542 INFO  (coreLoadExecutor-5437-thread-1) [    x:collection1] o.a.s.u.UpdateLog
Took 2.0ms to seed version buckets with highest version 1535895438524153856
   [junit4]   2> 1374542 INFO  (coreLoadExecutor-5437-thread-1) [    x:collection1] o.a.s.c.CoreContainer
registering core: collection1
   [junit4]   2> 1374543 INFO  (SUITE-SolrPluginUtilsTest-seed#[D7085877C52128C4]-worker)
[    ] o.a.s.SolrTestCaseJ4 ####initCore end
   [junit4]   2> 1374546 INFO  (TEST-SolrPluginUtilsTest.testInvokeSetters-seed#[D7085877C52128C4])
[    ] o.a.s.SolrTestCaseJ4 ###Starting testInvokeSetters
   [junit4]   2> 1374546 INFO  (TEST-SolrPluginUtilsTest.testInvokeSetters-seed#[D7085877C52128C4])
[    ] o.a.s.SolrTestCaseJ4 ###Ending testInvokeSetters
   [junit4]   2> NOTE: reproduce with: ant test  -Dtestcase=SolrPluginUtilsTest -Dtests.method=testInvokeSetters
-Dtests.seed=D7085877C52128C4 -Dtests.multiplier=3 -Dtests.slow=true -Dtests.locale=fr-BE
-Dtests.timezone=Etc/GMT-6 -Dtests.asserts=true -Dtests.file.encoding=UTF-8
   [junit4] ERROR   0.01s J1 | SolrPluginUtilsTest.testInvokeSetters <<<
   [junit4]    > Throwable #1: java.lang.IllegalArgumentException: argument type mismatch
   [junit4]    > 	at __randomizedtesting.SeedInfo.seed([D7085877C52128C4:BE17F37730174A6F]:0)
   [junit4]    > 	at org.apache.solr.util.SolrPluginUtils.invokeSetters(SolrPluginUtils.java:1071)
   [junit4]    > 	at org.apache.solr.util.SolrPluginUtilsTest.implTestInvokeSetters(SolrPluginUtilsTest.java:482)
   [junit4]    > 	at org.apache.solr.util.SolrPluginUtilsTest.testInvokeSetters(SolrPluginUtilsTest.java:474)
   [junit4]    > 	at java.lang.Thread.run(Thread.java:745)
   [junit4]   2> 1374550 INFO  (TEST-SolrPluginUtilsTest.testStripIllegalOperators-seed#[D7085877C52128C4])
[    ] o.a.s.SolrTestCaseJ4 ###Starting testStripIllegalOperators
   [junit4]   2> 1374550 INFO  (TEST-SolrPluginUtilsTest.testStripIllegalOperators-seed#[D7085877C52128C4])
[    ] o.a.s.SolrTestCaseJ4 ###Ending testStripIllegalOperators
   [junit4]   2> 1374552 INFO  (TEST-SolrPluginUtilsTest.testParseFieldBoosts-seed#[D7085877C52128C4])
[    ] o.a.s.SolrTestCaseJ4 ###Starting testParseFieldBoosts
   [junit4]   2> 1374552 INFO  (TEST-SolrPluginUtilsTest.testParseFieldBoosts-seed#[D7085877C52128C4])
[    ] o.a.s.SolrTestCaseJ4 ###Ending testParseFieldBoosts
   [junit4]   2> 1374555 INFO  (TEST-SolrPluginUtilsTest.testStripUnbalancedQuotes-seed#[D7085877C52128C4])
[    ] o.a.s.SolrTestCaseJ4 ###Starting testStripUnbalancedQuotes
   [junit4]   2> 1374555 INFO  (TEST-SolrPluginUtilsTest.testStripUnbalancedQuotes-seed#[D7085877C52128C4])
[    ] o.a.s.SolrTestCaseJ4 ###Ending testStripUnbalancedQuotes
   [junit4]   2> 1374556 INFO  (TEST-SolrPluginUtilsTest.testDisjunctionMaxQueryParser-seed#[D7085877C52128C4])
[    ] o.a.s.SolrTestCaseJ4 ###Starting testDisjunctionMaxQueryParser
   [junit4]   2> 1374558 INFO  (TEST-SolrPluginUtilsTest.testDisjunctionMaxQueryParser-seed#[D7085877C52128C4])
[    ] o.a.s.SolrTestCaseJ4 ###Ending testDisjunctionMaxQueryParser
   [junit4]   2> 1374560 INFO  (TEST-SolrPluginUtilsTest.testMinShouldMatchCalculator-seed#[D7085877C52128C4])
[    ] o.a.s.SolrTestCaseJ4 ###Starting testMinShouldMatchCalculator
   [junit4]   2> 1374561 INFO  (TEST-SolrPluginUtilsTest.testMinShouldMatchCalculator-seed#[D7085877C52128C4])
[    ] o.a.s.SolrTestCaseJ4 ###Ending testMinShouldMatchCalculator
   [junit4]   2> 1374563 INFO  (TEST-SolrPluginUtilsTest.testMinShouldMatchAutoRelax-seed#[D7085877C52128C4])
[    ] o.a.s.SolrTestCaseJ4 ###Starting testMinShouldMatchAutoRelax
   [junit4]   2> 1374563 INFO  (TEST-SolrPluginUtilsTest.testMinShouldMatchAutoRelax-seed#[D7085877C52128C4])
[    ] o.a.s.SolrTestCaseJ4 ###Ending testMinShouldMatchAutoRelax
   [junit4]   2> 1374566 INFO  (TEST-SolrPluginUtilsTest.testDocListConversion-seed#[D7085877C52128C4])
[    ] o.a.s.SolrTestCaseJ4 ###Starting testDocListConversion
   [junit4]   2> 1374568 INFO  (TEST-SolrPluginUtilsTest.testDocListConversion-seed#[D7085877C52128C4])
[    ] o.a.s.u.p.LogUpdateProcessorFactory [collection1]  webapp=null path=null params={}{add=[3234
(1535895438551416832)]} 0 1
   [junit4]   2> 1374569 INFO  (TEST-SolrPluginUtilsTest.testDocListConversion-seed#[D7085877C52128C4])
[    ] o.a.s.u.p.LogUpdateProcessorFactory [collection1]  webapp=null path=null params={}{add=[3235
(1535895438554562560)]} 0 0
   [junit4]   2> 1374570 INFO  (TEST-SolrPluginUtilsTest.testDocListConversion-seed#[D7085877C52128C4])
[    ] o.a.s.u.p.LogUpdateProcessorFactory [collection1]  webapp=null path=null params={}{add=[3236
(1535895438554562561)]} 0 0
   [junit4]   2> 1374570 INFO  (TEST-SolrPluginUtilsTest.testDocListConversion-seed#[D7085877C52128C4])
[    ] o.a.s.u.DirectUpdateHandler2 start commit{,optimize=false,openSearcher=true,waitSearcher=true,expungeDeletes=false,softCommit=false,prepareCommit=false}
   [junit4]   2> 1374572 INFO  (TEST-SolrPluginUtilsTest.testDocListConversion-seed#[D7085877C52128C4])
[    ] o.a.s.c.SolrDeletionPolicy SolrDeletionPolicy.onCommit: commits: num=2
   [junit4]   2> 	commit{dir=MockDirectoryWrapper(RAMDirectory@380f4d lockFactory=org.apache.lucene.store.SingleInstanceLockFactory@deee79),segFN=segments_1,generation=1}
   [junit4]   2> 	commit{dir=MockDirectoryWrapper(RAMDirectory@380f4d lockFactory=org.apache.lucene.store.SingleInstanceLockFactory@deee79),segFN=segments_2,generation=2}
   [junit4]   2> 1374572 INFO  (TEST-SolrPluginUtilsTest.testDocListConversion-seed#[D7085877C52128C4])
[    ] o.a.s.c.SolrDeletionPolicy newest commit generation = 2
   [junit4]   2> 1374574 INFO  (TEST-SolrPluginUtilsTest.testDocListConversion-seed#[D7085877C52128C4])
[    ] o.a.s.s.SolrIndexSearcher Opening [Searcher@10f5d01[collection1] main]
   [junit4]   2> 1374574 INFO  (TEST-SolrPluginUtilsTest.testDocListConversion-seed#[D7085877C52128C4])
[    ] o.a.s.u.DirectUpdateHandler2 end_commit_flush
   [junit4]   2> 1374575 INFO  (searcherExecutor-5438-thread-1) [    ] o.a.s.c.SolrCore
[collection1] Registered new searcher Searcher@10f5d01[collection1] main{ExitableDirectoryReader(UninvertingDirectoryReader(Uninverting(_0(7.0.0):C3)))}
   [junit4]   2> 1374575 INFO  (TEST-SolrPluginUtilsTest.testDocListConversion-seed#[D7085877C52128C4])
[    ] o.a.s.u.p.LogUpdateProcessorFactory [collection1]  webapp=null path=null params={}{commit=}
0 4
   [junit4]   2> 1374575 INFO  (TEST-SolrPluginUtilsTest.testDocListConversion-seed#[D7085877C52128C4])
[    ] o.a.s.SolrTestCaseJ4 ###Ending testDocListConversion
   [junit4]   2> 1374579 INFO  (TEST-SolrPluginUtilsTest.testPartialEscape-seed#[D7085877C52128C4])
[    ] o.a.s.SolrTestCaseJ4 ###Starting testPartialEscape
   [junit4]   2> 1374579 INFO  (TEST-SolrPluginUtilsTest.testPartialEscape-seed#[D7085877C52128C4])
[    ] o.a.s.SolrTestCaseJ4 ###Ending testPartialEscape
   [junit4]   2> 1374579 INFO  (SUITE-SolrPluginUtilsTest-seed#[D7085877C52128C4]-worker)
[    ] o.a.s.SolrTestCaseJ4 ###deleteCore
   [junit4]   2> 1374579 INFO  (SUITE-SolrPluginUtilsTest-seed#[D7085877C52128C4]-worker)
[    ] o.a.s.c.CoreContainer Shutting down CoreContainer instance=20939487
   [junit4]   2> 1374580 INFO  (coreCloseExecutor-5443-thread-1) [    x:collection1] o.a.s.c.SolrCore
[collection1]  CLOSING SolrCore org.apache.solr.core.SolrCore@1cc9bb3
   [junit4]   2> 1374580 INFO  (coreCloseExecutor-5443-thread-1) [    x:collection1] o.a.s.u.DirectUpdateHandler2
closing DirectUpdateHandler2{commits=1,autocommits=0,soft autocommits=0,optimizes=0,rollbacks=0,expungeDeletes=0,docsPending=0,adds=0,deletesById=0,deletesByQuery=0,errors=0,cumulative_adds=3,cumulative_deletesById=0,cumulative_deletesByQuery=0,cumulative_errors=0,transaction_logs_total_size=251,transaction_logs_total_number=1}
   [junit4]   2> 1374580 INFO  (coreCloseExecutor-5443-thread-1) [    x:collection1] o.a.s.u.SolrCoreState
Closing SolrCoreState
   [junit4]   2> 1374580 INFO  (coreCloseExecutor-5443-thread-1) [    x:collection1] o.a.s.u.DefaultSolrCoreState
SolrCoreState ref count has reached 0 - closing IndexWriter
   [junit4]   2> 1374580 INFO  (coreCloseExecutor-5443-thread-1) [    x:collection1] o.a.s.u.DefaultSolrCoreState
closing IndexWriter with IndexWriterCloser
   [junit4]   2> 1374581 INFO  (coreCloseExecutor-5443-thread-1) [    x:collection1] o.a.s.c.SolrCore
[collection1] Closing main searcher on request.
   [junit4]   2> 1374588 INFO  (coreCloseExecutor-5443-thread-1) [    x:collection1] o.a.s.c.CachingDirectoryFactory
Closing MockDirectoryFactory - 2 directories currently being tracked
   [junit4]   2> 1374588 INFO  (coreCloseExecutor-5443-thread-1) [    x:collection1] o.a.s.c.CachingDirectoryFactory
looking to close /home/jenkins/workspace/Lucene-Solr-master-Linux/solr/build/solr-core/test/J1/temp/solr.util.SolrPluginUtilsTest_D7085877C52128C4-001/init-core-data-001/index
[CachedDir<<refCount=0;path=/home/jenkins/workspace/Lucene-Solr-master-Linux/solr/build/solr-core/test/J1/temp/solr.util.SolrPluginUtilsTest_D7085877C52128C4-001/init-core-data-001/index;done=false>>]
   [junit4]   2> 1374588 INFO  (coreCloseExecutor-5443-thread-1) [    x:collection1] o.a.s.c.CachingDirectoryFactory
Closing directory, CoreContainer#isShutdown=true
   [junit4]   2> 1374588 INFO  (coreCloseExecutor-5443-thread-1) [    x:collection1] o.a.s.c.CachingDirectoryFactory
Closing directory: /home/jenkins/workspace/Lucene-Solr-master-Linux/solr/build/solr-core/test/J1/temp/solr.util.SolrPluginUtilsTest_D7085877C52128C4-001/init-core-data-001/index
   [junit4]   2> 1374588 INFO  (coreCloseExecutor-5443-thread-1) [    x:collection1] o.a.s.c.CachingDirectoryFactory
looking to close /home/jenkins/workspace/Lucene-Solr-master-Linux/solr/build/solr-core/test/J1/temp/solr.util.SolrPluginUtilsTest_D7085877C52128C4-001/init-core-data-001
[CachedDir<<refCount=0;path=/home/jenkins/workspace/Lucene-Solr-master-Linux/solr/build/solr-core/test/J1/temp/solr.util.SolrPluginUtilsTest_D7085877C52128C4-001/init-core-data-001;done=false>>]
   [junit4]   2> 1374588 INFO  (coreCloseExecutor-5443-thread-1) [    x:collection1] o.a.s.c.CachingDirectoryFactory
Closing directory, CoreContainer#isShutdown=true
   [junit4]   2> 1374588 INFO  (coreCloseExecutor-5443-thread-1) [    x:collection1] o.a.s.c.CachingDirectoryFactory
Closing directory: /home/jenkins/workspace/Lucene-Solr-master-Linux/solr/build/solr-core/test/J1/temp/solr.util.SolrPluginUtilsTest_D7085877C52128C4-001/init-core-data-001
   [junit4]   2> NOTE: leaving temporary files on disk at: /home/jenkins/workspace/Lucene-Solr-master-Linux/solr/build/solr-core/test/J1/temp/solr.util.SolrPluginUtilsTest_D7085877C52128C4-001
   [junit4]   2> NOTE: test params are: codec=Asserting(Lucene62): {val_dynamic=PostingsFormat(name=MockRandom),
range_facet_l_dv=PostingsFormat(name=Memory doPackFST= true), _version_=PostingsFormat(name=Direct),
multiDefault=PostingsFormat(name=Asserting), val_i=PostingsFormat(name=Memory doPackFST= true),
intDefault=PostingsFormat(name=Direct), dynamic_val=PostingsFormat(name=MockRandom), id=PostingsFormat(name=Memory
doPackFST= true), range_facet_i_dv=PostingsFormat(name=Asserting), range_facet_l=PostingsFormat(name=Asserting),
timestamp=PostingsFormat(name=Asserting)}, docValues:{range_facet_l_dv=DocValuesFormat(name=Direct),
range_facet_i_dv=DocValuesFormat(name=Lucene54), timestamp=DocValuesFormat(name=Lucene54)},
maxPointsInLeafNode=107, maxMBSortInHeap=6.178169855615189, sim=RandomSimilarity(queryNorm=true,coord=crazy):
{}, locale=fr-BE, timezone=Etc/GMT-6
   [junit4]   2> NOTE: Linux 4.4.0-21-generic i386/Oracle Corporation 1.8.0_92 (32-bit)/cpus=12,threads=1,free=198682840,total=518979584
   [junit4]   2> NOTE: All tests run in this JVM: [ClassificationUpdateProcessorFactoryTest,
DistributedQueryComponentOptimizationTest, HdfsChaosMonkeyNothingIsSafeTest, DistributedIntervalFacetingTest,
BJQParserTest, UpdateRequestProcessorFactoryTest, TestSolrXml, TestQuerySenderListener, HdfsDirectoryFactoryTest,
SpellingQueryConverterTest, TestSchemaSimilarityResource, TestDFRSimilarityFactory, TestSolrConfigHandlerConcurrent,
TestBulkSchemaAPI, TestPartialUpdateDeduplication, SpellCheckComponentTest, SpatialFilterTest,
TestTolerantUpdateProcessorRandomCloud, TestQueryUtils, SharedFSAutoReplicaFailoverUtilsTest,
TestFieldCollectionResource, UniqFieldsUpdateProcessorFactoryTest, TestCursorMarkWithoutUniqueKey,
TestCollectionAPI, TestGraphMLResponseWriter, TestRandomRequestDistribution, BlockCacheTest,
TestSolrQueryResponse, TestCloudManagedSchema, NotRequiredUniqueKeyTest, TestRecoveryHdfs,
MinimalSchemaTest, CustomCollectionTest, TestDistributedGrouping, ShardRoutingCustomTest,
SoftAutoCommitTest, CoreMergeIndexesAdminHandlerTest, TestDocBasedVersionConstraints, WordBreakSolrSpellCheckerTest,
FileUtilsTest, HdfsTlogReplayBufferedWhileIndexingTest, SpellPossibilityIteratorTest, TestInitParams,
TestShardHandlerFactory, DistributedTermsComponentTest, HdfsNNFailoverTest, RulesTest, OverseerRolesTest,
ConvertedLegacyTest, DistributedFacetPivotLargeTest, DocumentBuilderTest, CollectionReloadTest,
TimeZoneUtilsTest, TestHashPartitioner, TestFileDictionaryLookup, DistributedQueueTest, AnalysisErrorHandlingTest,
TestConfigReload, DeleteReplicaTest, TermsComponentTest, SegmentsInfoRequestHandlerTest, RestartWhileUpdatingTest,
CollectionsAPIAsyncDistributedZkTest, DocValuesTest, TestSubQueryTransformer, DistanceUnitsTest,
TestShortCircuitedRequests, TestSurroundQueryParser, SolrCmdDistributorTest, SolrIndexSplitterTest,
DistanceFunctionTest, VMParamsZkACLAndCredentialsProvidersTest, TestWordDelimiterFilterFactory,
TestExactStatsCache, TestInitQParser, SolrIndexConfigTest, TestRandomCollapseQParserPlugin,
SolrInfoMBeanTest, TestManagedResource, TestSolrCoreProperties, SchemaVersionSpecificBehaviorTest,
TestRestoreCore, TestNamedUpdateProcessors, TestNumericTerms64, VersionInfoTest, SaslZkACLProviderTest,
IndexBasedSpellCheckerTest, TestBM25SimilarityFactory, BlockJoinFacetSimpleTest, LeaderInitiatedRecoveryOnShardRestartTest,
StressHdfsTest, SimplePostToolTest, TestFilteredDocIdSet, TestDynamicLoading, DistribCursorPagingTest,
TestNoOpRegenerator, TestFiltering, ZkStateWriterTest, CollectionsAPIDistributedZkTest, ClusterStateUpdateTest,
TestRandomFaceting, ZkSolrClientTest, TestZkChroot, ZkCLITest, TermVectorComponentDistributedTest,
TestJoin, TestCoreContainer, QueryElevationComponentTest, PeerSyncTest, TestLazyCores, ShowFileRequestHandlerTest,
CurrencyFieldOpenExchangeTest, TestCoreDiscovery, AnalysisAfterCoreReloadTest, SuggesterFSTTest,
SolrRequestParserTest, TestFoldingMultitermQuery, TestStressLucene, SuggesterWFSTTest, TestUpdate,
QueryEqualityTest, SortByFunctionTest, DocValuesMultiTest, CacheHeaderTest, DirectSolrSpellCheckerTest,
DocumentAnalysisRequestHandlerTest, PrimitiveFieldTypeTest, TestOmitPositions, XmlUpdateRequestHandlerTest,
RequestHandlersTest, TestIndexingPerformance, MoreLikeThisHandlerTest, TestArbitraryIndexDir,
LoggingHandlerTest, SolrPluginUtilsTest]
   [junit4] Completed [377/611 (1!)] on J1 in 0.52s, 9 tests, 1 error <<< FAILURES!

[...truncated 765 lines...]
BUILD FAILED
/home/jenkins/workspace/Lucene-Solr-master-Linux/build.xml:740: The following error occurred
while executing this line:
/home/jenkins/workspace/Lucene-Solr-master-Linux/build.xml:684: The following error occurred
while executing this line:
/home/jenkins/workspace/Lucene-Solr-master-Linux/build.xml:59: The following error occurred
while executing this line:
/home/jenkins/workspace/Lucene-Solr-master-Linux/solr/build.xml:233: The following error occurred
while executing this line:
/home/jenkins/workspace/Lucene-Solr-master-Linux/solr/common-build.xml:531: The following
error occurred while executing this line:
/home/jenkins/workspace/Lucene-Solr-master-Linux/lucene/common-build.xml:1427: The following
error occurred while executing this line:
/home/jenkins/workspace/Lucene-Solr-master-Linux/lucene/common-build.xml:984: There were test
failures: 611 suites (10 ignored), 2558 tests, 1 error, 116 ignored (72 assumptions) [seed:
D7085877C52128C4]

Total time: 60 minutes 7 seconds
Build step 'Invoke Ant' marked build as failure
Archiving artifacts
[WARNINGS] Skipping publisher since build result is FAILURE
Recording test results
Email was triggered for: Failure - Any
Sending email for trigger: Failure - Any



Mime
View raw message