lucene-dev mailing list archives

Site index · List index
Message view « Date » · « Thread »
Top « Date » · « Thread »
From Apache Jenkins Server <jenk...@builds.apache.org>
Subject [JENKINS] Lucene-Solr-NightlyTests-6.x - Build # 81 - Still Failing
Date Thu, 02 Jun 2016 11:31:09 GMT
Build: https://builds.apache.org/job/Lucene-Solr-NightlyTests-6.x/81/

1 tests failed.
FAILED:  org.apache.lucene.search.join.TestBlockJoin.testMultiChildQueriesOfDiffParentLevels

Error Message:
this IndexWriter is closed

Stack Trace:
org.apache.lucene.store.AlreadyClosedException: this IndexWriter is closed
	at org.apache.lucene.index.IndexWriter.ensureOpen(IndexWriter.java:724)
	at org.apache.lucene.index.IndexWriter.getConfig(IndexWriter.java:1047)
	at org.apache.lucene.index.RandomIndexWriter.addDocuments(RandomIndexWriter.java:199)
	at org.apache.lucene.search.join.TestBlockJoin.testMultiChildQueriesOfDiffParentLevels(TestBlockJoin.java:1743)
	at sun.reflect.NativeMethodAccessorImpl.invoke0(Native Method)
	at sun.reflect.NativeMethodAccessorImpl.invoke(NativeMethodAccessorImpl.java:62)
	at sun.reflect.DelegatingMethodAccessorImpl.invoke(DelegatingMethodAccessorImpl.java:43)
	at java.lang.reflect.Method.invoke(Method.java:498)
	at com.carrotsearch.randomizedtesting.RandomizedRunner.invoke(RandomizedRunner.java:1764)
	at com.carrotsearch.randomizedtesting.RandomizedRunner$8.evaluate(RandomizedRunner.java:871)
	at com.carrotsearch.randomizedtesting.RandomizedRunner$9.evaluate(RandomizedRunner.java:907)
	at com.carrotsearch.randomizedtesting.RandomizedRunner$10.evaluate(RandomizedRunner.java:921)
	at org.apache.lucene.util.TestRuleSetupTeardownChained$1.evaluate(TestRuleSetupTeardownChained.java:49)
	at org.apache.lucene.util.AbstractBeforeAfterRule$1.evaluate(AbstractBeforeAfterRule.java:45)
	at org.apache.lucene.util.TestRuleThreadAndTestName$1.evaluate(TestRuleThreadAndTestName.java:48)
	at org.apache.lucene.util.TestRuleIgnoreAfterMaxFailures$1.evaluate(TestRuleIgnoreAfterMaxFailures.java:64)
	at org.apache.lucene.util.TestRuleMarkFailure$1.evaluate(TestRuleMarkFailure.java:47)
	at com.carrotsearch.randomizedtesting.rules.StatementAdapter.evaluate(StatementAdapter.java:36)
	at com.carrotsearch.randomizedtesting.ThreadLeakControl$StatementRunner.run(ThreadLeakControl.java:367)
	at com.carrotsearch.randomizedtesting.ThreadLeakControl.forkTimeoutingTask(ThreadLeakControl.java:809)
	at com.carrotsearch.randomizedtesting.ThreadLeakControl$3.evaluate(ThreadLeakControl.java:460)
	at com.carrotsearch.randomizedtesting.RandomizedRunner.runSingleTest(RandomizedRunner.java:880)
	at com.carrotsearch.randomizedtesting.RandomizedRunner$5.evaluate(RandomizedRunner.java:781)
	at com.carrotsearch.randomizedtesting.RandomizedRunner$6.evaluate(RandomizedRunner.java:816)
	at com.carrotsearch.randomizedtesting.RandomizedRunner$7.evaluate(RandomizedRunner.java:827)
	at org.apache.lucene.util.AbstractBeforeAfterRule$1.evaluate(AbstractBeforeAfterRule.java:45)
	at com.carrotsearch.randomizedtesting.rules.StatementAdapter.evaluate(StatementAdapter.java:36)
	at org.apache.lucene.util.TestRuleStoreClassName$1.evaluate(TestRuleStoreClassName.java:41)
	at com.carrotsearch.randomizedtesting.rules.NoShadowingOrOverridesOnMethodsRule$1.evaluate(NoShadowingOrOverridesOnMethodsRule.java:40)
	at com.carrotsearch.randomizedtesting.rules.NoShadowingOrOverridesOnMethodsRule$1.evaluate(NoShadowingOrOverridesOnMethodsRule.java:40)
	at com.carrotsearch.randomizedtesting.rules.StatementAdapter.evaluate(StatementAdapter.java:36)
	at com.carrotsearch.randomizedtesting.rules.StatementAdapter.evaluate(StatementAdapter.java:36)
	at com.carrotsearch.randomizedtesting.rules.StatementAdapter.evaluate(StatementAdapter.java:36)
	at org.apache.lucene.util.TestRuleAssertionsRequired$1.evaluate(TestRuleAssertionsRequired.java:53)
	at org.apache.lucene.util.TestRuleMarkFailure$1.evaluate(TestRuleMarkFailure.java:47)
	at org.apache.lucene.util.TestRuleIgnoreAfterMaxFailures$1.evaluate(TestRuleIgnoreAfterMaxFailures.java:64)
	at org.apache.lucene.util.TestRuleIgnoreTestSuites$1.evaluate(TestRuleIgnoreTestSuites.java:54)
	at com.carrotsearch.randomizedtesting.rules.StatementAdapter.evaluate(StatementAdapter.java:36)
	at com.carrotsearch.randomizedtesting.ThreadLeakControl$StatementRunner.run(ThreadLeakControl.java:367)
	at java.lang.Thread.run(Thread.java:745)
Caused by: java.lang.OutOfMemoryError: Java heap space
	at org.apache.lucene.store.RAMFile.newBuffer(RAMFile.java:78)
	at org.apache.lucene.store.RAMFile.addBuffer(RAMFile.java:51)
	at org.apache.lucene.store.RAMOutputStream.switchCurrentBuffer(RAMOutputStream.java:164)
	at org.apache.lucene.store.RAMOutputStream.writeBytes(RAMOutputStream.java:150)
	at org.apache.lucene.store.MockIndexOutputWrapper.writeBytes(MockIndexOutputWrapper.java:141)
	at org.apache.lucene.store.RateLimitedIndexOutput.writeBytes(RateLimitedIndexOutput.java:73)
	at org.apache.lucene.store.DataOutput.copyBytes(DataOutput.java:278)
	at org.apache.lucene.codecs.simpletext.SimpleTextCompoundFormat.write(SimpleTextCompoundFormat.java:183)
	at org.apache.lucene.index.IndexWriter.createCompoundFile(IndexWriter.java:4681)
	at org.apache.lucene.index.IndexWriter.mergeMiddle(IndexWriter.java:4156)
	at org.apache.lucene.index.IndexWriter.merge(IndexWriter.java:3679)
	at org.apache.lucene.index.ConcurrentMergeScheduler.doMerge(ConcurrentMergeScheduler.java:588)
	at org.apache.lucene.index.ConcurrentMergeScheduler$MergeThread.run(ConcurrentMergeScheduler.java:626)




Build Log:
[...truncated 7807 lines...]
   [junit4] Suite: org.apache.lucene.search.join.TestBlockJoin
   [junit4]   2> NOTE: download the large Jenkins line-docs file by running 'ant get-jenkins-line-docs'
in the lucene directory.
   [junit4]   2> NOTE: reproduce with: ant test  -Dtestcase=TestBlockJoin -Dtests.method=testMultiChildQueriesOfDiffParentLevels
-Dtests.seed=7431CF436D2424EA -Dtests.multiplier=2 -Dtests.nightly=true -Dtests.slow=true
-Dtests.linedocsfile=/x1/jenkins/lucene-data/enwiki.random.lines.txt -Dtests.locale=de-AT
-Dtests.timezone=Asia/Bishkek -Dtests.asserts=true -Dtests.file.encoding=UTF-8
   [junit4] ERROR    158s J1 | TestBlockJoin.testMultiChildQueriesOfDiffParentLevels <<<
   [junit4]    > Throwable #1: org.apache.lucene.store.AlreadyClosedException: this IndexWriter
is closed
   [junit4]    > 	at org.apache.lucene.index.IndexWriter.ensureOpen(IndexWriter.java:724)
   [junit4]    > 	at org.apache.lucene.index.IndexWriter.getConfig(IndexWriter.java:1047)
   [junit4]    > 	at org.apache.lucene.index.RandomIndexWriter.addDocuments(RandomIndexWriter.java:199)
   [junit4]    > 	at org.apache.lucene.search.join.TestBlockJoin.testMultiChildQueriesOfDiffParentLevels(TestBlockJoin.java:1743)
   [junit4]    > 	at java.lang.Thread.run(Thread.java:745)
   [junit4]    > Caused by: java.lang.OutOfMemoryError: Java heap space
   [junit4]    > 	at org.apache.lucene.store.RAMFile.newBuffer(RAMFile.java:78)
   [junit4]    > 	at org.apache.lucene.store.RAMFile.addBuffer(RAMFile.java:51)
   [junit4]    > 	at org.apache.lucene.store.RAMOutputStream.switchCurrentBuffer(RAMOutputStream.java:164)
   [junit4]    > 	at org.apache.lucene.store.RAMOutputStream.writeBytes(RAMOutputStream.java:150)
   [junit4]    > 	at org.apache.lucene.store.MockIndexOutputWrapper.writeBytes(MockIndexOutputWrapper.java:141)
   [junit4]    > 	at org.apache.lucene.store.RateLimitedIndexOutput.writeBytes(RateLimitedIndexOutput.java:73)
   [junit4]    > 	at org.apache.lucene.store.DataOutput.copyBytes(DataOutput.java:278)
   [junit4]    > 	at org.apache.lucene.codecs.simpletext.SimpleTextCompoundFormat.write(SimpleTextCompoundFormat.java:183)
   [junit4]    > 	at org.apache.lucene.index.IndexWriter.createCompoundFile(IndexWriter.java:4681)
   [junit4]    > 	at org.apache.lucene.index.IndexWriter.mergeMiddle(IndexWriter.java:4156)
   [junit4]    > 	at org.apache.lucene.index.IndexWriter.merge(IndexWriter.java:3679)
   [junit4]    > 	at org.apache.lucene.index.ConcurrentMergeScheduler.doMerge(ConcurrentMergeScheduler.java:588)
   [junit4]    > 	at org.apache.lucene.index.ConcurrentMergeScheduler$MergeThread.run(ConcurrentMergeScheduler.java:626)Throwable
#2: com.carrotsearch.randomizedtesting.UncaughtExceptionError: Captured an uncaught exception
in thread: Thread[id=92, name=Lucene Merge Thread #76, state=RUNNABLE, group=TGRP-TestBlockJoin]
   [junit4]    > Caused by: org.apache.lucene.index.MergePolicy$MergeException: java.lang.OutOfMemoryError:
Java heap space
   [junit4]    > 	at __randomizedtesting.SeedInfo.seed([7431CF436D2424EA]:0)
   [junit4]    > 	at org.apache.lucene.index.ConcurrentMergeScheduler.handleMergeException(ConcurrentMergeScheduler.java:668)
   [junit4]    > 	at org.apache.lucene.index.ConcurrentMergeScheduler$MergeThread.run(ConcurrentMergeScheduler.java:648)
   [junit4]    > Caused by: java.lang.OutOfMemoryError: Java heap space
   [junit4]    > 	at org.apache.lucene.store.RAMFile.newBuffer(RAMFile.java:78)
   [junit4]    > 	at org.apache.lucene.store.RAMFile.addBuffer(RAMFile.java:51)
   [junit4]    > 	at org.apache.lucene.store.RAMOutputStream.switchCurrentBuffer(RAMOutputStream.java:164)
   [junit4]    > 	at org.apache.lucene.store.RAMOutputStream.writeBytes(RAMOutputStream.java:150)
   [junit4]    > 	at org.apache.lucene.store.MockIndexOutputWrapper.writeBytes(MockIndexOutputWrapper.java:141)
   [junit4]    > 	at org.apache.lucene.store.MockIndexOutputWrapper.writeByte(MockIndexOutputWrapper.java:126)
   [junit4]    > 	at org.apache.lucene.store.RateLimitedIndexOutput.writeByte(RateLimitedIndexOutput.java:66)
   [junit4]    > 	at org.apache.lucene.codecs.simpletext.SimpleTextUtil.write(SimpleTextUtil.java:48)
   [junit4]    > 	at org.apache.lucene.codecs.simpletext.SimpleTextUtil.write(SimpleTextUtil.java:39)
   [junit4]    > 	at org.apache.lucene.codecs.simpletext.SimpleTextPointsWriter.write(SimpleTextPointsWriter.java:196)
   [junit4]    > 	at org.apache.lucene.codecs.simpletext.SimpleTextPointsWriter.access$300(SimpleTextPointsWriter.java:36)
   [junit4]    > 	at org.apache.lucene.codecs.simpletext.SimpleTextPointsWriter$1.writeLeafBlockPackedValue(SimpleTextPointsWriter.java:167)
   [junit4]    > 	at org.apache.lucene.util.bkd.BKDWriter.build(BKDWriter.java:1123)
   [junit4]    > 	at org.apache.lucene.util.bkd.BKDWriter.build(BKDWriter.java:1213)
   [junit4]    > 	at org.apache.lucene.util.bkd.BKDWriter.build(BKDWriter.java:1200)
   [junit4]    > 	at org.apache.lucene.util.bkd.BKDWriter.build(BKDWriter.java:1213)
   [junit4]    > 	at org.apache.lucene.util.bkd.BKDWriter.build(BKDWriter.java:1213)
   [junit4]    > 	at org.apache.lucene.util.bkd.BKDWriter.build(BKDWriter.java:1213)
   [junit4]    > 	at org.apache.lucene.util.bkd.BKDWriter.build(BKDWriter.java:1200)
   [junit4]    > 	at org.apache.lucene.util.bkd.BKDWriter.build(BKDWriter.java:1200)
   [junit4]    > 	at org.apache.lucene.util.bkd.BKDWriter.build(BKDWriter.java:1213)
   [junit4]    > 	at org.apache.lucene.util.bkd.BKDWriter.build(BKDWriter.java:1200)
   [junit4]    > 	at org.apache.lucene.util.bkd.BKDWriter.build(BKDWriter.java:1213)
   [junit4]    > 	at org.apache.lucene.util.bkd.BKDWriter.finish(BKDWriter.java:838)
   [junit4]    > 	at org.apache.lucene.codecs.simpletext.SimpleTextPointsWriter.writeField(SimpleTextPointsWriter.java:190)
   [junit4]    > 	at org.apache.lucene.codecs.PointsWriter.mergeOneField(PointsWriter.java:58)
   [junit4]    > 	at org.apache.lucene.codecs.PointsWriter.merge(PointsWriter.java:164)
   [junit4]    > 	at org.apache.lucene.index.SegmentMerger.mergePoints(SegmentMerger.java:168)
   [junit4]    > 	at org.apache.lucene.index.SegmentMerger.merge(SegmentMerger.java:117)
   [junit4]    > 	at org.apache.lucene.index.IndexWriter.mergeMiddle(IndexWriter.java:4099)
   [junit4]    > 	at org.apache.lucene.index.IndexWriter.merge(IndexWriter.java:3679)
   [junit4]    > 	at org.apache.lucene.index.ConcurrentMergeScheduler.doMerge(ConcurrentMergeScheduler.java:588)Throwable
#3: com.carrotsearch.randomizedtesting.UncaughtExceptionError: Captured an uncaught exception
in thread: Thread[id=108, name=Lucene Merge Thread #92, state=RUNNABLE, group=TGRP-TestBlockJoin]
   [junit4]    > Caused by: org.apache.lucene.index.MergePolicy$MergeException: java.lang.OutOfMemoryError:
Java heap space
   [junit4]    > 	at __randomizedtesting.SeedInfo.seed([7431CF436D2424EA]:0)
   [junit4]    > 	at org.apache.lucene.index.ConcurrentMergeScheduler.handleMergeException(ConcurrentMergeScheduler.java:668)
   [junit4]    > 	at org.apache.lucene.index.ConcurrentMergeScheduler$MergeThread.run(ConcurrentMergeScheduler.java:648)
   [junit4]    > Caused by: java.lang.OutOfMemoryError: Java heap space
   [junit4]    > 	at org.apache.lucene.store.RAMFile.newBuffer(RAMFile.java:78)
   [junit4]    > 	at org.apache.lucene.store.RAMFile.addBuffer(RAMFile.java:51)
   [junit4]    > 	at org.apache.lucene.store.RAMOutputStream.switchCurrentBuffer(RAMOutputStream.java:164)
   [junit4]    > 	at org.apache.lucene.store.RAMOutputStream.writeBytes(RAMOutputStream.java:150)
   [junit4]    > 	at org.apache.lucene.store.MockIndexOutputWrapper.writeBytes(MockIndexOutputWrapper.java:141)
   [junit4]    > 	at org.apache.lucene.store.RateLimitedIndexOutput.writeBytes(RateLimitedIndexOutput.java:73)
   [junit4]    > 	at org.apache.lucene.store.DataOutput.copyBytes(DataOutput.java:278)
   [junit4]    > 	at org.apache.lucene.codecs.simpletext.SimpleTextCompoundFormat.write(SimpleTextCompoundFormat.java:183)
   [junit4]    > 	at org.apache.lucene.index.IndexWriter.createCompoundFile(IndexWriter.java:4681)
   [junit4]    > 	at org.apache.lucene.index.IndexWriter.mergeMiddle(IndexWriter.java:4156)
   [junit4]    > 	at org.apache.lucene.index.IndexWriter.merge(IndexWriter.java:3679)
   [junit4]    > 	at org.apache.lucene.index.ConcurrentMergeScheduler.doMerge(ConcurrentMergeScheduler.java:588)
   [junit4]    > 	at org.apache.lucene.index.ConcurrentMergeScheduler$MergeThread.run(ConcurrentMergeScheduler.java:626)
   [junit4]   2> Jun 02, 2016 5:30:11 PM com.carrotsearch.randomizedtesting.RandomizedRunner$QueueUncaughtExceptionsHandler
uncaughtException
   [junit4]   2> WARNING: Uncaught exception in thread: Thread[Lucene Merge Thread #76,5,TGRP-TestBlockJoin]
   [junit4]   2> org.apache.lucene.index.MergePolicy$MergeException: java.lang.OutOfMemoryError:
Java heap space
   [junit4]   2> 	at __randomizedtesting.SeedInfo.seed([7431CF436D2424EA]:0)
   [junit4]   2> 	at org.apache.lucene.index.ConcurrentMergeScheduler.handleMergeException(ConcurrentMergeScheduler.java:668)
   [junit4]   2> 	at org.apache.lucene.index.ConcurrentMergeScheduler$MergeThread.run(ConcurrentMergeScheduler.java:648)
   [junit4]   2> Caused by: java.lang.OutOfMemoryError: Java heap space
   [junit4]   2> 	at org.apache.lucene.store.RAMFile.newBuffer(RAMFile.java:78)
   [junit4]   2> 	at org.apache.lucene.store.RAMFile.addBuffer(RAMFile.java:51)
   [junit4]   2> 	at org.apache.lucene.store.RAMOutputStream.switchCurrentBuffer(RAMOutputStream.java:164)
   [junit4]   2> 	at org.apache.lucene.store.RAMOutputStream.writeBytes(RAMOutputStream.java:150)
   [junit4]   2> 	at org.apache.lucene.store.MockIndexOutputWrapper.writeBytes(MockIndexOutputWrapper.java:141)
   [junit4]   2> 	at org.apache.lucene.store.MockIndexOutputWrapper.writeByte(MockIndexOutputWrapper.java:126)
   [junit4]   2> 	at org.apache.lucene.store.RateLimitedIndexOutput.writeByte(RateLimitedIndexOutput.java:66)
   [junit4]   2> 	at org.apache.lucene.codecs.simpletext.SimpleTextUtil.write(SimpleTextUtil.java:48)
   [junit4]   2> 	at org.apache.lucene.codecs.simpletext.SimpleTextUtil.write(SimpleTextUtil.java:39)
   [junit4]   2> 	at org.apache.lucene.codecs.simpletext.SimpleTextPointsWriter.write(SimpleTextPointsWriter.java:196)
   [junit4]   2> 	at org.apache.lucene.codecs.simpletext.SimpleTextPointsWriter.access$300(SimpleTextPointsWriter.java:36)
   [junit4]   2> 	at org.apache.lucene.codecs.simpletext.SimpleTextPointsWriter$1.writeLeafBlockPackedValue(SimpleTextPointsWriter.java:167)
   [junit4]   2> 	at org.apache.lucene.util.bkd.BKDWriter.build(BKDWriter.java:1123)
   [junit4]   2> 	at org.apache.lucene.util.bkd.BKDWriter.build(BKDWriter.java:1213)
   [junit4]   2> 	at org.apache.lucene.util.bkd.BKDWriter.build(BKDWriter.java:1200)
   [junit4]   2> 	at org.apache.lucene.util.bkd.BKDWriter.build(BKDWriter.java:1213)
   [junit4]   2> 	at org.apache.lucene.util.bkd.BKDWriter.build(BKDWriter.java:1213)
   [junit4]   2> 	at org.apache.lucene.util.bkd.BKDWriter.build(BKDWriter.java:1213)
   [junit4]   2> 	at org.apache.lucene.util.bkd.BKDWriter.build(BKDWriter.java:1200)
   [junit4]   2> 	at org.apache.lucene.util.bkd.BKDWriter.build(BKDWriter.java:1200)
   [junit4]   2> 	at org.apache.lucene.util.bkd.BKDWriter.build(BKDWriter.java:1213)
   [junit4]   2> 	at org.apache.lucene.util.bkd.BKDWriter.build(BKDWriter.java:1200)
   [junit4]   2> 	at org.apache.lucene.util.bkd.BKDWriter.build(BKDWriter.java:1213)
   [junit4]   2> 	at org.apache.lucene.util.bkd.BKDWriter.finish(BKDWriter.java:838)
   [junit4]   2> 	at org.apache.lucene.codecs.simpletext.SimpleTextPointsWriter.writeField(SimpleTextPointsWriter.java:190)
   [junit4]   2> 	at org.apache.lucene.codecs.PointsWriter.mergeOneField(PointsWriter.java:58)
   [junit4]   2> 	at org.apache.lucene.codecs.PointsWriter.merge(PointsWriter.java:164)
   [junit4]   2> 	at org.apache.lucene.index.SegmentMerger.mergePoints(SegmentMerger.java:168)
   [junit4]   2> 	at org.apache.lucene.index.SegmentMerger.merge(SegmentMerger.java:117)
   [junit4]   2> 	at org.apache.lucene.index.IndexWriter.mergeMiddle(IndexWriter.java:4099)
   [junit4]   2> 	at org.apache.lucene.index.IndexWriter.merge(IndexWriter.java:3679)
   [junit4]   2> 	at org.apache.lucene.index.ConcurrentMergeScheduler.doMerge(ConcurrentMergeScheduler.java:588)
   [junit4]   2> 
   [junit4]   2> Jun 02, 2016 5:30:11 PM com.carrotsearch.randomizedtesting.RandomizedRunner$QueueUncaughtExceptionsHandler
uncaughtException
   [junit4]   2> WARNING: Uncaught exception in thread: Thread[Lucene Merge Thread #92,5,TGRP-TestBlockJoin]
   [junit4]   2> org.apache.lucene.index.MergePolicy$MergeException: java.lang.OutOfMemoryError:
Java heap space
   [junit4]   2> 	at __randomizedtesting.SeedInfo.seed([7431CF436D2424EA]:0)
   [junit4]   2> 	at org.apache.lucene.index.ConcurrentMergeScheduler.handleMergeException(ConcurrentMergeScheduler.java:668)
   [junit4]   2> 	at org.apache.lucene.index.ConcurrentMergeScheduler$MergeThread.run(ConcurrentMergeScheduler.java:648)
   [junit4]   2> Caused by: java.lang.OutOfMemoryError: Java heap space
   [junit4]   2> 	at org.apache.lucene.store.RAMFile.newBuffer(RAMFile.java:78)
   [junit4]   2> 	at org.apache.lucene.store.RAMFile.addBuffer(RAMFile.java:51)
   [junit4]   2> 	at org.apache.lucene.store.RAMOutputStream.switchCurrentBuffer(RAMOutputStream.java:164)
   [junit4]   2> 	at org.apache.lucene.store.RAMOutputStream.writeBytes(RAMOutputStream.java:150)
   [junit4]   2> 	at org.apache.lucene.store.MockIndexOutputWrapper.writeBytes(MockIndexOutputWrapper.java:141)
   [junit4]   2> 	at org.apache.lucene.store.RateLimitedIndexOutput.writeBytes(RateLimitedIndexOutput.java:73)
   [junit4]   2> 	at org.apache.lucene.store.DataOutput.copyBytes(DataOutput.java:278)
   [junit4]   2> 	at org.apache.lucene.codecs.simpletext.SimpleTextCompoundFormat.write(SimpleTextCompoundFormat.java:183)
   [junit4]   2> 	at org.apache.lucene.index.IndexWriter.createCompoundFile(IndexWriter.java:4681)
   [junit4]   2> 	at org.apache.lucene.index.IndexWriter.mergeMiddle(IndexWriter.java:4156)
   [junit4]   2> 	at org.apache.lucene.index.IndexWriter.merge(IndexWriter.java:3679)
   [junit4]   2> 	at org.apache.lucene.index.ConcurrentMergeScheduler.doMerge(ConcurrentMergeScheduler.java:588)
   [junit4]   2> 	at org.apache.lucene.index.ConcurrentMergeScheduler$MergeThread.run(ConcurrentMergeScheduler.java:626)
   [junit4]   2> 
   [junit4]   2> NOTE: leaving temporary files on disk at: /x1/jenkins/jenkins-slave/workspace/Lucene-Solr-NightlyTests-6.x/lucene/build/join/test/J1/temp/lucene.search.join.TestBlockJoin_7431CF436D2424EA-001
   [junit4]   2> NOTE: test params are: codec=SimpleText, sim=RandomSimilarity(queryNorm=true,coord=no):
{parent=IB SPL-DZ(0.3), country=DFR I(ne)LZ(0.3), qualification=DFR G1, docType=DFR I(ne)B3(800.0),
skill=DFR I(n)LZ(0.3), childText=DFR I(ne)LZ(0.3), parentText=DFR GBZ(0.3), child=DFR I(n)LZ(0.3)},
locale=de-AT, timezone=Asia/Bishkek
   [junit4]   2> NOTE: Linux 3.13.0-85-generic amd64/Oracle Corporation 1.8.0_74 (64-bit)/cpus=4,threads=1,free=103421760,total=477626368
   [junit4]   2> NOTE: All tests run in this JVM: [TestBlockJoinSorting, TestBlockJoin]
   [junit4] Completed [6/6 (1!)] on J1 in 185.95s, 20 tests, 1 error <<< FAILURES!

[...truncated 1 lines...]
   [junit4] JVM J1: stdout was not empty, see: /x1/jenkins/jenkins-slave/workspace/Lucene-Solr-NightlyTests-6.x/lucene/build/join/test/temp/junit4-J1-20160602_112702_759.sysout
   [junit4] >>> JVM J1 emitted unexpected output (verbatim) ----
   [junit4] java.lang.OutOfMemoryError: Java heap space
   [junit4] Dumping heap to /x1/jenkins/jenkins-slave/workspace/Lucene-Solr-NightlyTests-6.x/heapdumps/java_pid17825.hprof
...
   [junit4] Heap dump file created [424309016 bytes in 0.496 secs]
   [junit4] <<< JVM J1: EOF ----

[...truncated 10 lines...]
BUILD FAILED
/x1/jenkins/jenkins-slave/workspace/Lucene-Solr-NightlyTests-6.x/build.xml:747: The following
error occurred while executing this line:
/x1/jenkins/jenkins-slave/workspace/Lucene-Solr-NightlyTests-6.x/build.xml:684: The following
error occurred while executing this line:
/x1/jenkins/jenkins-slave/workspace/Lucene-Solr-NightlyTests-6.x/build.xml:59: The following
error occurred while executing this line:
/x1/jenkins/jenkins-slave/workspace/Lucene-Solr-NightlyTests-6.x/lucene/build.xml:476: The
following error occurred while executing this line:
/x1/jenkins/jenkins-slave/workspace/Lucene-Solr-NightlyTests-6.x/lucene/common-build.xml:2161:
The following error occurred while executing this line:
/x1/jenkins/jenkins-slave/workspace/Lucene-Solr-NightlyTests-6.x/lucene/module-build.xml:58:
The following error occurred while executing this line:
/x1/jenkins/jenkins-slave/workspace/Lucene-Solr-NightlyTests-6.x/lucene/common-build.xml:1427:
The following error occurred while executing this line:
/x1/jenkins/jenkins-slave/workspace/Lucene-Solr-NightlyTests-6.x/lucene/common-build.xml:984:
There were test failures: 6 suites, 44 tests, 1 error [seed: 7431CF436D2424EA]

Total time: 177 minutes 28 seconds
Build step 'Invoke Ant' marked build as failure
Archiving artifacts
No prior successful build to compare, so performing full copy of artifacts
Recording test results
Email was triggered for: Failure - Any
Sending email for trigger: Failure - Any




Mime
View raw message