lucene-dev mailing list archives

Site index · List index
Message view « Date » · « Thread »
Top « Date » · « Thread »
From Apache Jenkins Server <jenk...@builds.apache.org>
Subject [JENKINS] Lucene-Solr-Tests-master - Build # 1186 - Still Failing
Date Thu, 02 Jun 2016 02:22:08 GMT
Build: https://builds.apache.org/job/Lucene-Solr-Tests-master/1186/

1 tests failed.
FAILED:  org.apache.solr.cloud.CollectionsAPIDistributedZkTest.test

Error Message:
replicaCount expected:<0> but was:<1>

Stack Trace:
java.lang.AssertionError: replicaCount expected:<0> but was:<1>
	at __randomizedtesting.SeedInfo.seed([4F09E14B41B31510:C75DDE91EF4F78E8]:0)
	at org.junit.Assert.fail(Assert.java:93)
	at org.junit.Assert.failNotEquals(Assert.java:647)
	at org.junit.Assert.assertEquals(Assert.java:128)
	at org.junit.Assert.assertEquals(Assert.java:472)
	at org.apache.solr.cloud.CollectionsAPIDistributedZkTest.testNoConfigSetExist(CollectionsAPIDistributedZkTest.java:619)
	at org.apache.solr.cloud.CollectionsAPIDistributedZkTest.test(CollectionsAPIDistributedZkTest.java:177)
	at sun.reflect.NativeMethodAccessorImpl.invoke0(Native Method)
	at sun.reflect.NativeMethodAccessorImpl.invoke(NativeMethodAccessorImpl.java:62)
	at sun.reflect.DelegatingMethodAccessorImpl.invoke(DelegatingMethodAccessorImpl.java:43)
	at java.lang.reflect.Method.invoke(Method.java:498)
	at com.carrotsearch.randomizedtesting.RandomizedRunner.invoke(RandomizedRunner.java:1764)
	at com.carrotsearch.randomizedtesting.RandomizedRunner$8.evaluate(RandomizedRunner.java:871)
	at com.carrotsearch.randomizedtesting.RandomizedRunner$9.evaluate(RandomizedRunner.java:907)
	at com.carrotsearch.randomizedtesting.RandomizedRunner$10.evaluate(RandomizedRunner.java:921)
	at org.apache.solr.BaseDistributedSearchTestCase$ShardsRepeatRule$ShardsFixedStatement.callStatement(BaseDistributedSearchTestCase.java:985)
	at org.apache.solr.BaseDistributedSearchTestCase$ShardsRepeatRule$ShardsStatement.evaluate(BaseDistributedSearchTestCase.java:960)
	at com.carrotsearch.randomizedtesting.rules.SystemPropertiesRestoreRule$1.evaluate(SystemPropertiesRestoreRule.java:57)
	at org.apache.lucene.util.TestRuleSetupTeardownChained$1.evaluate(TestRuleSetupTeardownChained.java:49)
	at org.apache.lucene.util.AbstractBeforeAfterRule$1.evaluate(AbstractBeforeAfterRule.java:45)
	at org.apache.lucene.util.TestRuleThreadAndTestName$1.evaluate(TestRuleThreadAndTestName.java:48)
	at org.apache.lucene.util.TestRuleIgnoreAfterMaxFailures$1.evaluate(TestRuleIgnoreAfterMaxFailures.java:64)
	at org.apache.lucene.util.TestRuleMarkFailure$1.evaluate(TestRuleMarkFailure.java:47)
	at com.carrotsearch.randomizedtesting.rules.StatementAdapter.evaluate(StatementAdapter.java:36)
	at com.carrotsearch.randomizedtesting.ThreadLeakControl$StatementRunner.run(ThreadLeakControl.java:367)
	at com.carrotsearch.randomizedtesting.ThreadLeakControl.forkTimeoutingTask(ThreadLeakControl.java:809)
	at com.carrotsearch.randomizedtesting.ThreadLeakControl$3.evaluate(ThreadLeakControl.java:460)
	at com.carrotsearch.randomizedtesting.RandomizedRunner.runSingleTest(RandomizedRunner.java:880)
	at com.carrotsearch.randomizedtesting.RandomizedRunner$5.evaluate(RandomizedRunner.java:781)
	at com.carrotsearch.randomizedtesting.RandomizedRunner$6.evaluate(RandomizedRunner.java:816)
	at com.carrotsearch.randomizedtesting.RandomizedRunner$7.evaluate(RandomizedRunner.java:827)
	at com.carrotsearch.randomizedtesting.rules.StatementAdapter.evaluate(StatementAdapter.java:36)
	at com.carrotsearch.randomizedtesting.rules.SystemPropertiesRestoreRule$1.evaluate(SystemPropertiesRestoreRule.java:57)
	at org.apache.lucene.util.AbstractBeforeAfterRule$1.evaluate(AbstractBeforeAfterRule.java:45)
	at com.carrotsearch.randomizedtesting.rules.StatementAdapter.evaluate(StatementAdapter.java:36)
	at org.apache.lucene.util.TestRuleStoreClassName$1.evaluate(TestRuleStoreClassName.java:41)
	at com.carrotsearch.randomizedtesting.rules.NoShadowingOrOverridesOnMethodsRule$1.evaluate(NoShadowingOrOverridesOnMethodsRule.java:40)
	at com.carrotsearch.randomizedtesting.rules.NoShadowingOrOverridesOnMethodsRule$1.evaluate(NoShadowingOrOverridesOnMethodsRule.java:40)
	at com.carrotsearch.randomizedtesting.rules.StatementAdapter.evaluate(StatementAdapter.java:36)
	at com.carrotsearch.randomizedtesting.rules.StatementAdapter.evaluate(StatementAdapter.java:36)
	at com.carrotsearch.randomizedtesting.rules.StatementAdapter.evaluate(StatementAdapter.java:36)
	at org.apache.lucene.util.TestRuleAssertionsRequired$1.evaluate(TestRuleAssertionsRequired.java:53)
	at org.apache.lucene.util.TestRuleMarkFailure$1.evaluate(TestRuleMarkFailure.java:47)
	at org.apache.lucene.util.TestRuleIgnoreAfterMaxFailures$1.evaluate(TestRuleIgnoreAfterMaxFailures.java:64)
	at org.apache.lucene.util.TestRuleIgnoreTestSuites$1.evaluate(TestRuleIgnoreTestSuites.java:54)
	at com.carrotsearch.randomizedtesting.rules.StatementAdapter.evaluate(StatementAdapter.java:36)
	at com.carrotsearch.randomizedtesting.ThreadLeakControl$StatementRunner.run(ThreadLeakControl.java:367)
	at java.lang.Thread.run(Thread.java:745)




Build Log:
[...truncated 10555 lines...]
   [junit4] Suite: org.apache.solr.cloud.CollectionsAPIDistributedZkTest
   [junit4]   2> Creating dataDir: /x1/jenkins/jenkins-slave/workspace/Lucene-Solr-Tests-master/solr/build/solr-core/test/J1/temp/solr.cloud.CollectionsAPIDistributedZkTest_4F09E14B41B31510-001/init-core-data-001
   [junit4]   2> 14356 INFO  (SUITE-CollectionsAPIDistributedZkTest-seed#[4F09E14B41B31510]-worker) [    ] o.a.s.SolrTestCaseJ4 Randomized ssl (true) and clientAuth (false) via: @org.apache.solr.util.RandomizeSSL(reason=, ssl=NaN, value=NaN, clientAuth=NaN)
   [junit4]   2> 14500 INFO  (SUITE-CollectionsAPIDistributedZkTest-seed#[4F09E14B41B31510]-worker) [    ] o.a.s.BaseDistributedSearchTestCase Setting hostContext system property: /
   [junit4]   2> 14509 INFO  (TEST-CollectionsAPIDistributedZkTest.test-seed#[4F09E14B41B31510]) [    ] o.a.s.c.ZkTestServer STARTING ZK TEST SERVER
   [junit4]   2> 14523 INFO  (Thread-5) [    ] o.a.s.c.ZkTestServer client port:0.0.0.0/0.0.0.0:0
   [junit4]   2> 14523 INFO  (Thread-5) [    ] o.a.s.c.ZkTestServer Starting server
   [junit4]   2> 14623 INFO  (TEST-CollectionsAPIDistributedZkTest.test-seed#[4F09E14B41B31510]) [    ] o.a.s.c.ZkTestServer start zk server on port:55057
   [junit4]   2> 14625 INFO  (TEST-CollectionsAPIDistributedZkTest.test-seed#[4F09E14B41B31510]) [    ] o.a.s.c.c.SolrZkClient Using default ZkCredentialsProvider
   [junit4]   2> 14633 INFO  (TEST-CollectionsAPIDistributedZkTest.test-seed#[4F09E14B41B31510]) [    ] o.a.s.c.c.ConnectionManager Waiting for client to connect to ZooKeeper
   [junit4]   2> 14637 INFO  (zkCallback-8-thread-1) [    ] o.a.s.c.c.ConnectionManager Watcher org.apache.solr.common.cloud.ConnectionManager@6ff223d9 name:ZooKeeperConnection Watcher:127.0.0.1:55057 got event WatchedEvent state:SyncConnected type:None path:null path:null type:None
   [junit4]   2> 14637 INFO  (TEST-CollectionsAPIDistributedZkTest.test-seed#[4F09E14B41B31510]) [    ] o.a.s.c.c.ConnectionManager Client is connected to ZooKeeper
   [junit4]   2> 14637 INFO  (TEST-CollectionsAPIDistributedZkTest.test-seed#[4F09E14B41B31510]) [    ] o.a.s.c.c.SolrZkClient Using default ZkACLProvider
   [junit4]   2> 14637 INFO  (TEST-CollectionsAPIDistributedZkTest.test-seed#[4F09E14B41B31510]) [    ] o.a.s.c.c.SolrZkClient makePath: /solr
   [junit4]   2> 14640 INFO  (TEST-CollectionsAPIDistributedZkTest.test-seed#[4F09E14B41B31510]) [    ] o.a.s.c.c.SolrZkClient Using default ZkCredentialsProvider
   [junit4]   2> 14650 INFO  (TEST-CollectionsAPIDistributedZkTest.test-seed#[4F09E14B41B31510]) [    ] o.a.s.c.c.ConnectionManager Waiting for client to connect to ZooKeeper
   [junit4]   2> 14652 INFO  (zkCallback-9-thread-1) [    ] o.a.s.c.c.ConnectionManager Watcher org.apache.solr.common.cloud.ConnectionManager@cd61797 name:ZooKeeperConnection Watcher:127.0.0.1:55057/solr got event WatchedEvent state:SyncConnected type:None path:null path:null type:None
   [junit4]   2> 14652 INFO  (TEST-CollectionsAPIDistributedZkTest.test-seed#[4F09E14B41B31510]) [    ] o.a.s.c.c.ConnectionManager Client is connected to ZooKeeper
   [junit4]   2> 14652 INFO  (TEST-CollectionsAPIDistributedZkTest.test-seed#[4F09E14B41B31510]) [    ] o.a.s.c.c.SolrZkClient Using default ZkACLProvider
   [junit4]   2> 14658 INFO  (TEST-CollectionsAPIDistributedZkTest.test-seed#[4F09E14B41B31510]) [    ] o.a.s.c.c.SolrZkClient makePath: /collections/collection1
   [junit4]   2> 14677 INFO  (TEST-CollectionsAPIDistributedZkTest.test-seed#[4F09E14B41B31510]) [    ] o.a.s.c.c.SolrZkClient makePath: /collections/collection1/shards
   [junit4]   2> 14681 INFO  (TEST-CollectionsAPIDistributedZkTest.test-seed#[4F09E14B41B31510]) [    ] o.a.s.c.c.SolrZkClient makePath: /collections/control_collection
   [junit4]   2> 14685 INFO  (TEST-CollectionsAPIDistributedZkTest.test-seed#[4F09E14B41B31510]) [    ] o.a.s.c.c.SolrZkClient makePath: /collections/control_collection/shards
   [junit4]   2> 14692 INFO  (TEST-CollectionsAPIDistributedZkTest.test-seed#[4F09E14B41B31510]) [    ] o.a.s.c.AbstractZkTestCase put /x1/jenkins/jenkins-slave/workspace/Lucene-Solr-Tests-master/solr/core/src/test-files/solr/collection1/conf/solrconfig-tlog.xml to /configs/conf1/solrconfig.xml
   [junit4]   2> 14693 INFO  (TEST-CollectionsAPIDistributedZkTest.test-seed#[4F09E14B41B31510]) [    ] o.a.s.c.c.SolrZkClient makePath: /configs/conf1/solrconfig.xml
   [junit4]   2> 14847 INFO  (TEST-CollectionsAPIDistributedZkTest.test-seed#[4F09E14B41B31510]) [    ] o.a.s.c.AbstractZkTestCase put /x1/jenkins/jenkins-slave/workspace/Lucene-Solr-Tests-master/solr/core/src/test-files/solr/collection1/conf/schema.xml to /configs/conf1/schema.xml
   [junit4]   2> 14847 INFO  (TEST-CollectionsAPIDistributedZkTest.test-seed#[4F09E14B41B31510]) [    ] o.a.s.c.c.SolrZkClient makePath: /configs/conf1/schema.xml
   [junit4]   2> 14849 INFO  (TEST-CollectionsAPIDistributedZkTest.test-seed#[4F09E14B41B31510]) [    ] o.a.s.c.AbstractZkTestCase put /x1/jenkins/jenkins-slave/workspace/Lucene-Solr-Tests-master/solr/core/src/test-files/solr/collection1/conf/solrconfig.snippet.randomindexconfig.xml to /configs/conf1/solrconfig.snippet.randomindexconfig.xml
   [junit4]   2> 14849 INFO  (TEST-CollectionsAPIDistributedZkTest.test-seed#[4F09E14B41B31510]) [    ] o.a.s.c.c.SolrZkClient makePath: /configs/conf1/solrconfig.snippet.randomindexconfig.xml
   [junit4]   2> 14850 INFO  (TEST-CollectionsAPIDistributedZkTest.test-seed#[4F09E14B41B31510]) [    ] o.a.s.c.AbstractZkTestCase put /x1/jenkins/jenkins-slave/workspace/Lucene-Solr-Tests-master/solr/core/src/test-files/solr/collection1/conf/stopwords.txt to /configs/conf1/stopwords.txt
   [junit4]   2> 14851 INFO  (TEST-CollectionsAPIDistributedZkTest.test-seed#[4F09E14B41B31510]) [    ] o.a.s.c.c.SolrZkClient makePath: /configs/conf1/stopwords.txt
   [junit4]   2> 14852 INFO  (TEST-CollectionsAPIDistributedZkTest.test-seed#[4F09E14B41B31510]) [    ] o.a.s.c.AbstractZkTestCase put /x1/jenkins/jenkins-slave/workspace/Lucene-Solr-Tests-master/solr/core/src/test-files/solr/collection1/conf/protwords.txt to /configs/conf1/protwords.txt
   [junit4]   2> 14852 INFO  (TEST-CollectionsAPIDistributedZkTest.test-seed#[4F09E14B41B31510]) [    ] o.a.s.c.c.SolrZkClient makePath: /configs/conf1/protwords.txt
   [junit4]   2> 14854 INFO  (TEST-CollectionsAPIDistributedZkTest.test-seed#[4F09E14B41B31510]) [    ] o.a.s.c.AbstractZkTestCase put /x1/jenkins/jenkins-slave/workspace/Lucene-Solr-Tests-master/solr/core/src/test-files/solr/collection1/conf/currency.xml to /configs/conf1/currency.xml
   [junit4]   2> 14854 INFO  (TEST-CollectionsAPIDistributedZkTest.test-seed#[4F09E14B41B31510]) [    ] o.a.s.c.c.SolrZkClient makePath: /configs/conf1/currency.xml
   [junit4]   2> 14856 INFO  (TEST-CollectionsAPIDistributedZkTest.test-seed#[4F09E14B41B31510]) [    ] o.a.s.c.AbstractZkTestCase put /x1/jenkins/jenkins-slave/workspace/Lucene-Solr-Tests-master/solr/core/src/test-files/solr/collection1/conf/enumsConfig.xml to /configs/conf1/enumsConfig.xml
   [junit4]   2> 14856 INFO  (TEST-CollectionsAPIDistributedZkTest.test-seed#[4F09E14B41B31510]) [    ] o.a.s.c.c.SolrZkClient makePath: /configs/conf1/enumsConfig.xml
   [junit4]   2> 14860 INFO  (TEST-CollectionsAPIDistributedZkTest.test-seed#[4F09E14B41B31510]) [    ] o.a.s.c.AbstractZkTestCase put /x1/jenkins/jenkins-slave/workspace/Lucene-Solr-Tests-master/solr/core/src/test-files/solr/collection1/conf/open-exchange-rates.json to /configs/conf1/open-exchange-rates.json
   [junit4]   2> 14860 INFO  (TEST-CollectionsAPIDistributedZkTest.test-seed#[4F09E14B41B31510]) [    ] o.a.s.c.c.SolrZkClient makePath: /configs/conf1/open-exchange-rates.json
   [junit4]   2> 14865 INFO  (TEST-CollectionsAPIDistributedZkTest.test-seed#[4F09E14B41B31510]) [    ] o.a.s.c.AbstractZkTestCase put /x1/jenkins/jenkins-slave/workspace/Lucene-Solr-Tests-master/solr/core/src/test-files/solr/collection1/conf/mapping-ISOLatin1Accent.txt to /configs/conf1/mapping-ISOLatin1Accent.txt
   [junit4]   2> 14865 INFO  (TEST-CollectionsAPIDistributedZkTest.test-seed#[4F09E14B41B31510]) [    ] o.a.s.c.c.SolrZkClient makePath: /configs/conf1/mapping-ISOLatin1Accent.txt
   [junit4]   2> 14867 INFO  (TEST-CollectionsAPIDistributedZkTest.test-seed#[4F09E14B41B31510]) [    ] o.a.s.c.AbstractZkTestCase put /x1/jenkins/jenkins-slave/workspace/Lucene-Solr-Tests-master/solr/core/src/test-files/solr/collection1/conf/old_synonyms.txt to /configs/conf1/old_synonyms.txt
   [junit4]   2> 14867 INFO  (TEST-CollectionsAPIDistributedZkTest.test-seed#[4F09E14B41B31510]) [    ] o.a.s.c.c.SolrZkClient makePath: /configs/conf1/old_synonyms.txt
   [junit4]   2> 14869 INFO  (TEST-CollectionsAPIDistributedZkTest.test-seed#[4F09E14B41B31510]) [    ] o.a.s.c.AbstractZkTestCase put /x1/jenkins/jenkins-slave/workspace/Lucene-Solr-Tests-master/solr/core/src/test-files/solr/collection1/conf/synonyms.txt to /configs/conf1/synonyms.txt
   [junit4]   2> 14869 INFO  (TEST-CollectionsAPIDistributedZkTest.test-seed#[4F09E14B41B31510]) [    ] o.a.s.c.c.SolrZkClient makePath: /configs/conf1/synonyms.txt
   [junit4]   2> 14875 INFO  (TEST-CollectionsAPIDistributedZkTest.test-seed#[4F09E14B41B31510]) [    ] o.a.s.c.c.SolrZkClient Using default ZkCredentialsProvider
   [junit4]   2> 14881 INFO  (TEST-CollectionsAPIDistributedZkTest.test-seed#[4F09E14B41B31510]) [    ] o.a.s.c.c.ConnectionManager Waiting for client to connect to ZooKeeper
   [junit4]   2> 14888 INFO  (zkCallback-11-thread-1) [    ] o.a.s.c.c.ConnectionManager Watcher org.apache.solr.common.cloud.ConnectionManager@128835d5 name:ZooKeeperConnection Watcher:127.0.0.1:55057/solr got event WatchedEvent state:SyncConnected type:None path:null path:null type:None
   [junit4]   2> 14899 INFO  (TEST-CollectionsAPIDistributedZkTest.test-seed#[4F09E14B41B31510]) [    ] o.a.s.c.c.ConnectionManager Client is connected to ZooKeeper
   [junit4]   2> 14900 INFO  (TEST-CollectionsAPIDistributedZkTest.test-seed#[4F09E14B41B31510]) [    ] o.a.s.c.c.SolrZkClient Using default ZkACLProvider
   [junit4]   2> 14903 INFO  (TEST-CollectionsAPIDistributedZkTest.test-seed#[4F09E14B41B31510]) [    ] o.a.s.c.c.SolrZkClient Using default ZkCredentialsProvider
   [junit4]   2> 14905 INFO  (TEST-CollectionsAPIDistributedZkTest.test-seed#[4F09E14B41B31510]) [    ] o.a.s.c.c.ConnectionManager Waiting for client to connect to ZooKeeper
   [junit4]   2> 14924 INFO  (zkCallback-12-thread-1) [    ] o.a.s.c.c.ConnectionManager Watcher org.apache.solr.common.cloud.ConnectionManager@4733384b name:ZooKeeperConnection Watcher:127.0.0.1:55057 got event WatchedEvent state:SyncConnected type:None path:null path:null type:None
   [junit4]   2> 14924 INFO  (TEST-CollectionsAPIDistributedZkTest.test-seed#[4F09E14B41B31510]) [    ] o.a.s.c.c.ConnectionManager Client is connected to ZooKeeper
   [junit4]   2> 14924 INFO  (TEST-CollectionsAPIDistributedZkTest.test-seed#[4F09E14B41B31510]) [    ] o.a.s.c.c.SolrZkClient Using default ZkACLProvider
   [junit4]   2> 14924 INFO  (TEST-CollectionsAPIDistributedZkTest.test-seed#[4F09E14B41B31510]) [    ] o.a.s.c.c.SolrZkClient makePath: /solr
   [junit4]   2> 14949 INFO  (TEST-CollectionsAPIDistributedZkTest.test-seed#[4F09E14B41B31510]) [    ] o.a.s.c.c.SolrZkClient Using default ZkCredentialsProvider
   [junit4]   2> 14951 INFO  (TEST-CollectionsAPIDistributedZkTest.test-seed#[4F09E14B41B31510]) [    ] o.a.s.c.c.ConnectionManager Waiting for client to connect to ZooKeeper
   [junit4]   2> 14960 INFO  (zkCallback-13-thread-1) [    ] o.a.s.c.c.ConnectionManager Watcher org.apache.solr.common.cloud.ConnectionManager@62bb6632 name:ZooKeeperConnection Watcher:127.0.0.1:55057/solr got event WatchedEvent state:SyncConnected type:None path:null path:null type:None
   [junit4]   2> 14971 INFO  (TEST-CollectionsAPIDistributedZkTest.test-seed#[4F09E14B41B31510]) [    ] o.a.s.c.c.ConnectionManager Client is connected to ZooKeeper
   [junit4]   2> 14971 INFO  (TEST-CollectionsAPIDistributedZkTest.test-seed#[4F09E14B41B31510]) [    ] o.a.s.c.c.SolrZkClient Using default ZkACLProvider
   [junit4]   2> 14971 INFO  (TEST-CollectionsAPIDistributedZkTest.test-seed#[4F09E14B41B31510]) [    ] o.a.s.c.AbstractZkTestCase put /x1/jenkins/jenkins-slave/workspace/Lucene-Solr-Tests-master/solr/core/src/test-files/solr/collection1/conf/solrconfig-tlog.xml to /configs/conf2/solrconfig.xml
   [junit4]   2> 14972 INFO  (TEST-CollectionsAPIDistributedZkTest.test-seed#[4F09E14B41B31510]) [    ] o.a.s.c.c.SolrZkClient makePath: /configs/conf2/solrconfig.xml
   [junit4]   2> 14975 INFO  (TEST-CollectionsAPIDistributedZkTest.test-seed#[4F09E14B41B31510]) [    ] o.a.s.c.AbstractZkTestCase put /x1/jenkins/jenkins-slave/workspace/Lucene-Solr-Tests-master/solr/core/src/test-files/solr/collection1/conf/schema.xml to /configs/conf2/schema.xml
   [junit4]   2> 14975 INFO  (TEST-CollectionsAPIDistributedZkTest.test-seed#[4F09E14B41B31510]) [    ] o.a.s.c.c.SolrZkClient makePath: /configs/conf2/schema.xml
   [junit4]   2> 14978 INFO  (TEST-CollectionsAPIDistributedZkTest.test-seed#[4F09E14B41B31510]) [    ] o.a.s.c.AbstractZkTestCase put /x1/jenkins/jenkins-slave/workspace/Lucene-Solr-Tests-master/solr/core/src/test-files/solr/collection1/conf/enumsConfig.xml to /configs/conf2/enumsConfig.xml
   [junit4]   2> 14978 INFO  (TEST-CollectionsAPIDistributedZkTest.test-seed#[4F09E14B41B31510]) [    ] o.a.s.c.c.SolrZkClient makePath: /configs/conf2/enumsConfig.xml
   [junit4]   2> 14980 INFO  (TEST-CollectionsAPIDistributedZkTest.test-seed#[4F09E14B41B31510]) [    ] o.a.s.c.AbstractZkTestCase put /x1/jenkins/jenkins-slave/workspace/Lucene-Solr-Tests-master/solr/core/src/test-files/solr/collection1/conf/solrconfig.snippet.randomindexconfig.xml to /configs/conf2/solrconfig.snippet.randomindexconfig.xml
   [junit4]   2> 14980 INFO  (TEST-CollectionsAPIDistributedZkTest.test-seed#[4F09E14B41B31510]) [    ] o.a.s.c.c.SolrZkClient makePath: /configs/conf2/solrconfig.snippet.randomindexconfig.xml
   [junit4]   2> 14982 INFO  (TEST-CollectionsAPIDistributedZkTest.test-seed#[4F09E14B41B31510]) [    ] o.a.s.c.AbstractZkTestCase put /x1/jenkins/jenkins-slave/workspace/Lucene-Solr-Tests-master/solr/core/src/test-files/solr/collection1/conf/stopwords.txt to /configs/conf2/stopwords.txt
   [junit4]   2> 14982 INFO  (TEST-CollectionsAPIDistributedZkTest.test-seed#[4F09E14B41B31510]) [    ] o.a.s.c.c.SolrZkClient makePath: /configs/conf2/stopwords.txt
   [junit4]   2> 14983 INFO  (TEST-CollectionsAPIDistributedZkTest.test-seed#[4F09E14B41B31510]) [    ] o.a.s.c.AbstractZkTestCase put /x1/jenkins/jenkins-slave/workspace/Lucene-Solr-Tests-master/solr/core/src/test-files/solr/collection1/conf/protwords.txt to /configs/conf2/protwords.txt
   [junit4]   2> 14983 INFO  (TEST-CollectionsAPIDistributedZkTest.test-seed#[4F09E14B41B31510]) [    ] o.a.s.c.c.SolrZkClient makePath: /configs/conf2/protwords.txt
   [junit4]   2> 14985 INFO  (TEST-CollectionsAPIDistributedZkTest.test-seed#[4F09E14B41B31510]) [    ] o.a.s.c.AbstractZkTestCase put /x1/jenkins/jenkins-slave/workspace/Lucene-Solr-Tests-master/solr/core/src/test-files/solr/collection1/conf/currency.xml to /configs/conf2/currency.xml
   [junit4]   2> 14985 INFO  (TEST-CollectionsAPIDistributedZkTest.test-seed#[4F09E14B41B31510]) [    ] o.a.s.c.c.SolrZkClient makePath: /configs/conf2/currency.xml
   [junit4]   2> 14986 INFO  (TEST-CollectionsAPIDistributedZkTest.test-seed#[4F09E14B41B31510]) [    ] o.a.s.c.AbstractZkTestCase put /x1/jenkins/jenkins-slave/workspace/Lucene-Solr-Tests-master/solr/core/src/test-files/solr/collection1/conf/open-exchange-rates.json to /configs/conf2/open-exchange-rates.json
   [junit4]   2> 14986 INFO  (TEST-CollectionsAPIDistributedZkTest.test-seed#[4F09E14B41B31510]) [    ] o.a.s.c.c.SolrZkClient makePath: /configs/conf2/open-exchange-rates.json
   [junit4]   2> 14988 INFO  (TEST-CollectionsAPIDistributedZkTest.test-seed#[4F09E14B41B31510]) [    ] o.a.s.c.AbstractZkTestCase put /x1/jenkins/jenkins-slave/workspace/Lucene-Solr-Tests-master/solr/core/src/test-files/solr/collection1/conf/mapping-ISOLatin1Accent.txt to /configs/conf2/mapping-ISOLatin1Accent.txt
   [junit4]   2> 14988 INFO  (TEST-CollectionsAPIDistributedZkTest.test-seed#[4F09E14B41B31510]) [    ] o.a.s.c.c.SolrZkClient makePath: /configs/conf2/mapping-ISOLatin1Accent.txt
   [junit4]   2> 14989 INFO  (TEST-CollectionsAPIDistributedZkTest.test-seed#[4F09E14B41B31510]) [    ] o.a.s.c.AbstractZkTestCase put /x1/jenkins/jenkins-slave/workspace/Lucene-Solr-Tests-master/solr/core/src/test-files/solr/collection1/conf/old_synonyms.txt to /configs/conf2/old_synonyms.txt
   [junit4]   2> 14989 INFO  (TEST-CollectionsAPIDistributedZkTest.test-seed#[4F09E14B41B31510]) [    ] o.a.s.c.c.SolrZkClient makePath: /configs/conf2/old_synonyms.txt
   [junit4]   2> 14991 INFO  (TEST-CollectionsAPIDistributedZkTest.test-seed#[4F09E14B41B31510]) [    ] o.a.s.c.AbstractZkTestCase put /x1/jenkins/jenkins-slave/workspace/Lucene-Solr-Tests-master/solr/core/src/test-files/solr/collection1/conf/synonyms.txt to /configs/conf2/synonyms.txt
   [junit4]   2> 14991 INFO  (TEST-CollectionsAPIDistributedZkTest.test-seed#[4F09E14B41B31510]) [    ] o.a.s.c.c.SolrZkClient makePath: /configs/conf2/synonyms.txt
   [junit4]   2> 14992 INFO  (TEST-CollectionsAPIDistributedZkTest.test-seed#[4F09E14B41B31510]) [    ] o.a.s.c.AbstractZkTestCase put /x1/jenkins/jenkins-slave/workspace/Lucene-Solr-Tests-master/solr/core/src/test-files/solr/collection1/conf/elevate.xml to /configs/conf2/elevate.xml
   [junit4]   2> 14992 INFO  (TEST-CollectionsAPIDistributedZkTest.test-seed#[4F09E14B41B31510]) [    ] o.a.s.c.c.SolrZkClient makePath: /configs/conf2/elevate.xml
   [junit4]   2> 15093 INFO  (TEST-CollectionsAPIDistributedZkTest.test-seed#[4F09E14B41B31510]) [    ] o.a.s.SolrTestCaseJ4 Writing core.properties file to /x1/jenkins/jenkins-slave/workspace/Lucene-Solr-Tests-master/solr/build/solr-core/test/J1/temp/solr.cloud.CollectionsAPIDistributedZkTest_4F09E14B41B31510-001/control-001/cores/collection1
   [junit4]   2> 15452 INFO  (TEST-CollectionsAPIDistributedZkTest.test-seed#[4F09E14B41B31510]) [    ] o.e.j.s.Server jetty-9.3.8.v20160314
   [junit4]   2> 15510 INFO  (TEST-CollectionsAPIDistributedZkTest.test-seed#[4F09E14B41B31510]) [    ] o.e.j.s.h.ContextHandler Started o.e.j.s.ServletContextHandler@34ee6074{/,null,AVAILABLE}
   [junit4]   2> 15568 INFO  (TEST-CollectionsAPIDistributedZkTest.test-seed#[4F09E14B41B31510]) [    ] o.e.j.s.ServerConnector Started ServerConnector@4b5e1b02{SSL,[ssl, http/1.1]}{127.0.0.1:41632}
   [junit4]   2> 15569 INFO  (TEST-CollectionsAPIDistributedZkTest.test-seed#[4F09E14B41B31510]) [    ] o.e.j.s.Server Started @19676ms
   [junit4]   2> 15569 INFO  (TEST-CollectionsAPIDistributedZkTest.test-seed#[4F09E14B41B31510]) [    ] o.a.s.c.s.e.JettySolrRunner Jetty properties: {solr.data.dir=/x1/jenkins/jenkins-slave/workspace/Lucene-Solr-Tests-master/solr/build/solr-core/test/J1/temp/solr.cloud.CollectionsAPIDistributedZkTest_4F09E14B41B31510-001/tempDir-001/control/data, hostContext=/, hostPort=41632, coreRootDirectory=/x1/jenkins/jenkins-slave/workspace/Lucene-Solr-Tests-master/solr/build/solr-core/test/J1/temp/solr.cloud.CollectionsAPIDistributedZkTest_4F09E14B41B31510-001/control-001/cores}
   [junit4]   2> 15578 INFO  (TEST-CollectionsAPIDistributedZkTest.test-seed#[4F09E14B41B31510]) [    ] o.a.s.s.SolrDispatchFilter SolrDispatchFilter.init(): sun.misc.Launcher$AppClassLoader@73d16e93
   [junit4]   2> 15611 INFO  (TEST-CollectionsAPIDistributedZkTest.test-seed#[4F09E14B41B31510]) [    ] o.a.s.c.SolrResourceLoader new SolrResourceLoader for directory: '/x1/jenkins/jenkins-slave/workspace/Lucene-Solr-Tests-master/solr/build/solr-core/test/J1/temp/solr.cloud.CollectionsAPIDistributedZkTest_4F09E14B41B31510-001/control-001'
   [junit4]   2> 15614 INFO  (TEST-CollectionsAPIDistributedZkTest.test-seed#[4F09E14B41B31510]) [    ] o.a.s.c.SolrResourceLoader JNDI not configured for solr (NoInitialContextEx)
   [junit4]   2> 15614 INFO  (TEST-CollectionsAPIDistributedZkTest.test-seed#[4F09E14B41B31510]) [    ] o.a.s.c.SolrResourceLoader solr home defaulted to 'solr/' (could not find system property or JNDI)
   [junit4]   2> 15618 INFO  (TEST-CollectionsAPIDistributedZkTest.test-seed#[4F09E14B41B31510]) [    ] o.a.s.c.c.SolrZkClient Using default ZkCredentialsProvider
   [junit4]   2> 15618 INFO  (TEST-CollectionsAPIDistributedZkTest.test-seed#[4F09E14B41B31510]) [    ] o.a.s.c.c.ConnectionManager Waiting for client to connect to ZooKeeper
   [junit4]   2> 15628 INFO  (zkCallback-14-thread-1) [    ] o.a.s.c.c.ConnectionManager Watcher org.apache.solr.common.cloud.ConnectionManager@7ffe9fd9 name:ZooKeeperConnection Watcher:127.0.0.1:55057/solr got event WatchedEvent state:SyncConnected type:None path:null path:null type:None
   [junit4]   2> 15629 INFO  (TEST-CollectionsAPIDistributedZkTest.test-seed#[4F09E14B41B31510]) [    ] o.a.s.c.c.ConnectionManager Client is connected to ZooKeeper
   [junit4]   2> 15629 INFO  (TEST-CollectionsAPIDistributedZkTest.test-seed#[4F09E14B41B31510]) [    ] o.a.s.c.c.SolrZkClient Using default ZkACLProvider
   [junit4]   2> 15635 INFO  (TEST-CollectionsAPIDistributedZkTest.test-seed#[4F09E14B41B31510]) [    ] o.a.s.s.SolrDispatchFilter Loading solr.xml from SolrHome (not found in ZooKeeper)
   [junit4]   2> 15637 INFO  (TEST-CollectionsAPIDistributedZkTest.test-seed#[4F09E14B41B31510]) [    ] o.a.s.c.SolrXmlConfig Loading container configuration from /x1/jenkins/jenkins-slave/workspace/Lucene-Solr-Tests-master/solr/build/solr-core/test/J1/temp/solr.cloud.CollectionsAPIDistributedZkTest_4F09E14B41B31510-001/control-001/solr.xml
   [junit4]   2> 16048 INFO  (TEST-CollectionsAPIDistributedZkTest.test-seed#[4F09E14B41B31510]) [    ] o.a.s.c.CorePropertiesLocator Config-defined core root directory: /x1/jenkins/jenkins-slave/workspace/Lucene-Solr-Tests-master/solr/build/solr-core/test/J1/temp/solr.cloud.CollectionsAPIDistributedZkTest_4F09E14B41B31510-001/control-001/cores
   [junit4]   2> 16088 INFO  (TEST-CollectionsAPIDistributedZkTest.test-seed#[4F09E14B41B31510]) [    ] o.a.s.c.CoreContainer New CoreContainer 252876864
   [junit4]   2> 16089 INFO  (TEST-CollectionsAPIDistributedZkTest.test-seed#[4F09E14B41B31510]) [    ] o.a.s.c.CoreContainer Loading cores into CoreContainer [instanceDir=/x1/jenkins/jenkins-slave/workspace/Lucene-Solr-Tests-master/solr/build/solr-core/test/J1/temp/solr.cloud.CollectionsAPIDistributedZkTest_4F09E14B41B31510-001/control-001]
   [junit4]   2> 16089 WARN  (TEST-CollectionsAPIDistributedZkTest.test-seed#[4F09E14B41B31510]) [    ] o.a.s.c.CoreContainer Couldn't add files from /x1/jenkins/jenkins-slave/workspace/Lucene-Solr-Tests-master/solr/build/solr-core/test/J1/temp/solr.cloud.CollectionsAPIDistributedZkTest_4F09E14B41B31510-001/control-001/lib to classpath: /x1/jenkins/jenkins-slave/workspace/Lucene-Solr-Tests-master/solr/build/solr-core/test/J1/temp/solr.cloud.CollectionsAPIDistributedZkTest_4F09E14B41B31510-001/control-001/lib
   [junit4]   2> 16107 INFO  (TEST-CollectionsAPIDistributedZkTest.test-seed#[4F09E14B41B31510]) [    ] o.a.s.h.c.HttpShardHandlerFactory created with socketTimeout : 90000,urlScheme : ,connTimeout : 15000,maxConnectionsPerHost : 20,maxConnections : 10000,corePoolSize : 0,maximumPoolSize : 2147483647,maxThreadIdleTime : 5,sizeOfQueue : -1,fairnessPolicy : false,
   [junit4]   2> 16438 INFO  (TEST-CollectionsAPIDistributedZkTest.test-seed#[4F09E14B41B31510]) [    ] o.a.s.u.UpdateShardHandler Creating UpdateShardHandler HTTP client with params: 
   [junit4]   2> 16441 INFO  (TEST-CollectionsAPIDistributedZkTest.test-seed#[4F09E14B41B31510]) [    ] o.a.s.l.LogWatcher SLF4J impl is org.slf4j.impl.Log4jLoggerFactory
   [junit4]   2> 16442 INFO  (TEST-CollectionsAPIDistributedZkTest.test-seed#[4F09E14B41B31510]) [    ] o.a.s.l.LogWatcher Registering Log Listener [Log4j (org.slf4j.impl.Log4jLoggerFactory)]
   [junit4]   2> 16443 INFO  (TEST-CollectionsAPIDistributedZkTest.test-seed#[4F09E14B41B31510]) [    ] o.a.s.c.ZkContainer Zookeeper client=127.0.0.1:55057/solr
   [junit4]   2> 16453 INFO  (TEST-CollectionsAPIDistributedZkTest.test-seed#[4F09E14B41B31510]) [    ] o.a.s.c.ZkController zkHost includes chroot
   [junit4]   2> 16453 INFO  (TEST-CollectionsAPIDistributedZkTest.test-seed#[4F09E14B41B31510]) [    ] o.a.s.c.c.SolrZkClient Using default ZkCredentialsProvider
   [junit4]   2> 16454 INFO  (TEST-CollectionsAPIDistributedZkTest.test-seed#[4F09E14B41B31510]) [    ] o.a.s.c.c.ConnectionManager Waiting for client to connect to ZooKeeper
   [junit4]   2> 16480 INFO  (zkCallback-17-thread-1) [    ] o.a.s.c.c.ConnectionManager Watcher org.apache.solr.common.cloud.ConnectionManager@5214680a name:ZooKeeperConnection Watcher:127.0.0.1:55057 got event WatchedEvent state:SyncConnected type:None path:null path:null type:None
   [junit4]   2> 16480 INFO  (TEST-CollectionsAPIDistributedZkTest.test-seed#[4F09E14B41B31510]) [    ] o.a.s.c.c.ConnectionManager Client is connected to ZooKeeper
   [junit4]   2> 16480 INFO  (TEST-CollectionsAPIDistributedZkTest.test-seed#[4F09E14B41B31510]) [    ] o.a.s.c.c.SolrZkClient Using default ZkACLProvider
   [junit4]   2> 16491 INFO  (TEST-CollectionsAPIDistributedZkTest.test-seed#[4F09E14B41B31510]) [n:127.0.0.1:41632_    ] o.a.s.c.ZkController Added new OnReconnect listener org.apache.solr.cloud.ZkController$$Lambda$13/1470131889@2692d31f
   [junit4]   2> 16495 INFO  (TEST-CollectionsAPIDistributedZkTest.test-seed#[4F09E14B41B31510]) [n:127.0.0.1:41632_    ] o.a.s.c.c.ConnectionManager Waiting for client to connect to ZooKeeper
   [junit4]   2> 16499 INFO  (zkCallback-18-thread-1-processing-n:127.0.0.1:41632_) [n:127.0.0.1:41632_    ] o.a.s.c.c.ConnectionManager Watcher org.apache.solr.common.cloud.ConnectionManager@79868fc5 name:ZooKeeperConnection Watcher:127.0.0.1:55057/solr got event WatchedEvent state:SyncConnected type:None path:null path:null type:None
   [junit4]   2> 16499 INFO  (TEST-CollectionsAPIDistributedZkTest.test-seed#[4F09E14B41B31510]) [n:127.0.0.1:41632_    ] o.a.s.c.c.ConnectionManager Client is connected to ZooKeeper
   [junit4]   2> 16510 INFO  (TEST-CollectionsAPIDistributedZkTest.test-seed#[4F09E14B41B31510]) [n:127.0.0.1:41632_    ] o.a.s.c.c.SolrZkClient makePath: /overseer/queue
   [junit4]   2> 16533 INFO  (TEST-CollectionsAPIDistributedZkTest.test-seed#[4F09E14B41B31510]) [n:127.0.0.1:41632_    ] o.a.s.c.c.SolrZkClient makePath: /overseer/collection-queue-work
   [junit4]   2> 16545 INFO  (TEST-CollectionsAPIDistributedZkTest.test-seed#[4F09E14B41B31510]) [n:127.0.0.1:41632_    ] o.a.s.c.c.SolrZkClient makePath: /overseer/collection-map-running
   [junit4]   2> 16555 INFO  (TEST-CollectionsAPIDistributedZkTest.test-seed#[4F09E14B41B31510]) [n:127.0.0.1:41632_    ] o.a.s.c.c.SolrZkClient makePath: /overseer/collection-map-completed
   [junit4]   2> 16559 INFO  (TEST-CollectionsAPIDistributedZkTest.test-seed#[4F09E14B41B31510]) [n:127.0.0.1:41632_    ] o.a.s.c.c.SolrZkClient makePath: /overseer/collection-map-failure
   [junit4]   2> 16563 INFO  (TEST-CollectionsAPIDistributedZkTest.test-seed#[4F09E14B41B31510]) [n:127.0.0.1:41632_    ] o.a.s.c.c.SolrZkClient makePath: /live_nodes
   [junit4]   2> 16565 INFO  (TEST-CollectionsAPIDistributedZkTest.test-seed#[4F09E14B41B31510]) [n:127.0.0.1:41632_    ] o.a.s.c.c.SolrZkClient makePath: /aliases.json
   [junit4]   2> 16568 INFO  (TEST-CollectionsAPIDistributedZkTest.test-seed#[4F09E14B41B31510]) [n:127.0.0.1:41632_    ] o.a.s.c.c.SolrZkClient makePath: /clusterstate.json
   [junit4]   2> 16575 INFO  (TEST-CollectionsAPIDistributedZkTest.test-seed#[4F09E14B41B31510]) [n:127.0.0.1:41632_    ] o.a.s.c.c.SolrZkClient makePath: /security.json
   [junit4]   2> 16576 INFO  (TEST-CollectionsAPIDistributedZkTest.test-seed#[4F09E14B41B31510]) [n:127.0.0.1:41632_    ] o.a.s.c.c.ZkStateReader Updating cluster state from ZooKeeper... 
   [junit4]   2> 16583 INFO  (TEST-CollectionsAPIDistributedZkTest.test-seed#[4F09E14B41B31510]) [n:127.0.0.1:41632_    ] o.a.s.c.c.ZkStateReader Loaded cluster properties: {urlScheme=https}
   [junit4]   2> 16586 INFO  (TEST-CollectionsAPIDistributedZkTest.test-seed#[4F09E14B41B31510]) [n:127.0.0.1:41632_    ] o.a.s.c.c.ZkStateReader Updated live nodes from ZooKeeper... (0) -> (0)
   [junit4]   2> 16611 INFO  (TEST-CollectionsAPIDistributedZkTest.test-seed#[4F09E14B41B31510]) [n:127.0.0.1:41632_    ] o.a.s.c.c.SolrZkClient makePath: /overseer_elect
   [junit4]   2> 16614 INFO  (TEST-CollectionsAPIDistributedZkTest.test-seed#[4F09E14B41B31510]) [n:127.0.0.1:41632_    ] o.a.s.c.c.SolrZkClient makePath: /overseer_elect/election
   [junit4]   2> 16616 INFO  (TEST-CollectionsAPIDistributedZkTest.test-seed#[4F09E14B41B31510]) [n:127.0.0.1:41632_    ] o.a.s.c.Overseer Overseer (id=null) closing
   [junit4]   2> 16617 INFO  (TEST-CollectionsAPIDistributedZkTest.test-seed#[4F09E14B41B31510]) [n:127.0.0.1:41632_    ] o.a.s.c.LeaderElector Joined leadership election with path: /overseer_elect/election/95999225822117895-127.0.0.1:41632_-n_0000000000
   [junit4]   2> 16618 INFO  (TEST-CollectionsAPIDistributedZkTest.test-seed#[4F09E14B41B31510]) [n:127.0.0.1:41632_    ] o.a.s.c.OverseerElectionContext I am going to be the leader 127.0.0.1:41632_
   [junit4]   2> 16618 INFO  (TEST-CollectionsAPIDistributedZkTest.test-seed#[4F09E14B41B31510]) [n:127.0.0.1:41632_    ] o.a.s.c.c.SolrZkClient makePath: /overseer_elect/leader
   [junit4]   2> 16621 INFO  (TEST-CollectionsAPIDistributedZkTest.test-seed#[4F09E14B41B31510]) [n:127.0.0.1:41632_    ] o.a.s.c.Overseer Overseer (id=95999225822117895-127.0.0.1:41632_-n_0000000000) starting
   [junit4]   2> 16630 INFO  (TEST-CollectionsAPIDistributedZkTest.test-seed#[4F09E14B41B31510]) [n:127.0.0.1:41632_    ] o.a.s.c.c.SolrZkClient makePath: /overseer/queue-work
   [junit4]   2> 16674 INFO  (TEST-CollectionsAPIDistributedZkTest.test-seed#[4F09E14B41B31510]) [n:127.0.0.1:41632_    ] o.a.s.c.OverseerAutoReplicaFailoverThread Starting OverseerAutoReplicaFailoverThread autoReplicaFailoverWorkLoopDelay=10000 autoReplicaFailoverWaitAfterExpiration=10000 autoReplicaFailoverBadNodeExpiration=60000
   [junit4]   2> 16728 INFO  (OverseerCollectionConfigSetProcessor-95999225822117895-127.0.0.1:41632_-n_0000000000) [n:127.0.0.1:41632_    ] o.a.s.c.OverseerTaskProcessor Process current queue of overseer operations
   [junit4]   2> 16730 INFO  (OverseerStateUpdate-95999225822117895-127.0.0.1:41632_-n_0000000000) [n:127.0.0.1:41632_    ] o.a.s.c.Overseer Starting to work on the main queue
   [junit4]   2> 16748 INFO  (TEST-CollectionsAPIDistributedZkTest.test-seed#[4F09E14B41B31510]) [n:127.0.0.1:41632_    ] o.a.s.c.ZkController Register node as live in ZooKeeper:/live_nodes/127.0.0.1:41632_
   [junit4]   2> 16749 INFO  (TEST-CollectionsAPIDistributedZkTest.test-seed#[4F09E14B41B31510]) [n:127.0.0.1:41632_    ] o.a.s.c.c.SolrZkClient makePath: /live_nodes/127.0.0.1:41632_
   [junit4]   2> 16753 INFO  (zkCallback-18-thread-1-processing-n:127.0.0.1:41632_) [n:127.0.0.1:41632_    ] o.a.s.c.c.ZkStateReader A live node change: [WatchedEvent state:SyncConnected type:NodeChildrenChanged path:/live_nodes], has occurred - updating... (live nodes size: [0])
   [junit4]   2> 16754 INFO  (OverseerStateUpdate-95999225822117895-127.0.0.1:41632_-n_0000000000) [n:127.0.0.1:41632_    ] o.a.s.c.c.ZkStateReader Updated live nodes from ZooKeeper... (0) -> (1)
   [junit4]   2> 16758 INFO  (zkCallback-18-thread-1-processing-n:127.0.0.1:41632_) [n:127.0.0.1:41632_    ] o.a.s.c.c.ZkStateReader Updated live nodes from ZooKeeper... (1) -> (1)
   [junit4]   2> 16785 INFO  (TEST-CollectionsAPIDistributedZkTest.test-seed#[4F09E14B41B31510]) [n:127.0.0.1:41632_    ] o.a.s.c.CoreContainer Security conf doesn't exist. Skipping setup for authorization module.
   [junit4]   2> 16785 INFO  (TEST-CollectionsAPIDistributedZkTest.test-seed#[4F09E14B41B31510]) [n:127.0.0.1:41632_    ] o.a.s.c.CoreContainer No authentication plugin used.
   [junit4]   2> 16856 INFO  (TEST-CollectionsAPIDistributedZkTest.test-seed#[4F09E14B41B31510]) [n:127.0.0.1:41632_    ] o.a.s.c.CorePropertiesLocator Looking for core definitions underneath /x1/jenkins/jenkins-slave/workspace/Lucene-Solr-Tests-master/solr/build/solr-core/test/J1/temp/solr.cloud.CollectionsAPIDistributedZkTest_4F09E14B41B31510-001/control-001/cores
   [junit4]   2> 17035 INFO  (TEST-CollectionsAPIDistributedZkTest.test-seed#[4F09E14B41B31510]) [n:127.0.0.1:41632_    ] o.a.s.c.CoreDescriptor Created CoreDescriptor: {name=collection1, config=solrconfig.xml, transient=false, schema=schema.xml, loadOnStartup=true, configSetProperties=configsetprops.json, collection=control_collection, coreNodeName=, dataDir=data/, shard=}
   [junit4]   2> 17035 INFO  (TEST-CollectionsAPIDistributedZkTest.test-seed#[4F09E14B41B31510]) [n:127.0.0.1:41632_    ] o.a.s.c.CorePropertiesLocator Found core collection1 in /x1/jenkins/jenkins-slave/workspace/Lucene-Solr-Tests-master/solr/build/solr-core/test/J1/temp/solr.cloud.CollectionsAPIDistributedZkTest_4F09E14B41B31510-001/control-001/cores/collection1
   [junit4]   2> 17035 INFO  (TEST-CollectionsAPIDistributedZkTest.test-seed#[4F09E14B41B31510]) [n:127.0.0.1:41632_    ] o.a.s.c.CorePropertiesLocator Found 1 core definitions
   [junit4]   2> 17044 INFO  (coreLoadExecutor-7-thread-1-processing-n:127.0.0.1:41632_) [n:127.0.0.1:41632_ c:control_collection   x:collection1] o.a.s.c.ZkController publishing state=down
   [junit4]   2> 17044 INFO  (coreLoadExecutor-7-thread-1-processing-n:127.0.0.1:41632_) [n:127.0.0.1:41632_ c:control_collection   x:collection1] o.a.s.c.ZkController numShards not found on descriptor - reading it from system property
   [junit4]   2> 17046 INFO  (TEST-CollectionsAPIDistributedZkTest.test-seed#[4F09E14B41B31510]) [n:127.0.0.1:41632_    ] o.a.s.s.SolrDispatchFilter user.dir=/x1/jenkins/jenkins-slave/workspace/Lucene-Solr-Tests-master/solr/build/solr-core/test/J1
   [junit4]   2> 17046 INFO  (TEST-CollectionsAPIDistributedZkTest.test-seed#[4F09E14B41B31510]) [n:127.0.0.1:41632_    ] o.a.s.s.SolrDispatchFilter SolrDispatchFilter.init() done
   [junit4]   2> 17046 INFO  (coreLoadExecutor-7-thread-1-processing-n:127.0.0.1:41632_) [n:127.0.0.1:41632_ c:control_collection   x:collection1] o.a.s.c.ZkController Collection control_collection not visible yet, but flagging it so a watch is registered when it becomes visible
   [junit4]   2> 17056 INFO  (coreLoadExecutor-7-thread-1-processing-n:127.0.0.1:41632_) [n:127.0.0.1:41632_ c:control_collection   x:collection1] o.a.s.c.c.ZkStateReader Deleting data for [control_collection]
   [junit4]   2> 17056 INFO  (OverseerStateUpdate-95999225822117895-127.0.0.1:41632_-n_0000000000) [n:127.0.0.1:41632_    ] o.a.s.c.Overseer processMessage: queueSize: 1, message = {
   [junit4]   2>   "core":"collection1",
   [junit4]   2>   "roles":null,
   [junit4]   2>   "base_url":"https://127.0.0.1:41632",
   [junit4]   2>   "node_name":"127.0.0.1:41632_",
   [junit4]   2>   "numShards":"1",
   [junit4]   2>   "state":"down",
   [junit4]   2>   "shard":null,
   [junit4]   2>   "collection":"control_collection",
   [junit4]   2>   "operation":"state"} current state version: 0
   [junit4]   2> 17061 INFO  (coreLoadExecutor-7-thread-1-processing-n:127.0.0.1:41632_) [n:127.0.0.1:41632_ c:control_collection   x:collection1] o.a.s.c.ZkController look for our core node name
   [junit4]   2> 17063 INFO  (OverseerStateUpdate-95999225822117895-127.0.0.1:41632_-n_0000000000) [n:127.0.0.1:41632_    ] o.a.s.c.o.ReplicaMutator Update state numShards=1 message={
   [junit4]   2>   "core":"collection1",
   [junit4]   2>   "roles":null,
   [junit4]   2>   "base_url":"https://127.0.0.1:41632",
   [junit4]   2>   "node_name":"127.0.0.1:41632_",
   [junit4]   2>   "numShards":"1",
   [junit4]   2>   "state":"down",
   [junit4]   2>   "shard":null,
   [junit4]   2>   "collection":"control_collection",
   [junit4]   2>   "operation":"state"}
   [junit4]   2> 17076 INFO  (OverseerStateUpdate-95999225822117895-127.0.0.1:41632_-n_0000000000) [n:127.0.0.1:41632_    ] o.a.s.c.o.ClusterStateMutator building a new cName: control_collection
   [junit4]   2> 17086 INFO  (OverseerStateUpdate-95999225822117895-127.0.0.1:41632_-n_0000000000) [n:127.0.0.1:41632_    ] o.a.s.c.o.ReplicaMutator Assigning new node to shard shard=shard1
   [junit4]   2> 17095 INFO  (zkCallback-18-thread-1-processing-n:127.0.0.1:41632_) [n:127.0.0.1:41632_    ] o.a.s.c.c.ZkStateReader A cluster state change: [WatchedEvent state:SyncConnected type:NodeDataChanged path:/clusterstate.json], has occurred - updating... (live nodes size: [1])
   [junit4]   2> 18109 INFO  (coreLoadExecutor-7-thread-1-processing-n:127.0.0.1:41632_) [n:127.0.0.1:41632_ c:control_collection   x:collection1] o.a.s.c.ZkController waiting to find shard id in clusterstate for collection1
   [junit4]   2> 18109 INFO  (coreLoadExecutor-7-thread-1-processing-n:127.0.0.1:41632_) [n:127.0.0.1:41632_ c:control_collection   x:collection1] o.a.s.c.ZkController Check for collection zkNode:control_collection
   [junit4]   2> 18110 INFO  (coreLoadExecutor-7-thread-1-processing-n:127.0.0.1:41632_) [n:127.0.0.1:41632_ c:control_collection   x:collection1] o.a.s.c.ZkController Collection zkNode exists
   [junit4]   2> 18110 INFO  (coreLoadExecutor-7-thread-1-processing-n:127.0.0.1:41632_) [n:127.0.0.1:41632_ c:control_collection   x:collection1] o.a.s.c.c.ZkStateReader Load collection config from: [/collections/control_collection]
   [junit4]   2> 18111 INFO  (coreLoadExecutor-7-thread-1-processing-n:127.0.0.1:41632_) [n:127.0.0.1:41632_ c:control_collection   x:collection1] o.a.s.c.c.ZkStateReader path=[/collections/control_collection] [configName]=[conf1] specified config exists in ZooKeeper
   [junit4]   2> 18112 INFO  (coreLoadExecutor-7-thread-1-processing-n:127.0.0.1:41632_) [n:127.0.0.1:41632_ c:control_collection   x:collection1] o.a.s.c.SolrResourceLoader new SolrResourceLoader for directory: '/x1/jenkins/jenkins-slave/workspace/Lucene-Solr-Tests-master/solr/build/solr-core/test/J1/temp/solr.cloud.CollectionsAPIDistributedZkTest_4F09E14B41B31510-001/control-001/cores/collection1'
   [junit4]   2> 18113 INFO  (coreLoadExecutor-7-thread-1-processing-n:127.0.0.1:41632_) [n:127.0.0.1:41632_ c:control_collection   x:collection1] o.a.s.c.SolrResourceLoader JNDI not configured for solr (NoInitialContextEx)
   [junit4]   2> 18113 INFO  (coreLoadExecutor-7-thread-1-processing-n:127.0.0.1:41632_) [n:127.0.0.1:41632_ c:control_collection   x:collection1] o.a.s.c.SolrResourceLoader solr home defaulted to 'solr/' (could not find system property or JNDI)
   [junit4]   2> 18124 INFO  (coreLoadExecutor-7-thread-1-processing-n:127.0.0.1:41632_) [n:127.0.0.1:41632_ c:control_collection   x:collection1] o.a.s.c.Config loaded config solrconfig.xml with version 0 
   [junit4]   2> 18194 INFO  (coreLoadExecutor-7-thread-1-processing-n:127.0.0.1:41632_) [n:127.0.0.1:41632_ c:control_collection   x:collection1] o.a.s.c.SolrConfig current version of requestparams : -1
   [junit4]   2> 18263 INFO  (coreLoadExecutor-7-thread-1-processing-n:127.0.0.1:41632_) [n:127.0.0.1:41632_ c:control_collection   x:collection1] o.a.s.c.SolrConfig Using Lucene MatchVersion: 7.0.0
   [junit4]   2> 18407 INFO  (coreLoadExecutor-7-thread-1-processing-n:127.0.0.1:41632_) [n:127.0.0.1:41632_ c:control_collection   x:collection1] o.a.s.c.SolrConfig Loaded SolrConfig: solrconfig.xml
   [junit4]   2> 18595 INFO  (coreLoadExecutor-7-thread-1-processing-n:127.0.0.1:41632_) [n:127.0.0.1:41632_ c:control_collection   x:collection1] o.a.s.s.IndexSchema [collection1] Schema name=test
   [junit4]   2> 19846 INFO  (coreLoadExecutor-7-thread-1-processing-n:127.0.0.1:41632_) [n:127.0.0.1:41632_ c:control_collection   x:collection1] o.a.s.s.OpenExchangeRatesOrgProvider Initialized with rates=open-exchange-rates.json, refreshInterval=1440.
   [junit4]   2> 19911 INFO  (coreLoadExecutor-7-thread-1-processing-n:127.0.0.1:41632_) [n:127.0.0.1:41632_ c:control_collection   x:collection1] o.a.s.s.IndexSchema default search field in schema is text
   [junit4]   2> 19921 INFO  (coreLoadExecutor-7-thread-1-processing-n:127.0.0.1:41632_) [n:127.0.0.1:41632_ c:control_collection   x:collection1] o.a.s.s.IndexSchema unique key field: id
   [junit4]   2> 20292 INFO  (coreLoadExecutor-7-thread-1-processing-n:127.0.0.1:41632_) [n:127.0.0.1:41632_ c:control_collection   x:collection1] o.a.s.s.FileExchangeRateProvider Reloading exchange rates from file currency.xml
   [junit4]   2> 20301 INFO  (coreLoadExecutor-7-thread-1-processing-n:127.0.0.1:41632_) [n:127.0.0.1:41632_ c:control_collection   x:collection1] o.a.s.s.FileExchangeRateProvider Reloading exchange rates from file currency.xml
   [junit4]   2> 20311 INFO  (coreLoadExecutor-7-thread-1-processing-n:127.0.0.1:41632_) [n:127.0.0.1:41632_ c:control_collection   x:collection1] o.a.s.s.OpenExchangeRatesOrgProvider Reloading exchange rates from open-exchange-rates.json
   [junit4]   2> 20313 INFO  (coreLoadExecutor-7-thread-1-processing-n:127.0.0.1:41632_) [n:127.0.0.1:41632_ c:control_collection   x:collection1] o.a.s.s.OpenExchangeRatesOrgProvider Reloading exchange rates from open-exchange-rates.json
   [junit4]   2> 20319 INFO  (coreLoadExecutor-7-thread-1-processing-n:127.0.0.1:41632_) [n:127.0.0.1:41632_ c:control_collection   x:collection1] o.a.s.c.ConfigSetProperties Did not find ConfigSet properties, assuming default properties: Can't find resource 'configsetprops.json' in classpath or '/configs/conf1', cwd=/x1/jenkins/jenkins-slave/workspace/Lucene-Solr-Tests-master/solr/build/solr-core/test/J1
   [junit4]   2> 20320 INFO  (coreLoadExecutor-7-thread-1-processing-n:127.0.0.1:41632_) [n:127.0.0.1:41632_ c:control_collection   x:collection1] o.a.s.c.CoreContainer Creating SolrCore 'collection1' using configuration from collection control_collection
   [junit4]   2> 20351 INFO  (coreLoadExecutor-7-thread-1-processing-n:127.0.0.1:41632_) [n:127.0.0.1:41632_ c:control_collection s:shard1 r:core_node1 x:collection1] o.a.s.c.SolrCore org.apache.solr.core.MockDirectoryFactory
   [junit4]   2> 20360 INFO  (coreLoadExecutor-7-thread-1-processing-n:127.0.0.1:41632_) [n:127.0.0.1:41632_ c:control_collection s:shard1 r:core_node1 x:collection1] o.a.s.c.SolrCore [[collection1] ] Opening new SolrCore at [/x1/jenkins/jenkins-slave/workspace/Lucene-Solr-Tests-master/solr/build/solr-core/test/J1/temp/solr.cloud.CollectionsAPIDistributedZkTest_4F09E14B41B31510-001/control-001/cores/collection1], dataDir=[/x1/jenkins/jenkins-slave/workspace/Lucene-Solr-Tests-master/solr/build/solr-core/test/J1/temp/solr.cloud.CollectionsAPIDistributedZkTest_4F09E14B41B31510-001/control-001/cores/collection1/data/]
   [junit4]   2> 20367 INFO  (coreLoadExecutor-7-thread-1-processing-n:127.0.0.1:41632_) [n:127.0.0.1:41632_ c:control_collection s:shard1 r:core_node1 x:collection1] o.a.s.c.JmxMonitoredMap JMX monitoring is enabled. Adding Solr mbeans to JMX Server: com.sun.jmx.mbeanserver.JmxMBeanServer@64be65a6
   [junit4]   2> 20405 INFO  (coreLoadExecutor-7-thread-1-processing-n:127.0.0.1:41632_) [n:127.0.0.1:41632_ c:control_collection s:shard1 r:core_node1 x:collection1] o.a.s.c.CachingDirectoryFactory return new directory for /x1/jenkins/jenkins-slave/workspace/Lucene-Solr-Tests-master/solr/build/solr-core/test/J1/temp/solr.cloud.CollectionsAPIDistributedZkTest_4F09E14B41B31510-001/control-001/cores/collection1/data
   [junit4]   2> 20406 INFO  (coreLoadExecutor-7-thread-1-processing-n:127.0.0.1:41632_) [n:127.0.0.1:41632_ c:control_collection s:shard1 r:core_node1 x:collection1] o.a.s.c.SolrCore New index directory detected: old=null new=/x1/jenkins/jenkins-slave/workspace/Lucene-Solr-Tests-master/solr/build/solr-core/test/J1/temp/solr.cloud.CollectionsAPIDistributedZkTest_4F09E14B41B31510-001/control-001/cores/collection1/data/index/
   [junit4]   2> 20414 WARN  (coreLoadExecutor-7-thread-1-processing-n:127.0.0.1:41632_) [n:127.0.0.1:41632_ c:control_collection s:shard1 r:core_node1 x:collection1] o.a.s.c.SolrCore [collection1] Solr index directory '/x1/jenkins/jenkins-slave/workspace/Lucene-Solr-Tests-master/solr/build/solr-core/test/J1/temp/solr.cloud.CollectionsAPIDistributedZkTest_4F09E14B41B31510-001/control-001/cores/collection1/data/index' doesn't exist. Creating new index...
   [junit4]   2> 20415 INFO  (coreLoadExecutor-7-thread-1-processing-n:127.0.0.1:41632_) [n:127.0.0.1:41632_ c:control_collection s:shard1 r:core_node1 x:collection1] o.a.s.c.CachingDirectoryFactory return new directory for /x1/jenkins/jenkins-slave/workspace/Lucene-Solr-Tests-master/solr/build/solr-core/test/J1/temp/solr.cloud.CollectionsAPIDistributedZkTest_4F09E14B41B31510-001/control-001/cores/collection1/data/index
   [junit4]   2> 20418 INFO  (coreLoadExecutor-7-thread-1-processing-n:127.0.0.1:41632_) [n:127.0.0.1:41632_ c:control_collection s:shard1 r:core_node1 x:collection1] o.a.s.u.RandomMergePolicy RandomMergePolicy wrapping class org.apache.lucene.index.TieredMergePolicy: [TieredMergePolicy: maxMergeAtOnce=50, maxMergeAtOnceExplicit=43, maxMergedSegmentMB=94.1669921875, floorSegmentMB=0.5908203125, forceMergeDeletesPctAllowed=16.000543914740113, segmentsPerTier=32.0, maxCFSSegmentSizeMB=8.796093022207999E12, noCFSRatio=1.0
   [junit4]   2> 20473 INFO  (coreLoadExecutor-7-thread-1-processing-n:127.0.0.1:41632_) [n:127.0.0.1:41632_ c:control_collection s:shard1 r:core_node1 x:collection1] o.a.s.c.SolrDeletionPolicy SolrDeletionPolicy.onCommit: commits: num=1
   [junit4]   2> 	commit{dir=MockDirectoryWrapper(RAMDirectory@774b7351 lockFactory=org.apache.lucene.store.SingleInstanceLockFactory@7bd2a0b7),segFN=segments_1,generation=1}
   [junit4]   2> 20474 INFO  (coreLoadExecutor-7-thread-1-processing-n:127.0.0.1:41632_) [n:127.0.0.1:41632_ c:control_collection s:shard1 r:core_node1 x:collection1] o.a.s.c.SolrDeletionPolicy newest commit generation = 1
   [junit4]   2> 20487 INFO  (OldIndexDirectoryCleanupThreadForCore-collection1) [n:127.0.0.1:41632_ c:control_collection s:shard1 r:core_node1 x:collection1] o.a.s.c.SolrCore Looking for old index directories to cleanup for core collection1 in /x1/jenkins/jenkins-slave/workspace/Lucene-Solr-Tests-master/solr/build/solr-core/test/J1/temp/solr.cloud.CollectionsAPIDistributedZkTest_4F09E14B41B31510-001/control-001/cores/collection1/data/
   [junit4]   2> 20488 WARN  (OldIndexDirectoryCleanupThreadForCore-collection1) [n:127.0.0.1:41632_ c:control_collection s:shard1 r:core_node1 x:collection1] o.a.s.c.DirectoryFactory /x1/jenkins/jenkins-slave/workspace/Lucene-Solr-Tests-master/solr/build/solr-core/test/J1/temp/solr.cloud.CollectionsAPIDistributedZkTest_4F09E14B41B31510-001/control-001/cores/collection1/data/ does not point to a valid data directory; skipping clean-up of old index directories.
   [junit4]   2> 20623 INFO  (coreLoadExecutor-7-thread-1-processing-n:127.0.0.1:41632_) [n:127.0.0.1:41632_ c:control_collection s:shard1 r:core_node1 x:collection1] o.a.s.u.p.UpdateRequestProcessorChain creating updateRequestProcessorChain "nodistrib"
   [junit4]   2> 20639 INFO  (coreLoadExecutor-7-thread-1-processing-n:127.0.0.1:41632_) [n:127.0.0.1:41632_ c:control_collection s:shard1 r:core_node1 x:collection1] o.a.s.u.p.UpdateRequestProcessorChain creating updateRequestProcessorChain "dedupe"
   [junit4]   2> 20643 INFO  (coreLoadExecutor-7-thread-1-processing-n:127.0.0.1:41632_) [n:127.0.0.1:41632_ c:control_collection s:shard1 r:core_node1 x:collection1] o.a.s.u.p.UpdateRequestProcessorChain inserting DistributedUpdateProcessorFactory into updateRequestProcessorChain "dedupe"
   [junit4]   2> 20643 INFO  (coreLoadExecutor-7-thread-1-processing-n:127.0.0.1:41632_) [n:127.0.0.1:41632_ c:control_collection s:shard1 r:core_node1 x:collection1] o.a.s.u.p.UpdateRequestProcessorChain creating updateRequestProcessorChain "stored_sig"
   [junit4]   2> 20643 INFO  (coreLoadExecutor-7-thread-1-processing-n:127.0.0.1:41632_) [n:127.0.0.1:41632_ c:control_collection s:shard1 r:core_node1 x:collection1] o.a.s.u.p.UpdateRequestProcessorChain inserting DistributedUpdateProcessorFactory into updateRequestProcessorChain "stored_sig"
   [junit4]   2> 20643 INFO  (coreLoadExecutor-7-thread-1-processing-n:127.0.0.1:41632_) [n:127.0.0.1:41632_ c:control_collection s:shard1 r:core_node1 x:collection1] o.a.s.u.p.UpdateRequestProcessorChain creating updateRequestProcessorChain "distrib-dup-test-chain-explicit"
   [junit4]   2> 20666 INFO  (coreLoadExecutor-7-thread-1-processing-n:127.0.0.1:41632_) [n:127.0.0.1:41632_ c:control_collection s:shard1 r:core_node1 x:collection1] o.a.s.u.p.UpdateRequestProcessorChain creating updateRequestProcessorChain "distrib-dup-test-chain-implicit"
   [junit4]   2> 20666 INFO  (coreLoadExecutor-7-thread-1-processing-n:127.0.0.1:41632_) [n:127.0.0.1:41632_ c:control_collection s:shard1 r:core_node1 x:collection1] o.a.s.u.p.UpdateRequestProcessorChain inserting DistributedUpdateProcessorFactory into updateRequestProcessorChain "distrib-dup-test-chain-implicit"
   [junit4]   2> 20667 INFO  (coreLoadExecutor-7-thread-1-processing-n:127.0.0.1:41632_) [n:127.0.0.1:41632_ c:control_collection s:shard1 r:core_node1 x:collection1] o.a.s.c.SolrCore no updateRequestProcessorChain defined as default, creating implicit default
   [junit4]   2> 20670 WARN  (coreLoadExecutor-7-thread-1-processing-n:127.0.0.1:41632_) [n:127.0.0.1:41632_ c:control_collection s:shard1 r:core_node1 x:collection1] o.a.s.c.RequestHandlers INVALID paramSet a in requestHandler {type = requestHandler,name = /dump,class = DumpRequestHandler,args = {defaults={a=A,b=B}}}
   [junit4]   2> 20718 INFO  (coreLoadExecutor-7-thread-1-processing-n:127.0.0.1:41632_) [n:127.0.0.1:41632_ c:control_collection s:shard1 r:core_node1 x:collection1] o.a.s.h.l.XMLLoader xsltCacheLifetimeSeconds=60
   [junit4]   2> 20723 INFO  (coreLoadExecutor-7-thread-1-processing-n:127.0.0.1:41632_) [n:127.0.0.1:41632_ c:control_collection s:shard1 r:core_node1 x:collection1] o.a.s.h.l.XMLLoader xsltCacheLifetimeSeconds=60
   [junit4]   2> 20724 INFO  (coreLoadExecutor-7-thread-1-processing-n:127.0.0.1:41632_) [n:127.0.0.1:41632_ c:control_collection s:shard1 r:core_node1 x:collection1] o.a.s.h.l.XMLLoader xsltCacheLifetimeSeconds=60
   [junit4]   2> 20725 INFO  (coreLoadExecutor-7-thread-1-processing-n:127.0.0.1:41632_) [n:127.0.0.1:41632_ c:control_collection s:shard1 r:core_node1 x:collection1] o.a.s.h.l.XMLLoader xsltCacheLifetimeSeconds=60
   [junit4]   2> 21200 INFO  (coreLoadExecutor-7-thread-1-processing-n:127.0.0.1:41632_) [n:127.0.0.1:41632_ c:control_collection s:shard1 r:core_node1 x:collection1] o.a.s.c.RequestHandlers Registered paths: /admin/mbeans,standard,/update/json/docs,/admin/luke,/export,/get,/admin/properties,/update/json,/admin/threads,/dump,/update/csv,/sql,/graph,/admin/segments,/admin/system,/replication,/config,/stream,/schema,/admin/plugins,/admin/logging,/admin/ping,/update,/admin/file
   [junit4]   2> 21200 INFO  (coreLoadExecutor-7-thread-1-processing-n:127.0.0.1:41632_) [n:127.0.0.1:41632_ c:control_collection s:shard1 r:core_node1 x:collection1] o.a.s.c.SolrCore Using default statsCache cache: org.apache.solr.search.stats.LocalStatsCache
   [junit4]   2> 21233 INFO  (coreLoadExecutor-7-thread-1-processing-n:127.0.0.1:41632_) [n:127.0.0.1:41632_ c:control_collection s:shard1 r:core_node1 x:collection1] o.a.s.u.UpdateHandler Using UpdateLog implementation: org.apache.solr.update.UpdateLog
   [junit4]   2> 21233 INFO  (coreLoadExecutor-7-thread-1-processing-n:127.0.0.1:41632_) [n:127.0.0.1:41632_ c:control_collection s:shard1 r:core_node1 x:collection1] o.a.s.u.UpdateLog Initializing UpdateLog: dataDir= defaultSyncLevel=FLUSH numRecordsToKeep=100 maxNumLogsToKeep=10 numVersionBuckets=65536
   [junit4]   2> 21402 INFO  (coreLoadExecutor-7-thread-1-processing-n:127.0.0.1:41632_) [n:127.0.0.1:41632_ c:control_collection s:shard1 r:core_node1 x:collection1] o.a.s.u.CommitTracker Hard AutoCommit: disabled
   [junit4]   2> 21419 INFO  (coreLoadExecutor-7-thread-1-processing-n:127.0.0.1:41632_) [n:127.0.0.1:41632_ c:control_collection s:shard1 r:core_node1 x:collection1] o.a.s.u.CommitTracker Soft AutoCommit: disabled
   [junit4]   2> 21420 INFO  (coreLoadExecutor-7-thread-1-processing-n:127.0.0.1:41632_) [n:127.0.0.1:41632_ c:control_collection s:shard1 r:core_node1 x:collection1] o.a.s.u.RandomMergePolicy RandomMergePolicy wrapping class org.apache.lucene.index.LogByteSizeMergePolicy: [LogByteSizeMergePolicy: minMergeSize=1677721, mergeFactor=34, maxMergeSize=2147483648, maxMergeSizeForForcedMerge=9223372036854775807, calibrateSizeByDeletes=true, maxMergeDocs=2147483647, maxCFSSegmentSizeMB=8.796093022207999E12, noCFSRatio=0.5097608665131672]
   [junit4]   2> 21422 INFO  (coreLoadExecutor-7-thread-1-processing-n:127.0.0.1:41632_) [n:127.0.0.1:41632_ c:control_collection s:shard1 r:core_node1 x:collection1] o.a.s.c.SolrDeletionPolicy SolrDeletionPolicy.onInit: commits: num=1
   [junit4]   2> 	commit{dir=MockDirectoryWrapper(RAMDirectory@774b7351 lockFactory=org.apache.lucene.store.SingleInstanceLockFactory@7bd2a0b7),segFN=segments_1,generation=1}
   [junit4]   2> 21435 INFO  (coreLoadExecutor-7-thread-1-processing-n:127.0.0.1:41632_) [n:127.0.0.1:41632_ c:control_collection s:shard1 r:core_node1 x:collection1] o.a.s.c.SolrDeletionPolicy newest commit generation = 1
   [junit4]   2> 21477 INFO  (coreLoadExecutor-7-thread-1-processing-n:127.0.0.1:41632_) [n:127.0.0.1:41632_ c:control_collection s:shard1 r:core_node1 x:collection1] o.a.s.s.SolrIndexSearcher Opening [Searcher@207854cf[collection1] main]
   [junit4]   2> 21485 INFO  (coreLoadExecutor-7-thread-1-processing-n:127.0.0.1:41632_) [n:127.0.0.1:41632_ c:control_collection s:shard1 r:core_node1 x:collection1] o.a.s.c.c.ZkStateReader Load collection config from: [/collections/control_collection]
   [junit4]   2> 21486 INFO  (coreLoadExecutor-7-thread-1-processing-n:127.0.0.1:41632_) [n:127.0.0.1:41632_ c:control_collection s:shard1 r:core_node1 x:collection1] o.a.s.c.c.ZkStateReader path=[/collections/control_collection] [configName]=[conf1] specified config exists in ZooKeeper
   [junit4]   2> 21486 INFO  (coreLoadExecutor-7-thread-1-processing-n:127.0.0.1:41632_) [n:127.0.0.1:41632_ c:control_collection s:shard1 r:core_node1 x:collection1] o.a.s.r.ManagedResourceStorage Setting up ZooKeeper-based storage for the RestManager with znodeBase: /configs/conf1
   [junit4]   2> 21489 INFO  (coreLoadExecutor-7-thread-1-processing-n:127.0.0.1:41632_) [n:127.0.0.1:41632_ c:control_collection s:shard1 r:core_node1 x:collection1] o.a.s.r.ManagedResourceStorage Configured ZooKeeperStorageIO with znodeBase: /configs/conf1
   [junit4]   2> 21489 INFO  (coreLoadExecutor-7-thread-1-processing-n:127.0.0.1:41632_) [n:127.0.0.1:41632_ c:control_collection s:shard1 r:core_node1 x:collection1] o.a.s.r.RestManager Initializing RestManager with initArgs: {}
   [junit4]   2> 21514 INFO  (coreLoadExecutor-7-thread-1-processing-n:127.0.0.1:41632_) [n:127.0.0.1:41632_ c:control_collection s:shard1 r:core_node1 x:collection1] o.a.s.r.ManagedResourceStorage Reading _rest_managed.json using ZooKeeperStorageIO:path=/configs/conf1
   [junit4]   2> 21524 INFO  (coreLoadExecutor-7-thread-1-processing-n:127.0.0.1:41632_) [n:127.0.0.1:41632_ c:control_collection s:shard1 r:core_node1 x:collection1] o.a.s.r.ManagedResourceStorage No data found for znode /configs/conf1/_rest_managed.json
   [junit4]   2> 21525 INFO  (coreLoadExecutor-7-thread-1-processing-n:127.0.0.1:41632_) [n:127.0.0.1:41632_ c:control_collection s:shard1 r:core_node1 x:collection1] o.a.s.r.ManagedResourceStorage Loaded null at path _rest_managed.json using ZooKeeperStorageIO:path=/configs/conf1
   [junit4]   2> 21525 INFO  (coreLoadExecutor-7-thread-1-processing-n:127.0.0.1:41632_) [n:127.0.0.1:41632_ c:control_collection s:shard1 r:core_node1 x:collection1] o.a.s.r.RestManager Initializing 0 registered ManagedResources
   [junit4]   2> 21579 INFO  (coreLoadExecutor-7-thread-1-processing-n:127.0.0.1:41632_) [n:127.0.0.1:41632_ c:control_collection s:shard1 r:core_node1 x:collection1] o.a.s.h.ReplicationHandler Commits will be reserved for  10000
   [junit4]   2> 21630 INFO  (searcherExecutor-8-thread-1-processing-n:127.0.0.1:41632_ x:collection1 s:shard1 c:control_collection r:core_node1) [n:127.0.0.1:41632_ c:control_collection s:shard1 r:core_node1 x:collection1] o.a.s.c.SolrCore [collection1] Registered new searcher Searcher@207854cf[collection1] main{ExitableDirectoryReader(UninvertingDirectoryReader())}
   [junit4]   2> 21632 INFO  (coreLoadExecutor-7-thread-1-processing-n:127.0.0.1:41632_) [n:127.0.0.1:41632_ c:control_collection s:shard1 r:core_node1 x:collection1] o.a.s.u.UpdateLog Looking up max value of version field to seed version buckets
   [junit4]   2> 21634 INFO  (coreLoadExecutor-7-thread-1-processing-n:127.0.0.1:41632_) [n:127.0.0.1:41632_ c:control_collection s:shard1 r:core_node1 x:collection1] o.a.s.u.VersionInfo Refreshing highest value of _version_ for 65536 version buckets from index
   [junit4]   2> 21634 INFO  (coreLoadExecutor-7-thread-1-processing-n:127.0.0.1:41632_) [n:127.0.0.1:41632_ c:control_collection s:shard1 r:core_node1 x:collection1] o.a.s.u.VersionInfo No terms found for _version_, cannot seed version bucket highest value from index
   [junit4]   2> 21634 INFO  (coreLoadExecutor-7-thread-1-processing-n:127.0.0.1:41632_) [n:127.0.0.1:41632_ c:control_collection s:shard1 r:core_node1 x:collection1] o.a.s.u.UpdateLog Could not find max version in index or recent updates, using new clock 1535987620593532928
   [junit4]   2> 21639 INFO  (coreLoadExecutor-7-thread-1-processing-n:127.0.0.1:41632_) [n:127.0.0.1:41632_ c:control_collection s:shard1 r:core_node1 x:collection1] o.a.s.u.UpdateLog Took 5.0ms to seed version buckets with highest version 1535987620593532928
   [junit4]   2> 21650 INFO  (coreLoadExecutor-7-thread-1-processing-n:127.0.0.1:41632_) [n:127.0.0.1:41632_ c:control_collection s:shard1 r:core_node1 x:collection1] o.a.s.c.ZkController watch zkdir /configs/conf1
   [junit4]   2> 21653 INFO  (coreLoadExecutor-7-thread-1-processing-n:127.0.0.1:41632_) [n:127.0.0.1:41632_ c:control_collection s:shard1 r:core_node1 x:collection1] o.a.s.c.CoreContainer registering core: collection1
   [junit4]   2> 21665 INFO  (coreZkRegister-1-thread-1-processing-n:127.0.0.1:41632_ x:collection1 s:shard1 c:control_collection r:core_node1) [n:127.0.0.1:41632_ c:control_collection s:shard1 r:core_node1 x:collection1] o.a.s.c.ZkController Register replica - core:collection1 address:https://127.0.0.1:41632 collection:control_collection shard:shard1
   [junit4]   2> 21683 INFO  (coreZkRegister-1-thread-1-processing-n:127.0.0.1:41632_ x:collection1 s:shard1 c:control_collection r:core_node1) [n:127.0.0.1:41632_ c:control_collection s:shard1 r:core_node1 x:collection1] o.a.s.c.c.SolrZkClient makePath: /collections/control_collection/leader_elect/shard1/election
   [junit4]   2> 21687 INFO  (coreZkRegister-1-thread-1-processing-n:127.0.0.1:41632_ x:collection1 s:shard1 c:control_collection r:core_node1) [n:127.0.0.1:41632_ c:control_collection s:shard1 r:core_node1 x:collection1] o.a.s.c.LeaderElector Joined leadership election with path: /collections/control_collection/leader_elect/shard1/election/95999225822117895-core_node1-n_0000000000
   [junit4]   2> 21695 INFO  (coreZkRegister-1-thread-1-processing-n:127.0.0.1:41632_ x:collection1 s:shard1 c:control_collection r:core_node1) [n:127.0.0.1:41632_ c:control_collection s:shard1 r:core_node1 x:collection1] o.a.s.c.ShardLeaderElectionContext Running the leader process for shard=shard1 and weAreReplacement=false and leaderVoteWait=180000
   [junit4]   2> 21699 INFO  (OverseerStateUpdate-95999225822117895-127.0.0.1:41632_-n_0000000000) [n:127.0.0.1:41632_    ] o.a.s.c.Overseer processMessage: queueSize: 1, message = {
   [junit4]   2>   "operation":"leader",
   [junit4]   2>   "shard":"shard1",
   [junit4]   2>   "collection":"control_collection"} current state version: 1
   [junit4]   2> 21702 INFO  (zkCallback-18-thread-1-processing-n:127.0.0.1:41632_) [n:127.0.0.1:41632_    ] o.a.s.c.c.ZkStateReader A cluster state change: [WatchedEvent state:SyncConnected type:NodeDataChanged path:/clusterstate.json], has occurred - updating... (live nodes size: [1])
   [junit4]   2> 21711 INFO  (coreZkRegister-1-thread-1-processing-n:127.0.0.1:41632_ x:collection1 s:shard1 c:control_collection r:core_node1) [n:127.0.0.1:41632_ c:control_collection s:shard1 r:core_node1 x:collection1] o.a.s.c.ShardLeaderElectionContext Enough replicas found to continue.
   [junit4]   2> 21711 INFO  (coreZkRegister-1-thread-1-processing-n:127.0.0.1:41632_ x:collection1 s:shard1 c:control_collection r:core_node1) [n:127.0.0.1:41632_ c:control_collection s:shard1 r:core_node1 x:collection1] o.a.s.c.ShardLeaderElectionContext I may be the new leader - try and sync
   [junit4]   2> 21711 INFO  (coreZkRegister-1-thread-1-processing-n:127.0.0.1:41632_ x:collection1 s:shard1 c:control_collection r:core_node1) [n:127.0.0.1:41632_ c:control_collection s:shard1 r:core_node1 x:collection1] o.a.s.c.SyncStrategy Sync replicas to https://127.0.0.1:41632/collection1/
   [junit4]   2> 21711 INFO  (coreZkRegister-1-thread-1-processing-n:127.0.0.1:41632_ x:collection1 s:shard1 c:control_collection r:core_node1) [n:127.0.0.1:41632_ c:control_collection s:shard1 r:core_node1 x:collection1] o.a.s.c.SyncStrategy Sync Success - now sync replicas to me
   [junit4]   2> 21711 INFO  (coreZkRegister-1-thread-1-processing-n:127.0.0.1:41632_ x:collection1 s:shard1 c:control_collection r:core_node1) [n:127.0.0.1:41632_ c:control_collection s:shard1 r:core_node1 x:collection1] o.a.s.c.SyncStrategy https://127.0.0.1:41632/collection1/ has no replicas
   [junit4]   2> 21722 INFO  (coreZkRegister-1-thread-1-processing-n:127.0.0.1:41632_ x:collection1 s:shard1 c:control_collection r:core_node1) [n:127.0.0.1:41632_ c:control_collection s:shard1 r:core_node1 x:collection1] o.a.s.c.c.SolrZkClient makePath: /collections/control_collection/leaders/shard1
   [junit4]   2> 21725 INFO  (coreZkRegister-1-thread-1-processing-n:127.0.0.1:41632_ x:collection1 s:shard1 c:control_collection r:core_node1) [n:127.0.0.1:41632_ c:control_collection s:shard1 r:core_node1 x:collection1] o.a.s.c.ShardLeaderElectionContextBase Creating leader registration node /collections/control_collection/leaders/shard1/leader after winning as /collections/control_collection/leader_elect/shard1/election/95999225822117895-core_node1-n_0000000000
   [junit4]   2> 21736 INFO  (OverseerStateUpdate-95999225822117895-127.0.0.1:41632_-n_0000000000) [n:127.0.0.1:41632_    ] o.a.s.c.Overseer processMessage: queueSize: 1, message = {
   [junit4]   2>   "operation":"leader",
   [junit4]   2>   "shard":"shard1",
   [junit4]   2>   "collection":"control_collection",
   [junit4]   2>   "base_url":"https://127.0.0.1:41632",
   [junit4]   2>   "core":"collection1",
   [junit4]   2>   "state":"active"} current state version: 2
   [junit4]   2> 21829 INFO  (coreZkRegister-1-thread-1-processing-n:127.0.0.1:41632_ x:collection1 s:shard1 c:control_collection r:core_node1) [n:127.0.0.1:41632_ c:control_collection s:shard1 r:core_node1 x:collection1] o.a.s.c.ShardLeaderElectionContext I am the new leader: https://127.0.0.1:41632/collection1/ shard1
   [junit4]   2> 21948 INFO  (TEST-CollectionsAPIDistributedZkTest.test-seed#[4F09E14B41B31510]) [    ] o.a.s.c.c.SolrZkClient Using default ZkCredentialsProvider
   [junit4]   2> 21949 INFO  (TEST-CollectionsAPIDistributedZkTest.test-seed#[4F09E14B41B31510]) [    ] o.a.s.c.c.ConnectionManager Waiting for client to connect to ZooKeeper
   [junit4]   2> 21950 INFO  (zkCallback-22-thread-1) [    ] o.a.s.c.c.ConnectionManager Watcher org.apache.solr.common.cloud.ConnectionManager@3a913206 name:ZooKeeperConnection Watcher:127.0.0.1:55057/solr got event WatchedEvent state:SyncConnected type:None path:null path:null type:None
   [junit4]   2> 21950 INFO  (TEST-CollectionsAPIDistributedZkTest.test-seed#[4F09E14B41B31510]) [    ] o.a.s.c.c.ConnectionManager Client is connected to ZooKeeper
   [junit4]   2> 21951 INFO  (TEST-CollectionsAPIDistributedZkTest.test-seed#[4F09E14B41B31510]) [    ] o.a.s.c.c.SolrZkClient Using default ZkACLProvider
   [junit4]   2> 21951 INFO  (TEST-CollectionsAPIDistributedZkTest.test-seed#[4F09E14B41B31510]) [    ] o.a.s.c.c.ZkStateReader Updating cluster state from ZooKeeper... 
   [junit4]   2> 21952 INFO  (TEST-CollectionsAPIDistributedZkTest.test-seed#[4F09E14B41B31510]) [    ] o.a.s.c.c.ZkStateReader Loaded cluster properties: {urlScheme=https}
   [junit4]   2> 21952 INFO  (TEST-CollectionsAPIDistributedZkTest.test-seed#[4F09E14B41B31510]) [    ] o.a.s.c.c.ZkStateReader Updated live nodes from ZooKeeper... (0) -> (1)
   [junit4]   2> 21958 INFO  (TEST-CollectionsAPIDistributedZkTest.test-seed#[4F09E14B41B31510]) [    ] o.a.s.c.ChaosMonkey monkey: init - expire sessions:false cause connection loss:false
   [junit4]   2> 21958 INFO  (TEST-CollectionsAPIDistributedZkTest.test-seed#[4F09E14B41B31510]) [    ] o.a.s.c.AbstractFullDistribZkTestBase Creating collection1 with stateFormat=2
   [junit4]   2> 21958 INFO  (TEST-CollectionsAPIDistributedZkTest.test-seed#[4F09E14B41B31510]) [    ] o.a.s.c.c.SolrZkClient Using default ZkCredentialsProvider
   [junit4]   2> 21960 INFO  (TEST-CollectionsAPIDistributedZkTest.test-seed#[4F09E14B41B31510]) [    ] o.a.s.c.c.ConnectionManager Waiting for client to connect to ZooKeeper
   [junit4]   2> 21967 INFO  (zkCallback-22-thread-1) [    ] o.a.s.c.c.ZkStateReader A cluster state change: [WatchedEvent state:SyncConnected type:NodeDataChanged path:/clusterstate.json], has occurred - updating... (live nodes size: [1])
   [junit4]   2> 21968 INFO  (zkCallback-18-thread-1-processing-n:127.0.0.1:41632_) [n:127.0.0.1:41632_    ] o.a.s.c.c.ZkStateReader A cluster state change: [WatchedEvent state:SyncConnected type:NodeDataChanged path:/clusterstate.json], has occurred - updating... (live nodes size: [1])
   [junit4]   2> 21972 INFO  (zkCallback-23-thread-1) [    ] o.a.s.c.c.ConnectionManager Watcher org.apache.solr.common.cloud.ConnectionManager@2cb31eef name:ZooKeeperConnection Watcher:127.0.0.1:55057/solr got event WatchedEvent state:SyncConnected type:None path:null path:null type:None
   [junit4]   2> 21972 INFO  (TEST-CollectionsAPIDistributedZkTest.test-seed#[4F09E14B41B31510]) [    ] o.a.s.c.c.ConnectionManager Client is connected to ZooKeeper
   [junit4]   2> 21972 INFO  (TEST-CollectionsAPIDistributedZkTest.test-seed#[4F09E14B41B31510]) [    ] o.a.s.c.c.SolrZkClient Using default ZkACLProvider
   [junit4]   2> 21974 INFO  (OverseerStateUpdate-95999225822117895-127.0.0.1:41632_-n_0000000000) [n:127.0.0.1:41632_    ] o.a.s.c.Overseer processMessage: queueSize: 1, message = {
   [junit4]   2>   "operation":"create",
   [junit4]   2>   "name":"collection1",
   [junit4]   2>   "numShards":"2",
   [junit4]   2>   "stateFormat":"2"} current state version: 3
   [junit4]   2> 21974 INFO  (OverseerStateUpdate-95999225822117895-127.0.0.1:41632_-n_0000000000) [n:127.0.0.1:41632_    ] o.a.s.c.o.ClusterStateMutator building a new cName: collection1
   [junit4]   2> 22017 INFO  (coreZkRegister-1-thread-1-processing-n:127.0.0.1:41632_ x:collection1 s:shard1 c:control_collection r:core_node1) [n:127.0.0.1:41632_ c:control_collection s:shard1 r:core_node1 x:collection1] o.a.s.c.ZkController We are https://127.0.0.1:41632/collection1/ and leader is https://127.0.0.1:41632/collection1/
   [junit4]   2> 22017 INFO  (coreZkRegister-1-thread-1-processing-n:127.0.0.1:41632_ x:collection1 s:shard1 c:control_collection r:core_node1) [n:127.0.0.1:41632_ c:control_collection s:shard1 r:core_node1 x:collection1] o.a.s.c.ZkController No LogReplay needed for core=collection1 baseURL=https://127.0.0.1:41632
   [junit4]   2> 22018 INFO  (coreZkRegister-1-thread-1-processing-n:127.0.0.1:41632_ x:collection1 s:shard1 c:control_collection r:core_node1) [n:127.0.0.1:41632_ c:control_collection s:shard1 r:core_node1 x:collection1] o.a.s.c.ZkController I am the leader, no recovery necessary
   [junit4]   2> 22018 INFO  (coreZkRegister-1-thread-1-processing-n:127.0.0.1:41632_ x:collection1 s:shard1 c:control_collection r:core_node1) [n:127.0.0.1:41632_ c:control_collection s:shard1 r:core_node1 x:collection1] o.a.s.c.ZkController publishing state=active
   [junit4]   2> 22018 INFO  (coreZkRegister-1-thread-1-processing-n:127.0.0.1:41632_ x:collection1 s:shard1 c:control_collection r:core_node1) [n:127.0.0.1:41632_ c:control_collection s:shard1 r:core_node1 x:collection1] o.a.s.c.ZkController numShards not found on descriptor - reading it from system property
   [junit4]   2> 22020 INFO  (OverseerStateUpdate-95999225822117895-127.0.0.1:41632_-n_0000000000) [n:127.0.0.1:41632_    ] o.a.s.c.Overseer processMessage: queueSize: 1, message = {
   [junit4]   2>   "core":"collection1",
   [junit4]   2>   "core_node_name":"core_node1",
   [junit4]   2>   "roles":null,
   [junit4]   2>   "base_url":"https://127.0.0.1:41632",
   [junit4]   2>   "node_name":"127.0.0.1:41632_",
   [junit4]   2>   "numShards":"2",
   [junit4]   2>   "state":"active",
   [junit4]   2>   "shard":"shard1",
   [junit4]   2>   "collection":"control_collection",
   [junit4]   2>   "operation":"state"} current state version: 3
   [junit4]   2> 22020 INFO  (OverseerStateUpdate-95999225822117895-127.0.0.1:41632_-n_0000000000) [n:127.0.0.1:41632_    ] o.a.s.c.o.ReplicaMutator Update state numShards=2 message={
   [junit4]   2>   "core":"collection1",
   [junit4]   2>   "core_node_name":"core_node1",
   [junit4]   2>   "roles":null,
   [junit4]   2>   "base_url":"https://127.0.0.1:41632",
   [junit4]   2>   "node_name":"127.0.0.1:41632_",
   [junit4]   2>   "numShards":"2",
   [junit4]   2>   "state":"active",
   [junit4]   2>   "shard":"shard1",
   [junit4]   2>   "collection":"control_collection",
   [junit4]   2>   "operation":"state"}
   [junit4]   2> 22021 INFO  (OverseerStateUpdate-95999225822117895-127.0.0.1:41632_-n_0000000000) [n:127.0.0.1:41632_    ] o.a.s.c.o.ZkStateWriter going to create_collection /collections/collection1/state.json
   [junit4]   2> 22060 INFO  (TEST-CollectionsAPIDistributedZkTest.test-seed#[4F09E14B41B31510]) [    ] o.a.s.SolrTestCaseJ4 Writing core.properties file to /x1/jenkins/jenkins-slave/workspace/Lucene-Solr-Tests-master/solr/build/solr-core/test/J1/temp/solr.cloud.CollectionsAPIDistributedZkTest_4F09E14B41B31510-001/shard-1-001/cores/collection1
   [junit4]   2> 22061 INFO  (TEST-CollectionsAPIDistributedZkTest.test-seed#[4F09E14B41B31510]) [    ] o.a.s.c.AbstractFullDistribZkTestBase create jetty 1 in directory /x1/jenkins/jenkins-slave/workspace/Lucene-Solr-Tests-master/solr/build/solr-core/test/J1/temp/solr.cloud.CollectionsAPIDistributedZkTest_4F09E14B41B31510-001/shard-1-001
   [junit4]   2> 22064 INFO  (TEST-CollectionsAPIDistributedZkTest.test-seed#[4F09E14B41B31510]) [    ] o.e.j.s.Server jetty-9.3.8.v20160314
   [junit4]   2> 22070 INFO  (TEST-CollectionsAPIDistributedZkTest.test-seed#[4F09E14B41B31510]) [    ] o.e.j.s.h.ContextHandler Started o.e.j.s.ServletContextHandler@7880da15{/,null,AVAILABLE}
   [junit4]   2> 22081 INFO  (TEST-CollectionsAPIDistributedZkTest.test-seed#[4F09E14B41B31510]) [    ] o.e.j.s.ServerConnector Started ServerConnector@589ab31{SSL,[ssl, http/1.1]}{127.0.0.1:44618}
   [junit4]   2> 22081 INFO  (TEST-CollectionsAPIDistributedZkTest.test-seed#[4F09E14B41B31510]) [    ] o.e.j.s.Server Started @26188ms
   [junit4]   2> 22081 INFO  (TEST-CollectionsAPIDistributedZkTest.test-seed#[4F09E14B41B31510]) [    ] o.a.s.c.s.e.JettySolrRunner Jetty properties: {solr.data.dir=/x1/jenkins/jenkins-slave/workspace/Lucene-Solr-Tests-master/solr/build/solr-core/test/J1/temp/solr.cloud.CollectionsAPIDistributedZkTest_4F09E14B41B31510-001/tempDir-001/jetty1, solrconfig=solrconfig.xml, hostContext=/, hostPort=44618, coreRootDirectory=/x1/jenkins/jenkins-slave/workspace/Lucene-Solr-Tests-master/solr/build/solr-core/test/J1/../../../../../../../../../../x1/jenkins/jenkins-slave/workspace/Lucene-Solr-Tests-master/solr/build/solr-core/test/J1/temp/solr.cloud.CollectionsAPIDistributedZkTest_4F09E14B41B31510-001/shard-1-001/cores}
   [junit4]   2> 22081 INFO  (TEST-CollectionsAPIDistributedZkTest.test-seed#[4F09E14B41B31510]) [    ] o.a.s.s.SolrDispatchFilter SolrDispatchFilter.init(): sun.misc.Launcher$AppClassLoader@73d16e93
   [junit4]   2> 22082 INFO  (TEST-CollectionsAPIDistributedZkTest.test-seed#[4F09E14B41B31510]) [    ] o.a.s.c.SolrResourceLoader new SolrResourceLoader for directory: '/x1/jenkins/jenkins-slave/workspace/Lucene-Solr-Tests-master/solr/build/solr-core/test/J1/temp/solr.cloud.CollectionsAPIDistributedZkTest_4F09E14B41B31510-001/shard-1-001'
   [junit4]   2> 22082 INFO  (TEST-CollectionsAPIDistributedZkTest.test-seed#[4F09E14B41B31510]) [    ] o.a.s.c.SolrResourceLoader JNDI not configured for solr (NoInitialContextEx)
   [junit4]   2> 22082 INFO  (TEST-CollectionsAPIDistributedZkTest.test-seed#[4F09E14B41B31510]) [    ] o.a.s.c.SolrResourceLoader solr home defaulted to 'solr/' (could not find system property or JNDI)
   [junit4]   2> 22082 INFO  (TEST-CollectionsAPIDistributedZkTest.test-seed#[4F09E14B41B31510]) [    ] o.a.s.c.c.SolrZkClient Using default ZkCredentialsProvider
   [junit4]   2> 22083 INFO  (TEST-CollectionsAPIDistributedZkTest.test-seed#[4F09E14B41B31510]) [    ] o.a.s.c.c.ConnectionManager Waiting for client to connect to ZooKeeper
   [junit4]   2> 22099 INFO  (zkCallback-24-thread-1) [    ] o.a.s.c.c.ConnectionManager Watcher org.apache.solr.common.cloud.ConnectionManager@3d75b352 name:ZooKeeperConnection Watcher:127.0.0.1:55057/solr got event WatchedEvent state:SyncConnected type:None path:null path:null type:None
   [junit4]   2> 22099 INFO  (TEST-CollectionsAPIDistributedZkTest.test-seed#[4F09E14B41B31510]) [    ] o.a.s.c.c.ConnectionManager Client is connected to ZooKeeper
   [junit4]   2> 22100 INFO  (TEST-CollectionsAPIDistributedZkTest.test-seed#[4F09E14B41B31510]) [    ] o.a.s.c.c.SolrZkClient Using default ZkACLProvider
   [junit4]   2> 22103 INFO  (TEST-CollectionsAPIDistributedZkTest.test-seed#[4F09E14B41B31510]) [    ] o.a.s.s.SolrDispatchFilter Loading solr.xml from SolrHome (not found in ZooKeeper)
   [junit4]   2> 22103 INFO  (TEST-CollectionsAPIDistributedZkTest.test-seed#[4F09E14B41B31510]) [    ] o.a.s.c.SolrXmlConfig Loading container configuration from /x1/jenkins/jenkins-slave/workspace/Lucene-Solr-Tests-master/solr/build/solr-core/test/J1/temp/solr.cloud.CollectionsAPIDistributedZkTest_4F09E14B41B31510-001/shard-1-001/solr.xml
   [junit4]   2> 22112 INFO  (TEST-CollectionsAPIDistributedZkTest.test-seed#[4F09E14B41B31510]) [    ] o.a.s.c.CorePropertiesLocator Config-defined core root directory: /x1/jenkins/jenkins-slave/workspace/Lucene-Solr-Tests-master/solr/build/solr-core/test/J1/../../../../../../../../../../x1/jenkins/jenkins-slave/workspace/Lucene-Solr-Tests-master/solr/build/solr-core/test/J1/temp/solr.cloud.CollectionsAPIDistributedZkTest_4F09E14B41B31510-001/shard-1-001/cores
   [junit4]   2> 22112 INFO  (TEST-CollectionsAPIDistributedZkTest.test-seed#[4F09E14B41B31510]) [    ] o.a.s.c.CoreContainer New CoreContainer 1630387692
   [junit4]   2> 22112 INFO  (TEST-CollectionsAPIDistributedZkTest.test-seed#[4F09E14B41B31510]) [    ] o.a.s.c.CoreContainer Loading cores into CoreContainer [instanceDir=/x1/jenkins/jenkins-slave/workspace/Lucene-Solr-Tests-master/solr/build/solr-core/test/J1/temp/solr.cloud.CollectionsAPIDistributedZkTest_4F09E14B41B31510-001/shard-1-001]
   [junit4]   2> 22113 WARN  (TEST-CollectionsAPIDistributedZkTest.test-seed#[4F09E14B41B31510]) [    ] o.a.s.c.CoreContainer Couldn't add files from /x1/jenkins/jenkins-slave/workspace/Lucene-Solr-Tests-master/solr/build/solr-core/test/J1/temp/solr.cloud.CollectionsAPIDistributedZkTest_4F09E14B41B31510-001/shard-1-001/lib to classpath: /x1/jenkins/jenkins-slave/workspace/Lucene-Solr-Tests-master/solr/build/solr-core/test/J1/temp/solr.cloud.CollectionsAPIDistributedZkTest_4F09E14B41B31510-001/shard-1-001/lib
   [junit4]   2> 22113 INFO  (TEST-CollectionsAPIDistributedZkTest.test-seed#[4F09E14B41B31510]) [    ] o.a.s.h.c.HttpShardHandlerFactory created with socketTimeout : 90000,urlScheme : ,connTimeout : 15000,maxConnectionsPerHost : 20,maxConnections : 10000,corePoolSize : 0,maximumPoolSize : 2147483647,maxThreadIdleTime : 5,sizeOfQueue : -1,fairnessPolicy : false,
   [junit4]   2> 22124 INFO  (TEST-CollectionsAPIDistributedZkTest.test-seed#[4F09E14B41B31510]) [    ] o.a.s.u.UpdateShardHandler Creating UpdateShardHandler HTTP client with params: 
   [junit4]   2> 22126 INFO  (TEST-CollectionsAPIDistributedZkTest.test-seed#[4F09E14B41B31510]) [    ] o.a.s.l.LogWatcher SLF4J impl is org.slf4j.impl.Log4jLoggerFactory
   [junit4]   2> 22126 INFO  (zkCallback-22-thread-1) [    ] o.a.s.c.c.ZkStateReader A cluster state change: [WatchedEvent state:SyncConnected type:NodeDataChanged path:/clusterstate.json], has occurred - updating... (live nodes size: [1])
   [junit4]   2> 22126 INFO  (TEST-CollectionsAPIDistributedZkTest.test-seed#[4F09E14B41B31510]) [    ] o.a.s.l.LogWatcher Registering Log Listener [Log4j (org.slf4j.impl.Log4jLoggerFactory)]
   [junit4]   2> 22126 INFO  (zkCallback-18-thread-1-processing-n:127.0.0.1:41632_) [n:127.0.0.1:41632_    ] o.a.s.c.c.ZkStateReader A cluster state change: [WatchedEvent state:SyncConnected type:NodeDataChanged path:/clusterstate.json], has occurred - updating... (live nodes size: [1])
   [junit4]   2> 22126 INFO  (TEST-CollectionsAPIDistributedZkTest.test-seed#[4F09E14B41B31510]) [    ] o.a.s.c.ZkContainer Zookeeper client=127.0.0.1:55057/solr
   [junit4]   2> 22132 INFO  (TEST-CollectionsAPIDistributedZkTest.test-seed#[4F09E14B41B31510]) [    ] o.a.s.c.ZkController zkHost includes chroot
   [junit4]   2> 22132 INFO  (TEST-CollectionsAPIDistributedZkTest.test-seed#[4F09E14B41B31510]) [    ] o.a.s.c.c.SolrZkClient Using default ZkCredentialsProvider
   [junit4]   2> 22170 INFO  (TEST-CollectionsAPIDistributedZkTest.test-seed#[4F09E14B41B31510]) [    ] o.a.s.c.c.ConnectionManager Waiting for client to connect to ZooKeeper
   [junit4]   2> 22187 INFO  (zkCallback-27-thread-1) [    ] o.a.s.c.c.ConnectionManager Watcher org.apache.solr.common.cloud.ConnectionManager@2bd04f29 name:ZooKeeperConnection Watcher:127.0.0.1:55057 got event WatchedEvent state:SyncConnected type:None path:null path:null type:None
   [junit4]   2> 22188 INFO  (TEST-CollectionsAPIDistributedZkTest.test-seed#[4F09E14B41B31510]) [    ] o.a.s.c.c.ConnectionManager Client is connected to ZooKeeper
   [junit4]   2> 22188 INFO  (TEST-CollectionsAPIDistributedZkTest.test-seed#[4F09E14B41B31510]) [    ] o.a.s.c.c.SolrZkClient Using default ZkACLProvider
   [junit4]   2> 22190 WARN  (NIOServerCxn.Factory:0.0.0.0/0.0.0.0:0) [    ] o.a.z.s.NIOServerCnxn caught end of stream exception
   [junit4]   2> EndOfStreamException: Unable to read additional data from client sessionid 0x1550ec989d7000b, likely client has closed socket
   [junit4]   2> 	at org.apache.zookeeper.server.NIOServerCnxn.doIO(NIOServerCnxn.java:228)
   [junit4]   2> 	at org.apache.zookeeper.server.NIOServerCnxnFactory.run(NIOServerCnxnFactory.java:208)
   [junit4]   2> 	at java.lang.Thread.run(Thread.java:745)
   [junit4]   2> 22211 INFO  (TEST-CollectionsAPIDistributedZkTest.test-seed#[4F09E14B41B31510]) [n:127.0.0.1:44618_    ] o.a.s.c.ZkController Added new OnReconnect listener org.apache.solr.cloud.ZkController$$Lambda$13/1470131889@2de71eef
   [junit4]   2> 22220 INFO  (TEST-CollectionsAPIDistributedZkTest.test-seed#[4F09E14B41B31510]) [n:127.0.0.1:44618_    ] o.a.s.c.c.ConnectionManager Waiting for client to connect to ZooKeeper
   [junit4]   2> 22229 INFO  (zkCallback-28-thread-1-processing-n:127.0.0.1:44618_) [n:127.0.0.1:44618_    ] o.a.s.c.c.ConnectionManager Watcher org.apache.solr.common.cloud.ConnectionManager@32a5e456 name:ZooKeeperConnection Watcher:127.0.0.1:55057/solr got event WatchedEvent state:SyncConnected type:None path:null path:null type:None
   [junit4]   2> 22229 INFO  (TEST-CollectionsAPIDistributedZkTest.test-seed#[4F09E14B41B31510]) [n:127.0.0.1:44618_    ] o.a.s.c.c.ConnectionManager Client is connected to ZooKeeper
   [junit4]   2> 22239 INFO  (TEST-CollectionsAPIDistributedZkTest.test-seed#[4F09E14B41B31510]) [n:127.0.0.1:44618_    ] o.a.s.c.c.ZkStateReader Updating cluster state from ZooKeeper... 
   [junit4]   2> 22329 INFO  (TEST-CollectionsAPIDistributedZkTest.test-seed#[4F09E14B41B31510]) [n:127.0.0.1:44618_    ] o.a.s.c.c.ZkStateReader Loaded cluster properties: {urlScheme=https}
   [junit4]   2> 22330 INFO  (TEST-CollectionsAPIDistributedZkTest.test-seed#[4F09E14B41B31510]) [n:127.0.0.1:44618_    ] o.a.s.c.c.ZkStateReader Updated live nodes from ZooKeeper... (0) -> (1)
   [junit4]   2> 22333 INFO  (TEST-CollectionsAPIDistributedZkTest.test-seed#[4F09E14B41B31510]) [n:127.0.0.1:44618_    ] o.a.s.c.Overseer Overseer (id=null) closing
   [junit4]   2> 22333 INFO  (TEST-CollectionsAPIDistributedZkTest.test-seed#[4F09E14B41B31510]) [n:127.0.0.1:44618_    ] o.a.s.c.LeaderElector Joined leadership election with path: /overseer_elect/election/95999225822117900-127.0.0.1:44618_-n_0000000001
   [junit4]   2> 22334 INFO  (TEST-CollectionsAPIDistributedZkTest.test-seed#[4F09E14B41B31510]) [n:127.0.0.1:44618_    ] o.a.s.c.LeaderElector Watching path /overseer_elect/election/95999225822117895-127.0.0.1:41632_-n_0000000000 to know if I could be the leader
   [junit4]   2> 22335 INFO  (TEST-CollectionsAPIDistributedZkTest.test-seed#[4F09E14B41B31510]) [n:127.0.0.1:44618_    ] o.a.s.c.ZkController Publish node=127.0.0.1:44618_ as DOWN
   [junit4]   2> 22337 INFO  (OverseerStateUpdate-95999225822117895-127.0.0.1:41632_-n_0000000000) [n:127.0.0.1:41632_    ] o.a.s.c.Overseer processMessage: queueSize: 1, message = {
   [junit4]   2>   "operation":"downnode",
   [junit4]   2>   "node_name":"127.0.0.1:44618_"} current state version: 4
   [junit4]   2> 22338 INFO  (OverseerStateUpdate-95999225822117895-127.0.0.1:41632_-n_0000000000) [n:127.0.0.1:41632_    ] o.a.s.c.o.NodeMutator DownNode state invoked for node: 127.0.0.1:44618_
   [junit4]   2> 22340 INFO  (zkCallback-18-thread-1-processing-n:127.0.0.1:41632_) [n:127.0.0.1:41632_    ] o.a.s.c.c.ZkStateReader A cluster state change: [WatchedEvent state:SyncConnected type:NodeDataChanged path:/clusterstate.json], has occurred - updating... (live nodes size: [1])
   [junit4]   2> 22340 INFO  (zkCallback-22-thread-1) [    ] o.a.s.c.c.ZkStateReader A cluster state change: [WatchedEvent state:SyncConnected type:NodeDataChanged path:/clusterstate.json], has occurred - updating... (live nodes size: [1])
   [junit4]   2> 22349 INFO  (zkCallback-28-thread-1-processing-n:127.0.0.1:44618_) [n:127.0.0.1:44618_    ] o.a.s.c.c.ZkStateReader A cluster state change: [WatchedEvent state:SyncConnected type:NodeDataChanged path:/clusterstate.json], has occurred - updating... (live nodes size: [1])
   [junit4]   2> 22444 INFO  (OverseerStateUpdate-95999225822117895-127.0.0.1:41632_-n_0000000000) [n:127.0.0.1:41632_    ] o.a.s.c.o.ZkStateWriter going to update_collection /collections/collection1/state.json version: 0
   [junit4]   2> 23337 INFO  (TEST-CollectionsAPIDistributedZkTest.test-seed#[4F09E14B41B31510]) [n:127.0.0.1:44618_    ] o.a.s.c.ZkController Register node as live in ZooKeeper:/live_nodes/127.0.0.1:44618_
   [junit4]   2> 23338 INFO  (TEST-CollectionsAPIDistributedZkTest.test-seed#[4F09E14B41B31510]) [n:127.0.0.1:44618_    ] o.a.s.c.c.SolrZkClient makePath: /live_nodes/127.0.0.1:44618_
   [junit4]   2> 23339 INFO  (zkCallback-22-thread-1) [    ] o.a.s.c.c.ZkStateReader A live node change: [WatchedEvent state:SyncConnected type:NodeChildrenChanged path:/live_nodes], has occurred - updating... (live nodes size: [1])
   [junit4]   2> 23339 INFO  (zkCallback-28-thread-1-processing-n:127.0.0.1:44618_) [n:127.0.0.1:44618_    ] o.a.s.c.c.ZkStateReader A live node change: [WatchedEvent state:SyncConnected type:NodeChildrenChanged path:/live_nodes], has occurred - updating... (live nodes size: [1])
   [junit4]   2> 23340 INFO  (zkCallback-18-thread-1-processing-n:127.0.0.1:41632_) [n:127.0.0.1:41632_    ] o.a.s.c.c.ZkStateReader A live node change: [WatchedEvent state:SyncConnected type:NodeChildrenChanged path:/live_nodes], has occurred - updating... (live nodes size: [1])
   [junit4]   2> 23340 INFO  (zkCallback-22-thread-1) [    ] o.a.s.c.c.ZkStateReader Updated live nodes from ZooKeeper... (1) -> (2)
   [junit4]   2> 23340 INFO  (zkCallback-18-thread-1-processing-n:127.0.0.1:41632_) [n:127.0.0.1:41632_    ] o.a.s.c.c.ZkStateReader Updated live nodes from ZooKeeper... (1) -> (2)
   [junit4]   2> 23340 INFO  (zkCallback-28-thread-1-processing-n:127.0.0.1:44618_) [n:127.0.0.1:44618_    ] o.a.s.c.c.ZkStateReader Updated live nodes from ZooKeeper... (1) -> (2)
   [junit4]   2> 233

[...truncated too long message...]

.1:45821_ c:collection1 s:shard1 r:core_node4 x:collection1] o.a.s.c.CachingDirectoryFactory Closing directory, CoreContainer#isShutdown=true
   [junit4]   2> 64193 INFO  (zkCallback-47-thread-1-processing-n:127.0.0.1:45821_) [n:127.0.0.1:45821_ c:collection1 s:shard1 r:core_node4 x:collection1] o.a.s.c.CachingDirectoryFactory Closing directory: /x1/jenkins/jenkins-slave/workspace/Lucene-Solr-Tests-master/solr/build/solr-core/test/J1/temp/solr.cloud.CollectionsAPIDistributedZkTest_4F09E14B41B31510-001/shard-4-001/cores/collection1/data/index
   [junit4]   2> 64193 INFO  (zkCallback-47-thread-1-processing-n:127.0.0.1:45821_) [n:127.0.0.1:45821_ c:collection1 s:shard1 r:core_node4 x:collection1] o.a.s.c.CachingDirectoryFactory looking to close /x1/jenkins/jenkins-slave/workspace/Lucene-Solr-Tests-master/solr/build/solr-core/test/J1/temp/solr.cloud.CollectionsAPIDistributedZkTest_4F09E14B41B31510-001/shard-4-001/cores/collection1/data [CachedDir<<refCount=0;path=/x1/jenkins/jenkins-slave/workspace/Lucene-Solr-Tests-master/solr/build/solr-core/test/J1/temp/solr.cloud.CollectionsAPIDistributedZkTest_4F09E14B41B31510-001/shard-4-001/cores/collection1/data;done=false>>]
   [junit4]   2> 64204 INFO  (zkCallback-47-thread-1-processing-n:127.0.0.1:45821_) [n:127.0.0.1:45821_ c:collection1 s:shard1 r:core_node4 x:collection1] o.a.s.c.CachingDirectoryFactory Closing directory, CoreContainer#isShutdown=true
   [junit4]   2> 64204 INFO  (zkCallback-47-thread-1-processing-n:127.0.0.1:45821_) [n:127.0.0.1:45821_ c:collection1 s:shard1 r:core_node4 x:collection1] o.a.s.c.CachingDirectoryFactory Closing directory: /x1/jenkins/jenkins-slave/workspace/Lucene-Solr-Tests-master/solr/build/solr-core/test/J1/temp/solr.cloud.CollectionsAPIDistributedZkTest_4F09E14B41B31510-001/shard-4-001/cores/collection1/data
   [junit4]   2> 64204 INFO  (zkCallback-47-thread-1-processing-n:127.0.0.1:45821_) [n:127.0.0.1:45821_ c:collection1 s:shard1 r:core_node4 x:collection1] o.a.s.c.ElectionContext Canceling election /collections/collection1/leader_elect/shard1/election/95999225822117909-core_node4-n_0000000001
   [junit4]   2> 64204 WARN  (zkCallback-47-thread-1-processing-n:127.0.0.1:45821_) [n:127.0.0.1:45821_ c:collection1 s:shard1 r:core_node4 x:collection1] o.a.s.c.LeaderElector 
   [junit4]   2> org.apache.zookeeper.KeeperException$SessionExpiredException: KeeperErrorCode = Session expired for /collections/collection1/leader_elect/shard1/election/95999225822117909-core_node4-n_0000000001
   [junit4]   2> 	at org.apache.zookeeper.KeeperException.create(KeeperException.java:127)
   [junit4]   2> 	at org.apache.zookeeper.KeeperException.create(KeeperException.java:51)
   [junit4]   2> 	at org.apache.zookeeper.ZooKeeper.delete(ZooKeeper.java:873)
   [junit4]   2> 	at org.apache.solr.common.cloud.SolrZkClient$2.execute(SolrZkClient.java:244)
   [junit4]   2> 	at org.apache.solr.common.cloud.SolrZkClient$2.execute(SolrZkClient.java:241)
   [junit4]   2> 	at org.apache.solr.common.cloud.ZkCmdExecutor.retryOperation(ZkCmdExecutor.java:60)
   [junit4]   2> 	at org.apache.solr.common.cloud.SolrZkClient.delete(SolrZkClient.java:241)
   [junit4]   2> 	at org.apache.solr.cloud.ElectionContext.cancelElection(ElectionContext.java:86)
   [junit4]   2> 	at org.apache.solr.cloud.ShardLeaderElectionContextBase.cancelElection(ElectionContext.java:143)
   [junit4]   2> 	at org.apache.solr.cloud.ShardLeaderElectionContext.cancelElection(ElectionContext.java:279)
   [junit4]   2> 	at org.apache.solr.cloud.ShardLeaderElectionContext.runLeaderProcess(ElectionContext.java:455)
   [junit4]   2> 	at org.apache.solr.cloud.LeaderElector.runIamLeaderProcess(LeaderElector.java:170)
   [junit4]   2> 	at org.apache.solr.cloud.LeaderElector.checkIfIamLeader(LeaderElector.java:135)
   [junit4]   2> 	at org.apache.solr.cloud.LeaderElector.access$200(LeaderElector.java:56)
   [junit4]   2> 	at org.apache.solr.cloud.LeaderElector$ElectionWatcher.process(LeaderElector.java:348)
   [junit4]   2> 	at org.apache.solr.common.cloud.SolrZkClient$3.lambda$process$0(SolrZkClient.java:266)
   [junit4]   2> 	at java.util.concurrent.Executors$RunnableAdapter.call(Executors.java:511)
   [junit4]   2> 	at java.util.concurrent.FutureTask.run(FutureTask.java:266)
   [junit4]   2> 	at org.apache.solr.common.util.ExecutorUtil$MDCAwareThreadPoolExecutor.lambda$execute$0(ExecutorUtil.java:229)
   [junit4]   2> 	at java.util.concurrent.ThreadPoolExecutor.runWorker(ThreadPoolExecutor.java:1142)
   [junit4]   2> 	at java.util.concurrent.ThreadPoolExecutor$Worker.run(ThreadPoolExecutor.java:617)
   [junit4]   2> 	at java.lang.Thread.run(Thread.java:745)
   [junit4]   2> 64239 WARN  (zkCallback-47-thread-3-processing-n:127.0.0.1:45821_) [n:127.0.0.1:45821_    ] o.a.s.c.c.ZkStateReader ZooKeeper watch triggered, but Solr cannot talk to ZK: [KeeperErrorCode = Session expired for /live_nodes]
   [junit4]   2> 64240 INFO  (TEST-CollectionsAPIDistributedZkTest.test-seed#[4F09E14B41B31510]) [    ] o.e.j.s.ServerConnector Stopped ServerConnector@383c7bb1{SSL,[ssl, http/1.1]}{127.0.0.1:0}
   [junit4]   2> 64240 INFO  (TEST-CollectionsAPIDistributedZkTest.test-seed#[4F09E14B41B31510]) [    ] o.e.j.s.h.ContextHandler Stopped o.e.j.s.ServletContextHandler@3131c3ec{/,null,UNAVAILABLE}
   [junit4]   2> 64246 INFO  (TEST-CollectionsAPIDistributedZkTest.test-seed#[4F09E14B41B31510]) [    ] o.a.s.c.ZkTestServer connecting to 127.0.0.1:55057 55057
   [junit4]   2> 64385 INFO  (Thread-5) [    ] o.a.s.c.ZkTestServer connecting to 127.0.0.1:55057 55057
   [junit4]   2> 64386 WARN  (Thread-5) [    ] o.a.s.c.ZkTestServer Watch limit violations: 
   [junit4]   2> Maximum concurrent create/delete watches above limit:
   [junit4]   2> 
   [junit4]   2> 	7	/solr/aliases.json
   [junit4]   2> 	5	/solr/security.json
   [junit4]   2> 	5	/solr/configs/conf1
   [junit4]   2> 
   [junit4]   2> Maximum concurrent data watches above limit:
   [junit4]   2> 
   [junit4]   2> 	7	/solr/clusterprops.json
   [junit4]   2> 	7	/solr/clusterstate.json
   [junit4]   2> 	4	/solr/collections/nodes_used_collection/state.json
   [junit4]   2> 	4	/solr/collections/collection1/state.json
   [junit4]   2> 
   [junit4]   2> Maximum concurrent children watches above limit:
   [junit4]   2> 
   [junit4]   2> 	7	/solr/live_nodes
   [junit4]   2> 	7	/solr/collections
   [junit4]   2> 	5	/solr/overseer/queue
   [junit4]   2> 	5	/solr/overseer/collection-queue-work
   [junit4]   2> 	2	/solr/overseer/queue-work
   [junit4]   2> 
   [junit4]   2> NOTE: reproduce with: ant test  -Dtestcase=CollectionsAPIDistributedZkTest -Dtests.method=test -Dtests.seed=4F09E14B41B31510 -Dtests.multiplier=2 -Dtests.slow=true -Dtests.locale=mk -Dtests.timezone=Asia/Ashkhabad -Dtests.asserts=true -Dtests.file.encoding=UTF-8
   [junit4] FAILURE 49.9s J1 | CollectionsAPIDistributedZkTest.test <<<
   [junit4]    > Throwable #1: java.lang.AssertionError: replicaCount expected:<0> but was:<1>
   [junit4]    > 	at __randomizedtesting.SeedInfo.seed([4F09E14B41B31510:C75DDE91EF4F78E8]:0)
   [junit4]    > 	at org.apache.solr.cloud.CollectionsAPIDistributedZkTest.testNoConfigSetExist(CollectionsAPIDistributedZkTest.java:619)
   [junit4]    > 	at org.apache.solr.cloud.CollectionsAPIDistributedZkTest.test(CollectionsAPIDistributedZkTest.java:177)
   [junit4]    > 	at org.apache.solr.BaseDistributedSearchTestCase$ShardsRepeatRule$ShardsFixedStatement.callStatement(BaseDistributedSearchTestCase.java:985)
   [junit4]    > 	at org.apache.solr.BaseDistributedSearchTestCase$ShardsRepeatRule$ShardsStatement.evaluate(BaseDistributedSearchTestCase.java:960)
   [junit4]    > 	at java.lang.Thread.run(Thread.java:745)
   [junit4]   2> 64392 INFO  (SUITE-CollectionsAPIDistributedZkTest-seed#[4F09E14B41B31510]-worker) [    ] o.a.s.SolrTestCaseJ4 ###deleteCore
   [junit4]   2> NOTE: leaving temporary files on disk at: /x1/jenkins/jenkins-slave/workspace/Lucene-Solr-Tests-master/solr/build/solr-core/test/J1/temp/solr.cloud.CollectionsAPIDistributedZkTest_4F09E14B41B31510-001
   [junit4]   2> Jun 02, 2016 1:46:26 AM com.carrotsearch.randomizedtesting.ThreadLeakControl checkThreadLeaks
   [junit4]   2> WARNING: Will linger awaiting termination of 1 leaked thread(s).
   [junit4]   2> NOTE: test params are: codec=Asserting(Lucene62), sim=RandomSimilarity(queryNorm=false,coord=yes): {}, locale=mk, timezone=Asia/Ashkhabad
   [junit4]   2> NOTE: Linux 3.13.0-85-generic amd64/Oracle Corporation 1.8.0_74 (64-bit)/cpus=4,threads=1,free=267202248,total=324534272
   [junit4]   2> NOTE: All tests run in this JVM: [SaslZkACLProviderTest, CollectionsAPIDistributedZkTest]
   [junit4] Completed [21/611 (1!)] on J1 in 50.39s, 1 test, 1 failure <<< FAILURES!

[...truncated 1906 lines...]
BUILD FAILED
/x1/jenkins/jenkins-slave/workspace/Lucene-Solr-Tests-master/build.xml:740: The following error occurred while executing this line:
/x1/jenkins/jenkins-slave/workspace/Lucene-Solr-Tests-master/build.xml:684: The following error occurred while executing this line:
/x1/jenkins/jenkins-slave/workspace/Lucene-Solr-Tests-master/build.xml:59: The following error occurred while executing this line:
/x1/jenkins/jenkins-slave/workspace/Lucene-Solr-Tests-master/solr/build.xml:233: The following error occurred while executing this line:
/x1/jenkins/jenkins-slave/workspace/Lucene-Solr-Tests-master/solr/common-build.xml:531: The following error occurred while executing this line:
/x1/jenkins/jenkins-slave/workspace/Lucene-Solr-Tests-master/lucene/common-build.xml:1427: The following error occurred while executing this line:
/x1/jenkins/jenkins-slave/workspace/Lucene-Solr-Tests-master/lucene/common-build.xml:984: There were test failures: 611 suites (10 ignored), 2559 tests, 1 failure, 87 ignored (72 assumptions) [seed: 4F09E14B41B31510]

Total time: 62 minutes 36 seconds
Build step 'Invoke Ant' marked build as failure
Archiving artifacts
Recording test results
Email was triggered for: Failure - Any
Sending email for trigger: Failure - Any




Mime
View raw message