lucene-dev mailing list archives

Site index · List index
Message view « Date » · « Thread »
Top « Date » · « Thread »
From Policeman Jenkins Server <jenk...@thetaphi.de>
Subject [JENKINS] Lucene-Solr-master-Linux (32bit/jdk1.8.0_92) - Build # 16885 - Still Failing!
Date Wed, 01 Jun 2016 03:41:09 GMT
Build: http://jenkins.thetaphi.de/job/Lucene-Solr-master-Linux/16885/
Java: 32bit/jdk1.8.0_92 -server -XX:+UseConcMarkSweepGC

2 tests failed.
FAILED:  org.apache.solr.handler.TestReqParamsAPI.test

Error Message:
Could not get expected value  'CY val' for path 'params/c' full output: {   "responseHeader":{     "status":0,     "QTime":0},   "params":{     "a":"A val",     "b":"B val",     "wt":"json",     "useParams":""},   "context":{     "webapp":"/q_qu/ii",     "path":"/dump1",     "httpMethod":"GET"}},  from server:  http://127.0.0.1:46529/q_qu/ii/collection1

Stack Trace:
java.lang.AssertionError: Could not get expected value  'CY val' for path 'params/c' full output: {
  "responseHeader":{
    "status":0,
    "QTime":0},
  "params":{
    "a":"A val",
    "b":"B val",
    "wt":"json",
    "useParams":""},
  "context":{
    "webapp":"/q_qu/ii",
    "path":"/dump1",
    "httpMethod":"GET"}},  from server:  http://127.0.0.1:46529/q_qu/ii/collection1
	at __randomizedtesting.SeedInfo.seed([D5640F95001631D9:5D30304FAEEA5C21]:0)
	at org.junit.Assert.fail(Assert.java:93)
	at org.junit.Assert.assertTrue(Assert.java:43)
	at org.apache.solr.core.TestSolrConfigHandler.testForResponseElement(TestSolrConfigHandler.java:457)
	at org.apache.solr.handler.TestReqParamsAPI.testReqParams(TestReqParamsAPI.java:172)
	at org.apache.solr.handler.TestReqParamsAPI.test(TestReqParamsAPI.java:62)
	at sun.reflect.NativeMethodAccessorImpl.invoke0(Native Method)
	at sun.reflect.NativeMethodAccessorImpl.invoke(NativeMethodAccessorImpl.java:62)
	at sun.reflect.DelegatingMethodAccessorImpl.invoke(DelegatingMethodAccessorImpl.java:43)
	at java.lang.reflect.Method.invoke(Method.java:498)
	at com.carrotsearch.randomizedtesting.RandomizedRunner.invoke(RandomizedRunner.java:1764)
	at com.carrotsearch.randomizedtesting.RandomizedRunner$8.evaluate(RandomizedRunner.java:871)
	at com.carrotsearch.randomizedtesting.RandomizedRunner$9.evaluate(RandomizedRunner.java:907)
	at com.carrotsearch.randomizedtesting.RandomizedRunner$10.evaluate(RandomizedRunner.java:921)
	at org.apache.solr.BaseDistributedSearchTestCase$ShardsRepeatRule$ShardsFixedStatement.callStatement(BaseDistributedSearchTestCase.java:985)
	at org.apache.solr.BaseDistributedSearchTestCase$ShardsRepeatRule$ShardsStatement.evaluate(BaseDistributedSearchTestCase.java:960)
	at com.carrotsearch.randomizedtesting.rules.SystemPropertiesRestoreRule$1.evaluate(SystemPropertiesRestoreRule.java:57)
	at org.apache.lucene.util.TestRuleSetupTeardownChained$1.evaluate(TestRuleSetupTeardownChained.java:49)
	at org.apache.lucene.util.AbstractBeforeAfterRule$1.evaluate(AbstractBeforeAfterRule.java:45)
	at org.apache.lucene.util.TestRuleThreadAndTestName$1.evaluate(TestRuleThreadAndTestName.java:48)
	at org.apache.lucene.util.TestRuleIgnoreAfterMaxFailures$1.evaluate(TestRuleIgnoreAfterMaxFailures.java:64)
	at org.apache.lucene.util.TestRuleMarkFailure$1.evaluate(TestRuleMarkFailure.java:47)
	at com.carrotsearch.randomizedtesting.rules.StatementAdapter.evaluate(StatementAdapter.java:36)
	at com.carrotsearch.randomizedtesting.ThreadLeakControl$StatementRunner.run(ThreadLeakControl.java:367)
	at com.carrotsearch.randomizedtesting.ThreadLeakControl.forkTimeoutingTask(ThreadLeakControl.java:809)
	at com.carrotsearch.randomizedtesting.ThreadLeakControl$3.evaluate(ThreadLeakControl.java:460)
	at com.carrotsearch.randomizedtesting.RandomizedRunner.runSingleTest(RandomizedRunner.java:880)
	at com.carrotsearch.randomizedtesting.RandomizedRunner$5.evaluate(RandomizedRunner.java:781)
	at com.carrotsearch.randomizedtesting.RandomizedRunner$6.evaluate(RandomizedRunner.java:816)
	at com.carrotsearch.randomizedtesting.RandomizedRunner$7.evaluate(RandomizedRunner.java:827)
	at com.carrotsearch.randomizedtesting.rules.StatementAdapter.evaluate(StatementAdapter.java:36)
	at com.carrotsearch.randomizedtesting.rules.SystemPropertiesRestoreRule$1.evaluate(SystemPropertiesRestoreRule.java:57)
	at org.apache.lucene.util.AbstractBeforeAfterRule$1.evaluate(AbstractBeforeAfterRule.java:45)
	at com.carrotsearch.randomizedtesting.rules.StatementAdapter.evaluate(StatementAdapter.java:36)
	at org.apache.lucene.util.TestRuleStoreClassName$1.evaluate(TestRuleStoreClassName.java:41)
	at com.carrotsearch.randomizedtesting.rules.NoShadowingOrOverridesOnMethodsRule$1.evaluate(NoShadowingOrOverridesOnMethodsRule.java:40)
	at com.carrotsearch.randomizedtesting.rules.NoShadowingOrOverridesOnMethodsRule$1.evaluate(NoShadowingOrOverridesOnMethodsRule.java:40)
	at com.carrotsearch.randomizedtesting.rules.StatementAdapter.evaluate(StatementAdapter.java:36)
	at com.carrotsearch.randomizedtesting.rules.StatementAdapter.evaluate(StatementAdapter.java:36)
	at com.carrotsearch.randomizedtesting.rules.StatementAdapter.evaluate(StatementAdapter.java:36)
	at org.apache.lucene.util.TestRuleAssertionsRequired$1.evaluate(TestRuleAssertionsRequired.java:53)
	at org.apache.lucene.util.TestRuleMarkFailure$1.evaluate(TestRuleMarkFailure.java:47)
	at org.apache.lucene.util.TestRuleIgnoreAfterMaxFailures$1.evaluate(TestRuleIgnoreAfterMaxFailures.java:64)
	at org.apache.lucene.util.TestRuleIgnoreTestSuites$1.evaluate(TestRuleIgnoreTestSuites.java:54)
	at com.carrotsearch.randomizedtesting.rules.StatementAdapter.evaluate(StatementAdapter.java:36)
	at com.carrotsearch.randomizedtesting.ThreadLeakControl$StatementRunner.run(ThreadLeakControl.java:367)
	at java.lang.Thread.run(Thread.java:745)


FAILED:  org.apache.solr.util.SolrPluginUtilsTest.testInvokeSetters

Error Message:
argument type mismatch

Stack Trace:
java.lang.IllegalArgumentException: argument type mismatch
	at __randomizedtesting.SeedInfo.seed([D5640F95001631D9:BC7BA495F5205372]:0)
	at sun.reflect.NativeMethodAccessorImpl.invoke0(Native Method)
	at sun.reflect.NativeMethodAccessorImpl.invoke(NativeMethodAccessorImpl.java:62)
	at sun.reflect.DelegatingMethodAccessorImpl.invoke(DelegatingMethodAccessorImpl.java:43)
	at java.lang.reflect.Method.invoke(Method.java:498)
	at org.apache.solr.util.SolrPluginUtils.invokeSetters(SolrPluginUtils.java:1071)
	at org.apache.solr.util.SolrPluginUtilsTest.implTestInvokeSetters(SolrPluginUtilsTest.java:482)
	at org.apache.solr.util.SolrPluginUtilsTest.testInvokeSetters(SolrPluginUtilsTest.java:474)
	at sun.reflect.NativeMethodAccessorImpl.invoke0(Native Method)
	at sun.reflect.NativeMethodAccessorImpl.invoke(NativeMethodAccessorImpl.java:62)
	at sun.reflect.DelegatingMethodAccessorImpl.invoke(DelegatingMethodAccessorImpl.java:43)
	at java.lang.reflect.Method.invoke(Method.java:498)
	at com.carrotsearch.randomizedtesting.RandomizedRunner.invoke(RandomizedRunner.java:1764)
	at com.carrotsearch.randomizedtesting.RandomizedRunner$8.evaluate(RandomizedRunner.java:871)
	at com.carrotsearch.randomizedtesting.RandomizedRunner$9.evaluate(RandomizedRunner.java:907)
	at com.carrotsearch.randomizedtesting.RandomizedRunner$10.evaluate(RandomizedRunner.java:921)
	at com.carrotsearch.randomizedtesting.rules.SystemPropertiesRestoreRule$1.evaluate(SystemPropertiesRestoreRule.java:57)
	at org.apache.lucene.util.TestRuleSetupTeardownChained$1.evaluate(TestRuleSetupTeardownChained.java:49)
	at org.apache.lucene.util.AbstractBeforeAfterRule$1.evaluate(AbstractBeforeAfterRule.java:45)
	at org.apache.lucene.util.TestRuleThreadAndTestName$1.evaluate(TestRuleThreadAndTestName.java:48)
	at org.apache.lucene.util.TestRuleIgnoreAfterMaxFailures$1.evaluate(TestRuleIgnoreAfterMaxFailures.java:64)
	at org.apache.lucene.util.TestRuleMarkFailure$1.evaluate(TestRuleMarkFailure.java:47)
	at com.carrotsearch.randomizedtesting.rules.StatementAdapter.evaluate(StatementAdapter.java:36)
	at com.carrotsearch.randomizedtesting.ThreadLeakControl$StatementRunner.run(ThreadLeakControl.java:367)
	at com.carrotsearch.randomizedtesting.ThreadLeakControl.forkTimeoutingTask(ThreadLeakControl.java:809)
	at com.carrotsearch.randomizedtesting.ThreadLeakControl$3.evaluate(ThreadLeakControl.java:460)
	at com.carrotsearch.randomizedtesting.RandomizedRunner.runSingleTest(RandomizedRunner.java:880)
	at com.carrotsearch.randomizedtesting.RandomizedRunner$5.evaluate(RandomizedRunner.java:781)
	at com.carrotsearch.randomizedtesting.RandomizedRunner$6.evaluate(RandomizedRunner.java:816)
	at com.carrotsearch.randomizedtesting.RandomizedRunner$7.evaluate(RandomizedRunner.java:827)
	at com.carrotsearch.randomizedtesting.rules.StatementAdapter.evaluate(StatementAdapter.java:36)
	at com.carrotsearch.randomizedtesting.rules.SystemPropertiesRestoreRule$1.evaluate(SystemPropertiesRestoreRule.java:57)
	at org.apache.lucene.util.AbstractBeforeAfterRule$1.evaluate(AbstractBeforeAfterRule.java:45)
	at com.carrotsearch.randomizedtesting.rules.StatementAdapter.evaluate(StatementAdapter.java:36)
	at org.apache.lucene.util.TestRuleStoreClassName$1.evaluate(TestRuleStoreClassName.java:41)
	at com.carrotsearch.randomizedtesting.rules.NoShadowingOrOverridesOnMethodsRule$1.evaluate(NoShadowingOrOverridesOnMethodsRule.java:40)
	at com.carrotsearch.randomizedtesting.rules.NoShadowingOrOverridesOnMethodsRule$1.evaluate(NoShadowingOrOverridesOnMethodsRule.java:40)
	at com.carrotsearch.randomizedtesting.rules.StatementAdapter.evaluate(StatementAdapter.java:36)
	at com.carrotsearch.randomizedtesting.rules.StatementAdapter.evaluate(StatementAdapter.java:36)
	at com.carrotsearch.randomizedtesting.rules.StatementAdapter.evaluate(StatementAdapter.java:36)
	at org.apache.lucene.util.TestRuleAssertionsRequired$1.evaluate(TestRuleAssertionsRequired.java:53)
	at org.apache.lucene.util.TestRuleMarkFailure$1.evaluate(TestRuleMarkFailure.java:47)
	at org.apache.lucene.util.TestRuleIgnoreAfterMaxFailures$1.evaluate(TestRuleIgnoreAfterMaxFailures.java:64)
	at org.apache.lucene.util.TestRuleIgnoreTestSuites$1.evaluate(TestRuleIgnoreTestSuites.java:54)
	at com.carrotsearch.randomizedtesting.rules.StatementAdapter.evaluate(StatementAdapter.java:36)
	at com.carrotsearch.randomizedtesting.ThreadLeakControl$StatementRunner.run(ThreadLeakControl.java:367)
	at java.lang.Thread.run(Thread.java:745)




Build Log:
[...truncated 11328 lines...]
   [junit4] Suite: org.apache.solr.handler.TestReqParamsAPI
   [junit4]   2> Creating dataDir: /home/jenkins/workspace/Lucene-Solr-master-Linux/solr/build/solr-core/test/J0/temp/solr.handler.TestReqParamsAPI_D5640F95001631D9-001/init-core-data-001
   [junit4]   2> 947186 INFO  (SUITE-TestReqParamsAPI-seed#[D5640F95001631D9]-worker) [    ] o.a.s.SolrTestCaseJ4 Randomized ssl (false) and clientAuth (true)
   [junit4]   2> 947187 INFO  (SUITE-TestReqParamsAPI-seed#[D5640F95001631D9]-worker) [    ] o.a.s.BaseDistributedSearchTestCase Setting hostContext system property: /q_qu/ii
   [junit4]   2> 947188 INFO  (TEST-TestReqParamsAPI.test-seed#[D5640F95001631D9]) [    ] o.a.s.c.ZkTestServer STARTING ZK TEST SERVER
   [junit4]   2> 947188 INFO  (Thread-2847) [    ] o.a.s.c.ZkTestServer client port:0.0.0.0/0.0.0.0:0
   [junit4]   2> 947188 INFO  (Thread-2847) [    ] o.a.s.c.ZkTestServer Starting server
   [junit4]   2> 947288 INFO  (TEST-TestReqParamsAPI.test-seed#[D5640F95001631D9]) [    ] o.a.s.c.ZkTestServer start zk server on port:36069
   [junit4]   2> 947288 INFO  (TEST-TestReqParamsAPI.test-seed#[D5640F95001631D9]) [    ] o.a.s.c.c.SolrZkClient Using default ZkCredentialsProvider
   [junit4]   2> 947289 INFO  (TEST-TestReqParamsAPI.test-seed#[D5640F95001631D9]) [    ] o.a.s.c.c.ConnectionManager Waiting for client to connect to ZooKeeper
   [junit4]   2> 947290 INFO  (zkCallback-1408-thread-1) [    ] o.a.s.c.c.ConnectionManager Watcher org.apache.solr.common.cloud.ConnectionManager@7e149a name:ZooKeeperConnection Watcher:127.0.0.1:36069 got event WatchedEvent state:SyncConnected type:None path:null path:null type:None
   [junit4]   2> 947290 INFO  (TEST-TestReqParamsAPI.test-seed#[D5640F95001631D9]) [    ] o.a.s.c.c.ConnectionManager Client is connected to ZooKeeper
   [junit4]   2> 947291 INFO  (TEST-TestReqParamsAPI.test-seed#[D5640F95001631D9]) [    ] o.a.s.c.c.SolrZkClient Using default ZkACLProvider
   [junit4]   2> 947291 INFO  (TEST-TestReqParamsAPI.test-seed#[D5640F95001631D9]) [    ] o.a.s.c.c.SolrZkClient makePath: /solr
   [junit4]   2> 947292 INFO  (TEST-TestReqParamsAPI.test-seed#[D5640F95001631D9]) [    ] o.a.s.c.c.SolrZkClient Using default ZkCredentialsProvider
   [junit4]   2> 947292 INFO  (TEST-TestReqParamsAPI.test-seed#[D5640F95001631D9]) [    ] o.a.s.c.c.ConnectionManager Waiting for client to connect to ZooKeeper
   [junit4]   2> 947293 INFO  (zkCallback-1409-thread-1) [    ] o.a.s.c.c.ConnectionManager Watcher org.apache.solr.common.cloud.ConnectionManager@135ae70 name:ZooKeeperConnection Watcher:127.0.0.1:36069/solr got event WatchedEvent state:SyncConnected type:None path:null path:null type:None
   [junit4]   2> 947293 INFO  (TEST-TestReqParamsAPI.test-seed#[D5640F95001631D9]) [    ] o.a.s.c.c.ConnectionManager Client is connected to ZooKeeper
   [junit4]   2> 947293 INFO  (TEST-TestReqParamsAPI.test-seed#[D5640F95001631D9]) [    ] o.a.s.c.c.SolrZkClient Using default ZkACLProvider
   [junit4]   2> 947293 INFO  (TEST-TestReqParamsAPI.test-seed#[D5640F95001631D9]) [    ] o.a.s.c.c.SolrZkClient makePath: /collections/collection1
   [junit4]   2> 947294 INFO  (TEST-TestReqParamsAPI.test-seed#[D5640F95001631D9]) [    ] o.a.s.c.c.SolrZkClient makePath: /collections/collection1/shards
   [junit4]   2> 947294 INFO  (TEST-TestReqParamsAPI.test-seed#[D5640F95001631D9]) [    ] o.a.s.c.c.SolrZkClient makePath: /collections/control_collection
   [junit4]   2> 947295 INFO  (TEST-TestReqParamsAPI.test-seed#[D5640F95001631D9]) [    ] o.a.s.c.c.SolrZkClient makePath: /collections/control_collection/shards
   [junit4]   2> 947295 INFO  (TEST-TestReqParamsAPI.test-seed#[D5640F95001631D9]) [    ] o.a.s.c.AbstractZkTestCase put /home/jenkins/workspace/Lucene-Solr-master-Linux/solr/core/src/test-files/solr/collection1/conf/solrconfig-tlog.xml to /configs/conf1/solrconfig.xml
   [junit4]   2> 947295 INFO  (TEST-TestReqParamsAPI.test-seed#[D5640F95001631D9]) [    ] o.a.s.c.c.SolrZkClient makePath: /configs/conf1/solrconfig.xml
   [junit4]   2> 947296 INFO  (TEST-TestReqParamsAPI.test-seed#[D5640F95001631D9]) [    ] o.a.s.c.AbstractZkTestCase put /home/jenkins/workspace/Lucene-Solr-master-Linux/solr/core/src/test-files/solr/collection1/conf/schema.xml to /configs/conf1/schema.xml
   [junit4]   2> 947296 INFO  (TEST-TestReqParamsAPI.test-seed#[D5640F95001631D9]) [    ] o.a.s.c.c.SolrZkClient makePath: /configs/conf1/schema.xml
   [junit4]   2> 947297 INFO  (TEST-TestReqParamsAPI.test-seed#[D5640F95001631D9]) [    ] o.a.s.c.AbstractZkTestCase put /home/jenkins/workspace/Lucene-Solr-master-Linux/solr/core/src/test-files/solr/collection1/conf/solrconfig.snippet.randomindexconfig.xml to /configs/conf1/solrconfig.snippet.randomindexconfig.xml
   [junit4]   2> 947297 INFO  (TEST-TestReqParamsAPI.test-seed#[D5640F95001631D9]) [    ] o.a.s.c.c.SolrZkClient makePath: /configs/conf1/solrconfig.snippet.randomindexconfig.xml
   [junit4]   2> 947298 INFO  (TEST-TestReqParamsAPI.test-seed#[D5640F95001631D9]) [    ] o.a.s.c.AbstractZkTestCase put /home/jenkins/workspace/Lucene-Solr-master-Linux/solr/core/src/test-files/solr/collection1/conf/stopwords.txt to /configs/conf1/stopwords.txt
   [junit4]   2> 947298 INFO  (TEST-TestReqParamsAPI.test-seed#[D5640F95001631D9]) [    ] o.a.s.c.c.SolrZkClient makePath: /configs/conf1/stopwords.txt
   [junit4]   2> 947299 INFO  (TEST-TestReqParamsAPI.test-seed#[D5640F95001631D9]) [    ] o.a.s.c.AbstractZkTestCase put /home/jenkins/workspace/Lucene-Solr-master-Linux/solr/core/src/test-files/solr/collection1/conf/protwords.txt to /configs/conf1/protwords.txt
   [junit4]   2> 947299 INFO  (TEST-TestReqParamsAPI.test-seed#[D5640F95001631D9]) [    ] o.a.s.c.c.SolrZkClient makePath: /configs/conf1/protwords.txt
   [junit4]   2> 947300 INFO  (TEST-TestReqParamsAPI.test-seed#[D5640F95001631D9]) [    ] o.a.s.c.AbstractZkTestCase put /home/jenkins/workspace/Lucene-Solr-master-Linux/solr/core/src/test-files/solr/collection1/conf/currency.xml to /configs/conf1/currency.xml
   [junit4]   2> 947300 INFO  (TEST-TestReqParamsAPI.test-seed#[D5640F95001631D9]) [    ] o.a.s.c.c.SolrZkClient makePath: /configs/conf1/currency.xml
   [junit4]   2> 947300 INFO  (TEST-TestReqParamsAPI.test-seed#[D5640F95001631D9]) [    ] o.a.s.c.AbstractZkTestCase put /home/jenkins/workspace/Lucene-Solr-master-Linux/solr/core/src/test-files/solr/collection1/conf/enumsConfig.xml to /configs/conf1/enumsConfig.xml
   [junit4]   2> 947301 INFO  (TEST-TestReqParamsAPI.test-seed#[D5640F95001631D9]) [    ] o.a.s.c.c.SolrZkClient makePath: /configs/conf1/enumsConfig.xml
   [junit4]   2> 947301 INFO  (TEST-TestReqParamsAPI.test-seed#[D5640F95001631D9]) [    ] o.a.s.c.AbstractZkTestCase put /home/jenkins/workspace/Lucene-Solr-master-Linux/solr/core/src/test-files/solr/collection1/conf/open-exchange-rates.json to /configs/conf1/open-exchange-rates.json
   [junit4]   2> 947301 INFO  (TEST-TestReqParamsAPI.test-seed#[D5640F95001631D9]) [    ] o.a.s.c.c.SolrZkClient makePath: /configs/conf1/open-exchange-rates.json
   [junit4]   2> 947302 INFO  (TEST-TestReqParamsAPI.test-seed#[D5640F95001631D9]) [    ] o.a.s.c.AbstractZkTestCase put /home/jenkins/workspace/Lucene-Solr-master-Linux/solr/core/src/test-files/solr/collection1/conf/mapping-ISOLatin1Accent.txt to /configs/conf1/mapping-ISOLatin1Accent.txt
   [junit4]   2> 947302 INFO  (TEST-TestReqParamsAPI.test-seed#[D5640F95001631D9]) [    ] o.a.s.c.c.SolrZkClient makePath: /configs/conf1/mapping-ISOLatin1Accent.txt
   [junit4]   2> 947302 INFO  (TEST-TestReqParamsAPI.test-seed#[D5640F95001631D9]) [    ] o.a.s.c.AbstractZkTestCase put /home/jenkins/workspace/Lucene-Solr-master-Linux/solr/core/src/test-files/solr/collection1/conf/old_synonyms.txt to /configs/conf1/old_synonyms.txt
   [junit4]   2> 947303 INFO  (TEST-TestReqParamsAPI.test-seed#[D5640F95001631D9]) [    ] o.a.s.c.c.SolrZkClient makePath: /configs/conf1/old_synonyms.txt
   [junit4]   2> 947303 INFO  (TEST-TestReqParamsAPI.test-seed#[D5640F95001631D9]) [    ] o.a.s.c.AbstractZkTestCase put /home/jenkins/workspace/Lucene-Solr-master-Linux/solr/core/src/test-files/solr/collection1/conf/synonyms.txt to /configs/conf1/synonyms.txt
   [junit4]   2> 947303 INFO  (TEST-TestReqParamsAPI.test-seed#[D5640F95001631D9]) [    ] o.a.s.c.c.SolrZkClient makePath: /configs/conf1/synonyms.txt
   [junit4]   2> 947363 INFO  (TEST-TestReqParamsAPI.test-seed#[D5640F95001631D9]) [    ] o.a.s.SolrTestCaseJ4 Writing core.properties file to /home/jenkins/workspace/Lucene-Solr-master-Linux/solr/build/solr-core/test/J0/temp/solr.handler.TestReqParamsAPI_D5640F95001631D9-001/control-001/cores/collection1
   [junit4]   2> 947364 INFO  (TEST-TestReqParamsAPI.test-seed#[D5640F95001631D9]) [    ] o.e.j.s.Server jetty-9.3.8.v20160314
   [junit4]   2> 947364 INFO  (TEST-TestReqParamsAPI.test-seed#[D5640F95001631D9]) [    ] o.e.j.s.h.ContextHandler Started o.e.j.s.ServletContextHandler@122798c{/q_qu/ii,null,AVAILABLE}
   [junit4]   2> 947366 INFO  (TEST-TestReqParamsAPI.test-seed#[D5640F95001631D9]) [    ] o.e.j.s.ServerConnector Started ServerConnector@1c935ec{HTTP/1.1,[http/1.1]}{127.0.0.1:37428}
   [junit4]   2> 947366 INFO  (TEST-TestReqParamsAPI.test-seed#[D5640F95001631D9]) [    ] o.e.j.s.Server Started @949262ms
   [junit4]   2> 947366 INFO  (TEST-TestReqParamsAPI.test-seed#[D5640F95001631D9]) [    ] o.a.s.c.s.e.JettySolrRunner Jetty properties: {solr.data.dir=/home/jenkins/workspace/Lucene-Solr-master-Linux/solr/build/solr-core/test/J0/temp/solr.handler.TestReqParamsAPI_D5640F95001631D9-001/tempDir-001/control/data, hostContext=/q_qu/ii, hostPort=37428, coreRootDirectory=/home/jenkins/workspace/Lucene-Solr-master-Linux/solr/build/solr-core/test/J0/temp/solr.handler.TestReqParamsAPI_D5640F95001631D9-001/control-001/cores}
   [junit4]   2> 947366 INFO  (TEST-TestReqParamsAPI.test-seed#[D5640F95001631D9]) [    ] o.a.s.s.SolrDispatchFilter SolrDispatchFilter.init(): sun.misc.Launcher$AppClassLoader@1d16e93
   [junit4]   2> 947366 INFO  (TEST-TestReqParamsAPI.test-seed#[D5640F95001631D9]) [    ] o.a.s.c.SolrResourceLoader new SolrResourceLoader for directory: '/home/jenkins/workspace/Lucene-Solr-master-Linux/solr/build/solr-core/test/J0/temp/solr.handler.TestReqParamsAPI_D5640F95001631D9-001/control-001'
   [junit4]   2> 947367 INFO  (TEST-TestReqParamsAPI.test-seed#[D5640F95001631D9]) [    ] o.a.s.c.SolrResourceLoader JNDI not configured for solr (NoInitialContextEx)
   [junit4]   2> 947367 INFO  (TEST-TestReqParamsAPI.test-seed#[D5640F95001631D9]) [    ] o.a.s.c.SolrResourceLoader solr home defaulted to 'solr/' (could not find system property or JNDI)
   [junit4]   2> 947367 INFO  (TEST-TestReqParamsAPI.test-seed#[D5640F95001631D9]) [    ] o.a.s.c.c.SolrZkClient Using default ZkCredentialsProvider
   [junit4]   2> 947367 INFO  (TEST-TestReqParamsAPI.test-seed#[D5640F95001631D9]) [    ] o.a.s.c.c.ConnectionManager Waiting for client to connect to ZooKeeper
   [junit4]   2> 947367 INFO  (zkCallback-1410-thread-1) [    ] o.a.s.c.c.ConnectionManager Watcher org.apache.solr.common.cloud.ConnectionManager@703616 name:ZooKeeperConnection Watcher:127.0.0.1:36069/solr got event WatchedEvent state:SyncConnected type:None path:null path:null type:None
   [junit4]   2> 947368 INFO  (TEST-TestReqParamsAPI.test-seed#[D5640F95001631D9]) [    ] o.a.s.c.c.ConnectionManager Client is connected to ZooKeeper
   [junit4]   2> 947368 INFO  (TEST-TestReqParamsAPI.test-seed#[D5640F95001631D9]) [    ] o.a.s.c.c.SolrZkClient Using default ZkACLProvider
   [junit4]   2> 947368 INFO  (TEST-TestReqParamsAPI.test-seed#[D5640F95001631D9]) [    ] o.a.s.s.SolrDispatchFilter Loading solr.xml from SolrHome (not found in ZooKeeper)
   [junit4]   2> 947368 INFO  (TEST-TestReqParamsAPI.test-seed#[D5640F95001631D9]) [    ] o.a.s.c.SolrXmlConfig Loading container configuration from /home/jenkins/workspace/Lucene-Solr-master-Linux/solr/build/solr-core/test/J0/temp/solr.handler.TestReqParamsAPI_D5640F95001631D9-001/control-001/solr.xml
   [junit4]   2> 947378 INFO  (TEST-TestReqParamsAPI.test-seed#[D5640F95001631D9]) [    ] o.a.s.c.CorePropertiesLocator Config-defined core root directory: /home/jenkins/workspace/Lucene-Solr-master-Linux/solr/build/solr-core/test/J0/temp/solr.handler.TestReqParamsAPI_D5640F95001631D9-001/control-001/cores
   [junit4]   2> 947378 INFO  (TEST-TestReqParamsAPI.test-seed#[D5640F95001631D9]) [    ] o.a.s.c.CoreContainer New CoreContainer 31304105
   [junit4]   2> 947378 INFO  (TEST-TestReqParamsAPI.test-seed#[D5640F95001631D9]) [    ] o.a.s.c.CoreContainer Loading cores into CoreContainer [instanceDir=/home/jenkins/workspace/Lucene-Solr-master-Linux/solr/build/solr-core/test/J0/temp/solr.handler.TestReqParamsAPI_D5640F95001631D9-001/control-001]
   [junit4]   2> 947378 WARN  (TEST-TestReqParamsAPI.test-seed#[D5640F95001631D9]) [    ] o.a.s.c.CoreContainer Couldn't add files from /home/jenkins/workspace/Lucene-Solr-master-Linux/solr/build/solr-core/test/J0/temp/solr.handler.TestReqParamsAPI_D5640F95001631D9-001/control-001/lib to classpath: /home/jenkins/workspace/Lucene-Solr-master-Linux/solr/build/solr-core/test/J0/temp/solr.handler.TestReqParamsAPI_D5640F95001631D9-001/control-001/lib
   [junit4]   2> 947379 INFO  (TEST-TestReqParamsAPI.test-seed#[D5640F95001631D9]) [    ] o.a.s.h.c.HttpShardHandlerFactory created with socketTimeout : 90000,urlScheme : ,connTimeout : 15000,maxConnectionsPerHost : 20,maxConnections : 10000,corePoolSize : 0,maximumPoolSize : 2147483647,maxThreadIdleTime : 5,sizeOfQueue : -1,fairnessPolicy : false,
   [junit4]   2> 947380 INFO  (TEST-TestReqParamsAPI.test-seed#[D5640F95001631D9]) [    ] o.a.s.u.UpdateShardHandler Creating UpdateShardHandler HTTP client with params: 
   [junit4]   2> 947381 INFO  (TEST-TestReqParamsAPI.test-seed#[D5640F95001631D9]) [    ] o.a.s.l.LogWatcher SLF4J impl is org.slf4j.impl.Log4jLoggerFactory
   [junit4]   2> 947381 INFO  (TEST-TestReqParamsAPI.test-seed#[D5640F95001631D9]) [    ] o.a.s.l.LogWatcher Registering Log Listener [Log4j (org.slf4j.impl.Log4jLoggerFactory)]
   [junit4]   2> 947381 INFO  (TEST-TestReqParamsAPI.test-seed#[D5640F95001631D9]) [    ] o.a.s.c.ZkContainer Zookeeper client=127.0.0.1:36069/solr
   [junit4]   2> 947381 INFO  (TEST-TestReqParamsAPI.test-seed#[D5640F95001631D9]) [    ] o.a.s.c.ZkController zkHost includes chroot
   [junit4]   2> 947381 INFO  (TEST-TestReqParamsAPI.test-seed#[D5640F95001631D9]) [    ] o.a.s.c.c.SolrZkClient Using default ZkCredentialsProvider
   [junit4]   2> 947382 INFO  (TEST-TestReqParamsAPI.test-seed#[D5640F95001631D9]) [    ] o.a.s.c.c.ConnectionManager Waiting for client to connect to ZooKeeper
   [junit4]   2> 947383 INFO  (zkCallback-1413-thread-1) [    ] o.a.s.c.c.ConnectionManager Watcher org.apache.solr.common.cloud.ConnectionManager@1cc1da9 name:ZooKeeperConnection Watcher:127.0.0.1:36069 got event WatchedEvent state:SyncConnected type:None path:null path:null type:None
   [junit4]   2> 947383 INFO  (TEST-TestReqParamsAPI.test-seed#[D5640F95001631D9]) [    ] o.a.s.c.c.ConnectionManager Client is connected to ZooKeeper
   [junit4]   2> 947384 INFO  (TEST-TestReqParamsAPI.test-seed#[D5640F95001631D9]) [    ] o.a.s.c.c.SolrZkClient Using default ZkACLProvider
   [junit4]   2> 947384 INFO  (TEST-TestReqParamsAPI.test-seed#[D5640F95001631D9]) [n:127.0.0.1:37428_q_qu%2Fii    ] o.a.s.c.ZkController Added new OnReconnect listener org.apache.solr.cloud.ZkController$$Lambda$67/25158017@1730161
   [junit4]   2> 947390 INFO  (TEST-TestReqParamsAPI.test-seed#[D5640F95001631D9]) [n:127.0.0.1:37428_q_qu%2Fii    ] o.a.s.c.c.ConnectionManager Waiting for client to connect to ZooKeeper
   [junit4]   2> 947390 INFO  (zkCallback-1414-thread-1-processing-n:127.0.0.1:37428_q_qu%2Fii) [n:127.0.0.1:37428_q_qu%2Fii    ] o.a.s.c.c.ConnectionManager Watcher org.apache.solr.common.cloud.ConnectionManager@3dbdb8 name:ZooKeeperConnection Watcher:127.0.0.1:36069/solr got event WatchedEvent state:SyncConnected type:None path:null path:null type:None
   [junit4]   2> 947390 INFO  (TEST-TestReqParamsAPI.test-seed#[D5640F95001631D9]) [n:127.0.0.1:37428_q_qu%2Fii    ] o.a.s.c.c.ConnectionManager Client is connected to ZooKeeper
   [junit4]   2> 947391 INFO  (TEST-TestReqParamsAPI.test-seed#[D5640F95001631D9]) [n:127.0.0.1:37428_q_qu%2Fii    ] o.a.s.c.c.SolrZkClient makePath: /overseer/queue
   [junit4]   2> 947392 INFO  (TEST-TestReqParamsAPI.test-seed#[D5640F95001631D9]) [n:127.0.0.1:37428_q_qu%2Fii    ] o.a.s.c.c.SolrZkClient makePath: /overseer/collection-queue-work
   [junit4]   2> 947392 INFO  (TEST-TestReqParamsAPI.test-seed#[D5640F95001631D9]) [n:127.0.0.1:37428_q_qu%2Fii    ] o.a.s.c.c.SolrZkClient makePath: /overseer/collection-map-running
   [junit4]   2> 947393 INFO  (TEST-TestReqParamsAPI.test-seed#[D5640F95001631D9]) [n:127.0.0.1:37428_q_qu%2Fii    ] o.a.s.c.c.SolrZkClient makePath: /overseer/collection-map-completed
   [junit4]   2> 947394 INFO  (TEST-TestReqParamsAPI.test-seed#[D5640F95001631D9]) [n:127.0.0.1:37428_q_qu%2Fii    ] o.a.s.c.c.SolrZkClient makePath: /overseer/collection-map-failure
   [junit4]   2> 947395 INFO  (TEST-TestReqParamsAPI.test-seed#[D5640F95001631D9]) [n:127.0.0.1:37428_q_qu%2Fii    ] o.a.s.c.c.SolrZkClient makePath: /live_nodes
   [junit4]   2> 947396 INFO  (TEST-TestReqParamsAPI.test-seed#[D5640F95001631D9]) [n:127.0.0.1:37428_q_qu%2Fii    ] o.a.s.c.c.SolrZkClient makePath: /aliases.json
   [junit4]   2> 947396 INFO  (TEST-TestReqParamsAPI.test-seed#[D5640F95001631D9]) [n:127.0.0.1:37428_q_qu%2Fii    ] o.a.s.c.c.SolrZkClient makePath: /clusterstate.json
   [junit4]   2> 947397 INFO  (TEST-TestReqParamsAPI.test-seed#[D5640F95001631D9]) [n:127.0.0.1:37428_q_qu%2Fii    ] o.a.s.c.c.SolrZkClient makePath: /security.json
   [junit4]   2> 947397 INFO  (TEST-TestReqParamsAPI.test-seed#[D5640F95001631D9]) [n:127.0.0.1:37428_q_qu%2Fii    ] o.a.s.c.c.ZkStateReader Updating cluster state from ZooKeeper... 
   [junit4]   2> 947397 INFO  (TEST-TestReqParamsAPI.test-seed#[D5640F95001631D9]) [n:127.0.0.1:37428_q_qu%2Fii    ] o.a.s.c.c.ZkStateReader Loaded empty cluster properties
   [junit4]   2> 947397 INFO  (TEST-TestReqParamsAPI.test-seed#[D5640F95001631D9]) [n:127.0.0.1:37428_q_qu%2Fii    ] o.a.s.c.c.ZkStateReader Updated live nodes from ZooKeeper... (0) -> (0)
   [junit4]   2> 947399 INFO  (TEST-TestReqParamsAPI.test-seed#[D5640F95001631D9]) [n:127.0.0.1:37428_q_qu%2Fii    ] o.a.s.c.c.SolrZkClient makePath: /overseer_elect
   [junit4]   2> 947399 INFO  (TEST-TestReqParamsAPI.test-seed#[D5640F95001631D9]) [n:127.0.0.1:37428_q_qu%2Fii    ] o.a.s.c.c.SolrZkClient makePath: /overseer_elect/election
   [junit4]   2> 947400 INFO  (TEST-TestReqParamsAPI.test-seed#[D5640F95001631D9]) [n:127.0.0.1:37428_q_qu%2Fii    ] o.a.s.c.Overseer Overseer (id=null) closing
   [junit4]   2> 947400 INFO  (TEST-TestReqParamsAPI.test-seed#[D5640F95001631D9]) [n:127.0.0.1:37428_q_qu%2Fii    ] o.a.s.c.LeaderElector Joined leadership election with path: /overseer_elect/election/95993948005072900-127.0.0.1:37428_q_qu%2Fii-n_0000000000
   [junit4]   2> 947400 INFO  (TEST-TestReqParamsAPI.test-seed#[D5640F95001631D9]) [n:127.0.0.1:37428_q_qu%2Fii    ] o.a.s.c.OverseerElectionContext I am going to be the leader 127.0.0.1:37428_q_qu%2Fii
   [junit4]   2> 947400 INFO  (TEST-TestReqParamsAPI.test-seed#[D5640F95001631D9]) [n:127.0.0.1:37428_q_qu%2Fii    ] o.a.s.c.c.SolrZkClient makePath: /overseer_elect/leader
   [junit4]   2> 947401 INFO  (TEST-TestReqParamsAPI.test-seed#[D5640F95001631D9]) [n:127.0.0.1:37428_q_qu%2Fii    ] o.a.s.c.Overseer Overseer (id=95993948005072900-127.0.0.1:37428_q_qu%2Fii-n_0000000000) starting
   [junit4]   2> 947401 INFO  (TEST-TestReqParamsAPI.test-seed#[D5640F95001631D9]) [n:127.0.0.1:37428_q_qu%2Fii    ] o.a.s.c.c.SolrZkClient makePath: /overseer/queue-work
   [junit4]   2> 947403 INFO  (TEST-TestReqParamsAPI.test-seed#[D5640F95001631D9]) [n:127.0.0.1:37428_q_qu%2Fii    ] o.a.s.c.OverseerAutoReplicaFailoverThread Starting OverseerAutoReplicaFailoverThread autoReplicaFailoverWorkLoopDelay=10000 autoReplicaFailoverWaitAfterExpiration=30000 autoReplicaFailoverBadNodeExpiration=60000
   [junit4]   2> 947404 INFO  (OverseerCollectionConfigSetProcessor-95993948005072900-127.0.0.1:37428_q_qu%2Fii-n_0000000000) [n:127.0.0.1:37428_q_qu%2Fii    ] o.a.s.c.OverseerTaskProcessor Process current queue of overseer operations
   [junit4]   2> 947404 INFO  (OverseerStateUpdate-95993948005072900-127.0.0.1:37428_q_qu%2Fii-n_0000000000) [n:127.0.0.1:37428_q_qu%2Fii    ] o.a.s.c.Overseer Starting to work on the main queue
   [junit4]   2> 947404 INFO  (TEST-TestReqParamsAPI.test-seed#[D5640F95001631D9]) [n:127.0.0.1:37428_q_qu%2Fii    ] o.a.s.c.ZkController Register node as live in ZooKeeper:/live_nodes/127.0.0.1:37428_q_qu%2Fii
   [junit4]   2> 947405 INFO  (TEST-TestReqParamsAPI.test-seed#[D5640F95001631D9]) [n:127.0.0.1:37428_q_qu%2Fii    ] o.a.s.c.c.SolrZkClient makePath: /live_nodes/127.0.0.1:37428_q_qu%2Fii
   [junit4]   2> 947405 INFO  (OverseerStateUpdate-95993948005072900-127.0.0.1:37428_q_qu%2Fii-n_0000000000) [n:127.0.0.1:37428_q_qu%2Fii    ] o.a.s.c.c.ZkStateReader Updated live nodes from ZooKeeper... (0) -> (0)
   [junit4]   2> 947405 INFO  (zkCallback-1414-thread-1-processing-n:127.0.0.1:37428_q_qu%2Fii) [n:127.0.0.1:37428_q_qu%2Fii    ] o.a.s.c.c.ZkStateReader A live node change: [WatchedEvent state:SyncConnected type:NodeChildrenChanged path:/live_nodes], has occurred - updating... (live nodes size: [0])
   [junit4]   2> 947405 INFO  (zkCallback-1414-thread-1-processing-n:127.0.0.1:37428_q_qu%2Fii) [n:127.0.0.1:37428_q_qu%2Fii    ] o.a.s.c.c.ZkStateReader Updated live nodes from ZooKeeper... (0) -> (1)
   [junit4]   2> 947444 INFO  (TEST-TestReqParamsAPI.test-seed#[D5640F95001631D9]) [n:127.0.0.1:37428_q_qu%2Fii    ] o.a.s.c.CoreContainer Security conf doesn't exist. Skipping setup for authorization module.
   [junit4]   2> 947444 INFO  (TEST-TestReqParamsAPI.test-seed#[D5640F95001631D9]) [n:127.0.0.1:37428_q_qu%2Fii    ] o.a.s.c.CoreContainer No authentication plugin used.
   [junit4]   2> 947445 INFO  (TEST-TestReqParamsAPI.test-seed#[D5640F95001631D9]) [n:127.0.0.1:37428_q_qu%2Fii    ] o.a.s.c.CorePropertiesLocator Looking for core definitions underneath /home/jenkins/workspace/Lucene-Solr-master-Linux/solr/build/solr-core/test/J0/temp/solr.handler.TestReqParamsAPI_D5640F95001631D9-001/control-001/cores
   [junit4]   2> 947445 INFO  (TEST-TestReqParamsAPI.test-seed#[D5640F95001631D9]) [n:127.0.0.1:37428_q_qu%2Fii    ] o.a.s.c.CoreDescriptor Created CoreDescriptor: {name=collection1, config=solrconfig.xml, transient=false, schema=schema.xml, loadOnStartup=true, configSetProperties=configsetprops.json, collection=control_collection, coreNodeName=, dataDir=data/, shard=}
   [junit4]   2> 947445 INFO  (TEST-TestReqParamsAPI.test-seed#[D5640F95001631D9]) [n:127.0.0.1:37428_q_qu%2Fii    ] o.a.s.c.CorePropertiesLocator Found core collection1 in /home/jenkins/workspace/Lucene-Solr-master-Linux/solr/build/solr-core/test/J0/temp/solr.handler.TestReqParamsAPI_D5640F95001631D9-001/control-001/cores/collection1
   [junit4]   2> 947445 INFO  (TEST-TestReqParamsAPI.test-seed#[D5640F95001631D9]) [n:127.0.0.1:37428_q_qu%2Fii    ] o.a.s.c.CorePropertiesLocator Found 1 core definitions
   [junit4]   2> 947446 INFO  (coreLoadExecutor-3826-thread-1-processing-n:127.0.0.1:37428_q_qu%2Fii) [n:127.0.0.1:37428_q_qu%2Fii c:control_collection   x:collection1] o.a.s.c.ZkController publishing state=down
   [junit4]   2> 947446 INFO  (coreLoadExecutor-3826-thread-1-processing-n:127.0.0.1:37428_q_qu%2Fii) [n:127.0.0.1:37428_q_qu%2Fii c:control_collection   x:collection1] o.a.s.c.ZkController numShards not found on descriptor - reading it from system property
   [junit4]   2> 947446 INFO  (TEST-TestReqParamsAPI.test-seed#[D5640F95001631D9]) [n:127.0.0.1:37428_q_qu%2Fii    ] o.a.s.s.SolrDispatchFilter user.dir=/home/jenkins/workspace/Lucene-Solr-master-Linux/solr/build/solr-core/test/J0
   [junit4]   2> 947446 INFO  (TEST-TestReqParamsAPI.test-seed#[D5640F95001631D9]) [n:127.0.0.1:37428_q_qu%2Fii    ] o.a.s.s.SolrDispatchFilter SolrDispatchFilter.init() done
   [junit4]   2> 947447 INFO  (coreLoadExecutor-3826-thread-1-processing-n:127.0.0.1:37428_q_qu%2Fii) [n:127.0.0.1:37428_q_qu%2Fii c:control_collection   x:collection1] o.a.s.c.ZkController Collection control_collection not visible yet, but flagging it so a watch is registered when it becomes visible
   [junit4]   2> 947447 INFO  (OverseerStateUpdate-95993948005072900-127.0.0.1:37428_q_qu%2Fii-n_0000000000) [n:127.0.0.1:37428_q_qu%2Fii    ] o.a.s.c.Overseer processMessage: queueSize: 1, message = {
   [junit4]   2>   "core":"collection1",
   [junit4]   2>   "roles":null,
   [junit4]   2>   "base_url":"http://127.0.0.1:37428/q_qu/ii",
   [junit4]   2>   "node_name":"127.0.0.1:37428_q_qu%2Fii",
   [junit4]   2>   "numShards":"1",
   [junit4]   2>   "state":"down",
   [junit4]   2>   "shard":null,
   [junit4]   2>   "collection":"control_collection",
   [junit4]   2>   "operation":"state"} current state version: 0
   [junit4]   2> 947447 INFO  (OverseerStateUpdate-95993948005072900-127.0.0.1:37428_q_qu%2Fii-n_0000000000) [n:127.0.0.1:37428_q_qu%2Fii    ] o.a.s.c.o.ReplicaMutator Update state numShards=1 message={
   [junit4]   2>   "core":"collection1",
   [junit4]   2>   "roles":null,
   [junit4]   2>   "base_url":"http://127.0.0.1:37428/q_qu/ii",
   [junit4]   2>   "node_name":"127.0.0.1:37428_q_qu%2Fii",
   [junit4]   2>   "numShards":"1",
   [junit4]   2>   "state":"down",
   [junit4]   2>   "shard":null,
   [junit4]   2>   "collection":"control_collection",
   [junit4]   2>   "operation":"state"}
   [junit4]   2> 947447 INFO  (coreLoadExecutor-3826-thread-1-processing-n:127.0.0.1:37428_q_qu%2Fii) [n:127.0.0.1:37428_q_qu%2Fii c:control_collection   x:collection1] o.a.s.c.c.ZkStateReader Deleting data for [control_collection]
   [junit4]   2> 947447 INFO  (OverseerStateUpdate-95993948005072900-127.0.0.1:37428_q_qu%2Fii-n_0000000000) [n:127.0.0.1:37428_q_qu%2Fii    ] o.a.s.c.o.ClusterStateMutator building a new cName: control_collection
   [junit4]   2> 947447 INFO  (OverseerStateUpdate-95993948005072900-127.0.0.1:37428_q_qu%2Fii-n_0000000000) [n:127.0.0.1:37428_q_qu%2Fii    ] o.a.s.c.o.ReplicaMutator Assigning new node to shard shard=shard1
   [junit4]   2> 947447 INFO  (coreLoadExecutor-3826-thread-1-processing-n:127.0.0.1:37428_q_qu%2Fii) [n:127.0.0.1:37428_q_qu%2Fii c:control_collection   x:collection1] o.a.s.c.ZkController look for our core node name
   [junit4]   2> 947448 INFO  (zkCallback-1414-thread-1-processing-n:127.0.0.1:37428_q_qu%2Fii) [n:127.0.0.1:37428_q_qu%2Fii    ] o.a.s.c.c.ZkStateReader A cluster state change: [WatchedEvent state:SyncConnected type:NodeDataChanged path:/clusterstate.json], has occurred - updating... (live nodes size: [1])
   [junit4]   2> 948448 INFO  (coreLoadExecutor-3826-thread-1-processing-n:127.0.0.1:37428_q_qu%2Fii) [n:127.0.0.1:37428_q_qu%2Fii c:control_collection   x:collection1] o.a.s.c.ZkController waiting to find shard id in clusterstate for collection1
   [junit4]   2> 948448 INFO  (coreLoadExecutor-3826-thread-1-processing-n:127.0.0.1:37428_q_qu%2Fii) [n:127.0.0.1:37428_q_qu%2Fii c:control_collection   x:collection1] o.a.s.c.ZkController Check for collection zkNode:control_collection
   [junit4]   2> 948448 INFO  (coreLoadExecutor-3826-thread-1-processing-n:127.0.0.1:37428_q_qu%2Fii) [n:127.0.0.1:37428_q_qu%2Fii c:control_collection   x:collection1] o.a.s.c.ZkController Collection zkNode exists
   [junit4]   2> 948448 INFO  (coreLoadExecutor-3826-thread-1-processing-n:127.0.0.1:37428_q_qu%2Fii) [n:127.0.0.1:37428_q_qu%2Fii c:control_collection   x:collection1] o.a.s.c.c.ZkStateReader Load collection config from: [/collections/control_collection]
   [junit4]   2> 948448 INFO  (coreLoadExecutor-3826-thread-1-processing-n:127.0.0.1:37428_q_qu%2Fii) [n:127.0.0.1:37428_q_qu%2Fii c:control_collection   x:collection1] o.a.s.c.c.ZkStateReader path=[/collections/control_collection] [configName]=[conf1] specified config exists in ZooKeeper
   [junit4]   2> 948448 INFO  (coreLoadExecutor-3826-thread-1-processing-n:127.0.0.1:37428_q_qu%2Fii) [n:127.0.0.1:37428_q_qu%2Fii c:control_collection   x:collection1] o.a.s.c.SolrResourceLoader new SolrResourceLoader for directory: '/home/jenkins/workspace/Lucene-Solr-master-Linux/solr/build/solr-core/test/J0/temp/solr.handler.TestReqParamsAPI_D5640F95001631D9-001/control-001/cores/collection1'
   [junit4]   2> 948448 INFO  (coreLoadExecutor-3826-thread-1-processing-n:127.0.0.1:37428_q_qu%2Fii) [n:127.0.0.1:37428_q_qu%2Fii c:control_collection   x:collection1] o.a.s.c.SolrResourceLoader JNDI not configured for solr (NoInitialContextEx)
   [junit4]   2> 948448 INFO  (coreLoadExecutor-3826-thread-1-processing-n:127.0.0.1:37428_q_qu%2Fii) [n:127.0.0.1:37428_q_qu%2Fii c:control_collection   x:collection1] o.a.s.c.SolrResourceLoader solr home defaulted to 'solr/' (could not find system property or JNDI)
   [junit4]   2> 948449 INFO  (coreLoadExecutor-3826-thread-1-processing-n:127.0.0.1:37428_q_qu%2Fii) [n:127.0.0.1:37428_q_qu%2Fii c:control_collection   x:collection1] o.a.s.c.Config loaded config solrconfig.xml with version 0 
   [junit4]   2> 948453 INFO  (coreLoadExecutor-3826-thread-1-processing-n:127.0.0.1:37428_q_qu%2Fii) [n:127.0.0.1:37428_q_qu%2Fii c:control_collection   x:collection1] o.a.s.c.SolrConfig current version of requestparams : -1
   [junit4]   2> 948455 WARN  (coreLoadExecutor-3826-thread-1-processing-n:127.0.0.1:37428_q_qu%2Fii) [n:127.0.0.1:37428_q_qu%2Fii c:control_collection   x:collection1] o.a.s.c.Config Beginning with Solr 5.5, <mergePolicy> is deprecated, use <mergePolicyFactory> instead.
   [junit4]   2> 948464 INFO  (coreLoadExecutor-3826-thread-1-processing-n:127.0.0.1:37428_q_qu%2Fii) [n:127.0.0.1:37428_q_qu%2Fii c:control_collection   x:collection1] o.a.s.c.SolrConfig Using Lucene MatchVersion: 7.0.0
   [junit4]   2> 948474 INFO  (coreLoadExecutor-3826-thread-1-processing-n:127.0.0.1:37428_q_qu%2Fii) [n:127.0.0.1:37428_q_qu%2Fii c:control_collection   x:collection1] o.a.s.c.SolrConfig Loaded SolrConfig: solrconfig.xml
   [junit4]   2> 948479 INFO  (coreLoadExecutor-3826-thread-1-processing-n:127.0.0.1:37428_q_qu%2Fii) [n:127.0.0.1:37428_q_qu%2Fii c:control_collection   x:collection1] o.a.s.s.IndexSchema [collection1] Schema name=test
   [junit4]   2> 948617 INFO  (coreLoadExecutor-3826-thread-1-processing-n:127.0.0.1:37428_q_qu%2Fii) [n:127.0.0.1:37428_q_qu%2Fii c:control_collection   x:collection1] o.a.s.s.OpenExchangeRatesOrgProvider Initialized with rates=open-exchange-rates.json, refreshInterval=1440.
   [junit4]   2> 948624 INFO  (coreLoadExecutor-3826-thread-1-processing-n:127.0.0.1:37428_q_qu%2Fii) [n:127.0.0.1:37428_q_qu%2Fii c:control_collection   x:collection1] o.a.s.s.IndexSchema default search field in schema is text
   [junit4]   2> 948625 INFO  (coreLoadExecutor-3826-thread-1-processing-n:127.0.0.1:37428_q_qu%2Fii) [n:127.0.0.1:37428_q_qu%2Fii c:control_collection   x:collection1] o.a.s.s.IndexSchema unique key field: id
   [junit4]   2> 948630 INFO  (coreLoadExecutor-3826-thread-1-processing-n:127.0.0.1:37428_q_qu%2Fii) [n:127.0.0.1:37428_q_qu%2Fii c:control_collection   x:collection1] o.a.s.s.FileExchangeRateProvider Reloading exchange rates from file currency.xml
   [junit4]   2> 948632 INFO  (coreLoadExecutor-3826-thread-1-processing-n:127.0.0.1:37428_q_qu%2Fii) [n:127.0.0.1:37428_q_qu%2Fii c:control_collection   x:collection1] o.a.s.s.FileExchangeRateProvider Reloading exchange rates from file currency.xml
   [junit4]   2> 948633 INFO  (coreLoadExecutor-3826-thread-1-processing-n:127.0.0.1:37428_q_qu%2Fii) [n:127.0.0.1:37428_q_qu%2Fii c:control_collection   x:collection1] o.a.s.s.OpenExchangeRatesOrgProvider Reloading exchange rates from open-exchange-rates.json
   [junit4]   2> 948634 INFO  (coreLoadExecutor-3826-thread-1-processing-n:127.0.0.1:37428_q_qu%2Fii) [n:127.0.0.1:37428_q_qu%2Fii c:control_collection   x:collection1] o.a.s.s.OpenExchangeRatesOrgProvider Reloading exchange rates from open-exchange-rates.json
   [junit4]   2> 948635 INFO  (coreLoadExecutor-3826-thread-1-processing-n:127.0.0.1:37428_q_qu%2Fii) [n:127.0.0.1:37428_q_qu%2Fii c:control_collection   x:collection1] o.a.s.c.ConfigSetProperties Did not find ConfigSet properties, assuming default properties: Can't find resource 'configsetprops.json' in classpath or '/configs/conf1', cwd=/home/jenkins/workspace/Lucene-Solr-master-Linux/solr/build/solr-core/test/J0
   [junit4]   2> 948635 INFO  (coreLoadExecutor-3826-thread-1-processing-n:127.0.0.1:37428_q_qu%2Fii) [n:127.0.0.1:37428_q_qu%2Fii c:control_collection   x:collection1] o.a.s.c.CoreContainer Creating SolrCore 'collection1' using configuration from collection control_collection
   [junit4]   2> 948635 INFO  (coreLoadExecutor-3826-thread-1-processing-n:127.0.0.1:37428_q_qu%2Fii) [n:127.0.0.1:37428_q_qu%2Fii c:control_collection s:shard1 r:core_node1 x:collection1] o.a.s.c.SolrCore org.apache.solr.core.MockDirectoryFactory
   [junit4]   2> 948635 INFO  (coreLoadExecutor-3826-thread-1-processing-n:127.0.0.1:37428_q_qu%2Fii) [n:127.0.0.1:37428_q_qu%2Fii c:control_collection s:shard1 r:core_node1 x:collection1] o.a.s.c.SolrCore [[collection1] ] Opening new SolrCore at [/home/jenkins/workspace/Lucene-Solr-master-Linux/solr/build/solr-core/test/J0/temp/solr.handler.TestReqParamsAPI_D5640F95001631D9-001/control-001/cores/collection1], dataDir=[/home/jenkins/workspace/Lucene-Solr-master-Linux/solr/build/solr-core/test/J0/temp/solr.handler.TestReqParamsAPI_D5640F95001631D9-001/control-001/cores/collection1/data/]
   [junit4]   2> 948635 INFO  (coreLoadExecutor-3826-thread-1-processing-n:127.0.0.1:37428_q_qu%2Fii) [n:127.0.0.1:37428_q_qu%2Fii c:control_collection s:shard1 r:core_node1 x:collection1] o.a.s.c.JmxMonitoredMap JMX monitoring is enabled. Adding Solr mbeans to JMX Server: com.sun.jmx.mbeanserver.JmxMBeanServer@305b99
   [junit4]   2> 948636 INFO  (coreLoadExecutor-3826-thread-1-processing-n:127.0.0.1:37428_q_qu%2Fii) [n:127.0.0.1:37428_q_qu%2Fii c:control_collection s:shard1 r:core_node1 x:collection1] o.a.s.c.CachingDirectoryFactory return new directory for /home/jenkins/workspace/Lucene-Solr-master-Linux/solr/build/solr-core/test/J0/temp/solr.handler.TestReqParamsAPI_D5640F95001631D9-001/control-001/cores/collection1/data
   [junit4]   2> 948636 INFO  (coreLoadExecutor-3826-thread-1-processing-n:127.0.0.1:37428_q_qu%2Fii) [n:127.0.0.1:37428_q_qu%2Fii c:control_collection s:shard1 r:core_node1 x:collection1] o.a.s.c.SolrCore New index directory detected: old=null new=/home/jenkins/workspace/Lucene-Solr-master-Linux/solr/build/solr-core/test/J0/temp/solr.handler.TestReqParamsAPI_D5640F95001631D9-001/control-001/cores/collection1/data/index/
   [junit4]   2> 948636 WARN  (coreLoadExecutor-3826-thread-1-processing-n:127.0.0.1:37428_q_qu%2Fii) [n:127.0.0.1:37428_q_qu%2Fii c:control_collection s:shard1 r:core_node1 x:collection1] o.a.s.c.SolrCore [collection1] Solr index directory '/home/jenkins/workspace/Lucene-Solr-master-Linux/solr/build/solr-core/test/J0/temp/solr.handler.TestReqParamsAPI_D5640F95001631D9-001/control-001/cores/collection1/data/index' doesn't exist. Creating new index...
   [junit4]   2> 948636 INFO  (coreLoadExecutor-3826-thread-1-processing-n:127.0.0.1:37428_q_qu%2Fii) [n:127.0.0.1:37428_q_qu%2Fii c:control_collection s:shard1 r:core_node1 x:collection1] o.a.s.c.CachingDirectoryFactory return new directory for /home/jenkins/workspace/Lucene-Solr-master-Linux/solr/build/solr-core/test/J0/temp/solr.handler.TestReqParamsAPI_D5640F95001631D9-001/control-001/cores/collection1/data/index
   [junit4]   2> 948636 INFO  (coreLoadExecutor-3826-thread-1-processing-n:127.0.0.1:37428_q_qu%2Fii) [n:127.0.0.1:37428_q_qu%2Fii c:control_collection s:shard1 r:core_node1 x:collection1] o.a.s.u.RandomMergePolicy RandomMergePolicy wrapping class org.apache.lucene.index.LogDocMergePolicy: [LogDocMergePolicy: minMergeSize=1000, mergeFactor=14, maxMergeSize=9223372036854775807, maxMergeSizeForForcedMerge=9223372036854775807, calibrateSizeByDeletes=false, maxMergeDocs=2147483647, maxCFSSegmentSizeMB=8.796093022207999E12, noCFSRatio=0.10679302545155851]
   [junit4]   2> 948637 INFO  (coreLoadExecutor-3826-thread-1-processing-n:127.0.0.1:37428_q_qu%2Fii) [n:127.0.0.1:37428_q_qu%2Fii c:control_collection s:shard1 r:core_node1 x:collection1] o.a.s.c.SolrDeletionPolicy SolrDeletionPolicy.onCommit: commits: num=1
   [junit4]   2> 	commit{dir=MockDirectoryWrapper(RAMDirectory@a29c65 lockFactory=org.apache.lucene.store.SingleInstanceLockFactory@1f13701),segFN=segments_1,generation=1}
   [junit4]   2> 948637 INFO  (coreLoadExecutor-3826-thread-1-processing-n:127.0.0.1:37428_q_qu%2Fii) [n:127.0.0.1:37428_q_qu%2Fii c:control_collection s:shard1 r:core_node1 x:collection1] o.a.s.c.SolrDeletionPolicy newest commit generation = 1
   [junit4]   2> 948637 INFO  (OldIndexDirectoryCleanupThreadForCore-collection1) [n:127.0.0.1:37428_q_qu%2Fii c:control_collection s:shard1 r:core_node1 x:collection1] o.a.s.c.SolrCore Looking for old index directories to cleanup for core collection1 in /home/jenkins/workspace/Lucene-Solr-master-Linux/solr/build/solr-core/test/J0/temp/solr.handler.TestReqParamsAPI_D5640F95001631D9-001/control-001/cores/collection1/data/
   [junit4]   2> 948637 WARN  (OldIndexDirectoryCleanupThreadForCore-collection1) [n:127.0.0.1:37428_q_qu%2Fii c:control_collection s:shard1 r:core_node1 x:collection1] o.a.s.c.DirectoryFactory /home/jenkins/workspace/Lucene-Solr-master-Linux/solr/build/solr-core/test/J0/temp/solr.handler.TestReqParamsAPI_D5640F95001631D9-001/control-001/cores/collection1/data/ does not point to a valid data directory; skipping clean-up of old index directories.
   [junit4]   2> 948640 INFO  (coreLoadExecutor-3826-thread-1-processing-n:127.0.0.1:37428_q_qu%2Fii) [n:127.0.0.1:37428_q_qu%2Fii c:control_collection s:shard1 r:core_node1 x:collection1] o.a.s.u.p.UpdateRequestProcessorChain creating updateRequestProcessorChain "nodistrib"
   [junit4]   2> 948640 INFO  (coreLoadExecutor-3826-thread-1-processing-n:127.0.0.1:37428_q_qu%2Fii) [n:127.0.0.1:37428_q_qu%2Fii c:control_collection s:shard1 r:core_node1 x:collection1] o.a.s.u.p.UpdateRequestProcessorChain creating updateRequestProcessorChain "dedupe"
   [junit4]   2> 948640 INFO  (coreLoadExecutor-3826-thread-1-processing-n:127.0.0.1:37428_q_qu%2Fii) [n:127.0.0.1:37428_q_qu%2Fii c:control_collection s:shard1 r:core_node1 x:collection1] o.a.s.u.p.UpdateRequestProcessorChain inserting DistributedUpdateProcessorFactory into updateRequestProcessorChain "dedupe"
   [junit4]   2> 948640 INFO  (coreLoadExecutor-3826-thread-1-processing-n:127.0.0.1:37428_q_qu%2Fii) [n:127.0.0.1:37428_q_qu%2Fii c:control_collection s:shard1 r:core_node1 x:collection1] o.a.s.u.p.UpdateRequestProcessorChain creating updateRequestProcessorChain "stored_sig"
   [junit4]   2> 948640 INFO  (coreLoadExecutor-3826-thread-1-processing-n:127.0.0.1:37428_q_qu%2Fii) [n:127.0.0.1:37428_q_qu%2Fii c:control_collection s:shard1 r:core_node1 x:collection1] o.a.s.u.p.UpdateRequestProcessorChain inserting DistributedUpdateProcessorFactory into updateRequestProcessorChain "stored_sig"
   [junit4]   2> 948640 INFO  (coreLoadExecutor-3826-thread-1-processing-n:127.0.0.1:37428_q_qu%2Fii) [n:127.0.0.1:37428_q_qu%2Fii c:control_collection s:shard1 r:core_node1 x:collection1] o.a.s.u.p.UpdateRequestProcessorChain creating updateRequestProcessorChain "distrib-dup-test-chain-explicit"
   [junit4]   2> 948640 INFO  (coreLoadExecutor-3826-thread-1-processing-n:127.0.0.1:37428_q_qu%2Fii) [n:127.0.0.1:37428_q_qu%2Fii c:control_collection s:shard1 r:core_node1 x:collection1] o.a.s.u.p.UpdateRequestProcessorChain creating updateRequestProcessorChain "distrib-dup-test-chain-implicit"
   [junit4]   2> 948640 INFO  (coreLoadExecutor-3826-thread-1-processing-n:127.0.0.1:37428_q_qu%2Fii) [n:127.0.0.1:37428_q_qu%2Fii c:control_collection s:shard1 r:core_node1 x:collection1] o.a.s.u.p.UpdateRequestProcessorChain inserting DistributedUpdateProcessorFactory into updateRequestProcessorChain "distrib-dup-test-chain-implicit"
   [junit4]   2> 948640 INFO  (coreLoadExecutor-3826-thread-1-processing-n:127.0.0.1:37428_q_qu%2Fii) [n:127.0.0.1:37428_q_qu%2Fii c:control_collection s:shard1 r:core_node1 x:collection1] o.a.s.c.SolrCore no updateRequestProcessorChain defined as default, creating implicit default
   [junit4]   2> 948641 WARN  (coreLoadExecutor-3826-thread-1-processing-n:127.0.0.1:37428_q_qu%2Fii) [n:127.0.0.1:37428_q_qu%2Fii c:control_collection s:shard1 r:core_node1 x:collection1] o.a.s.c.RequestHandlers INVALID paramSet a in requestHandler {type = requestHandler,name = /dump,class = DumpRequestHandler,args = {defaults={a=A,b=B}}}
   [junit4]   2> 948643 INFO  (coreLoadExecutor-3826-thread-1-processing-n:127.0.0.1:37428_q_qu%2Fii) [n:127.0.0.1:37428_q_qu%2Fii c:control_collection s:shard1 r:core_node1 x:collection1] o.a.s.h.l.XMLLoader xsltCacheLifetimeSeconds=60
   [junit4]   2> 948643 INFO  (coreLoadExecutor-3826-thread-1-processing-n:127.0.0.1:37428_q_qu%2Fii) [n:127.0.0.1:37428_q_qu%2Fii c:control_collection s:shard1 r:core_node1 x:collection1] o.a.s.h.l.XMLLoader xsltCacheLifetimeSeconds=60
   [junit4]   2> 948644 INFO  (coreLoadExecutor-3826-thread-1-processing-n:127.0.0.1:37428_q_qu%2Fii) [n:127.0.0.1:37428_q_qu%2Fii c:control_collection s:shard1 r:core_node1 x:collection1] o.a.s.h.l.XMLLoader xsltCacheLifetimeSeconds=60
   [junit4]   2> 948645 INFO  (coreLoadExecutor-3826-thread-1-processing-n:127.0.0.1:37428_q_qu%2Fii) [n:127.0.0.1:37428_q_qu%2Fii c:control_collection s:shard1 r:core_node1 x:collection1] o.a.s.h.l.XMLLoader xsltCacheLifetimeSeconds=60
   [junit4]   2> 948651 INFO  (coreLoadExecutor-3826-thread-1-processing-n:127.0.0.1:37428_q_qu%2Fii) [n:127.0.0.1:37428_q_qu%2Fii c:control_collection s:shard1 r:core_node1 x:collection1] o.a.s.c.RequestHandlers Registered paths: /admin/mbeans,standard,/update/json/docs,/admin/luke,/export,/get,/admin/properties,/update/json,/admin/threads,/dump,/update/csv,/sql,/graph,/admin/segments,/admin/system,/replication,/config,/stream,/schema,/admin/plugins,/admin/logging,/admin/ping,/update,/admin/file
   [junit4]   2> 948651 INFO  (coreLoadExecutor-3826-thread-1-processing-n:127.0.0.1:37428_q_qu%2Fii) [n:127.0.0.1:37428_q_qu%2Fii c:control_collection s:shard1 r:core_node1 x:collection1] o.a.s.c.SolrCore Using default statsCache cache: org.apache.solr.search.stats.LocalStatsCache
   [junit4]   2> 948651 INFO  (coreLoadExecutor-3826-thread-1-processing-n:127.0.0.1:37428_q_qu%2Fii) [n:127.0.0.1:37428_q_qu%2Fii c:control_collection s:shard1 r:core_node1 x:collection1] o.a.s.u.UpdateHandler Using UpdateLog implementation: org.apache.solr.update.UpdateLog
   [junit4]   2> 948651 INFO  (coreLoadExecutor-3826-thread-1-processing-n:127.0.0.1:37428_q_qu%2Fii) [n:127.0.0.1:37428_q_qu%2Fii c:control_collection s:shard1 r:core_node1 x:collection1] o.a.s.u.UpdateLog Initializing UpdateLog: dataDir= defaultSyncLevel=FLUSH numRecordsToKeep=100 maxNumLogsToKeep=10 numVersionBuckets=65536
   [junit4]   2> 948652 INFO  (coreLoadExecutor-3826-thread-1-processing-n:127.0.0.1:37428_q_qu%2Fii) [n:127.0.0.1:37428_q_qu%2Fii c:control_collection s:shard1 r:core_node1 x:collection1] o.a.s.u.CommitTracker Hard AutoCommit: disabled
   [junit4]   2> 948652 INFO  (coreLoadExecutor-3826-thread-1-processing-n:127.0.0.1:37428_q_qu%2Fii) [n:127.0.0.1:37428_q_qu%2Fii c:control_collection s:shard1 r:core_node1 x:collection1] o.a.s.u.CommitTracker Soft AutoCommit: disabled
   [junit4]   2> 948652 INFO  (coreLoadExecutor-3826-thread-1-processing-n:127.0.0.1:37428_q_qu%2Fii) [n:127.0.0.1:37428_q_qu%2Fii c:control_collection s:shard1 r:core_node1 x:collection1] o.a.s.u.RandomMergePolicy RandomMergePolicy wrapping class org.apache.lucene.index.LogDocMergePolicy: [LogDocMergePolicy: minMergeSize=1000, mergeFactor=31, maxMergeSize=9223372036854775807, maxMergeSizeForForcedMerge=9223372036854775807, calibrateSizeByDeletes=false, maxMergeDocs=2147483647, maxCFSSegmentSizeMB=8.796093022207999E12, noCFSRatio=1.0]
   [junit4]   2> 948652 INFO  (coreLoadExecutor-3826-thread-1-processing-n:127.0.0.1:37428_q_qu%2Fii) [n:127.0.0.1:37428_q_qu%2Fii c:control_collection s:shard1 r:core_node1 x:collection1] o.a.s.c.SolrDeletionPolicy SolrDeletionPolicy.onInit: commits: num=1
   [junit4]   2> 	commit{dir=MockDirectoryWrapper(RAMDirectory@a29c65 lockFactory=org.apache.lucene.store.SingleInstanceLockFactory@1f13701),segFN=segments_1,generation=1}
   [junit4]   2> 948652 INFO  (coreLoadExecutor-3826-thread-1-processing-n:127.0.0.1:37428_q_qu%2Fii) [n:127.0.0.1:37428_q_qu%2Fii c:control_collection s:shard1 r:core_node1 x:collection1] o.a.s.c.SolrDeletionPolicy newest commit generation = 1
   [junit4]   2> 948653 INFO  (coreLoadExecutor-3826-thread-1-processing-n:127.0.0.1:37428_q_qu%2Fii) [n:127.0.0.1:37428_q_qu%2Fii c:control_collection s:shard1 r:core_node1 x:collection1] o.a.s.s.SolrIndexSearcher Opening [Searcher@c65ad0[collection1] main]
   [junit4]   2> 948653 INFO  (coreLoadExecutor-3826-thread-1-processing-n:127.0.0.1:37428_q_qu%2Fii) [n:127.0.0.1:37428_q_qu%2Fii c:control_collection s:shard1 r:core_node1 x:collection1] o.a.s.c.c.ZkStateReader Load collection config from: [/collections/control_collection]
   [junit4]   2> 948653 INFO  (coreLoadExecutor-3826-thread-1-processing-n:127.0.0.1:37428_q_qu%2Fii) [n:127.0.0.1:37428_q_qu%2Fii c:control_collection s:shard1 r:core_node1 x:collection1] o.a.s.c.c.ZkStateReader path=[/collections/control_collection] [configName]=[conf1] specified config exists in ZooKeeper
   [junit4]   2> 948653 INFO  (coreLoadExecutor-3826-thread-1-processing-n:127.0.0.1:37428_q_qu%2Fii) [n:127.0.0.1:37428_q_qu%2Fii c:control_collection s:shard1 r:core_node1 x:collection1] o.a.s.r.ManagedResourceStorage Setting up ZooKeeper-based storage for the RestManager with znodeBase: /configs/conf1
   [junit4]   2> 948653 INFO  (coreLoadExecutor-3826-thread-1-processing-n:127.0.0.1:37428_q_qu%2Fii) [n:127.0.0.1:37428_q_qu%2Fii c:control_collection s:shard1 r:core_node1 x:collection1] o.a.s.r.ManagedResourceStorage Configured ZooKeeperStorageIO with znodeBase: /configs/conf1
   [junit4]   2> 948653 INFO  (coreLoadExecutor-3826-thread-1-processing-n:127.0.0.1:37428_q_qu%2Fii) [n:127.0.0.1:37428_q_qu%2Fii c:control_collection s:shard1 r:core_node1 x:collection1] o.a.s.r.RestManager Initializing RestManager with initArgs: {}
   [junit4]   2> 948653 INFO  (coreLoadExecutor-3826-thread-1-processing-n:127.0.0.1:37428_q_qu%2Fii) [n:127.0.0.1:37428_q_qu%2Fii c:control_collection s:shard1 r:core_node1 x:collection1] o.a.s.r.ManagedResourceStorage Reading _rest_managed.json using ZooKeeperStorageIO:path=/configs/conf1
   [junit4]   2> 948654 INFO  (coreLoadExecutor-3826-thread-1-processing-n:127.0.0.1:37428_q_qu%2Fii) [n:127.0.0.1:37428_q_qu%2Fii c:control_collection s:shard1 r:core_node1 x:collection1] o.a.s.r.ManagedResourceStorage No data found for znode /configs/conf1/_rest_managed.json
   [junit4]   2> 948654 INFO  (coreLoadExecutor-3826-thread-1-processing-n:127.0.0.1:37428_q_qu%2Fii) [n:127.0.0.1:37428_q_qu%2Fii c:control_collection s:shard1 r:core_node1 x:collection1] o.a.s.r.ManagedResourceStorage Loaded null at path _rest_managed.json using ZooKeeperStorageIO:path=/configs/conf1
   [junit4]   2> 948654 INFO  (coreLoadExecutor-3826-thread-1-processing-n:127.0.0.1:37428_q_qu%2Fii) [n:127.0.0.1:37428_q_qu%2Fii c:control_collection s:shard1 r:core_node1 x:collection1] o.a.s.r.RestManager Initializing 0 registered ManagedResources
   [junit4]   2> 948654 INFO  (coreLoadExecutor-3826-thread-1-processing-n:127.0.0.1:37428_q_qu%2Fii) [n:127.0.0.1:37428_q_qu%2Fii c:control_collection s:shard1 r:core_node1 x:collection1] o.a.s.h.ReplicationHandler Commits will be reserved for  10000
   [junit4]   2> 948655 INFO  (searcherExecutor-3827-thread-1-processing-n:127.0.0.1:37428_q_qu%2Fii x:collection1 s:shard1 c:control_collection r:core_node1) [n:127.0.0.1:37428_q_qu%2Fii c:control_collection s:shard1 r:core_node1 x:collection1] o.a.s.c.SolrCore [collection1] Registered new searcher Searcher@c65ad0[collection1] main{ExitableDirectoryReader(UninvertingDirectoryReader())}
   [junit4]   2> 948655 INFO  (coreLoadExecutor-3826-thread-1-processing-n:127.0.0.1:37428_q_qu%2Fii) [n:127.0.0.1:37428_q_qu%2Fii c:control_collection s:shard1 r:core_node1 x:collection1] o.a.s.u.UpdateLog Looking up max value of version field to seed version buckets
   [junit4]   2> 948655 INFO  (coreLoadExecutor-3826-thread-1-processing-n:127.0.0.1:37428_q_qu%2Fii) [n:127.0.0.1:37428_q_qu%2Fii c:control_collection s:shard1 r:core_node1 x:collection1] o.a.s.u.VersionInfo Refreshing highest value of _version_ for 65536 version buckets from index
   [junit4]   2> 948655 INFO  (coreLoadExecutor-3826-thread-1-processing-n:127.0.0.1:37428_q_qu%2Fii) [n:127.0.0.1:37428_q_qu%2Fii c:control_collection s:shard1 r:core_node1 x:collection1] o.a.s.u.VersionInfo No terms found for _version_, cannot seed version bucket highest value from index
   [junit4]   2> 948655 INFO  (coreLoadExecutor-3826-thread-1-processing-n:127.0.0.1:37428_q_qu%2Fii) [n:127.0.0.1:37428_q_qu%2Fii c:control_collection s:shard1 r:core_node1 x:collection1] o.a.s.u.UpdateLog Could not find max version in index or recent updates, using new clock 1535903169618378752
   [junit4]   2> 948657 INFO  (coreLoadExecutor-3826-thread-1-processing-n:127.0.0.1:37428_q_qu%2Fii) [n:127.0.0.1:37428_q_qu%2Fii c:control_collection s:shard1 r:core_node1 x:collection1] o.a.s.u.UpdateLog Took 1.0ms to seed version buckets with highest version 1535903169618378752
   [junit4]   2> 948657 INFO  (coreLoadExecutor-3826-thread-1-processing-n:127.0.0.1:37428_q_qu%2Fii) [n:127.0.0.1:37428_q_qu%2Fii c:control_collection s:shard1 r:core_node1 x:collection1] o.a.s.c.ZkController watch zkdir /configs/conf1
   [junit4]   2> 948657 INFO  (coreLoadExecutor-3826-thread-1-processing-n:127.0.0.1:37428_q_qu%2Fii) [n:127.0.0.1:37428_q_qu%2Fii c:control_collection s:shard1 r:core_node1 x:collection1] o.a.s.c.CoreContainer registering core: collection1
   [junit4]   2> 948658 INFO  (coreZkRegister-3820-thread-1-processing-n:127.0.0.1:37428_q_qu%2Fii x:collection1 s:shard1 c:control_collection r:core_node1) [n:127.0.0.1:37428_q_qu%2Fii c:control_collection s:shard1 r:core_node1 x:collection1] o.a.s.c.ZkController Register replica - core:collection1 address:http://127.0.0.1:37428/q_qu/ii collection:control_collection shard:shard1
   [junit4]   2> 948658 INFO  (coreZkRegister-3820-thread-1-processing-n:127.0.0.1:37428_q_qu%2Fii x:collection1 s:shard1 c:control_collection r:core_node1) [n:127.0.0.1:37428_q_qu%2Fii c:control_collection s:shard1 r:core_node1 x:collection1] o.a.s.c.c.SolrZkClient makePath: /collections/control_collection/leader_elect/shard1/election
   [junit4]   2> 948659 INFO  (coreZkRegister-3820-thread-1-processing-n:127.0.0.1:37428_q_qu%2Fii x:collection1 s:shard1 c:control_collection r:core_node1) [n:127.0.0.1:37428_q_qu%2Fii c:control_collection s:shard1 r:core_node1 x:collection1] o.a.s.c.LeaderElector Joined leadership election with path: /collections/control_collection/leader_elect/shard1/election/95993948005072900-core_node1-n_0000000000
   [junit4]   2> 948659 INFO  (coreZkRegister-3820-thread-1-processing-n:127.0.0.1:37428_q_qu%2Fii x:collection1 s:shard1 c:control_collection r:core_node1) [n:127.0.0.1:37428_q_qu%2Fii c:control_collection s:shard1 r:core_node1 x:collection1] o.a.s.c.ShardLeaderElectionContext Running the leader process for shard=shard1 and weAreReplacement=false and leaderVoteWait=10000
   [junit4]   2> 948660 INFO  (coreZkRegister-3820-thread-1-processing-n:127.0.0.1:37428_q_qu%2Fii x:collection1 s:shard1 c:control_collection r:core_node1) [n:127.0.0.1:37428_q_qu%2Fii c:control_collection s:shard1 r:core_node1 x:collection1] o.a.s.c.ShardLeaderElectionContext Enough replicas found to continue.
   [junit4]   2> 948660 INFO  (coreZkRegister-3820-thread-1-processing-n:127.0.0.1:37428_q_qu%2Fii x:collection1 s:shard1 c:control_collection r:core_node1) [n:127.0.0.1:37428_q_qu%2Fii c:control_collection s:shard1 r:core_node1 x:collection1] o.a.s.c.ShardLeaderElectionContext I may be the new leader - try and sync
   [junit4]   2> 948660 INFO  (coreZkRegister-3820-thread-1-processing-n:127.0.0.1:37428_q_qu%2Fii x:collection1 s:shard1 c:control_collection r:core_node1) [n:127.0.0.1:37428_q_qu%2Fii c:control_collection s:shard1 r:core_node1 x:collection1] o.a.s.c.SyncStrategy Sync replicas to http://127.0.0.1:37428/q_qu/ii/collection1/
   [junit4]   2> 948660 INFO  (OverseerStateUpdate-95993948005072900-127.0.0.1:37428_q_qu%2Fii-n_0000000000) [n:127.0.0.1:37428_q_qu%2Fii    ] o.a.s.c.Overseer processMessage: queueSize: 1, message = {
   [junit4]   2>   "operation":"leader",
   [junit4]   2>   "shard":"shard1",
   [junit4]   2>   "collection":"control_collection"} current state version: 1
   [junit4]   2> 948660 INFO  (coreZkRegister-3820-thread-1-processing-n:127.0.0.1:37428_q_qu%2Fii x:collection1 s:shard1 c:control_collection r:core_node1) [n:127.0.0.1:37428_q_qu%2Fii c:control_collection s:shard1 r:core_node1 x:collection1] o.a.s.c.SyncStrategy Sync Success - now sync replicas to me
   [junit4]   2> 948660 INFO  (coreZkRegister-3820-thread-1-processing-n:127.0.0.1:37428_q_qu%2Fii x:collection1 s:shard1 c:control_collection r:core_node1) [n:127.0.0.1:37428_q_qu%2Fii c:control_collection s:shard1 r:core_node1 x:collection1] o.a.s.c.SyncStrategy http://127.0.0.1:37428/q_qu/ii/collection1/ has no replicas
   [junit4]   2> 948661 INFO  (coreZkRegister-3820-thread-1-processing-n:127.0.0.1:37428_q_qu%2Fii x:collection1 s:shard1 c:control_collection r:core_node1) [n:127.0.0.1:37428_q_qu%2Fii c:control_collection s:shard1 r:core_node1 x:collection1] o.a.s.c.c.SolrZkClient makePath: /collections/control_collection/leaders/shard1
   [junit4]   2> 948662 INFO  (coreZkRegister-3820-thread-1-processing-n:127.0.0.1:37428_q_qu%2Fii x:collection1 s:shard1 c:control_collection r:core_node1) [n:127.0.0.1:37428_q_qu%2Fii c:control_collection s:shard1 r:core_node1 x:collection1] o.a.s.c.ShardLeaderElectionContextBase Creating leader registration node /collections/control_collection/leaders/shard1/leader after winning as /collections/control_collection/leader_elect/shard1/election/95993948005072900-core_node1-n_0000000000
   [junit4]   2> 948662 INFO  (coreZkRegister-3820-thread-1-processing-n:127.0.0.1:37428_q_qu%2Fii x:collection1 s:shard1 c:control_collection r:core_node1) [n:127.0.0.1:37428_q_qu%2Fii c:control_collection s:shard1 r:core_node1 x:collection1] o.a.s.c.ShardLeaderElectionContext I am the new leader: http://127.0.0.1:37428/q_qu/ii/collection1/ shard1
   [junit4]   2> 948663 INFO  (OverseerStateUpdate-95993948005072900-127.0.0.1:37428_q_qu%2Fii-n_0000000000) [n:127.0.0.1:37428_q_qu%2Fii    ] o.a.s.c.Overseer processMessage: queueSize: 1, message = {
   [junit4]   2>   "operation":"leader",
   [junit4]   2>   "shard":"shard1",
   [junit4]   2>   "collection":"control_collection",
   [junit4]   2>   "base_url":"http://127.0.0.1:37428/q_qu/ii",
   [junit4]   2>   "core":"collection1",
   [junit4]   2>   "state":"active"} current state version: 1
   [junit4]   2> 948764 INFO  (zkCallback-1414-thread-1-processing-n:127.0.0.1:37428_q_qu%2Fii) [n:127.0.0.1:37428_q_qu%2Fii    ] o.a.s.c.c.ZkStateReader A cluster state change: [WatchedEvent state:SyncConnected type:NodeDataChanged path:/clusterstate.json], has occurred - updating... (live nodes size: [1])
   [junit4]   2> 948813 INFO  (coreZkRegister-3820-thread-1-processing-n:127.0.0.1:37428_q_qu%2Fii x:collection1 s:shard1 c:control_collection r:core_node1) [n:127.0.0.1:37428_q_qu%2Fii c:control_collection s:shard1 r:core_node1 x:collection1] o.a.s.c.ZkController We are http://127.0.0.1:37428/q_qu/ii/collection1/ and leader is http://127.0.0.1:37428/q_qu/ii/collection1/
   [junit4]   2> 948813 INFO  (coreZkRegister-3820-thread-1-processing-n:127.0.0.1:37428_q_qu%2Fii x:collection1 s:shard1 c:control_collection r:core_node1) [n:127.0.0.1:37428_q_qu%2Fii c:control_collection s:shard1 r:core_node1 x:collection1] o.a.s.c.ZkController No LogReplay needed for core=collection1 baseURL=http://127.0.0.1:37428/q_qu/ii
   [junit4]   2> 948813 INFO  (coreZkRegister-3820-thread-1-processing-n:127.0.0.1:37428_q_qu%2Fii x:collection1 s:shard1 c:control_collection r:core_node1) [n:127.0.0.1:37428_q_qu%2Fii c:control_collection s:shard1 r:core_node1 x:collection1] o.a.s.c.ZkController I am the leader, no recovery necessary
   [junit4]   2> 948813 INFO  (coreZkRegister-3820-thread-1-processing-n:127.0.0.1:37428_q_qu%2Fii x:collection1 s:shard1 c:control_collection r:core_node1) [n:127.0.0.1:37428_q_qu%2Fii c:control_collection s:shard1 r:core_node1 x:collection1] o.a.s.c.ZkController publishing state=active
   [junit4]   2> 948813 INFO  (coreZkRegister-3820-thread-1-processing-n:127.0.0.1:37428_q_qu%2Fii x:collection1 s:shard1 c:control_collection r:core_node1) [n:127.0.0.1:37428_q_qu%2Fii c:control_collection s:shard1 r:core_node1 x:collection1] o.a.s.c.ZkController numShards not found on descriptor - reading it from system property
   [junit4]   2> 948814 INFO  (OverseerStateUpdate-95993948005072900-127.0.0.1:37428_q_qu%2Fii-n_0000000000) [n:127.0.0.1:37428_q_qu%2Fii    ] o.a.s.c.Overseer processMessage: queueSize: 1, message = {
   [junit4]   2>   "core":"collection1",
   [junit4]   2>   "core_node_name":"core_node1",
   [junit4]   2>   "roles":null,
   [junit4]   2>   "base_url":"http://127.0.0.1:37428/q_qu/ii",
   [junit4]   2>   "node_name":"127.0.0.1:37428_q_qu%2Fii",
   [junit4]   2>   "numShards":"1",
   [junit4]   2>   "state":"active",
   [junit4]   2>   "shard":"shard1",
   [junit4]   2>   "collection":"control_collection",
   [junit4]   2>   "operation":"state"} current state version: 2
   [junit4]   2> 948814 INFO  (OverseerStateUpdate-95993948005072900-127.0.0.1:37428_q_qu%2Fii-n_0000000000) [n:127.0.0.1:37428_q_qu%2Fii    ] o.a.s.c.o.ReplicaMutator Update state numShards=1 message={
   [junit4]   2>   "core":"collection1",
   [junit4]   2>   "core_node_name":"core_node1",
   [junit4]   2>   "roles":null,
   [junit4]   2>   "base_url":"http://127.0.0.1:37428/q_qu/ii",
   [junit4]   2>   "node_name":"127.0.0.1:37428_q_qu%2Fii",
   [junit4]   2>   "numShards":"1",
   [junit4]   2>   "state":"active",
   [junit4]   2>   "shard":"shard1",
   [junit4]   2>   "collection":"control_collection",
   [junit4]   2>   "operation":"state"}
   [junit4]   2> 948916 INFO  (zkCallback-1414-thread-1-processing-n:127.0.0.1:37428_q_qu%2Fii) [n:127.0.0.1:37428_q_qu%2Fii    ] o.a.s.c.c.ZkStateReader A cluster state change: [WatchedEvent state:SyncConnected type:NodeDataChanged path:/clusterstate.json], has occurred - updating... (live nodes size: [1])
   [junit4]   2> 948948 INFO  (TEST-TestReqParamsAPI.test-seed#[D5640F95001631D9]) [    ] o.a.s.c.c.SolrZkClient Using default ZkCredentialsProvider
   [junit4]   2> 948948 INFO  (TEST-TestReqParamsAPI.test-seed#[D5640F95001631D9]) [    ] o.a.s.c.c.ConnectionManager Waiting for client to connect to ZooKeeper
   [junit4]   2> 948949 INFO  (zkCallback-1418-thread-1) [    ] o.a.s.c.c.ConnectionManager Watcher org.apache.solr.common.cloud.ConnectionManager@12eeb85 name:ZooKeeperConnection Watcher:127.0.0.1:36069/solr got event WatchedEvent state:SyncConnected type:None path:null path:null type:None
   [junit4]   2> 948949 INFO  (TEST-TestReqParamsAPI.test-seed#[D5640F95001631D9]) [    ] o.a.s.c.c.ConnectionManager Client is connected to ZooKeeper
   [junit4]   2> 948949 INFO  (TEST-TestReqParamsAPI.test-seed#[D5640F95001631D9]) [    ] o.a.s.c.c.SolrZkClient Using default ZkACLProvider
   [junit4]   2> 948949 INFO  (TEST-TestReqParamsAPI.test-seed#[D5640F95001631D9]) [    ] o.a.s.c.c.ZkStateReader Updating cluster state from ZooKeeper... 
   [junit4]   2> 948950 INFO  (TEST-TestReqParamsAPI.test-seed#[D5640F95001631D9]) [    ] o.a.s.c.c.ZkStateReader Loaded empty cluster properties
   [junit4]   2> 948950 INFO  (TEST-TestReqParamsAPI.test-seed#[D5640F95001631D9]) [    ] o.a.s.c.c.ZkStateReader Updated live nodes from ZooKeeper... (0) -> (1)
   [junit4]   2> 948950 INFO  (TEST-TestReqParamsAPI.test-seed#[D5640F95001631D9]) [    ] o.a.s.c.ChaosMonkey monkey: init - expire sessions:false cause connection loss:false
   [junit4]   2> 949021 INFO  (TEST-TestReqParamsAPI.test-seed#[D5640F95001631D9]) [    ] o.a.s.SolrTestCaseJ4 Writing core.properties file to /home/jenkins/workspace/Lucene-Solr-master-Linux/solr/build/solr-core/test/J0/temp/solr.handler.TestReqParamsAPI_D5640F95001631D9-001/shard-1-001/cores/collection1
   [junit4]   2> 949022 INFO  (TEST-TestReqParamsAPI.test-seed#[D5640F95001631D9]) [    ] o.a.s.c.AbstractFullDistribZkTestBase create jetty 1 in directory /home/jenkins/workspace/Lucene-Solr-master-Linux/solr/build/solr-core/test/J0/temp/solr.handler.TestReqParamsAPI_D5640F95001631D9-001/shard-1-001
   [junit4]   2> 949022 INFO  (TEST-TestReqParamsAPI.test-seed#[D5640F95001631D9]) [    ] o.e.j.s.Server jetty-9.3.8.v20160314
   [junit4]   2> 949023 INFO  (TEST-TestReqParamsAPI.test-seed#[D5640F95001631D9]) [    ] o.e.j.s.h.ContextHandler Started o.e.j.s.ServletContextHandler@9ec925{/q_qu/ii,null,AVAILABLE}
   [junit4]   2> 949023 INFO  (TEST-TestReqParamsAPI.test-seed#[D5640F95001631D9]) [    ] o.e.j.s.ServerConnector Started ServerConnector@15e4b45{HTTP/1.1,[http/1.1]}{127.0.0.1:35795}
   [junit4]   2> 949023 INFO  (TEST-TestReqParamsAPI.test-seed#[D5640F95001631D9]) [    ] o.e.j.s.Server Started @950920ms
   [junit4]   2> 949023 INFO  (TEST-TestReqParamsAPI.test-seed#[D5640F95001631D9]) [    ] o.a.s.c.s.e.JettySolrRunner Jetty properties: {solr.data.dir=/home/jenkins/workspace/Lucene-Solr-master-Linux/solr/build/solr-core/test/J0/temp/solr.handler.TestReqParamsAPI_D5640F95001631D9-001/tempDir-001/jetty1, solrconfig=solrconfig.xml, hostContext=/q_qu/ii, hostPort=35795, coreRootDirectory=/home/jenkins/workspace/Lucene-Solr-master-Linux/solr/build/solr-core/test/J0/../../../../../../../../../home/jenkins/workspace/Lucene-Solr-master-Linux/solr/build/solr-core/test/J0/temp/solr.handler.TestReqParamsAPI_D5640F95001631D9-001/shard-1-001/cores}
   [junit4]   2> 949024 INFO  (TEST-TestReqParamsAPI.test-seed#[D5640F95001631D9]) [    ] o.a.s.s.SolrDispatchFilter SolrDispatchFilter.init(): sun.misc.Launcher$AppClassLoader@1d16e93
   [junit4]   2> 949024 INFO  (TEST-TestReqParamsAPI.test-seed#[D5640F95001631D9]) [    ] o.a.s.c.SolrResourceLoader new SolrResourceLoader for directory: '/home/jenkins/workspace/Lucene-Solr-master-Linux/solr/build/solr-core/test/J0/temp/solr.handler.TestReqParamsAPI_D5640F95001631D9-001/shard-1-001'
   [junit4]   2> 949024 INFO  (TEST-TestReqParamsAPI.test-seed#[D5640F95001631D9]) [    ] o.a.s.c.SolrResourceLoader JNDI not configured for solr (NoInitialContextEx)
   [junit4]   2> 949024 INFO  (TEST-TestReqParamsAPI.test-seed#[D5640F95001631D9]) [    ] o.a.s.c.SolrResourceLoader solr home defaulted to 'solr/' (could not find system property or JNDI)
   [junit4]   2> 949024 INFO  (TEST-TestReqParamsAPI.test-seed#[D5640F95001631D9]) [    ] o.a.s.c.c.SolrZkClient Using default ZkCredentialsProvider
   [junit4]   2> 949024 INFO  (TEST-TestReqParamsAPI.test-seed#[D5640F95001631D9]) [    ] o.a.s.c.c.ConnectionManager Waiting for client to connect to ZooKeeper
   [junit4]   2> 949025 INFO  (zkCallback-1419-thread-1) [    ] o.a.s.c.c.ConnectionManager Watcher org.apache.solr.common.cloud.ConnectionManager@982809 name:ZooKeeperConnection Watcher:127.0.0.1:36069/solr got event WatchedEvent state:SyncConnected type:None path:null path:null type:None
   [junit4]   2> 949025 INFO  (TEST-TestReqParamsAPI.test-seed#[D5640F95001631D9]) [    ] o.a.s.c.c.ConnectionManager Client is connected to ZooKeeper
   [junit4]   2> 949025 INFO  (TEST-TestReqParamsAPI.test-seed#[D5640F95001631D9]) [    ] o.a.s.c.c.SolrZkClient Using default ZkACLProvider
   [junit4]   2> 949026 INFO  (TEST-TestReqParamsAPI.test-seed#[D5640F95001631D9]) [    ] o.a.s.s.SolrDispatchFilter Loading solr.xml from SolrHome (not found in ZooKeeper)
   [junit4]   2> 949026 INFO  (TEST-TestReqParamsAPI.test-seed#[D5640F95001631D9]) [    ] o.a.s.c.SolrXmlConfig Loading container configuration from /home/jenkins/workspace/Lucene-Solr-master-Linux/solr/build/solr-core/test/J0/temp/solr.handler.TestReqParamsAPI_D5640F95001631D9-001/shard-1-001/solr.xml
   [junit4]   2> 949031 INFO  (TEST-TestReqParamsAPI.test-seed#[D5640F95001631D9]) [    ] o.a.s.c.CorePropertiesLocator Config-defined core root directory: /home/jenkins/workspace/Lucene-Solr-master-Linux/solr/build/solr-core/test/J0/../../../../../../../../../home/jenkins/workspace/Lucene-Solr-master-Linux/solr/build/solr-core/test/J0/temp/solr.handler.TestReqParamsAPI_D5640F95001631D9-001/shard-1-001/cores
   [junit4]   2> 949031 INFO  (TEST-TestReqParamsAPI.test-seed#[D5640F95001631D9]) [    ] o.a.s.c.CoreContainer New CoreContainer 29058949
   [junit4]   2> 949031 INFO  (TEST-TestReqParamsAPI.test-seed#[D5640F95001631D9]) [    ] o.a.s.c.CoreContainer Loading cores into CoreContainer [instanceDir=/home/jenkins/workspace/Lucene-Solr-master-Linux/solr/build/solr-core/test/J0/temp/solr.handler.TestReqParamsAPI_D5640F95001631D9-001/shard-1-001]
   [junit4]   2> 949031 WARN  (TEST-TestReqParamsAPI.test-seed#[D5640F95001631D9]) [    ] o.a.s.c.CoreContainer Couldn't add files from /home/jenkins/workspace/Lucene-Solr-master-Linux/solr/build/solr-core/test/J0/temp/solr.handler.TestReqParamsAPI_D5640F95001631D9-001/shard-1-001/lib to classpath: /home/jenkins/workspace/Lucene-Solr-master-Linux/solr/build/solr-core/test/J0/temp/solr.handler.TestReqParamsAPI_D5640F95001631D9-001/shard-1-001/lib
   [junit4]   2> 949031 INFO  (TEST-TestReqParamsAPI.test-seed#[D5640F95001631D9]) [    ] o.a.s.h.c.HttpShardHandlerFactory created with socketTimeout : 90000,urlScheme : ,connTimeout : 15000,maxConnectionsPerHost : 20,maxConnections : 10000,corePoolSize : 0,maximumPoolSize : 2147483647,maxThreadIdleTime : 5,sizeOfQueue : -1,fairnessPolicy : false,
   [junit4]   2> 949033 INFO  (TEST-TestReqParamsAPI.test-seed#[D5640F95001631D9]) [    ] o.a.s.u.UpdateShardHandler Creating UpdateShardHandler HTTP client with params: 
   [junit4]   2> 949041 INFO  (TEST-TestReqParamsAPI.test-seed#[D5640F95001631D9]) [    ] o.a.s.l.LogWatcher SLF4J impl is org.slf4j.impl.Log4jLoggerFactory
   [junit4]   2> 949041 INFO  (TEST-TestReqParamsAPI.test-seed#[D5640F95001631D9]) [    ] o.a.s.l.LogWatcher Registering Log Listener [Log4j (org.slf4j.impl.Log4jLoggerFactory)]
   [junit4]   2> 949041 INFO  (TEST-TestReqParamsAPI.test-seed#[D5640F95001631D9]) [    ] o.a.s.c.ZkContainer Zookeeper client=127.0.0.1:36069/solr
   [junit4]   2> 949041 INFO  (TEST-TestReqParamsAPI.test-seed#[D5640F95001631D9]) [    ] o.a.s.c.ZkController zkHost includes chroot
   [junit4]   2> 949041 INFO  (TEST-TestReqParamsAPI.test-seed#[D5640F95001631D9]) [    ] o.a.s.c.c.SolrZkClient Using default ZkCredentialsProvider
   [junit4]   2> 949042 INFO  (TEST-TestReqParamsAPI.test-seed#[D5640F95001631D9]) [    ] o.a.s.c.c.ConnectionManager Waiting for client to connect to ZooKeeper
   [junit4]   2> 949042 INFO  (zkCallback-1422-thread-1) [    ] o.a.s.c.c.ConnectionManager Watcher org.apache.solr.common.cloud.ConnectionManager@23d010 name:ZooKeeperConnection Watcher:127.0.0.1:36069 got event WatchedEvent state:SyncConnected type:None path:null path:null type:None
   [junit4]   2> 949043 INFO  (TEST-TestReqParamsAPI.test-seed#[D5640F95001631D9]) [    ] o.a.s.c.c.ConnectionManager Client is connected to ZooKeeper
   [junit4]   2> 949043 INFO  (TEST-TestReqParamsAPI.test-seed#[D5640F95001631D9]) [    ] o.a.s.c.c.SolrZkClient Using default ZkACLProvider
   [junit4]   2> 949044 INFO  (TEST-TestReqParamsAPI.test-seed#[D5640F95001631D9]) [n:127.0.0.1:35795_q_qu%2Fii    ] o.a.s.c.ZkController Added new OnReconnect listener org.apache.solr.cloud.ZkController$$Lambda$67/25158017@1fd0fff
   [junit4]   2> 949044 INFO  (TEST-TestReqParamsAPI.test-seed#[D5640F95001631D9]) [n:127.0.0.1:35795_q_qu%2Fii    ] o.a.s.c.c.ConnectionManager Waiting for client to connect to ZooKeeper
   [junit4]   2> 949045 INFO  (zkCallback-1423-thread-1-processing-n:127.0.0.1:35795_q_qu%2Fii) [n:127.0.0.1:35795_q_qu%2Fii    ] o.a.s.c.c.ConnectionManager Watcher org.apache.solr.common.cloud.ConnectionManager@65beb name:ZooKeeperConnection Watcher:127.0.0.1:36069/solr got event WatchedEvent state:SyncConnected type:None path:null path:null type:None
   [junit4]   2> 949045 INFO  (TEST-TestReqParamsAPI.test-seed#[D5640F95001631D9]) [n:127.0.0.1:35795_q_qu%2Fii    ] o.a.s.c.c.ConnectionManager Client is connected to ZooKeeper
   [junit4]   2> 949048 INFO  (TEST-TestReqParamsAPI.test-seed#[D5640F95001631D9]) [n:127.0.0.1:35795_q_qu%2Fii    ] o.a.s.c.c.ZkStateReader Updating cluster state from ZooKeeper... 
   [junit4]   2> 949048 INFO  (TEST-TestReqParamsAPI.test-seed#[D5640F95001631D9]) [n:127.0.0.1:35795_q_qu%2Fii    ] o.a.s.c.c.ZkStateReader Loaded empty cluster properties
   [junit4]   2> 949048 INFO  (TEST-TestReqParamsAPI.test-seed#[D5640F95001631D9]) [n:127.0.0.1:35795_q_qu%2Fii    ] o.a.s.c.c.ZkStateReader Updated live nodes from ZooKeeper... (0) -> (1)
   [junit4]   2> 949050 INFO  (TEST-TestReqParamsAPI.test-seed#[D5640F95001631D9]) [n:127.0.0.1:35795_q_qu%2Fii    ] o.a.s.c.Overseer Overseer (id=null) closing
   [junit4]   2> 949050 INFO  (TEST-TestReqParamsAPI.test-seed#[D5640F95001631D9]) [n:127.0.0.1:35795_q_qu%2Fii    ] o.a.s.c.LeaderElector Joined leadership election with path: /overseer_elect/election/95993948005072904-127.0.0.1:35795_q_qu%2Fii-n_0000000001
   [junit4]   2> 949051 INFO  (TEST-TestReqParamsAPI.test-seed#[D5640F95001631D9]) [n:127.0.0.1:35795_q_qu%2Fii    ] o.a.s.c.LeaderElector Watching path /overseer_elect/election/95993948005072900-127.0.0.1:37428_q_qu%2Fii-n_0000000000 to know if I could be the leader
   [junit4]   2> 949051 INFO  (TEST-TestReqParamsAPI.test-seed#[D5640F95001631D9]) [n:127.0.0.1:35795_q_qu%2Fii    ] o.a.s.c.ZkController Publish node=127.0.0.1:35795_q_qu%2Fii as DOWN
   [junit4]   2> 949052 INFO  (OverseerStateUpdate-95993948005072900-127.0.0.1:37428_q_qu%2Fii-n_0000000000) [n:127.0.0.1:37428_q_qu%2Fii    ] o.a.s.c.Overseer processMessage: queueSize: 1, message = {
   [junit4]   2>   "operation":"downnode",
   [junit4]   2>   "node_name":"127.0.0.1:35795_q_qu%2Fii"} current state version: 3
   [junit4]   2> 949052 INFO  (OverseerStateUpdate-95993948005072900-127.0.0.1:37428_q_qu%2Fii-n_0000000000) [n:127.0.0.1:37428_q_qu%2Fii    ] o.a.s.c.o.NodeMutator DownNode state invoked for node: 127.0.0.1:35795_q_qu%2Fii
   [junit4]   2> 949153 INFO  (zkCallback-1423-thread-1-processing-n:127.0.0.1:35795_q_qu%2Fii) [n:127.0.0.1:35795_q_qu%2Fii    ] o.a.s.c.c.ZkStateReader A cluster state change: [WatchedEvent state:SyncConnected type:NodeDataChanged path:/clusterstate.json], has occurred - updating... (live nodes size: [1])
   [junit4]   2> 949153 INFO  (zkCallback-1414-thread-1-processing-n:127.0.0.1:37428_q_qu%2Fii) [n:127.0.0.1:37428_q_qu%2Fii    ] o.a.s.c.c.ZkStateReader A cluster state change: [WatchedEvent state:SyncConnected type:NodeDataChanged path:/clusterstate.json], has occurred - updating... (live nodes size: [1])
   [junit4]   2> 949153 INFO  (zkCallback-1418-thread-1) [    ] o.a.s.c.c.ZkStateReader A cluster state change: [WatchedEvent state:SyncConnected type:NodeDataChanged path:/clusterstate.json], has occurred - updating... (live nodes size: [1])
   [junit4]   2> 950052 INFO  (TEST-TestReqParamsAPI.test-seed#[D5640F95001631D9]) [n:127.0.0.1:35795_q_qu%2Fii    ] o.a.s.c.ZkController Register node as live in ZooKeeper:/live_nodes/127.0.0.1:35795_q_qu%2Fii
   [junit4]   2> 950052 INFO  (TEST-TestReqParamsAPI.test-seed#[D5640F95001631D9]) [n:127.0.0.1:35795_q_qu%2Fii    ] o.a.s.c.c.SolrZkClient makePath: /live_nodes/127.0.0.1:35795_q_qu%2Fii
   [junit4]   2> 950053 INFO  (zkCallback-1418-thread-1) [    ] o.a.s.c.c.ZkStateReader A live node change: [WatchedEvent state:SyncConnected type:NodeChildrenChanged path:/live_nodes], has occurred - updating... (live nodes size: [1])
   [junit4]   2> 950053 INFO  (zkCallback-1423-thread-1-processing-n:127.0.0.1:35795_q_qu%2Fii) [n:127.0.0.1:35795_q_qu%2Fii    ] o.a.s.c.c.ZkStateReader A live node change: [WatchedEvent state:SyncConnected type:NodeChildrenChanged path:/live_nodes], has occurred - updating... (live nodes size: [1])
   [junit4]   2> 950053 INFO  (zkCallback-1414-thread-1-processing-n:127.0.0.1:37428_q_qu%2Fii) [n:127.0.0.1:37428_q_qu%2Fii    ] o.a.s.c.c.ZkStateReader A live node change: [WatchedEvent state:SyncConnected type:NodeChildrenChanged path:/live_nodes], has occurred - updating... (live nodes size: [1])
   [junit4]   2> 950053 INFO  (zkCallback-1418-thread-1) [    ] o.a.s.c.c.ZkStateReader Updated live nodes from ZooKeeper... (1) -> (2)
   [junit4]   2> 950053 INFO  (zkCallback-1423-thread-1-processing-n:127.0.0.1:35795_q_qu%2Fii) [n:127.0.0.1:35795_q_qu%2Fii    ] o.a.s.c.c.ZkStateReader Updated live nodes from ZooKeeper... (1) -> (2)
   [junit4]   2> 950053 INFO  (zkCallback-1414-thread-1-processing-n:127.0.0.1:37428_q_qu%2Fii) [n:127.0.0.1:37428_q_qu%2Fii    ] o.a.s.c.c.ZkStateReader Updated live nodes from ZooKeeper... (1) -> (2)
   [junit4]   2> 950083 INFO  (TEST-TestReqParamsAPI.test-seed#[D5640F95001631D9]) [n:127.0.0.1:35795_q_qu%2Fii    ] o.a.s.c.CoreContainer Security conf doesn't exist. Skipping setup for authorization module.
   [junit4]   2> 950083 INFO  (TEST-TestReqParamsAPI.test-seed#[D5640F95001631D9]) [n:127.0.0.1:35795_q_qu%2Fii    ] o.a.s.c.CoreContainer No authentication plugin used.
   [junit4]   2> 950084 INFO  (TEST-TestReqParamsAPI.test-seed#[D5640F95001631D9]) [n:127.0.0.1:35795_q_qu%2Fii    ] o.a.s.c.CorePropertiesLocator Looking for core definitions underneath /home/jenkins/workspace/Lucene-Solr-master-Linux/solr/build/solr-core/test/J0/../../../../../../../../../home/jenkins/workspace/Lucene-Solr-master-Linux/solr/build/solr-core/test/J0/temp/solr.handler.TestReqParamsAPI_D5640F95001631D9-001/shard-1-001/cores
   [junit4]   2> 950084 INFO  (TEST-TestReqParamsAPI.test-seed#[D5640F95001631D9]) [n:127.0.0.1:35795_q_qu%2Fii    ] o.a.s.c.CoreDescriptor Created CoreDescriptor: {name=collection1, config=solrconfig.xml, transient=false, schema=schema.xml, loadOnStartup=true, configSetProperties=configsetprops.json, collection=collection1, coreNodeName=, dataDir=data/, shard=}
   [junit4]   2> 950084 INFO  (TEST-TestReqParamsAPI.test-seed#[D5640F95001631D9]) [n:127.0.0.1:35795_q_qu%2Fii    ] o.a.s.c.CorePropertiesLocator Found core collection1 in /home/jenkins/workspace/Lucene-Solr-master-Linux/solr/build/solr-core/test/J0/../../../../../../../../../home/jenkins/workspace/Lucene-Solr-master-Linux/solr/build/solr-core/test/J0/temp/solr.handler.TestReqParamsAPI_D5640F95001631D9-001/shard-1-001/cores/collection1
   [junit4]   2> 950084 INFO  (TEST-TestReqParamsAPI.test-seed#[D5640F95001631D9]) [n:127.0.0.1:35795_q_qu%2Fii    ] o.a.s.c.CorePropertiesLocator Found 1 core definitions
   [junit4]   2> 950085 INFO  (coreLoadExecutor-3837-thread-1-processing-n:127.0.0.1:35795_q_qu%2Fii) [n:127.0.0.1:35795_q_qu%2Fii c:collection1   x:collection1] o.a.s.c.ZkController publishing state=down
   [junit4]   2> 950085 INFO  (coreLoadExecutor-3837-thread-1-processing-n:127.0.0.1:35795_q_qu%2Fii) [n:127.0.0.1:35795_q_qu%2Fii c:collection1   x:collection1] o.a.s.c.ZkController numShards not found on descriptor - reading it from system property
   [junit4]   2> 950085 INFO  (TEST-TestReqParamsAPI.test-seed#[D5640F95001631D9]) [n:127.0.0.1:35795_q_qu%2Fii    ] o.a.s.s.SolrDispatchFilter user.dir=/home/jenkins/workspace/Lucene-Solr-master-Linux/solr/build/solr-core/test/J0
   [junit4]   2> 950085 INFO  (TEST-TestReqParamsAPI.test-seed#[D5640F95001631D9]) [n:127.0.0.1:35795_q_qu%2Fii    ] o.a.s.s.SolrDispatchFilter SolrDispatchFilter.init() done
   [junit4]   2> 950085 INFO  (coreLoadExecutor-3837-thread-1-processing-n:127.0.0.1:35795_q_qu%2Fii) [n:127.0.0.1:35795_q_qu%2Fii c:collection1   x:collection1] o.a.s.c.ZkController Collection collection1 not visible yet, but flagging it so a watch is registered when it becomes visible
   [junit4]   2> 950086 INFO  (OverseerStateUpdate-95993948005072900-127.0.0.1:37428_q_qu%2Fii-n_0000000000) [n:127.0.0.1:37428_q_qu%2Fii    ] o.a.s.c.Overseer processMessage: queueSize: 1, message = {
   [junit4]   2>   "core":"collection1",
   [junit4]   2>   "roles":null,
   [junit4]   2>   "base_url":"http://127.0.0.1:35795/q_qu/ii",
   [junit4]   2>   "node_name":"127.0.0.1:35795_q_qu%2Fii",
   [junit4]   2>   "numShards":"2",
   [junit4]   2>   "state":"down",
   [junit4]   2>   "shard":null,
   [junit4]   2>   "collection":"collection1",
   [junit4]   2>   "operation":"state"} current state version: 4
   [junit4]   2> 950086 INFO  (OverseerStateUpdate-95993948005072900-127.0.0.1:37428_q_qu%2Fii-n_0000000000) [n:127.0.0.1:37428_q_qu%2Fii    ] o.a.s.c.o.ReplicaMutator Update state numShards=2 message={
   [junit4]   2>   "core":"collection1",
   [junit4]   2>   "roles":null,
   [junit4]   2>   "base_url":"http://127.0.0.1:35795/q_qu/ii",
   [junit4]   2>   "node_name":"127.0.0.1:35795_q_qu%2Fii",
   [junit4]   2>   "numShards":"2",
   [junit4]   2>   "state":"down",
   [junit4]   2>   "shard":null,
   [junit4]   2>   "collection":"collection1",
   [junit4]   2>   "operation":"state"}
   [junit4]   2> 950086 INFO  (OverseerStateUpdate-95993948005072900-127.0.0.1:37428_q_qu%2Fii-n_0000000000) [n:127.0.0.1:37428_q_qu%2Fii    ] o.a.s.c.o.ClusterStateMutator building a new cName: collection1
   [junit4]   2> 950086 INFO  (OverseerStateUpdate-95993948005072900-127.0.0.1:37428_q_qu%2Fii-n_0000000000) [n:127.0.0.1:37428_q_qu%2Fii    ] o.a.s.c.o.ReplicaMutator Assigning new node to shard shard=shard2
   [junit4]   2> 950088 INFO  (coreLoadExecutor-3837-thread-1-processing-n:127.0.0.1:35795_q_qu%2Fii) [n:127.0.0.1:35795_q_qu%2Fii c:collection1   x:collection1] o.a.s.c.c.ZkStateReader Deleting data for [collection1]
   [junit4]   2> 950089 INFO  (coreLoadExecutor-3837-thread-1-processing-n:127.0.0.1:35795_q_qu%2Fii) [n:127.0.0.1:35795_q_qu%2Fii c:collection1   x:collection1] o.a.s.c.ZkController look for our core node name
   [junit4]   2> 950187 INFO  (zkCallback-1418-thread-1) [    ] o.a.s.c.c.ZkStateReader A cluster state change: [WatchedEvent state:SyncConnected type:NodeDataChanged path:/clusterstate.json], has occurred - updating... (live nodes size: [2])
   [junit4]   2> 950187 INFO  (zkCallback-1414-thread-1-processing-n:127.0.0.1:37428_q_qu%2Fii) [n:127.0.0.1:37428_q_qu%2Fii    ] o.a.s.c.c.ZkStateReader A cluster state change: [WatchedEvent state:SyncConnected type:NodeDataChanged path:/clusterstate.json], has occurred - updating... (live nodes size: [2])
   [junit4]   2> 950187 INFO  (zkCallback-1423-thread-1-processing-n:127.0.0.1:35795_q_qu%2Fii) [n:127.0.0.1:35795_q_qu%2Fii    ] o.a.s.c.c.ZkStateReader A cluster state change: [WatchedEvent state:SyncConnected type:NodeDataChanged path:/clusterstate.json], has occurred - updating... (live nodes size: [2])
   [junit4]   2> 951089 INFO  (coreLoadExecutor-3837-thread-1-processing-n:127.0.0.1:35795_q_qu%2Fii) [n:127.0.0.1:35795_q_qu%2Fii c:collection1   x:collection1] o.a.s.c.ZkController waiting to find shard id in clusterstate for collection1
   [junit4]   2> 951089 INFO  (coreLoadExecutor-3837-thread-1-processing-n:127.0.0.1:35795_q_qu%2Fii) [n:127.0.0.1:35795_q_qu%2Fii c:collection1   x:collection1] o.a.s.c.ZkController Check for collection zkNode:collection1
   [junit4]   2> 951089 INFO  (coreLoadExecutor-3837-thread-1-processing-n:127.0.0.1:35795_q_qu%2Fii) [n:127.0.0.1:35795_q_qu%2Fii c:collection1   x:collection1] 

[...truncated too long message...]

 2> 1378409 INFO  (TEST-SolrPluginUtilsTest.testMinShouldMatchAutoRelax-seed#[D5640F95001631D9]) [    ] o.a.s.SolrTestCaseJ4 ###Ending testMinShouldMatchAutoRelax
   [junit4]   2> 1378410 INFO  (TEST-SolrPluginUtilsTest.testStripIllegalOperators-seed#[D5640F95001631D9]) [    ] o.a.s.SolrTestCaseJ4 ###Starting testStripIllegalOperators
   [junit4]   2> 1378410 INFO  (TEST-SolrPluginUtilsTest.testStripIllegalOperators-seed#[D5640F95001631D9]) [    ] o.a.s.SolrTestCaseJ4 ###Ending testStripIllegalOperators
   [junit4]   2> 1378410 INFO  (SUITE-SolrPluginUtilsTest-seed#[D5640F95001631D9]-worker) [    ] o.a.s.SolrTestCaseJ4 ###deleteCore
   [junit4]   2> 1378410 INFO  (SUITE-SolrPluginUtilsTest-seed#[D5640F95001631D9]-worker) [    ] o.a.s.c.CoreContainer Shutting down CoreContainer instance=11091989
   [junit4]   2> 1378411 INFO  (coreCloseExecutor-4969-thread-1) [    x:collection1] o.a.s.c.SolrCore [collection1]  CLOSING SolrCore org.apache.solr.core.SolrCore@c34675
   [junit4]   2> 1378411 INFO  (coreCloseExecutor-4969-thread-1) [    x:collection1] o.a.s.u.DirectUpdateHandler2 closing DirectUpdateHandler2{commits=1,autocommits=0,soft autocommits=0,optimizes=0,rollbacks=0,expungeDeletes=0,docsPending=0,adds=0,deletesById=0,deletesByQuery=0,errors=0,cumulative_adds=3,cumulative_deletesById=0,cumulative_deletesByQuery=0,cumulative_errors=0,transaction_logs_total_size=251,transaction_logs_total_number=1}
   [junit4]   2> 1378411 INFO  (coreCloseExecutor-4969-thread-1) [    x:collection1] o.a.s.u.SolrCoreState Closing SolrCoreState
   [junit4]   2> 1378411 INFO  (coreCloseExecutor-4969-thread-1) [    x:collection1] o.a.s.u.DefaultSolrCoreState SolrCoreState ref count has reached 0 - closing IndexWriter
   [junit4]   2> 1378411 INFO  (coreCloseExecutor-4969-thread-1) [    x:collection1] o.a.s.u.DefaultSolrCoreState closing IndexWriter with IndexWriterCloser
   [junit4]   2> 1378411 INFO  (coreCloseExecutor-4969-thread-1) [    x:collection1] o.a.s.c.SolrCore [collection1] Closing main searcher on request.
   [junit4]   2> 1378418 INFO  (coreCloseExecutor-4969-thread-1) [    x:collection1] o.a.s.c.CachingDirectoryFactory Closing MockDirectoryFactory - 2 directories currently being tracked
   [junit4]   2> 1378418 INFO  (coreCloseExecutor-4969-thread-1) [    x:collection1] o.a.s.c.CachingDirectoryFactory looking to close /home/jenkins/workspace/Lucene-Solr-master-Linux/solr/build/solr-core/test/J1/temp/solr.util.SolrPluginUtilsTest_D5640F95001631D9-001/init-core-data-001 [CachedDir<<refCount=0;path=/home/jenkins/workspace/Lucene-Solr-master-Linux/solr/build/solr-core/test/J1/temp/solr.util.SolrPluginUtilsTest_D5640F95001631D9-001/init-core-data-001;done=false>>]
   [junit4]   2> 1378418 INFO  (coreCloseExecutor-4969-thread-1) [    x:collection1] o.a.s.c.CachingDirectoryFactory Closing directory, CoreContainer#isShutdown=true
   [junit4]   2> 1378418 INFO  (coreCloseExecutor-4969-thread-1) [    x:collection1] o.a.s.c.CachingDirectoryFactory Closing directory: /home/jenkins/workspace/Lucene-Solr-master-Linux/solr/build/solr-core/test/J1/temp/solr.util.SolrPluginUtilsTest_D5640F95001631D9-001/init-core-data-001
   [junit4]   2> 1378418 INFO  (coreCloseExecutor-4969-thread-1) [    x:collection1] o.a.s.c.CachingDirectoryFactory looking to close /home/jenkins/workspace/Lucene-Solr-master-Linux/solr/build/solr-core/test/J1/temp/solr.util.SolrPluginUtilsTest_D5640F95001631D9-001/init-core-data-001/index [CachedDir<<refCount=0;path=/home/jenkins/workspace/Lucene-Solr-master-Linux/solr/build/solr-core/test/J1/temp/solr.util.SolrPluginUtilsTest_D5640F95001631D9-001/init-core-data-001/index;done=false>>]
   [junit4]   2> 1378418 INFO  (coreCloseExecutor-4969-thread-1) [    x:collection1] o.a.s.c.CachingDirectoryFactory Closing directory, CoreContainer#isShutdown=true
   [junit4]   2> 1378418 INFO  (coreCloseExecutor-4969-thread-1) [    x:collection1] o.a.s.c.CachingDirectoryFactory Closing directory: /home/jenkins/workspace/Lucene-Solr-master-Linux/solr/build/solr-core/test/J1/temp/solr.util.SolrPluginUtilsTest_D5640F95001631D9-001/init-core-data-001/index
   [junit4]   2> NOTE: leaving temporary files on disk at: /home/jenkins/workspace/Lucene-Solr-master-Linux/solr/build/solr-core/test/J1/temp/solr.util.SolrPluginUtilsTest_D5640F95001631D9-001
   [junit4]   2> NOTE: test params are: codec=Asserting(Lucene62): {val_dynamic=PostingsFormat(name=Direct), range_facet_l_dv=PostingsFormat(name=Direct), _version_=BlockTreeOrds(blocksize=128), multiDefault=PostingsFormat(name=Memory doPackFST= false), val_i=PostingsFormat(name=Direct), intDefault=BlockTreeOrds(blocksize=128), dynamic_val=PostingsFormat(name=Direct), id=PostingsFormat(name=Direct), range_facet_i_dv=BlockTreeOrds(blocksize=128), range_facet_l=BlockTreeOrds(blocksize=128), timestamp=BlockTreeOrds(blocksize=128)}, docValues:{range_facet_l_dv=DocValuesFormat(name=Memory), range_facet_i_dv=DocValuesFormat(name=Lucene54), timestamp=DocValuesFormat(name=Lucene54)}, maxPointsInLeafNode=1535, maxMBSortInHeap=6.743083700531086, sim=ClassicSimilarity, locale=pt-BR, timezone=Africa/Bangui
   [junit4]   2> NOTE: Linux 4.4.0-21-generic i386/Oracle Corporation 1.8.0_92 (32-bit)/cpus=12,threads=1,free=204715120,total=303251456
   [junit4]   2> NOTE: All tests run in this JVM: [TestExactStatsCache, MoreLikeThisHandlerTest, FastVectorHighlighterTest, SuggesterFSTTest, TestDistributedGrouping, TestShardHandlerFactory, TestComplexPhraseQParserPlugin, TestBinaryResponseWriter, TestGraphMLResponseWriter, TestFastLRUCache, DistributedFacetPivotSmallTest, AsyncMigrateRouteKeyTest, DeleteReplicaTest, TestConfigSetsAPIZkFailure, HttpPartitionTest, TestFieldCollectionResource, TestSolrFieldCacheMBean, TestRandomRequestDistribution, ZkSolrClientTest, AliasIntegrationTest, OpenExchangeRatesOrgProviderTest, VersionInfoTest, TestDownShardTolerantSearch, TestTolerantUpdateProcessorRandomCloud, ClassificationUpdateProcessorFactoryTest, TestConfigReload, TestSurroundQueryParser, SoftAutoCommitTest, ShardRoutingTest, DirectSolrSpellCheckerTest, TestManagedStopFilterFactory, CSVRequestHandlerTest, BlockJoinFacetSimpleTest, IgnoreCommitOptimizeUpdateProcessorFactoryTest, HdfsNNFailoverTest, TestFileDictionaryLookup, TestDefaultStatsCache, TestFieldCache, SpellCheckComponentTest, SpellingQueryConverterTest, TestCloudDeleteByQuery, TestQueryUtils, TestStressVersions, ConfigSetsAPITest, DistributedIntervalFacetingTest, SegmentsInfoRequestHandlerTest, CdcrReplicationHandlerTest, TestSolrCLIRunExample, TestRequestForwarding, OutOfBoxZkACLAndCredentialsProvidersTest, TestTrie, CachingDirectoryFactoryTest, HdfsChaosMonkeyNothingIsSafeTest, TestDefaultSearchFieldResource, SolrIndexConfigTest, LoggingHandlerTest, SimplePostToolTest, TestAddFieldRealTimeGet, TestCollationFieldDocValues, SparseHLLTest, FileUtilsTest, StressHdfsTest, DistributedFacetPivotLargeTest, PKIAuthenticationIntegrationTest, TestSchemaSimilarityResource, TestDistributedStatsComponentCardinality, TestFieldCacheWithThreads, TestSubQueryTransformer, TestQueryTypes, TestStressCloudBlindAtomicUpdates, HdfsDirectoryFactoryTest, TestDocBasedVersionConstraints, TestSimpleTrackingShardHandler, TestNoOpRegenerator, SpatialFilterTest, TestCoreContainer, TestMinMaxOnMultiValuedField, TimeZoneUtilsTest, RecoveryAfterSoftCommitTest, DistributedMLTComponentTest, TestSolrCoreProperties, ZkCLITest, SolrCmdDistributorTest, TestRecoveryHdfs, TestSolrDeletionPolicy2, MergeStrategyTest, SpellCheckCollatorTest, MBeansHandlerTest, HdfsRestartWhileUpdatingTest, WordBreakSolrSpellCheckerTest, BJQParserTest, TestBM25SimilarityFactory, TestDocumentBuilder, TestHashPartitioner, NotRequiredUniqueKeyTest, CollectionsAPIDistributedZkTest, TestNumericTerms64, TestSolrXml, CustomCollectionTest, OpenCloseCoreStressTest, BasicZkTest, RecoveryZkTest, ClusterStateUpdateTest, ShardRoutingCustomTest, AutoCommitTest, TestRecovery, TestRealTimeGet, HardAutoCommitTest, SimpleFacetsTest, SolrCoreTest, TestGroupingSearch, BadIndexSchemaTest, TestSort, BasicFunctionalityTest, TestLazyCores, DirectUpdateHandlerTest, TestBadConfig, HighlighterTest, CurrencyFieldOpenExchangeTest, DistributedQueryElevationComponentTest, CoreAdminHandlerTest, SuggesterTest, TestStressLucene, SuggesterWFSTTest, PolyFieldTest, TestPseudoReturnFields, TestWordDelimiterFilterFactory, DirectUpdateHandlerOptimizeTest, DefaultValueUpdateProcessorTest, SortByFunctionTest, TestRemoteStreaming, SolrInfoMBeanTest, CacheHeaderTest, StandardRequestHandlerTest, TestWriterPerf, TermsComponentTest, DocumentBuilderTest, TermVectorComponentTest, FieldAnalysisRequestHandlerTest, SolrPluginUtilsTest]
   [junit4] Completed [378/611 (2!)] on J1 in 0.47s, 9 tests, 1 error <<< FAILURES!

[...truncated 779 lines...]
BUILD FAILED
/home/jenkins/workspace/Lucene-Solr-master-Linux/build.xml:740: The following error occurred while executing this line:
/home/jenkins/workspace/Lucene-Solr-master-Linux/build.xml:684: The following error occurred while executing this line:
/home/jenkins/workspace/Lucene-Solr-master-Linux/build.xml:59: The following error occurred while executing this line:
/home/jenkins/workspace/Lucene-Solr-master-Linux/solr/build.xml:233: The following error occurred while executing this line:
/home/jenkins/workspace/Lucene-Solr-master-Linux/solr/common-build.xml:531: The following error occurred while executing this line:
/home/jenkins/workspace/Lucene-Solr-master-Linux/lucene/common-build.xml:1427: The following error occurred while executing this line:
/home/jenkins/workspace/Lucene-Solr-master-Linux/lucene/common-build.xml:984: There were test failures: 611 suites (10 ignored), 2558 tests, 1 error, 1 failure, 116 ignored (72 assumptions) [seed: D5640F95001631D9]

Total time: 60 minutes 32 seconds
Build step 'Invoke Ant' marked build as failure
Archiving artifacts
[WARNINGS] Skipping publisher since build result is FAILURE
Recording test results
Email was triggered for: Failure - Any
Sending email for trigger: Failure - Any



Mime
View raw message