lucene-dev mailing list archives

Site index · List index
Message view « Date » · « Thread »
Top « Date » · « Thread »
From Policeman Jenkins Server <jenk...@thetaphi.de>
Subject [JENKINS-EA] Lucene-Solr-master-Linux (32bit/jdk-9-ea+120) - Build # 16887 - Still Failing!
Date Wed, 01 Jun 2016 07:50:41 GMT
Build: http://jenkins.thetaphi.de/job/Lucene-Solr-master-Linux/16887/
Java: 32bit/jdk-9-ea+120 -server -XX:+UseParallelGC

1 tests failed.
FAILED:  org.apache.solr.util.SolrPluginUtilsTest.testInvokeSetters

Error Message:
argument type mismatch

Stack Trace:
java.lang.IllegalArgumentException: argument type mismatch
	at __randomizedtesting.SeedInfo.seed([C958CF768C6F6B20:A04764767959098B]:0)
	at jdk.internal.reflect.NativeMethodAccessorImpl.invoke0(java.base@9-ea/Native Method)
	at jdk.internal.reflect.NativeMethodAccessorImpl.invoke(java.base@9-ea/NativeMethodAccessorImpl.java:62)
	at jdk.internal.reflect.DelegatingMethodAccessorImpl.invoke(java.base@9-ea/DelegatingMethodAccessorImpl.java:43)
	at java.lang.reflect.Method.invoke(java.base@9-ea/Method.java:531)
	at org.apache.solr.util.SolrPluginUtils.invokeSetters(SolrPluginUtils.java:1071)
	at org.apache.solr.util.SolrPluginUtilsTest.implTestInvokeSetters(SolrPluginUtilsTest.java:482)
	at org.apache.solr.util.SolrPluginUtilsTest.testInvokeSetters(SolrPluginUtilsTest.java:474)
	at jdk.internal.reflect.NativeMethodAccessorImpl.invoke0(java.base@9-ea/Native Method)
	at jdk.internal.reflect.NativeMethodAccessorImpl.invoke(java.base@9-ea/NativeMethodAccessorImpl.java:62)
	at jdk.internal.reflect.DelegatingMethodAccessorImpl.invoke(java.base@9-ea/DelegatingMethodAccessorImpl.java:43)
	at java.lang.reflect.Method.invoke(java.base@9-ea/Method.java:531)
	at com.carrotsearch.randomizedtesting.RandomizedRunner.invoke(RandomizedRunner.java:1764)
	at com.carrotsearch.randomizedtesting.RandomizedRunner$8.evaluate(RandomizedRunner.java:871)
	at com.carrotsearch.randomizedtesting.RandomizedRunner$9.evaluate(RandomizedRunner.java:907)
	at com.carrotsearch.randomizedtesting.RandomizedRunner$10.evaluate(RandomizedRunner.java:921)
	at com.carrotsearch.randomizedtesting.rules.SystemPropertiesRestoreRule$1.evaluate(SystemPropertiesRestoreRule.java:57)
	at org.apache.lucene.util.TestRuleSetupTeardownChained$1.evaluate(TestRuleSetupTeardownChained.java:49)
	at org.apache.lucene.util.AbstractBeforeAfterRule$1.evaluate(AbstractBeforeAfterRule.java:45)
	at org.apache.lucene.util.TestRuleThreadAndTestName$1.evaluate(TestRuleThreadAndTestName.java:48)
	at org.apache.lucene.util.TestRuleIgnoreAfterMaxFailures$1.evaluate(TestRuleIgnoreAfterMaxFailures.java:64)
	at org.apache.lucene.util.TestRuleMarkFailure$1.evaluate(TestRuleMarkFailure.java:47)
	at com.carrotsearch.randomizedtesting.rules.StatementAdapter.evaluate(StatementAdapter.java:36)
	at com.carrotsearch.randomizedtesting.ThreadLeakControl$StatementRunner.run(ThreadLeakControl.java:367)
	at com.carrotsearch.randomizedtesting.ThreadLeakControl.forkTimeoutingTask(ThreadLeakControl.java:809)
	at com.carrotsearch.randomizedtesting.ThreadLeakControl$3.evaluate(ThreadLeakControl.java:460)
	at com.carrotsearch.randomizedtesting.RandomizedRunner.runSingleTest(RandomizedRunner.java:880)
	at com.carrotsearch.randomizedtesting.RandomizedRunner$5.evaluate(RandomizedRunner.java:781)
	at com.carrotsearch.randomizedtesting.RandomizedRunner$6.evaluate(RandomizedRunner.java:816)
	at com.carrotsearch.randomizedtesting.RandomizedRunner$7.evaluate(RandomizedRunner.java:827)
	at com.carrotsearch.randomizedtesting.rules.StatementAdapter.evaluate(StatementAdapter.java:36)
	at com.carrotsearch.randomizedtesting.rules.SystemPropertiesRestoreRule$1.evaluate(SystemPropertiesRestoreRule.java:57)
	at org.apache.lucene.util.AbstractBeforeAfterRule$1.evaluate(AbstractBeforeAfterRule.java:45)
	at com.carrotsearch.randomizedtesting.rules.StatementAdapter.evaluate(StatementAdapter.java:36)
	at org.apache.lucene.util.TestRuleStoreClassName$1.evaluate(TestRuleStoreClassName.java:41)
	at com.carrotsearch.randomizedtesting.rules.NoShadowingOrOverridesOnMethodsRule$1.evaluate(NoShadowingOrOverridesOnMethodsRule.java:40)
	at com.carrotsearch.randomizedtesting.rules.NoShadowingOrOverridesOnMethodsRule$1.evaluate(NoShadowingOrOverridesOnMethodsRule.java:40)
	at com.carrotsearch.randomizedtesting.rules.StatementAdapter.evaluate(StatementAdapter.java:36)
	at com.carrotsearch.randomizedtesting.rules.StatementAdapter.evaluate(StatementAdapter.java:36)
	at com.carrotsearch.randomizedtesting.rules.StatementAdapter.evaluate(StatementAdapter.java:36)
	at org.apache.lucene.util.TestRuleAssertionsRequired$1.evaluate(TestRuleAssertionsRequired.java:53)
	at org.apache.lucene.util.TestRuleMarkFailure$1.evaluate(TestRuleMarkFailure.java:47)
	at org.apache.lucene.util.TestRuleIgnoreAfterMaxFailures$1.evaluate(TestRuleIgnoreAfterMaxFailures.java:64)
	at org.apache.lucene.util.TestRuleIgnoreTestSuites$1.evaluate(TestRuleIgnoreTestSuites.java:54)
	at com.carrotsearch.randomizedtesting.rules.StatementAdapter.evaluate(StatementAdapter.java:36)
	at com.carrotsearch.randomizedtesting.ThreadLeakControl$StatementRunner.run(ThreadLeakControl.java:367)
	at java.lang.Thread.run(java.base@9-ea/Thread.java:843)




Build Log:
[...truncated 11714 lines...]
   [junit4] Suite: org.apache.solr.util.SolrPluginUtilsTest
   [junit4]   2> Creating dataDir: /home/jenkins/workspace/Lucene-Solr-master-Linux/solr/build/solr-core/test/J1/temp/solr.util.SolrPluginUtilsTest_C958CF768C6F6B20-001/init-core-data-001
   [junit4]   2> 1218444 INFO  (SUITE-SolrPluginUtilsTest-seed#[C958CF768C6F6B20]-worker)
[    ] o.a.s.SolrTestCaseJ4 Randomized ssl (false) and clientAuth (false)
   [junit4]   2> 1218446 INFO  (SUITE-SolrPluginUtilsTest-seed#[C958CF768C6F6B20]-worker)
[    ] o.a.s.SolrTestCaseJ4 ####initCore
   [junit4]   2> 1218446 INFO  (SUITE-SolrPluginUtilsTest-seed#[C958CF768C6F6B20]-worker)
[    ] o.a.s.c.SolrResourceLoader new SolrResourceLoader for directory: '/home/jenkins/workspace/Lucene-Solr-master-Linux/solr/core/src/test-files/solr/collection1'
   [junit4]   2> 1218446 INFO  (SUITE-SolrPluginUtilsTest-seed#[C958CF768C6F6B20]-worker)
[    ] o.a.s.c.SolrResourceLoader JNDI not configured for solr (NoInitialContextEx)
   [junit4]   2> 1218446 INFO  (SUITE-SolrPluginUtilsTest-seed#[C958CF768C6F6B20]-worker)
[    ] o.a.s.c.SolrResourceLoader using system property solr.solr.home: /home/jenkins/workspace/Lucene-Solr-master-Linux/solr/core/src/test-files/solr
   [junit4]   2> 1218446 INFO  (SUITE-SolrPluginUtilsTest-seed#[C958CF768C6F6B20]-worker)
[    ] o.a.s.c.SolrResourceLoader Adding 'file:/home/jenkins/workspace/Lucene-Solr-master-Linux/solr/core/src/test-files/solr/collection1/lib/classes/'
to classloader
   [junit4]   2> 1218446 INFO  (SUITE-SolrPluginUtilsTest-seed#[C958CF768C6F6B20]-worker)
[    ] o.a.s.c.SolrResourceLoader Adding 'file:/home/jenkins/workspace/Lucene-Solr-master-Linux/solr/core/src/test-files/solr/collection1/lib/README'
to classloader
   [junit4]   2> 1218460 INFO  (SUITE-SolrPluginUtilsTest-seed#[C958CF768C6F6B20]-worker)
[    ] o.a.s.c.SolrConfig current version of requestparams : -1
   [junit4]   2> 1218465 WARN  (SUITE-SolrPluginUtilsTest-seed#[C958CF768C6F6B20]-worker)
[    ] o.a.s.c.Config Beginning with Solr 5.5, <mergePolicy> is deprecated, use <mergePolicyFactory>
instead.
   [junit4]   2> 1218466 INFO  (SUITE-SolrPluginUtilsTest-seed#[C958CF768C6F6B20]-worker)
[    ] o.a.s.c.SolrConfig Using Lucene MatchVersion: 7.0.0
   [junit4]   2> 1218479 INFO  (SUITE-SolrPluginUtilsTest-seed#[C958CF768C6F6B20]-worker)
[    ] o.a.s.c.SolrConfig Loaded SolrConfig: solrconfig.xml
   [junit4]   2> 1218483 INFO  (SUITE-SolrPluginUtilsTest-seed#[C958CF768C6F6B20]-worker)
[    ] o.a.s.s.IndexSchema [null] Schema name=test
   [junit4]   2> 1218534 INFO  (SUITE-SolrPluginUtilsTest-seed#[C958CF768C6F6B20]-worker)
[    ] o.a.s.s.OpenExchangeRatesOrgProvider Initialized with rates=open-exchange-rates.json,
refreshInterval=1440.
   [junit4]   2> 1218538 INFO  (SUITE-SolrPluginUtilsTest-seed#[C958CF768C6F6B20]-worker)
[    ] o.a.s.s.IndexSchema default search field in schema is text
   [junit4]   2> 1218539 INFO  (SUITE-SolrPluginUtilsTest-seed#[C958CF768C6F6B20]-worker)
[    ] o.a.s.s.IndexSchema unique key field: id
   [junit4]   2> 1218541 INFO  (SUITE-SolrPluginUtilsTest-seed#[C958CF768C6F6B20]-worker)
[    ] o.a.s.s.FileExchangeRateProvider Reloading exchange rates from file currency.xml
   [junit4]   2> 1218542 INFO  (SUITE-SolrPluginUtilsTest-seed#[C958CF768C6F6B20]-worker)
[    ] o.a.s.s.FileExchangeRateProvider Reloading exchange rates from file currency.xml
   [junit4]   2> 1218543 INFO  (SUITE-SolrPluginUtilsTest-seed#[C958CF768C6F6B20]-worker)
[    ] o.a.s.s.OpenExchangeRatesOrgProvider Reloading exchange rates from open-exchange-rates.json
   [junit4]   2> 1218543 INFO  (SUITE-SolrPluginUtilsTest-seed#[C958CF768C6F6B20]-worker)
[    ] o.a.s.s.OpenExchangeRatesOrgProvider Reloading exchange rates from open-exchange-rates.json
   [junit4]   2> 1218543 INFO  (SUITE-SolrPluginUtilsTest-seed#[C958CF768C6F6B20]-worker)
[    ] o.a.s.c.SolrResourceLoader JNDI not configured for solr (NoInitialContextEx)
   [junit4]   2> 1218543 INFO  (SUITE-SolrPluginUtilsTest-seed#[C958CF768C6F6B20]-worker)
[    ] o.a.s.c.SolrResourceLoader using system property solr.solr.home: /home/jenkins/workspace/Lucene-Solr-master-Linux/solr/core/src/test-files/solr
   [junit4]   2> 1218543 INFO  (SUITE-SolrPluginUtilsTest-seed#[C958CF768C6F6B20]-worker)
[    ] o.a.s.c.SolrResourceLoader new SolrResourceLoader for directory: '/home/jenkins/workspace/Lucene-Solr-master-Linux/solr/core/src/test-files/solr'
   [junit4]   2> 1218544 INFO  (SUITE-SolrPluginUtilsTest-seed#[C958CF768C6F6B20]-worker)
[    ] o.a.s.c.SolrResourceLoader JNDI not configured for solr (NoInitialContextEx)
   [junit4]   2> 1218544 INFO  (SUITE-SolrPluginUtilsTest-seed#[C958CF768C6F6B20]-worker)
[    ] o.a.s.c.SolrResourceLoader using system property solr.solr.home: /home/jenkins/workspace/Lucene-Solr-master-Linux/solr/core/src/test-files/solr
   [junit4]   2> 1218544 INFO  (SUITE-SolrPluginUtilsTest-seed#[C958CF768C6F6B20]-worker)
[    ] o.a.s.c.CoreContainer New CoreContainer 32555017
   [junit4]   2> 1218544 INFO  (SUITE-SolrPluginUtilsTest-seed#[C958CF768C6F6B20]-worker)
[    ] o.a.s.c.CoreContainer Loading cores into CoreContainer [instanceDir=/home/jenkins/workspace/Lucene-Solr-master-Linux/solr/core/src/test-files/solr]
   [junit4]   2> 1218544 WARN  (SUITE-SolrPluginUtilsTest-seed#[C958CF768C6F6B20]-worker)
[    ] o.a.s.c.CoreContainer Couldn't add files from /home/jenkins/workspace/Lucene-Solr-master-Linux/solr/core/src/test-files/solr/lib
to classpath: /home/jenkins/workspace/Lucene-Solr-master-Linux/solr/core/src/test-files/solr/lib
   [junit4]   2> 1218544 INFO  (SUITE-SolrPluginUtilsTest-seed#[C958CF768C6F6B20]-worker)
[    ] o.a.s.h.c.HttpShardHandlerFactory created with socketTimeout : 600000,connTimeout :
60000,maxConnectionsPerHost : 20,maxConnections : 10000,corePoolSize : 0,maximumPoolSize :
2147483647,maxThreadIdleTime : 5,sizeOfQueue : -1,fairnessPolicy : false,
   [junit4]   2> 1218545 INFO  (SUITE-SolrPluginUtilsTest-seed#[C958CF768C6F6B20]-worker)
[    ] o.a.s.u.UpdateShardHandler Creating UpdateShardHandler HTTP client with params: 
   [junit4]   2> 1218546 INFO  (SUITE-SolrPluginUtilsTest-seed#[C958CF768C6F6B20]-worker)
[    ] o.a.s.l.LogWatcher SLF4J impl is org.slf4j.impl.Log4jLoggerFactory
   [junit4]   2> 1218546 INFO  (SUITE-SolrPluginUtilsTest-seed#[C958CF768C6F6B20]-worker)
[    ] o.a.s.l.LogWatcher Registering Log Listener [Log4j (org.slf4j.impl.Log4jLoggerFactory)]
   [junit4]   2> 1218546 INFO  (SUITE-SolrPluginUtilsTest-seed#[C958CF768C6F6B20]-worker)
[    ] o.a.s.c.CoreContainer Security conf doesn't exist. Skipping setup for authorization
module.
   [junit4]   2> 1218546 INFO  (SUITE-SolrPluginUtilsTest-seed#[C958CF768C6F6B20]-worker)
[    ] o.a.s.c.CoreContainer No authentication plugin used.
   [junit4]   2> 1218546 INFO  (SUITE-SolrPluginUtilsTest-seed#[C958CF768C6F6B20]-worker)
[    ] o.a.s.c.CoreDescriptor Created CoreDescriptor: {schema=schema.xml, dataDir=/home/jenkins/workspace/Lucene-Solr-master-Linux/solr/build/solr-core/test/J1/temp/solr.util.SolrPluginUtilsTest_C958CF768C6F6B20-001/init-core-data-001,
collection=collection1, loadOnStartup=true, transient=false, name=collection1, shard=shard1,
config=solrconfig.xml, configSetProperties=configsetprops.json}
   [junit4]   2> 1218564 INFO  (coreLoadExecutor-4295-thread-1) [    ] o.a.s.c.SolrResourceLoader
new SolrResourceLoader for directory: '/home/jenkins/workspace/Lucene-Solr-master-Linux/solr/core/src/test-files/solr/collection1'
   [junit4]   2> 1218565 INFO  (coreLoadExecutor-4295-thread-1) [    ] o.a.s.c.SolrResourceLoader
JNDI not configured for solr (NoInitialContextEx)
   [junit4]   2> 1218565 INFO  (coreLoadExecutor-4295-thread-1) [    ] o.a.s.c.SolrResourceLoader
using system property solr.solr.home: /home/jenkins/workspace/Lucene-Solr-master-Linux/solr/core/src/test-files/solr
   [junit4]   2> 1218565 INFO  (coreLoadExecutor-4295-thread-1) [    ] o.a.s.c.SolrResourceLoader
Adding 'file:/home/jenkins/workspace/Lucene-Solr-master-Linux/solr/core/src/test-files/solr/collection1/lib/classes/'
to classloader
   [junit4]   2> 1218565 INFO  (coreLoadExecutor-4295-thread-1) [    ] o.a.s.c.SolrResourceLoader
Adding 'file:/home/jenkins/workspace/Lucene-Solr-master-Linux/solr/core/src/test-files/solr/collection1/lib/README'
to classloader
   [junit4]   2> 1218576 INFO  (coreLoadExecutor-4295-thread-1) [    ] o.a.s.c.SolrConfig
current version of requestparams : -1
   [junit4]   2> 1218582 WARN  (coreLoadExecutor-4295-thread-1) [    ] o.a.s.c.Config Beginning
with Solr 5.5, <mergePolicy> is deprecated, use <mergePolicyFactory> instead.
   [junit4]   2> 1218583 INFO  (coreLoadExecutor-4295-thread-1) [    ] o.a.s.c.SolrConfig
Using Lucene MatchVersion: 7.0.0
   [junit4]   2> 1218596 INFO  (coreLoadExecutor-4295-thread-1) [    ] o.a.s.c.SolrConfig
Loaded SolrConfig: solrconfig.xml
   [junit4]   2> 1218599 INFO  (coreLoadExecutor-4295-thread-1) [    ] o.a.s.s.IndexSchema
[collection1] Schema name=test
   [junit4]   2> 1218648 INFO  (coreLoadExecutor-4295-thread-1) [    ] o.a.s.s.OpenExchangeRatesOrgProvider
Initialized with rates=open-exchange-rates.json, refreshInterval=1440.
   [junit4]   2> 1218651 INFO  (coreLoadExecutor-4295-thread-1) [    ] o.a.s.s.IndexSchema
default search field in schema is text
   [junit4]   2> 1218652 INFO  (coreLoadExecutor-4295-thread-1) [    ] o.a.s.s.IndexSchema
unique key field: id
   [junit4]   2> 1218654 INFO  (coreLoadExecutor-4295-thread-1) [    ] o.a.s.s.FileExchangeRateProvider
Reloading exchange rates from file currency.xml
   [junit4]   2> 1218655 INFO  (coreLoadExecutor-4295-thread-1) [    ] o.a.s.s.FileExchangeRateProvider
Reloading exchange rates from file currency.xml
   [junit4]   2> 1218655 INFO  (coreLoadExecutor-4295-thread-1) [    ] o.a.s.s.OpenExchangeRatesOrgProvider
Reloading exchange rates from open-exchange-rates.json
   [junit4]   2> 1218656 INFO  (coreLoadExecutor-4295-thread-1) [    ] o.a.s.s.OpenExchangeRatesOrgProvider
Reloading exchange rates from open-exchange-rates.json
   [junit4]   2> 1218656 INFO  (coreLoadExecutor-4295-thread-1) [    ] o.a.s.c.ConfigSetProperties
Did not find ConfigSet properties, assuming default properties: Can't find resource 'configsetprops.json'
in classpath or '/home/jenkins/workspace/Lucene-Solr-master-Linux/solr/core/src/test-files/solr/collection1'
   [junit4]   2> 1218656 INFO  (coreLoadExecutor-4295-thread-1) [    ] o.a.s.c.CoreContainer
Creating SolrCore 'collection1' using configuration from instancedir /home/jenkins/workspace/Lucene-Solr-master-Linux/solr/core/src/test-files/solr/collection1
   [junit4]   2> 1218657 INFO  (coreLoadExecutor-4295-thread-1) [    ] o.a.s.c.SolrCore
org.apache.solr.core.MockDirectoryFactory
   [junit4]   2> 1218657 INFO  (coreLoadExecutor-4295-thread-1) [    ] o.a.s.c.SolrCore
[[collection1] ] Opening new SolrCore at [/home/jenkins/workspace/Lucene-Solr-master-Linux/solr/core/src/test-files/solr/collection1],
dataDir=[/home/jenkins/workspace/Lucene-Solr-master-Linux/solr/build/solr-core/test/J1/temp/solr.util.SolrPluginUtilsTest_C958CF768C6F6B20-001/init-core-data-001/]
   [junit4]   2> 1218657 INFO  (coreLoadExecutor-4295-thread-1) [    ] o.a.s.c.JmxMonitoredMap
JMX monitoring is enabled. Adding Solr mbeans to JMX Server: com.sun.jmx.mbeanserver.JmxMBeanServer@498667
   [junit4]   2> 1218658 INFO  (coreLoadExecutor-4295-thread-1) [    ] o.a.s.c.CachingDirectoryFactory
return new directory for /home/jenkins/workspace/Lucene-Solr-master-Linux/solr/build/solr-core/test/J1/temp/solr.util.SolrPluginUtilsTest_C958CF768C6F6B20-001/init-core-data-001
   [junit4]   2> 1218658 INFO  (coreLoadExecutor-4295-thread-1) [    ] o.a.s.c.SolrCore
New index directory detected: old=null new=/home/jenkins/workspace/Lucene-Solr-master-Linux/solr/build/solr-core/test/J1/temp/solr.util.SolrPluginUtilsTest_C958CF768C6F6B20-001/init-core-data-001/index/
   [junit4]   2> 1218658 WARN  (coreLoadExecutor-4295-thread-1) [    ] o.a.s.c.SolrCore
[collection1] Solr index directory '/home/jenkins/workspace/Lucene-Solr-master-Linux/solr/build/solr-core/test/J1/temp/solr.util.SolrPluginUtilsTest_C958CF768C6F6B20-001/init-core-data-001/index'
doesn't exist. Creating new index...
   [junit4]   2> 1218658 INFO  (coreLoadExecutor-4295-thread-1) [    ] o.a.s.c.CachingDirectoryFactory
return new directory for /home/jenkins/workspace/Lucene-Solr-master-Linux/solr/build/solr-core/test/J1/temp/solr.util.SolrPluginUtilsTest_C958CF768C6F6B20-001/init-core-data-001/index
   [junit4]   2> 1218658 INFO  (coreLoadExecutor-4295-thread-1) [    ] o.a.s.u.RandomMergePolicy
RandomMergePolicy wrapping class org.apache.lucene.index.LogByteSizeMergePolicy: [LogByteSizeMergePolicy:
minMergeSize=1677721, mergeFactor=14, maxMergeSize=2147483648, maxMergeSizeForForcedMerge=9223372036854775807,
calibrateSizeByDeletes=false, maxMergeDocs=2147483647, maxCFSSegmentSizeMB=8.796093022207999E12,
noCFSRatio=0.10518016637181252]
   [junit4]   2> 1218658 INFO  (coreLoadExecutor-4295-thread-1) [    ] o.a.s.c.SolrDeletionPolicy
SolrDeletionPolicy.onCommit: commits: num=1
   [junit4]   2> 	commit{dir=MockDirectoryWrapper(RAMDirectory@382ff9 lockFactory=org.apache.lucene.store.SingleInstanceLockFactory@1a6024e),segFN=segments_1,generation=1}
   [junit4]   2> 1218658 INFO  (coreLoadExecutor-4295-thread-1) [    ] o.a.s.c.SolrDeletionPolicy
newest commit generation = 1
   [junit4]   2> 1218658 INFO  (OldIndexDirectoryCleanupThreadForCore-collection1) [  
 ] o.a.s.c.SolrCore Looking for old index directories to cleanup for core collection1 in /home/jenkins/workspace/Lucene-Solr-master-Linux/solr/build/solr-core/test/J1/temp/solr.util.SolrPluginUtilsTest_C958CF768C6F6B20-001/init-core-data-001/
   [junit4]   2> 1218660 INFO  (coreLoadExecutor-4295-thread-1) [    ] o.a.s.u.p.UpdateRequestProcessorChain
creating updateRequestProcessorChain "dedupe"
   [junit4]   2> 1218660 INFO  (coreLoadExecutor-4295-thread-1) [    ] o.a.s.u.p.UpdateRequestProcessorChain
inserting DistributedUpdateProcessorFactory into updateRequestProcessorChain "dedupe"
   [junit4]   2> 1218660 INFO  (coreLoadExecutor-4295-thread-1) [    ] o.a.s.u.p.UpdateRequestProcessorChain
creating updateRequestProcessorChain "dedupe-allfields"
   [junit4]   2> 1218660 INFO  (coreLoadExecutor-4295-thread-1) [    ] o.a.s.u.p.UpdateRequestProcessorChain
inserting DistributedUpdateProcessorFactory into updateRequestProcessorChain "dedupe-allfields"
   [junit4]   2> 1218660 INFO  (coreLoadExecutor-4295-thread-1) [    ] o.a.s.u.p.UpdateRequestProcessorChain
creating updateRequestProcessorChain "stored_sig"
   [junit4]   2> 1218660 INFO  (coreLoadExecutor-4295-thread-1) [    ] o.a.s.u.p.UpdateRequestProcessorChain
inserting DistributedUpdateProcessorFactory into updateRequestProcessorChain "stored_sig"
   [junit4]   2> 1218660 INFO  (coreLoadExecutor-4295-thread-1) [    ] o.a.s.u.p.UpdateRequestProcessorChain
creating updateRequestProcessorChain "uniq-fields"
   [junit4]   2> 1218660 INFO  (coreLoadExecutor-4295-thread-1) [    ] o.a.s.u.p.UpdateRequestProcessorChain
inserting DistributedUpdateProcessorFactory into updateRequestProcessorChain "uniq-fields"
   [junit4]   2> 1218660 INFO  (coreLoadExecutor-4295-thread-1) [    ] o.a.s.u.p.UpdateRequestProcessorChain
creating updateRequestProcessorChain "distrib-dup-test-chain-explicit"
   [junit4]   2> 1218661 INFO  (coreLoadExecutor-4295-thread-1) [    ] o.a.s.u.p.UpdateRequestProcessorChain
creating updateRequestProcessorChain "distrib-dup-test-chain-implicit"
   [junit4]   2> 1218661 INFO  (coreLoadExecutor-4295-thread-1) [    ] o.a.s.u.p.UpdateRequestProcessorChain
inserting DistributedUpdateProcessorFactory into updateRequestProcessorChain "distrib-dup-test-chain-implicit"
   [junit4]   2> 1218661 INFO  (coreLoadExecutor-4295-thread-1) [    ] o.a.s.c.SolrCore
no updateRequestProcessorChain defined as default, creating implicit default
   [junit4]   2> 1218662 INFO  (coreLoadExecutor-4295-thread-1) [    ] o.a.s.h.l.XMLLoader
xsltCacheLifetimeSeconds=60
   [junit4]   2> 1218662 INFO  (coreLoadExecutor-4295-thread-1) [    ] o.a.s.h.l.XMLLoader
xsltCacheLifetimeSeconds=60
   [junit4]   2> 1218663 INFO  (coreLoadExecutor-4295-thread-1) [    ] o.a.s.h.l.XMLLoader
xsltCacheLifetimeSeconds=60
   [junit4]   2> 1218663 INFO  (coreLoadExecutor-4295-thread-1) [    ] o.a.s.h.l.XMLLoader
xsltCacheLifetimeSeconds=60
   [junit4]   2> 1218665 INFO  (coreLoadExecutor-4295-thread-1) [    ] o.a.s.c.PluginBag
requestHandler : 'lazy' created with startup=lazy 
   [junit4]   2> 1218666 INFO  (coreLoadExecutor-4295-thread-1) [    ] o.a.s.c.RequestHandlers
Registered paths: /admin/mbeans,standard,spellCheckCompRH,lazy,/update/json/docs,/admin/luke,/export,spellCheckWithWordbreak_Direct,tvrh,/get,/admin/properties,/update/json,mltrh,/admin/threads,/search-facet-def,/update/csv,/sql,/graph,/search-facet-invariants,/admin/segments,spellCheckCompRH1,/mlt,/admin/system,/replication,dismax,defaults,/config,/stream,/schema,/admin/plugins,/admin/logging,spellCheckWithWordbreak,mock,/admin/ping,/update,/admin/file,/terms,spellCheckCompRH_Direct,/debug/dump
   [junit4]   2> 1218666 INFO  (coreLoadExecutor-4295-thread-1) [    ] o.a.s.c.SolrCore
Using default statsCache cache: org.apache.solr.search.stats.LocalStatsCache
   [junit4]   2> 1218666 INFO  (coreLoadExecutor-4295-thread-1) [    ] o.a.s.u.UpdateHandler
Using UpdateLog implementation: org.apache.solr.update.UpdateLog
   [junit4]   2> 1218666 INFO  (coreLoadExecutor-4295-thread-1) [    ] o.a.s.u.UpdateLog
Initializing UpdateLog: dataDir= defaultSyncLevel=FLUSH numRecordsToKeep=100 maxNumLogsToKeep=10
numVersionBuckets=65536
   [junit4]   2> 1218670 INFO  (coreLoadExecutor-4295-thread-1) [    ] o.a.s.u.CommitTracker
Hard AutoCommit: disabled
   [junit4]   2> 1218670 INFO  (coreLoadExecutor-4295-thread-1) [    ] o.a.s.u.CommitTracker
Soft AutoCommit: disabled
   [junit4]   2> 1218671 INFO  (coreLoadExecutor-4295-thread-1) [    ] o.a.s.u.RandomMergePolicy
RandomMergePolicy wrapping class org.apache.lucene.index.TieredMergePolicy: [TieredMergePolicy:
maxMergeAtOnce=19, maxMergeAtOnceExplicit=16, maxMergedSegmentMB=42.91796875, floorSegmentMB=1.9052734375,
forceMergeDeletesPctAllowed=23.904782015834083, segmentsPerTier=45.0, maxCFSSegmentSizeMB=8.796093022207999E12,
noCFSRatio=0.8989960090543303
   [junit4]   2> 1218671 INFO  (coreLoadExecutor-4295-thread-1) [    ] o.a.s.c.SolrDeletionPolicy
SolrDeletionPolicy.onInit: commits: num=1
   [junit4]   2> 	commit{dir=MockDirectoryWrapper(RAMDirectory@382ff9 lockFactory=org.apache.lucene.store.SingleInstanceLockFactory@1a6024e),segFN=segments_1,generation=1}
   [junit4]   2> 1218671 INFO  (coreLoadExecutor-4295-thread-1) [    ] o.a.s.c.SolrDeletionPolicy
newest commit generation = 1
   [junit4]   2> 1218671 INFO  (coreLoadExecutor-4295-thread-1) [    ] o.a.s.s.SolrIndexSearcher
Opening [Searcher@ab8ae3[collection1] main]
   [junit4]   2> 1218671 INFO  (coreLoadExecutor-4295-thread-1) [    ] o.a.s.r.RestManager
Initializing RestManager with initArgs: {storageIO=org.apache.solr.rest.ManagedResourceStorage$InMemoryStorageIO}
   [junit4]   2> 1218671 INFO  (coreLoadExecutor-4295-thread-1) [    ] o.a.s.r.ManagedResourceStorage
Reading _rest_managed.json using InMemoryStorage
   [junit4]   2> 1218671 INFO  (coreLoadExecutor-4295-thread-1) [    ] o.a.s.r.RestManager
Initializing 0 registered ManagedResources
   [junit4]   2> 1218671 INFO  (coreLoadExecutor-4295-thread-1) [    ] o.a.s.h.c.SpellCheckComponent
Initializing spell checkers
   [junit4]   2> 1218734 INFO  (coreLoadExecutor-4295-thread-1) [    ] o.a.s.s.DirectSolrSpellChecker
init: {name=direct,classname=DirectSolrSpellChecker,field=lowerfilt,minQueryLength=3}
   [junit4]   2> 1218932 INFO  (coreLoadExecutor-4295-thread-1) [    ] o.a.s.h.ReplicationHandler
Commits will be reserved for  10000
   [junit4]   2> 1218932 INFO  (searcherExecutor-4296-thread-1) [    ] o.a.s.h.c.SpellCheckComponent
Loading spell index for spellchecker: default
   [junit4]   2> 1218932 INFO  (searcherExecutor-4296-thread-1) [    ] o.a.s.h.c.SpellCheckComponent
Loading spell index for spellchecker: direct
   [junit4]   2> 1218933 INFO  (searcherExecutor-4296-thread-1) [    ] o.a.s.h.c.SpellCheckComponent
Loading spell index for spellchecker: wordbreak
   [junit4]   2> 1218933 INFO  (searcherExecutor-4296-thread-1) [    ] o.a.s.h.c.SpellCheckComponent
Loading spell index for spellchecker: multipleFields
   [junit4]   2> 1218933 INFO  (searcherExecutor-4296-thread-1) [    ] o.a.s.h.c.SpellCheckComponent
Loading spell index for spellchecker: jarowinkler
   [junit4]   2> 1218933 INFO  (coreLoadExecutor-4295-thread-1) [    ] o.a.s.u.UpdateLog
Looking up max value of version field to seed version buckets
   [junit4]   2> 1218933 INFO  (coreLoadExecutor-4295-thread-1) [    ] o.a.s.u.VersionInfo
Refreshing highest value of _version_ for 65536 version buckets from index
   [junit4]   2> 1218933 INFO  (searcherExecutor-4296-thread-1) [    ] o.a.s.h.c.SpellCheckComponent
Loading spell index for spellchecker: external
   [junit4]   2> 1218933 INFO  (coreLoadExecutor-4295-thread-1) [    ] o.a.s.u.VersionInfo
No terms found for _version_, cannot seed version bucket highest value from index
   [junit4]   2> 1218933 INFO  (coreLoadExecutor-4295-thread-1) [    ] o.a.s.u.UpdateLog
Could not find max version in index or recent updates, using new clock 1535919270669582336
   [junit4]   2> 1218933 INFO  (searcherExecutor-4296-thread-1) [    ] o.a.s.h.c.SpellCheckComponent
Loading spell index for spellchecker: freq
   [junit4]   2> 1218933 INFO  (searcherExecutor-4296-thread-1) [    ] o.a.s.h.c.SpellCheckComponent
Loading spell index for spellchecker: fqcn
   [junit4]   2> 1218933 INFO  (searcherExecutor-4296-thread-1) [    ] o.a.s.h.c.SpellCheckComponent
Loading spell index for spellchecker: perDict
   [junit4]   2> 1218934 INFO  (searcherExecutor-4296-thread-1) [    ] o.a.s.c.SolrCore
[collection1] Registered new searcher Searcher@ab8ae3[collection1] main{ExitableDirectoryReader(UninvertingDirectoryReader())}
   [junit4]   2> 1218935 INFO  (coreLoadExecutor-4295-thread-1) [    ] o.a.s.u.UpdateLog
Took 1.0ms to seed version buckets with highest version 1535919270669582336
   [junit4]   2> 1218935 INFO  (coreLoadExecutor-4295-thread-1) [    ] o.a.s.c.CoreContainer
registering core: collection1
   [junit4]   2> 1218935 INFO  (SUITE-SolrPluginUtilsTest-seed#[C958CF768C6F6B20]-worker)
[    ] o.a.s.SolrTestCaseJ4 ####initCore end
   [junit4]   2> 1218937 INFO  (TEST-SolrPluginUtilsTest.testMinShouldMatchAutoRelax-seed#[C958CF768C6F6B20])
[    ] o.a.s.SolrTestCaseJ4 ###Starting testMinShouldMatchAutoRelax
   [junit4]   2> 1218937 INFO  (TEST-SolrPluginUtilsTest.testMinShouldMatchAutoRelax-seed#[C958CF768C6F6B20])
[    ] o.a.s.SolrTestCaseJ4 ###Ending testMinShouldMatchAutoRelax
   [junit4]   2> 1218938 INFO  (TEST-SolrPluginUtilsTest.testParseFieldBoosts-seed#[C958CF768C6F6B20])
[    ] o.a.s.SolrTestCaseJ4 ###Starting testParseFieldBoosts
   [junit4]   2> 1218938 INFO  (TEST-SolrPluginUtilsTest.testParseFieldBoosts-seed#[C958CF768C6F6B20])
[    ] o.a.s.SolrTestCaseJ4 ###Ending testParseFieldBoosts
   [junit4]   2> 1218939 INFO  (TEST-SolrPluginUtilsTest.testPartialEscape-seed#[C958CF768C6F6B20])
[    ] o.a.s.SolrTestCaseJ4 ###Starting testPartialEscape
   [junit4]   2> 1218939 INFO  (TEST-SolrPluginUtilsTest.testPartialEscape-seed#[C958CF768C6F6B20])
[    ] o.a.s.SolrTestCaseJ4 ###Ending testPartialEscape
   [junit4]   2> 1218940 INFO  (TEST-SolrPluginUtilsTest.testStripUnbalancedQuotes-seed#[C958CF768C6F6B20])
[    ] o.a.s.SolrTestCaseJ4 ###Starting testStripUnbalancedQuotes
   [junit4]   2> 1218940 INFO  (TEST-SolrPluginUtilsTest.testStripUnbalancedQuotes-seed#[C958CF768C6F6B20])
[    ] o.a.s.SolrTestCaseJ4 ###Ending testStripUnbalancedQuotes
   [junit4]   2> 1218941 INFO  (TEST-SolrPluginUtilsTest.testDisjunctionMaxQueryParser-seed#[C958CF768C6F6B20])
[    ] o.a.s.SolrTestCaseJ4 ###Starting testDisjunctionMaxQueryParser
   [junit4]   2> 1218942 INFO  (TEST-SolrPluginUtilsTest.testDisjunctionMaxQueryParser-seed#[C958CF768C6F6B20])
[    ] o.a.s.SolrTestCaseJ4 ###Ending testDisjunctionMaxQueryParser
   [junit4]   2> 1218943 INFO  (TEST-SolrPluginUtilsTest.testInvokeSetters-seed#[C958CF768C6F6B20])
[    ] o.a.s.SolrTestCaseJ4 ###Starting testInvokeSetters
   [junit4]   2> 1218944 INFO  (TEST-SolrPluginUtilsTest.testInvokeSetters-seed#[C958CF768C6F6B20])
[    ] o.a.s.SolrTestCaseJ4 ###Ending testInvokeSetters
   [junit4]   2> NOTE: reproduce with: ant test  -Dtestcase=SolrPluginUtilsTest -Dtests.method=testInvokeSetters
-Dtests.seed=C958CF768C6F6B20 -Dtests.multiplier=3 -Dtests.slow=true -Dtests.locale=fr-BF
-Dtests.timezone=America/Santo_Domingo -Dtests.asserts=true -Dtests.file.encoding=ISO-8859-1
   [junit4] ERROR   0.00s J1 | SolrPluginUtilsTest.testInvokeSetters <<<
   [junit4]    > Throwable #1: java.lang.IllegalArgumentException: argument type mismatch
   [junit4]    > 	at __randomizedtesting.SeedInfo.seed([C958CF768C6F6B20:A04764767959098B]:0)
   [junit4]    > 	at jdk.internal.reflect.NativeMethodAccessorImpl.invoke0(java.base@9-ea/Native
Method)
   [junit4]    > 	at jdk.internal.reflect.NativeMethodAccessorImpl.invoke(java.base@9-ea/NativeMethodAccessorImpl.java:62)
   [junit4]    > 	at jdk.internal.reflect.DelegatingMethodAccessorImpl.invoke(java.base@9-ea/DelegatingMethodAccessorImpl.java:43)
   [junit4]    > 	at org.apache.solr.util.SolrPluginUtils.invokeSetters(SolrPluginUtils.java:1071)
   [junit4]    > 	at org.apache.solr.util.SolrPluginUtilsTest.implTestInvokeSetters(SolrPluginUtilsTest.java:482)
   [junit4]    > 	at org.apache.solr.util.SolrPluginUtilsTest.testInvokeSetters(SolrPluginUtilsTest.java:474)
   [junit4]    > 	at jdk.internal.reflect.NativeMethodAccessorImpl.invoke0(java.base@9-ea/Native
Method)
   [junit4]    > 	at jdk.internal.reflect.NativeMethodAccessorImpl.invoke(java.base@9-ea/NativeMethodAccessorImpl.java:62)
   [junit4]    > 	at jdk.internal.reflect.DelegatingMethodAccessorImpl.invoke(java.base@9-ea/DelegatingMethodAccessorImpl.java:43)
   [junit4]    > 	at java.lang.Thread.run(java.base@9-ea/Thread.java:843)
   [junit4]   2> 1218946 INFO  (TEST-SolrPluginUtilsTest.testMinShouldMatchCalculator-seed#[C958CF768C6F6B20])
[    ] o.a.s.SolrTestCaseJ4 ###Starting testMinShouldMatchCalculator
   [junit4]   2> 1218946 INFO  (TEST-SolrPluginUtilsTest.testMinShouldMatchCalculator-seed#[C958CF768C6F6B20])
[    ] o.a.s.SolrTestCaseJ4 ###Ending testMinShouldMatchCalculator
   [junit4]   2> 1218947 INFO  (TEST-SolrPluginUtilsTest.testStripIllegalOperators-seed#[C958CF768C6F6B20])
[    ] o.a.s.SolrTestCaseJ4 ###Starting testStripIllegalOperators
   [junit4]   2> 1218947 INFO  (TEST-SolrPluginUtilsTest.testStripIllegalOperators-seed#[C958CF768C6F6B20])
[    ] o.a.s.SolrTestCaseJ4 ###Ending testStripIllegalOperators
   [junit4]   2> 1218948 INFO  (TEST-SolrPluginUtilsTest.testDocListConversion-seed#[C958CF768C6F6B20])
[    ] o.a.s.SolrTestCaseJ4 ###Starting testDocListConversion
   [junit4]   2> 1218950 INFO  (TEST-SolrPluginUtilsTest.testDocListConversion-seed#[C958CF768C6F6B20])
[    ] o.a.s.u.p.LogUpdateProcessorFactory [collection1]  webapp=null path=null params={}{add=[3234
(1535919270685310976)]} 0 1
   [junit4]   2> 1218951 INFO  (TEST-SolrPluginUtilsTest.testDocListConversion-seed#[C958CF768C6F6B20])
[    ] o.a.s.u.p.LogUpdateProcessorFactory [collection1]  webapp=null path=null params={}{add=[3235
(1535919270688456704)]} 0 0
   [junit4]   2> 1218951 INFO  (TEST-SolrPluginUtilsTest.testDocListConversion-seed#[C958CF768C6F6B20])
[    ] o.a.s.u.p.LogUpdateProcessorFactory [collection1]  webapp=null path=null params={}{add=[3236
(1535919270688456705)]} 0 0
   [junit4]   2> 1218952 INFO  (TEST-SolrPluginUtilsTest.testDocListConversion-seed#[C958CF768C6F6B20])
[    ] o.a.s.u.DirectUpdateHandler2 start commit{,optimize=false,openSearcher=true,waitSearcher=true,expungeDeletes=false,softCommit=false,prepareCommit=false}
   [junit4]   2> 1218954 INFO  (TEST-SolrPluginUtilsTest.testDocListConversion-seed#[C958CF768C6F6B20])
[    ] o.a.s.c.SolrDeletionPolicy SolrDeletionPolicy.onCommit: commits: num=2
   [junit4]   2> 	commit{dir=MockDirectoryWrapper(RAMDirectory@382ff9 lockFactory=org.apache.lucene.store.SingleInstanceLockFactory@1a6024e),segFN=segments_1,generation=1}
   [junit4]   2> 	commit{dir=MockDirectoryWrapper(RAMDirectory@382ff9 lockFactory=org.apache.lucene.store.SingleInstanceLockFactory@1a6024e),segFN=segments_2,generation=2}
   [junit4]   2> 1218954 INFO  (TEST-SolrPluginUtilsTest.testDocListConversion-seed#[C958CF768C6F6B20])
[    ] o.a.s.c.SolrDeletionPolicy newest commit generation = 2
   [junit4]   2> 1218955 INFO  (TEST-SolrPluginUtilsTest.testDocListConversion-seed#[C958CF768C6F6B20])
[    ] o.a.s.s.SolrIndexSearcher Opening [Searcher@1a94f50[collection1] main]
   [junit4]   2> 1218956 INFO  (TEST-SolrPluginUtilsTest.testDocListConversion-seed#[C958CF768C6F6B20])
[    ] o.a.s.u.DirectUpdateHandler2 end_commit_flush
   [junit4]   2> 1218956 INFO  (searcherExecutor-4296-thread-1) [    ] o.a.s.c.SolrCore
[collection1] Registered new searcher Searcher@1a94f50[collection1] main{ExitableDirectoryReader(UninvertingDirectoryReader(Uninverting(_0(7.0.0):c3)))}
   [junit4]   2> 1218956 INFO  (TEST-SolrPluginUtilsTest.testDocListConversion-seed#[C958CF768C6F6B20])
[    ] o.a.s.u.p.LogUpdateProcessorFactory [collection1]  webapp=null path=null params={}{commit=}
0 4
   [junit4]   2> 1218957 INFO  (TEST-SolrPluginUtilsTest.testDocListConversion-seed#[C958CF768C6F6B20])
[    ] o.a.s.SolrTestCaseJ4 ###Ending testDocListConversion
   [junit4]   2> 1218957 INFO  (SUITE-SolrPluginUtilsTest-seed#[C958CF768C6F6B20]-worker)
[    ] o.a.s.SolrTestCaseJ4 ###deleteCore
   [junit4]   2> 1218957 INFO  (SUITE-SolrPluginUtilsTest-seed#[C958CF768C6F6B20]-worker)
[    ] o.a.s.c.CoreContainer Shutting down CoreContainer instance=32555017
   [junit4]   2> 1218958 INFO  (coreCloseExecutor-4301-thread-1) [    ] o.a.s.c.SolrCore
[collection1]  CLOSING SolrCore org.apache.solr.core.SolrCore@19c8ceb
   [junit4]   2> 1218958 INFO  (coreCloseExecutor-4301-thread-1) [    ] o.a.s.u.DirectUpdateHandler2
closing DirectUpdateHandler2{commits=1,autocommits=0,soft autocommits=0,optimizes=0,rollbacks=0,expungeDeletes=0,docsPending=0,adds=0,deletesById=0,deletesByQuery=0,errors=0,cumulative_adds=3,cumulative_deletesById=0,cumulative_deletesByQuery=0,cumulative_errors=0,transaction_logs_total_size=251,transaction_logs_total_number=1}
   [junit4]   2> 1218958 INFO  (coreCloseExecutor-4301-thread-1) [    ] o.a.s.u.SolrCoreState
Closing SolrCoreState
   [junit4]   2> 1218958 INFO  (coreCloseExecutor-4301-thread-1) [    ] o.a.s.u.DefaultSolrCoreState
SolrCoreState ref count has reached 0 - closing IndexWriter
   [junit4]   2> 1218958 INFO  (coreCloseExecutor-4301-thread-1) [    ] o.a.s.u.DefaultSolrCoreState
closing IndexWriter with IndexWriterCloser
   [junit4]   2> 1218958 INFO  (coreCloseExecutor-4301-thread-1) [    ] o.a.s.c.SolrCore
[collection1] Closing main searcher on request.
   [junit4]   2> 1218965 INFO  (coreCloseExecutor-4301-thread-1) [    ] o.a.s.c.CachingDirectoryFactory
Closing MockDirectoryFactory - 2 directories currently being tracked
   [junit4]   2> 1218965 INFO  (coreCloseExecutor-4301-thread-1) [    ] o.a.s.c.CachingDirectoryFactory
looking to close /home/jenkins/workspace/Lucene-Solr-master-Linux/solr/build/solr-core/test/J1/temp/solr.util.SolrPluginUtilsTest_C958CF768C6F6B20-001/init-core-data-001
[CachedDir<<refCount=0;path=/home/jenkins/workspace/Lucene-Solr-master-Linux/solr/build/solr-core/test/J1/temp/solr.util.SolrPluginUtilsTest_C958CF768C6F6B20-001/init-core-data-001;done=false>>]
   [junit4]   2> 1218965 INFO  (coreCloseExecutor-4301-thread-1) [    ] o.a.s.c.CachingDirectoryFactory
Closing directory, CoreContainer#isShutdown=true
   [junit4]   2> 1218965 INFO  (coreCloseExecutor-4301-thread-1) [    ] o.a.s.c.CachingDirectoryFactory
Closing directory: /home/jenkins/workspace/Lucene-Solr-master-Linux/solr/build/solr-core/test/J1/temp/solr.util.SolrPluginUtilsTest_C958CF768C6F6B20-001/init-core-data-001
   [junit4]   2> 1218965 INFO  (coreCloseExecutor-4301-thread-1) [    ] o.a.s.c.CachingDirectoryFactory
looking to close /home/jenkins/workspace/Lucene-Solr-master-Linux/solr/build/solr-core/test/J1/temp/solr.util.SolrPluginUtilsTest_C958CF768C6F6B20-001/init-core-data-001/index
[CachedDir<<refCount=0;path=/home/jenkins/workspace/Lucene-Solr-master-Linux/solr/build/solr-core/test/J1/temp/solr.util.SolrPluginUtilsTest_C958CF768C6F6B20-001/init-core-data-001/index;done=false>>]
   [junit4]   2> 1218965 INFO  (coreCloseExecutor-4301-thread-1) [    ] o.a.s.c.CachingDirectoryFactory
Closing directory, CoreContainer#isShutdown=true
   [junit4]   2> 1218965 INFO  (coreCloseExecutor-4301-thread-1) [    ] o.a.s.c.CachingDirectoryFactory
Closing directory: /home/jenkins/workspace/Lucene-Solr-master-Linux/solr/build/solr-core/test/J1/temp/solr.util.SolrPluginUtilsTest_C958CF768C6F6B20-001/init-core-data-001/index
   [junit4]   2> NOTE: leaving temporary files on disk at: /home/jenkins/workspace/Lucene-Solr-master-Linux/solr/build/solr-core/test/J1/temp/solr.util.SolrPluginUtilsTest_C958CF768C6F6B20-001
   [junit4]   2> NOTE: test params are: codec=Lucene62, sim=RandomSimilarity(queryNorm=true,coord=crazy):
{}, locale=fr-BF, timezone=America/Santo_Domingo
   [junit4]   2> NOTE: Linux 4.4.0-21-generic i386/Oracle Corporation 9-ea (32-bit)/cpus=12,threads=1,free=272744144,total=369885184
   [junit4]   2> NOTE: All tests run in this JVM: [TestStressVersions, ZkControllerTest,
TestCloudDeleteByQuery, DistributedFacetPivotSmallTest, CollectionsAPIAsyncDistributedZkTest,
TestFileDictionaryLookup, TestAddFieldRealTimeGet, MultiTermTest, TestCollectionAPI, SaslZkACLProviderTest,
ShardRoutingTest, TestNamedUpdateProcessors, TestRandomRequestDistribution, CollectionsAPIDistributedZkTest,
SpellingQueryConverterTest, TestLeaderInitiatedRecoveryThread, SpatialFilterTest, TestScoreJoinQPScore,
DocValuesTest, OverseerRolesTest, TestConfigSetsAPIZkFailure, TestFieldCacheSort, TestTrie,
TestCloudManagedSchema, TestPartialUpdateDeduplication, DistanceFunctionTest, TestSolrQueryParserDefaultOperatorResource,
TestLFUCache, SolrIndexConfigTest, TestExactStatsCache, ZkSolrClientTest, TestQuerySenderListener,
TestSolrXml, TestSystemIdResolver, TestSolrConfigHandlerConcurrent, SolrCmdDistributorTest,
TestSubQueryTransformer, SuggesterFSTTest, TestEmbeddedSolrServerConstructors, SpellPossibilityIteratorTest,
SpatialHeatmapFacetsTest, SolrXmlInZkTest, ConjunctionSolrSpellCheckerTest, OutOfBoxZkACLAndCredentialsProvidersTest,
TestFieldCollectionResource, DistributedQueryComponentOptimizationTest, TestShardHandlerFactory,
TestDefaultSearchFieldResource, ConvertedLegacyTest, TestQuerySenderNoQuery, DistributedFacetPivotLargeTest,
DistributedMLTComponentTest, HdfsDirectoryTest, FileUtilsTest, TestSimpleTrackingShardHandler,
TestSolrCLIRunExample, SpellCheckCollatorTest, TestDistributedGrouping, ClusterStateUpdateTest,
TestSolrDeletionPolicy2, TestFieldTypeResource, TimeZoneUtilsTest, FastVectorHighlighterTest,
TestLMJelinekMercerSimilarityFactory, TestFieldCacheWithThreads, TestSlowCompositeReaderWrapper,
TestDownShardTolerantSearch, SortByFunctionTest, TestSolrQueryResponse, TestDistributedStatsComponentCardinality,
RulesTest, RestartWhileUpdatingTest, TestRuleBasedAuthorizationPlugin, TestBulkSchemaAPI,
TestFastLRUCache, TestHashPartitioner, TestSchemaManager, BigEndianAscendingWordSerializerTest,
TestBinaryResponseWriter, DistribCursorPagingTest, TestManagedResource, AsyncMigrateRouteKeyTest,
DocumentBuilderTest, RecoveryAfterSoftCommitTest, MergeStrategyTest, TestCollationFieldDocValues,
CdcrReplicationHandlerTest, ZkCLITest, DistanceUnitsTest, HdfsRestartWhileUpdatingTest, CollectionReloadTest,
VMParamsZkACLAndCredentialsProvidersTest, TestDynamicLoading, AnalysisErrorHandlingTest, TestSurroundQueryParser,
MinimalSchemaTest, EnumFieldTest, BJQParserTest, BlockJoinFacetSimpleTest, SuggesterTSTTest,
SchemaVersionSpecificBehaviorTest, TestUpdate, TestWordDelimiterFilterFactory, SolrInfoMBeanTest,
TestQueryUtils, TestWriterPerf, TestQueryTypes, PrimitiveFieldTypeTest, TestValueSourceCache,
MoreLikeThisHandlerTest, IndexSchemaRuntimeFieldTest, SolrPluginUtilsTest]
   [junit4] Completed [381/611 (1!)] on J1 in 0.53s, 9 tests, 1 error <<< FAILURES!

[...truncated 756 lines...]
BUILD FAILED
/home/jenkins/workspace/Lucene-Solr-master-Linux/build.xml:740: The following error occurred
while executing this line:
/home/jenkins/workspace/Lucene-Solr-master-Linux/build.xml:684: The following error occurred
while executing this line:
/home/jenkins/workspace/Lucene-Solr-master-Linux/build.xml:59: The following error occurred
while executing this line:
/home/jenkins/workspace/Lucene-Solr-master-Linux/solr/build.xml:233: The following error occurred
while executing this line:
/home/jenkins/workspace/Lucene-Solr-master-Linux/solr/common-build.xml:531: The following
error occurred while executing this line:
/home/jenkins/workspace/Lucene-Solr-master-Linux/lucene/common-build.xml:1427: The following
error occurred while executing this line:
/home/jenkins/workspace/Lucene-Solr-master-Linux/lucene/common-build.xml:984: There were test
failures: 611 suites (10 ignored), 2558 tests, 1 error, 118 ignored (72 assumptions) [seed:
C958CF768C6F6B20]

Total time: 56 minutes 22 seconds
Build step 'Invoke Ant' marked build as failure
Archiving artifacts
[WARNINGS] Skipping publisher since build result is FAILURE
Recording test results
Email was triggered for: Failure - Any
Sending email for trigger: Failure - Any



Mime
View raw message