lucene-dev mailing list archives

Site index · List index
Message view « Date » · « Thread »
Top « Date » · « Thread »
From Policeman Jenkins Server <jenk...@thetaphi.de>
Subject [JENKINS] Lucene-Solr-5.5-Windows (64bit/jdk1.7.0_80) - Build # 95 - Still Failing!
Date Wed, 22 Jun 2016 01:26:50 GMT
Build: http://jenkins.thetaphi.de/job/Lucene-Solr-5.5-Windows/95/
Java: 64bit/jdk1.7.0_80 -XX:+UseCompressedOops -XX:+UseConcMarkSweepGC

2 tests failed.
FAILED:  junit.framework.TestSuite.org.apache.solr.schema.TestManagedSchemaAPI

Error Message:
ObjectTracker found 8 object(s) that were not released!!! [MDCAwareThreadPoolExecutor, TransactionLog, MockDirectoryWrapper, MockDirectoryWrapper, MockDirectoryWrapper, TransactionLog, MDCAwareThreadPoolExecutor, MockDirectoryWrapper]

Stack Trace:
java.lang.AssertionError: ObjectTracker found 8 object(s) that were not released!!! [MDCAwareThreadPoolExecutor, TransactionLog, MockDirectoryWrapper, MockDirectoryWrapper, MockDirectoryWrapper, TransactionLog, MDCAwareThreadPoolExecutor, MockDirectoryWrapper]
	at __randomizedtesting.SeedInfo.seed([CD2CA3F263D747AD]:0)
	at org.junit.Assert.fail(Assert.java:93)
	at org.junit.Assert.assertTrue(Assert.java:43)
	at org.junit.Assert.assertNull(Assert.java:551)
	at org.apache.solr.SolrTestCaseJ4.afterClass(SolrTestCaseJ4.java:238)
	at sun.reflect.GeneratedMethodAccessor20.invoke(Unknown Source)
	at sun.reflect.DelegatingMethodAccessorImpl.invoke(DelegatingMethodAccessorImpl.java:43)
	at java.lang.reflect.Method.invoke(Method.java:606)
	at com.carrotsearch.randomizedtesting.RandomizedRunner.invoke(RandomizedRunner.java:1764)
	at com.carrotsearch.randomizedtesting.RandomizedRunner$7.evaluate(RandomizedRunner.java:834)
	at com.carrotsearch.randomizedtesting.rules.StatementAdapter.evaluate(StatementAdapter.java:36)
	at com.carrotsearch.randomizedtesting.rules.SystemPropertiesRestoreRule$1.evaluate(SystemPropertiesRestoreRule.java:57)
	at org.apache.lucene.util.AbstractBeforeAfterRule$1.evaluate(AbstractBeforeAfterRule.java:45)
	at com.carrotsearch.randomizedtesting.rules.StatementAdapter.evaluate(StatementAdapter.java:36)
	at org.apache.lucene.util.TestRuleStoreClassName$1.evaluate(TestRuleStoreClassName.java:41)
	at com.carrotsearch.randomizedtesting.rules.NoShadowingOrOverridesOnMethodsRule$1.evaluate(NoShadowingOrOverridesOnMethodsRule.java:40)
	at com.carrotsearch.randomizedtesting.rules.NoShadowingOrOverridesOnMethodsRule$1.evaluate(NoShadowingOrOverridesOnMethodsRule.java:40)
	at com.carrotsearch.randomizedtesting.rules.StatementAdapter.evaluate(StatementAdapter.java:36)
	at com.carrotsearch.randomizedtesting.rules.StatementAdapter.evaluate(StatementAdapter.java:36)
	at com.carrotsearch.randomizedtesting.rules.StatementAdapter.evaluate(StatementAdapter.java:36)
	at org.apache.lucene.util.TestRuleAssertionsRequired$1.evaluate(TestRuleAssertionsRequired.java:53)
	at org.apache.lucene.util.TestRuleMarkFailure$1.evaluate(TestRuleMarkFailure.java:47)
	at org.apache.lucene.util.TestRuleIgnoreAfterMaxFailures$1.evaluate(TestRuleIgnoreAfterMaxFailures.java:64)
	at org.apache.lucene.util.TestRuleIgnoreTestSuites$1.evaluate(TestRuleIgnoreTestSuites.java:54)
	at com.carrotsearch.randomizedtesting.rules.StatementAdapter.evaluate(StatementAdapter.java:36)
	at com.carrotsearch.randomizedtesting.ThreadLeakControl$StatementRunner.run(ThreadLeakControl.java:367)
	at java.lang.Thread.run(Thread.java:745)


FAILED:  junit.framework.TestSuite.org.apache.solr.schema.TestManagedSchemaAPI

Error Message:
Could not remove the following files (in the order of attempts):    C:\Users\jenkins\workspace\Lucene-Solr-5.5-Windows\solr\build\solr-core\test\J0\temp\solr.schema.TestManagedSchemaAPI_CD2CA3F263D747AD-001\tempDir-001\node2\testschemaapi_shard1_replica1\data\tlog\tlog.0000000000000000001: java.nio.file.FileSystemException: C:\Users\jenkins\workspace\Lucene-Solr-5.5-Windows\solr\build\solr-core\test\J0\temp\solr.schema.TestManagedSchemaAPI_CD2CA3F263D747AD-001\tempDir-001\node2\testschemaapi_shard1_replica1\data\tlog\tlog.0000000000000000001: The process cannot access the file because it is being used by another process.     C:\Users\jenkins\workspace\Lucene-Solr-5.5-Windows\solr\build\solr-core\test\J0\temp\solr.schema.TestManagedSchemaAPI_CD2CA3F263D747AD-001\tempDir-001\node2\testschemaapi_shard1_replica1\data\tlog: java.nio.file.DirectoryNotEmptyException: C:\Users\jenkins\workspace\Lucene-Solr-5.5-Windows\solr\build\solr-core\test\J0\temp\solr.schema.TestManagedSchemaAPI_CD2CA3F263D747AD-001\tempDir-001\node2\testschemaapi_shard1_replica1\data\tlog    C:\Users\jenkins\workspace\Lucene-Solr-5.5-Windows\solr\build\solr-core\test\J0\temp\solr.schema.TestManagedSchemaAPI_CD2CA3F263D747AD-001\tempDir-001\node2\testschemaapi_shard1_replica1\data: java.nio.file.DirectoryNotEmptyException: C:\Users\jenkins\workspace\Lucene-Solr-5.5-Windows\solr\build\solr-core\test\J0\temp\solr.schema.TestManagedSchemaAPI_CD2CA3F263D747AD-001\tempDir-001\node2\testschemaapi_shard1_replica1\data    C:\Users\jenkins\workspace\Lucene-Solr-5.5-Windows\solr\build\solr-core\test\J0\temp\solr.schema.TestManagedSchemaAPI_CD2CA3F263D747AD-001\tempDir-001\node2\testschemaapi_shard1_replica1: java.nio.file.DirectoryNotEmptyException: C:\Users\jenkins\workspace\Lucene-Solr-5.5-Windows\solr\build\solr-core\test\J0\temp\solr.schema.TestManagedSchemaAPI_CD2CA3F263D747AD-001\tempDir-001\node2\testschemaapi_shard1_replica1    C:\Users\jenkins\workspace\Lucene-Solr-5.5-Windows\solr\build\solr-core\test\J0\temp\solr.schema.TestManagedSchemaAPI_CD2CA3F263D747AD-001\tempDir-001\node2: java.nio.file.DirectoryNotEmptyException: C:\Users\jenkins\workspace\Lucene-Solr-5.5-Windows\solr\build\solr-core\test\J0\temp\solr.schema.TestManagedSchemaAPI_CD2CA3F263D747AD-001\tempDir-001\node2    C:\Users\jenkins\workspace\Lucene-Solr-5.5-Windows\solr\build\solr-core\test\J0\temp\solr.schema.TestManagedSchemaAPI_CD2CA3F263D747AD-001\tempDir-001\node1\testschemaapi_shard1_replica2\data\tlog\tlog.0000000000000000000: java.nio.file.FileSystemException: C:\Users\jenkins\workspace\Lucene-Solr-5.5-Windows\solr\build\solr-core\test\J0\temp\solr.schema.TestManagedSchemaAPI_CD2CA3F263D747AD-001\tempDir-001\node1\testschemaapi_shard1_replica2\data\tlog\tlog.0000000000000000000: The process cannot access the file because it is being used by another process.     C:\Users\jenkins\workspace\Lucene-Solr-5.5-Windows\solr\build\solr-core\test\J0\temp\solr.schema.TestManagedSchemaAPI_CD2CA3F263D747AD-001\tempDir-001\node1\testschemaapi_shard1_replica2\data\tlog: java.nio.file.DirectoryNotEmptyException: C:\Users\jenkins\workspace\Lucene-Solr-5.5-Windows\solr\build\solr-core\test\J0\temp\solr.schema.TestManagedSchemaAPI_CD2CA3F263D747AD-001\tempDir-001\node1\testschemaapi_shard1_replica2\data\tlog    C:\Users\jenkins\workspace\Lucene-Solr-5.5-Windows\solr\build\solr-core\test\J0\temp\solr.schema.TestManagedSchemaAPI_CD2CA3F263D747AD-001\tempDir-001\node1\testschemaapi_shard1_replica2\data: java.nio.file.DirectoryNotEmptyException: C:\Users\jenkins\workspace\Lucene-Solr-5.5-Windows\solr\build\solr-core\test\J0\temp\solr.schema.TestManagedSchemaAPI_CD2CA3F263D747AD-001\tempDir-001\node1\testschemaapi_shard1_replica2\data    C:\Users\jenkins\workspace\Lucene-Solr-5.5-Windows\solr\build\solr-core\test\J0\temp\solr.schema.TestManagedSchemaAPI_CD2CA3F263D747AD-001\tempDir-001\node1\testschemaapi_shard1_replica2: java.nio.file.DirectoryNotEmptyException: C:\Users\jenkins\workspace\Lucene-Solr-5.5-Windows\solr\build\solr-core\test\J0\temp\solr.schema.TestManagedSchemaAPI_CD2CA3F263D747AD-001\tempDir-001\node1\testschemaapi_shard1_replica2    C:\Users\jenkins\workspace\Lucene-Solr-5.5-Windows\solr\build\solr-core\test\J0\temp\solr.schema.TestManagedSchemaAPI_CD2CA3F263D747AD-001\tempDir-001\node1: java.nio.file.DirectoryNotEmptyException: C:\Users\jenkins\workspace\Lucene-Solr-5.5-Windows\solr\build\solr-core\test\J0\temp\solr.schema.TestManagedSchemaAPI_CD2CA3F263D747AD-001\tempDir-001\node1    C:\Users\jenkins\workspace\Lucene-Solr-5.5-Windows\solr\build\solr-core\test\J0\temp\solr.schema.TestManagedSchemaAPI_CD2CA3F263D747AD-001\tempDir-001: java.nio.file.DirectoryNotEmptyException: C:\Users\jenkins\workspace\Lucene-Solr-5.5-Windows\solr\build\solr-core\test\J0\temp\solr.schema.TestManagedSchemaAPI_CD2CA3F263D747AD-001\tempDir-001    C:\Users\jenkins\workspace\Lucene-Solr-5.5-Windows\solr\build\solr-core\test\J0\temp\solr.schema.TestManagedSchemaAPI_CD2CA3F263D747AD-001: java.nio.file.DirectoryNotEmptyException: C:\Users\jenkins\workspace\Lucene-Solr-5.5-Windows\solr\build\solr-core\test\J0\temp\solr.schema.TestManagedSchemaAPI_CD2CA3F263D747AD-001 

Stack Trace:
java.io.IOException: Could not remove the following files (in the order of attempts):
   C:\Users\jenkins\workspace\Lucene-Solr-5.5-Windows\solr\build\solr-core\test\J0\temp\solr.schema.TestManagedSchemaAPI_CD2CA3F263D747AD-001\tempDir-001\node2\testschemaapi_shard1_replica1\data\tlog\tlog.0000000000000000001: java.nio.file.FileSystemException: C:\Users\jenkins\workspace\Lucene-Solr-5.5-Windows\solr\build\solr-core\test\J0\temp\solr.schema.TestManagedSchemaAPI_CD2CA3F263D747AD-001\tempDir-001\node2\testschemaapi_shard1_replica1\data\tlog\tlog.0000000000000000001: The process cannot access the file because it is being used by another process.

   C:\Users\jenkins\workspace\Lucene-Solr-5.5-Windows\solr\build\solr-core\test\J0\temp\solr.schema.TestManagedSchemaAPI_CD2CA3F263D747AD-001\tempDir-001\node2\testschemaapi_shard1_replica1\data\tlog: java.nio.file.DirectoryNotEmptyException: C:\Users\jenkins\workspace\Lucene-Solr-5.5-Windows\solr\build\solr-core\test\J0\temp\solr.schema.TestManagedSchemaAPI_CD2CA3F263D747AD-001\tempDir-001\node2\testschemaapi_shard1_replica1\data\tlog
   C:\Users\jenkins\workspace\Lucene-Solr-5.5-Windows\solr\build\solr-core\test\J0\temp\solr.schema.TestManagedSchemaAPI_CD2CA3F263D747AD-001\tempDir-001\node2\testschemaapi_shard1_replica1\data: java.nio.file.DirectoryNotEmptyException: C:\Users\jenkins\workspace\Lucene-Solr-5.5-Windows\solr\build\solr-core\test\J0\temp\solr.schema.TestManagedSchemaAPI_CD2CA3F263D747AD-001\tempDir-001\node2\testschemaapi_shard1_replica1\data
   C:\Users\jenkins\workspace\Lucene-Solr-5.5-Windows\solr\build\solr-core\test\J0\temp\solr.schema.TestManagedSchemaAPI_CD2CA3F263D747AD-001\tempDir-001\node2\testschemaapi_shard1_replica1: java.nio.file.DirectoryNotEmptyException: C:\Users\jenkins\workspace\Lucene-Solr-5.5-Windows\solr\build\solr-core\test\J0\temp\solr.schema.TestManagedSchemaAPI_CD2CA3F263D747AD-001\tempDir-001\node2\testschemaapi_shard1_replica1
   C:\Users\jenkins\workspace\Lucene-Solr-5.5-Windows\solr\build\solr-core\test\J0\temp\solr.schema.TestManagedSchemaAPI_CD2CA3F263D747AD-001\tempDir-001\node2: java.nio.file.DirectoryNotEmptyException: C:\Users\jenkins\workspace\Lucene-Solr-5.5-Windows\solr\build\solr-core\test\J0\temp\solr.schema.TestManagedSchemaAPI_CD2CA3F263D747AD-001\tempDir-001\node2
   C:\Users\jenkins\workspace\Lucene-Solr-5.5-Windows\solr\build\solr-core\test\J0\temp\solr.schema.TestManagedSchemaAPI_CD2CA3F263D747AD-001\tempDir-001\node1\testschemaapi_shard1_replica2\data\tlog\tlog.0000000000000000000: java.nio.file.FileSystemException: C:\Users\jenkins\workspace\Lucene-Solr-5.5-Windows\solr\build\solr-core\test\J0\temp\solr.schema.TestManagedSchemaAPI_CD2CA3F263D747AD-001\tempDir-001\node1\testschemaapi_shard1_replica2\data\tlog\tlog.0000000000000000000: The process cannot access the file because it is being used by another process.

   C:\Users\jenkins\workspace\Lucene-Solr-5.5-Windows\solr\build\solr-core\test\J0\temp\solr.schema.TestManagedSchemaAPI_CD2CA3F263D747AD-001\tempDir-001\node1\testschemaapi_shard1_replica2\data\tlog: java.nio.file.DirectoryNotEmptyException: C:\Users\jenkins\workspace\Lucene-Solr-5.5-Windows\solr\build\solr-core\test\J0\temp\solr.schema.TestManagedSchemaAPI_CD2CA3F263D747AD-001\tempDir-001\node1\testschemaapi_shard1_replica2\data\tlog
   C:\Users\jenkins\workspace\Lucene-Solr-5.5-Windows\solr\build\solr-core\test\J0\temp\solr.schema.TestManagedSchemaAPI_CD2CA3F263D747AD-001\tempDir-001\node1\testschemaapi_shard1_replica2\data: java.nio.file.DirectoryNotEmptyException: C:\Users\jenkins\workspace\Lucene-Solr-5.5-Windows\solr\build\solr-core\test\J0\temp\solr.schema.TestManagedSchemaAPI_CD2CA3F263D747AD-001\tempDir-001\node1\testschemaapi_shard1_replica2\data
   C:\Users\jenkins\workspace\Lucene-Solr-5.5-Windows\solr\build\solr-core\test\J0\temp\solr.schema.TestManagedSchemaAPI_CD2CA3F263D747AD-001\tempDir-001\node1\testschemaapi_shard1_replica2: java.nio.file.DirectoryNotEmptyException: C:\Users\jenkins\workspace\Lucene-Solr-5.5-Windows\solr\build\solr-core\test\J0\temp\solr.schema.TestManagedSchemaAPI_CD2CA3F263D747AD-001\tempDir-001\node1\testschemaapi_shard1_replica2
   C:\Users\jenkins\workspace\Lucene-Solr-5.5-Windows\solr\build\solr-core\test\J0\temp\solr.schema.TestManagedSchemaAPI_CD2CA3F263D747AD-001\tempDir-001\node1: java.nio.file.DirectoryNotEmptyException: C:\Users\jenkins\workspace\Lucene-Solr-5.5-Windows\solr\build\solr-core\test\J0\temp\solr.schema.TestManagedSchemaAPI_CD2CA3F263D747AD-001\tempDir-001\node1
   C:\Users\jenkins\workspace\Lucene-Solr-5.5-Windows\solr\build\solr-core\test\J0\temp\solr.schema.TestManagedSchemaAPI_CD2CA3F263D747AD-001\tempDir-001: java.nio.file.DirectoryNotEmptyException: C:\Users\jenkins\workspace\Lucene-Solr-5.5-Windows\solr\build\solr-core\test\J0\temp\solr.schema.TestManagedSchemaAPI_CD2CA3F263D747AD-001\tempDir-001
   C:\Users\jenkins\workspace\Lucene-Solr-5.5-Windows\solr\build\solr-core\test\J0\temp\solr.schema.TestManagedSchemaAPI_CD2CA3F263D747AD-001: java.nio.file.DirectoryNotEmptyException: C:\Users\jenkins\workspace\Lucene-Solr-5.5-Windows\solr\build\solr-core\test\J0\temp\solr.schema.TestManagedSchemaAPI_CD2CA3F263D747AD-001

	at org.apache.lucene.util.IOUtils.rm(IOUtils.java:295)
	at org.apache.lucene.util.TestRuleTemporaryFilesCleanup.afterAlways(TestRuleTemporaryFilesCleanup.java:217)
	at com.carrotsearch.randomizedtesting.rules.TestRuleAdapter$1.afterAlways(TestRuleAdapter.java:31)
	at com.carrotsearch.randomizedtesting.rules.StatementAdapter.evaluate(StatementAdapter.java:43)
	at com.carrotsearch.randomizedtesting.rules.StatementAdapter.evaluate(StatementAdapter.java:36)
	at org.apache.lucene.util.TestRuleAssertionsRequired$1.evaluate(TestRuleAssertionsRequired.java:53)
	at org.apache.lucene.util.TestRuleMarkFailure$1.evaluate(TestRuleMarkFailure.java:47)
	at org.apache.lucene.util.TestRuleIgnoreAfterMaxFailures$1.evaluate(TestRuleIgnoreAfterMaxFailures.java:64)
	at org.apache.lucene.util.TestRuleIgnoreTestSuites$1.evaluate(TestRuleIgnoreTestSuites.java:54)
	at com.carrotsearch.randomizedtesting.rules.StatementAdapter.evaluate(StatementAdapter.java:36)
	at com.carrotsearch.randomizedtesting.ThreadLeakControl$StatementRunner.run(ThreadLeakControl.java:367)
	at java.lang.Thread.run(Thread.java:745)




Build Log:
[...truncated 12258 lines...]
   [junit4] Suite: org.apache.solr.schema.TestManagedSchemaAPI
   [junit4]   2> Creating dataDir: C:\Users\jenkins\workspace\Lucene-Solr-5.5-Windows\solr\build\solr-core\test\J0\temp\solr.schema.TestManagedSchemaAPI_CD2CA3F263D747AD-001\init-core-data-001
   [junit4]   2> 3396620 INFO  (SUITE-TestManagedSchemaAPI-seed#[CD2CA3F263D747AD]-worker) [    ] o.a.s.SolrTestCaseJ4 Randomized ssl (false) and clientAuth (false)
   [junit4]   2> 3396624 INFO  (TEST-TestManagedSchemaAPI.test-seed#[CD2CA3F263D747AD]) [    ] o.a.s.SolrTestCaseJ4 ###Starting test
   [junit4]   2> 3396626 INFO  (TEST-TestManagedSchemaAPI.test-seed#[CD2CA3F263D747AD]) [    ] o.a.s.c.ZkTestServer STARTING ZK TEST SERVER
   [junit4]   2> 3396681 INFO  (Thread-8412) [    ] o.a.s.c.ZkTestServer client port:0.0.0.0/0.0.0.0:0
   [junit4]   2> 3396681 INFO  (Thread-8412) [    ] o.a.s.c.ZkTestServer Starting server
   [junit4]   2> 3396884 INFO  (TEST-TestManagedSchemaAPI.test-seed#[CD2CA3F263D747AD]) [    ] o.a.s.c.ZkTestServer start zk server on port:64088
   [junit4]   2> 3396885 INFO  (TEST-TestManagedSchemaAPI.test-seed#[CD2CA3F263D747AD]) [    ] o.a.s.c.c.SolrZkClient Using default ZkCredentialsProvider
   [junit4]   2> 3396886 INFO  (TEST-TestManagedSchemaAPI.test-seed#[CD2CA3F263D747AD]) [    ] o.a.s.c.c.ConnectionManager Waiting for client to connect to ZooKeeper
   [junit4]   2> 3397201 INFO  (zkCallback-3277-thread-1) [    ] o.a.s.c.c.ConnectionManager Watcher org.apache.solr.common.cloud.ConnectionManager@6961ae1c name:ZooKeeperConnection Watcher:127.0.0.1:64088 got event WatchedEvent state:SyncConnected type:None path:null path:null type:None
   [junit4]   2> 3397202 INFO  (TEST-TestManagedSchemaAPI.test-seed#[CD2CA3F263D747AD]) [    ] o.a.s.c.c.ConnectionManager Client is connected to ZooKeeper
   [junit4]   2> 3397202 INFO  (TEST-TestManagedSchemaAPI.test-seed#[CD2CA3F263D747AD]) [    ] o.a.s.c.c.SolrZkClient Using default ZkACLProvider
   [junit4]   2> 3397202 INFO  (TEST-TestManagedSchemaAPI.test-seed#[CD2CA3F263D747AD]) [    ] o.a.s.c.c.SolrZkClient makePath: /solr/solr.xml
   [junit4]   2> 3397324 INFO  (jetty-launcher-3276-thread-2) [    ] o.e.j.s.Server jetty-9.2.13.v20150730
   [junit4]   2> 3397325 INFO  (jetty-launcher-3276-thread-2) [    ] o.e.j.s.h.ContextHandler Started o.e.j.s.ServletContextHandler@44c546f{/solr,null,AVAILABLE}
   [junit4]   2> 3397331 INFO  (jetty-launcher-3276-thread-1) [    ] o.e.j.s.Server jetty-9.2.13.v20150730
   [junit4]   2> 3397332 INFO  (jetty-launcher-3276-thread-1) [    ] o.e.j.s.h.ContextHandler Started o.e.j.s.ServletContextHandler@5bcbed8d{/solr,null,AVAILABLE}
   [junit4]   2> 3397340 INFO  (jetty-launcher-3276-thread-2) [    ] o.e.j.s.ServerConnector Started ServerConnector@2f3b459d{HTTP/1.1}{127.0.0.1:64092}
   [junit4]   2> 3397341 INFO  (jetty-launcher-3276-thread-2) [    ] o.e.j.s.Server Started @3402107ms
   [junit4]   2> 3397341 INFO  (jetty-launcher-3276-thread-1) [    ] o.e.j.s.ServerConnector Started ServerConnector@2958f310{HTTP/1.1}{127.0.0.1:64095}
   [junit4]   2> 3397341 INFO  (jetty-launcher-3276-thread-2) [    ] o.a.s.c.s.e.JettySolrRunner Jetty properties: {hostPort=64092, hostContext=/solr}
   [junit4]   2> 3397341 INFO  (jetty-launcher-3276-thread-1) [    ] o.e.j.s.Server Started @3402108ms
   [junit4]   2> 3397341 INFO  (jetty-launcher-3276-thread-1) [    ] o.a.s.c.s.e.JettySolrRunner Jetty properties: {hostContext=/solr, hostPort=64095}
   [junit4]   2> 3397341 INFO  (jetty-launcher-3276-thread-1) [    ] o.a.s.s.SolrDispatchFilter SolrDispatchFilter.init(): sun.misc.Launcher$AppClassLoader@2a6d23ea
   [junit4]   2> 3397341 INFO  (jetty-launcher-3276-thread-2) [    ] o.a.s.s.SolrDispatchFilter SolrDispatchFilter.init(): sun.misc.Launcher$AppClassLoader@2a6d23ea
   [junit4]   2> 3397341 INFO  (jetty-launcher-3276-thread-1) [    ] o.a.s.c.SolrResourceLoader new SolrResourceLoader for directory: 'C:\Users\jenkins\workspace\Lucene-Solr-5.5-Windows\solr\build\solr-core\test\J0\temp\solr.schema.TestManagedSchemaAPI_CD2CA3F263D747AD-001\tempDir-001\node1'
   [junit4]   2> 3397341 INFO  (jetty-launcher-3276-thread-2) [    ] o.a.s.c.SolrResourceLoader new SolrResourceLoader for directory: 'C:\Users\jenkins\workspace\Lucene-Solr-5.5-Windows\solr\build\solr-core\test\J0\temp\solr.schema.TestManagedSchemaAPI_CD2CA3F263D747AD-001\tempDir-001\node2'
   [junit4]   2> 3397342 INFO  (jetty-launcher-3276-thread-1) [    ] o.a.s.c.SolrResourceLoader JNDI not configured for solr (NoInitialContextEx)
   [junit4]   2> 3397342 INFO  (jetty-launcher-3276-thread-1) [    ] o.a.s.c.SolrResourceLoader solr home defaulted to 'solr/' (could not find system property or JNDI)
   [junit4]   2> 3397342 INFO  (jetty-launcher-3276-thread-2) [    ] o.a.s.c.SolrResourceLoader JNDI not configured for solr (NoInitialContextEx)
   [junit4]   2> 3397342 INFO  (jetty-launcher-3276-thread-2) [    ] o.a.s.c.SolrResourceLoader solr home defaulted to 'solr/' (could not find system property or JNDI)
   [junit4]   2> 3397342 INFO  (jetty-launcher-3276-thread-1) [    ] o.a.s.c.c.SolrZkClient Using default ZkCredentialsProvider
   [junit4]   2> 3397343 INFO  (jetty-launcher-3276-thread-1) [    ] o.a.s.c.c.ConnectionManager Waiting for client to connect to ZooKeeper
   [junit4]   2> 3397344 INFO  (jetty-launcher-3276-thread-2) [    ] o.a.s.c.c.SolrZkClient Using default ZkCredentialsProvider
   [junit4]   2> 3397345 INFO  (jetty-launcher-3276-thread-2) [    ] o.a.s.c.c.ConnectionManager Waiting for client to connect to ZooKeeper
   [junit4]   2> 3397439 INFO  (zkCallback-3279-thread-1) [    ] o.a.s.c.c.ConnectionManager Watcher org.apache.solr.common.cloud.ConnectionManager@5c6c0415 name:ZooKeeperConnection Watcher:127.0.0.1:64088/solr got event WatchedEvent state:SyncConnected type:None path:null path:null type:None
   [junit4]   2> 3397439 INFO  (jetty-launcher-3276-thread-2) [    ] o.a.s.c.c.ConnectionManager Client is connected to ZooKeeper
   [junit4]   2> 3397439 INFO  (jetty-launcher-3276-thread-2) [    ] o.a.s.c.c.SolrZkClient Using default ZkACLProvider
   [junit4]   2> 3397441 INFO  (jetty-launcher-3276-thread-2) [    ] o.a.s.s.SolrDispatchFilter solr.xml found in ZooKeeper. Loading...
   [junit4]   2> 3397449 INFO  (zkCallback-3278-thread-1) [    ] o.a.s.c.c.ConnectionManager Watcher org.apache.solr.common.cloud.ConnectionManager@7b263418 name:ZooKeeperConnection Watcher:127.0.0.1:64088/solr got event WatchedEvent state:SyncConnected type:None path:null path:null type:None
   [junit4]   2> 3397449 INFO  (jetty-launcher-3276-thread-1) [    ] o.a.s.c.c.ConnectionManager Client is connected to ZooKeeper
   [junit4]   2> 3397449 INFO  (jetty-launcher-3276-thread-1) [    ] o.a.s.c.c.SolrZkClient Using default ZkACLProvider
   [junit4]   2> 3397450 INFO  (jetty-launcher-3276-thread-1) [    ] o.a.s.s.SolrDispatchFilter solr.xml found in ZooKeeper. Loading...
   [junit4]   2> 3397485 INFO  (jetty-launcher-3276-thread-2) [    ] o.a.s.c.CorePropertiesLocator Config-defined core root directory: C:\Users\jenkins\workspace\Lucene-Solr-5.5-Windows\solr\build\solr-core\test\J0\temp\solr.schema.TestManagedSchemaAPI_CD2CA3F263D747AD-001\tempDir-001\node2\.
   [junit4]   2> 3397486 INFO  (jetty-launcher-3276-thread-2) [    ] o.a.s.c.CoreContainer New CoreContainer 1251791790
   [junit4]   2> 3397486 INFO  (jetty-launcher-3276-thread-2) [    ] o.a.s.c.CoreContainer Loading cores into CoreContainer [instanceDir=C:\Users\jenkins\workspace\Lucene-Solr-5.5-Windows\solr\build\solr-core\test\J0\temp\solr.schema.TestManagedSchemaAPI_CD2CA3F263D747AD-001\tempDir-001\node2]
   [junit4]   2> 3397486 WARN  (jetty-launcher-3276-thread-2) [    ] o.a.s.c.CoreContainer Couldn't add files from C:\Users\jenkins\workspace\Lucene-Solr-5.5-Windows\solr\build\solr-core\test\J0\temp\solr.schema.TestManagedSchemaAPI_CD2CA3F263D747AD-001\tempDir-001\node2\lib to classpath: C:\Users\jenkins\workspace\Lucene-Solr-5.5-Windows\solr\build\solr-core\test\J0\temp\solr.schema.TestManagedSchemaAPI_CD2CA3F263D747AD-001\tempDir-001\node2\lib
   [junit4]   2> 3397487 INFO  (jetty-launcher-3276-thread-2) [    ] o.a.s.h.c.HttpShardHandlerFactory created with socketTimeout : 90000,urlScheme : ,connTimeout : 15000,maxConnectionsPerHost : 20,maxConnections : 10000,corePoolSize : 0,maximumPoolSize : 2147483647,maxThreadIdleTime : 5,sizeOfQueue : -1,fairnessPolicy : false,useRetries : false,
   [junit4]   2> 3397488 INFO  (jetty-launcher-3276-thread-2) [    ] o.a.s.u.UpdateShardHandler Creating UpdateShardHandler HTTP client with params: socketTimeout=340000&connTimeout=45000&retry=true
   [junit4]   2> 3397489 INFO  (jetty-launcher-3276-thread-2) [    ] o.a.s.l.LogWatcher SLF4J impl is org.slf4j.impl.Log4jLoggerFactory
   [junit4]   2> 3397489 INFO  (jetty-launcher-3276-thread-2) [    ] o.a.s.l.LogWatcher Registering Log Listener [Log4j (org.slf4j.impl.Log4jLoggerFactory)]
   [junit4]   2> 3397489 INFO  (jetty-launcher-3276-thread-2) [    ] o.a.s.c.ZkContainer Zookeeper client=127.0.0.1:64088/solr
   [junit4]   2> 3397489 INFO  (jetty-launcher-3276-thread-2) [    ] o.a.s.c.ZkController zkHost includes chroot
   [junit4]   2> 3397489 INFO  (jetty-launcher-3276-thread-2) [    ] o.a.s.c.c.SolrZkClient Using default ZkCredentialsProvider
   [junit4]   2> 3397491 WARN  (NIOServerCxn.Factory:0.0.0.0/0.0.0.0:0) [    ] o.a.z.s.NIOServerCnxn caught end of stream exception
   [junit4]   2> EndOfStreamException: Unable to read additional data from client sessionid 0x15575b36be80001, likely client has closed socket
   [junit4]   2> 	at org.apache.zookeeper.server.NIOServerCnxn.doIO(NIOServerCnxn.java:228)
   [junit4]   2> 	at org.apache.zookeeper.server.NIOServerCnxnFactory.run(NIOServerCnxnFactory.java:208)
   [junit4]   2> 	at java.lang.Thread.run(Thread.java:745)
   [junit4]   2> 3397491 INFO  (jetty-launcher-3276-thread-2) [    ] o.a.s.c.c.ConnectionManager Waiting for client to connect to ZooKeeper
   [junit4]   2> 3397492 INFO  (jetty-launcher-3276-thread-1) [    ] o.a.s.c.CorePropertiesLocator Config-defined core root directory: C:\Users\jenkins\workspace\Lucene-Solr-5.5-Windows\solr\build\solr-core\test\J0\temp\solr.schema.TestManagedSchemaAPI_CD2CA3F263D747AD-001\tempDir-001\node1\.
   [junit4]   2> 3397492 INFO  (jetty-launcher-3276-thread-1) [    ] o.a.s.c.CoreContainer New CoreContainer 81534774
   [junit4]   2> 3397492 INFO  (jetty-launcher-3276-thread-1) [    ] o.a.s.c.CoreContainer Loading cores into CoreContainer [instanceDir=C:\Users\jenkins\workspace\Lucene-Solr-5.5-Windows\solr\build\solr-core\test\J0\temp\solr.schema.TestManagedSchemaAPI_CD2CA3F263D747AD-001\tempDir-001\node1]
   [junit4]   2> 3397493 WARN  (jetty-launcher-3276-thread-1) [    ] o.a.s.c.CoreContainer Couldn't add files from C:\Users\jenkins\workspace\Lucene-Solr-5.5-Windows\solr\build\solr-core\test\J0\temp\solr.schema.TestManagedSchemaAPI_CD2CA3F263D747AD-001\tempDir-001\node1\lib to classpath: C:\Users\jenkins\workspace\Lucene-Solr-5.5-Windows\solr\build\solr-core\test\J0\temp\solr.schema.TestManagedSchemaAPI_CD2CA3F263D747AD-001\tempDir-001\node1\lib
   [junit4]   2> 3397493 INFO  (jetty-launcher-3276-thread-1) [    ] o.a.s.h.c.HttpShardHandlerFactory created with socketTimeout : 90000,urlScheme : ,connTimeout : 15000,maxConnectionsPerHost : 20,maxConnections : 10000,corePoolSize : 0,maximumPoolSize : 2147483647,maxThreadIdleTime : 5,sizeOfQueue : -1,fairnessPolicy : false,useRetries : false,
   [junit4]   2> 3397494 INFO  (jetty-launcher-3276-thread-1) [    ] o.a.s.u.UpdateShardHandler Creating UpdateShardHandler HTTP client with params: socketTimeout=340000&connTimeout=45000&retry=true
   [junit4]   2> 3397495 INFO  (jetty-launcher-3276-thread-1) [    ] o.a.s.l.LogWatcher SLF4J impl is org.slf4j.impl.Log4jLoggerFactory
   [junit4]   2> 3397495 INFO  (jetty-launcher-3276-thread-1) [    ] o.a.s.l.LogWatcher Registering Log Listener [Log4j (org.slf4j.impl.Log4jLoggerFactory)]
   [junit4]   2> 3397495 INFO  (jetty-launcher-3276-thread-1) [    ] o.a.s.c.ZkContainer Zookeeper client=127.0.0.1:64088/solr
   [junit4]   2> 3397495 INFO  (jetty-launcher-3276-thread-1) [    ] o.a.s.c.ZkController zkHost includes chroot
   [junit4]   2> 3397496 INFO  (jetty-launcher-3276-thread-1) [    ] o.a.s.c.c.SolrZkClient Using default ZkCredentialsProvider
   [junit4]   2> 3397497 INFO  (jetty-launcher-3276-thread-1) [    ] o.a.s.c.c.ConnectionManager Waiting for client to connect to ZooKeeper
   [junit4]   2> 3397500 INFO  (zkCallback-3282-thread-1) [    ] o.a.s.c.c.ConnectionManager Watcher org.apache.solr.common.cloud.ConnectionManager@5d67cca6 name:ZooKeeperConnection Watcher:127.0.0.1:64088 got event WatchedEvent state:SyncConnected type:None path:null path:null type:None
   [junit4]   2> 3397500 INFO  (jetty-launcher-3276-thread-2) [    ] o.a.s.c.c.ConnectionManager Client is connected to ZooKeeper
   [junit4]   2> 3397501 INFO  (jetty-launcher-3276-thread-2) [    ] o.a.s.c.c.SolrZkClient Using default ZkACLProvider
   [junit4]   2> 3397501 INFO  (zkCallback-3285-thread-1) [    ] o.a.s.c.c.ConnectionManager Watcher org.apache.solr.common.cloud.ConnectionManager@65b4f2f8 name:ZooKeeperConnection Watcher:127.0.0.1:64088 got event WatchedEvent state:SyncConnected type:None path:null path:null type:None
   [junit4]   2> 3397501 INFO  (jetty-launcher-3276-thread-1) [    ] o.a.s.c.c.ConnectionManager Client is connected to ZooKeeper
   [junit4]   2> 3397501 INFO  (jetty-launcher-3276-thread-1) [    ] o.a.s.c.c.SolrZkClient Using default ZkACLProvider
   [junit4]   2> 3397502 WARN  (NIOServerCxn.Factory:0.0.0.0/0.0.0.0:0) [    ] o.a.z.s.NIOServerCnxn caught end of stream exception
   [junit4]   2> EndOfStreamException: Unable to read additional data from client sessionid 0x15575b36be80003, likely client has closed socket
   [junit4]   2> 	at org.apache.zookeeper.server.NIOServerCnxn.doIO(NIOServerCnxn.java:228)
   [junit4]   2> 	at org.apache.zookeeper.server.NIOServerCnxnFactory.run(NIOServerCnxnFactory.java:208)
   [junit4]   2> 	at java.lang.Thread.run(Thread.java:745)
   [junit4]   2> 3397503 INFO  (jetty-launcher-3276-thread-2) [n:127.0.0.1:64092_solr    ] o.a.s.c.ZkController Added new OnReconnect listener org.apache.solr.cloud.ZkController$6@53115652
   [junit4]   2> 3397504 WARN  (NIOServerCxn.Factory:0.0.0.0/0.0.0.0:0) [    ] o.a.z.s.NIOServerCnxn caught end of stream exception
   [junit4]   2> EndOfStreamException: Unable to read additional data from client sessionid 0x15575b36be80004, likely client has closed socket
   [junit4]   2> 	at org.apache.zookeeper.server.NIOServerCnxn.doIO(NIOServerCnxn.java:228)
   [junit4]   2> 	at org.apache.zookeeper.server.NIOServerCnxnFactory.run(NIOServerCnxnFactory.java:208)
   [junit4]   2> 	at java.lang.Thread.run(Thread.java:745)
   [junit4]   2> 3397505 INFO  (jetty-launcher-3276-thread-2) [n:127.0.0.1:64092_solr    ] o.a.s.c.c.ConnectionManager Waiting for client to connect to ZooKeeper
   [junit4]   2> 3397506 INFO  (jetty-launcher-3276-thread-1) [n:127.0.0.1:64095_solr    ] o.a.s.c.ZkController Added new OnReconnect listener org.apache.solr.cloud.ZkController$6@d75ed3a
   [junit4]   2> 3397507 INFO  (jetty-launcher-3276-thread-1) [n:127.0.0.1:64095_solr    ] o.a.s.c.c.ConnectionManager Waiting for client to connect to ZooKeeper
   [junit4]   2> 3397509 INFO  (zkCallback-3286-thread-1-processing-n:127.0.0.1:64092_solr) [n:127.0.0.1:64092_solr    ] o.a.s.c.c.ConnectionManager Watcher org.apache.solr.common.cloud.ConnectionManager@5b4301dc name:ZooKeeperConnection Watcher:127.0.0.1:64088/solr got event WatchedEvent state:SyncConnected type:None path:null path:null type:None
   [junit4]   2> 3397509 INFO  (zkCallback-3287-thread-1-processing-n:127.0.0.1:64095_solr) [n:127.0.0.1:64095_solr    ] o.a.s.c.c.ConnectionManager Watcher org.apache.solr.common.cloud.ConnectionManager@c2f4153 name:ZooKeeperConnection Watcher:127.0.0.1:64088/solr got event WatchedEvent state:SyncConnected type:None path:null path:null type:None
   [junit4]   2> 3397509 INFO  (jetty-launcher-3276-thread-1) [n:127.0.0.1:64095_solr    ] o.a.s.c.c.ConnectionManager Client is connected to ZooKeeper
   [junit4]   2> 3397509 INFO  (jetty-launcher-3276-thread-2) [n:127.0.0.1:64092_solr    ] o.a.s.c.c.ConnectionManager Client is connected to ZooKeeper
   [junit4]   2> 3397510 INFO  (jetty-launcher-3276-thread-2) [n:127.0.0.1:64092_solr    ] o.a.s.c.c.SolrZkClient makePath: /overseer/queue
   [junit4]   2> 3397510 INFO  (jetty-launcher-3276-thread-1) [n:127.0.0.1:64095_solr    ] o.a.s.c.c.SolrZkClient makePath: /overseer/queue
   [junit4]   2> 3397513 INFO  (jetty-launcher-3276-thread-2) [n:127.0.0.1:64092_solr    ] o.a.s.c.c.SolrZkClient makePath: /overseer/collection-queue-work
   [junit4]   2> 3397513 INFO  (jetty-launcher-3276-thread-1) [n:127.0.0.1:64095_solr    ] o.a.s.c.c.SolrZkClient makePath: /overseer/collection-queue-work
   [junit4]   2> 3397518 INFO  (jetty-launcher-3276-thread-2) [n:127.0.0.1:64092_solr    ] o.a.s.c.c.SolrZkClient makePath: /overseer/collection-map-running
   [junit4]   2> 3397519 INFO  (jetty-launcher-3276-thread-1) [n:127.0.0.1:64095_solr    ] o.a.s.c.c.SolrZkClient makePath: /overseer/collection-map-running
   [junit4]   2> 3397522 INFO  (jetty-launcher-3276-thread-2) [n:127.0.0.1:64092_solr    ] o.a.s.c.c.SolrZkClient makePath: /overseer/collection-map-completed
   [junit4]   2> 3397522 INFO  (jetty-launcher-3276-thread-1) [n:127.0.0.1:64095_solr    ] o.a.s.c.c.SolrZkClient makePath: /overseer/collection-map-completed
   [junit4]   2> 3397525 INFO  (jetty-launcher-3276-thread-2) [n:127.0.0.1:64092_solr    ] o.a.s.c.c.SolrZkClient makePath: /overseer/collection-map-failure
   [junit4]   2> 3397526 INFO  (jetty-launcher-3276-thread-1) [n:127.0.0.1:64095_solr    ] o.a.s.c.c.SolrZkClient makePath: /overseer/collection-map-failure
   [junit4]   2> 3397529 INFO  (jetty-launcher-3276-thread-1) [n:127.0.0.1:64095_solr    ] o.a.s.c.c.SolrZkClient makePath: /live_nodes
   [junit4]   2> 3397530 INFO  (jetty-launcher-3276-thread-2) [n:127.0.0.1:64092_solr    ] o.a.s.c.c.SolrZkClient makePath: /live_nodes
   [junit4]   2> 3397532 INFO  (jetty-launcher-3276-thread-1) [n:127.0.0.1:64095_solr    ] o.a.s.c.c.SolrZkClient makePath: /collections
   [junit4]   2> 3397533 INFO  (jetty-launcher-3276-thread-2) [n:127.0.0.1:64092_solr    ] o.a.s.c.c.SolrZkClient makePath: /collections
   [junit4]   2> 3397536 INFO  (jetty-launcher-3276-thread-1) [n:127.0.0.1:64095_solr    ] o.a.s.c.c.SolrZkClient makePath: /aliases.json
   [junit4]   2> 3397536 INFO  (jetty-launcher-3276-thread-2) [n:127.0.0.1:64092_solr    ] o.a.s.c.c.SolrZkClient makePath: /aliases.json
   [junit4]   2> 3397540 INFO  (jetty-launcher-3276-thread-1) [n:127.0.0.1:64095_solr    ] o.a.s.c.c.SolrZkClient makePath: /clusterstate.json
   [junit4]   2> 3397540 INFO  (jetty-launcher-3276-thread-2) [n:127.0.0.1:64092_solr    ] o.a.s.c.c.SolrZkClient makePath: /clusterstate.json
   [junit4]   2> 3397542 INFO  (jetty-launcher-3276-thread-2) [n:127.0.0.1:64092_solr    ] o.a.s.c.c.SolrZkClient makePath: /security.json
   [junit4]   2> 3397542 INFO  (jetty-launcher-3276-thread-1) [n:127.0.0.1:64095_solr    ] o.a.s.c.c.SolrZkClient makePath: /security.json
   [junit4]   2> 3397544 INFO  (jetty-launcher-3276-thread-1) [n:127.0.0.1:64095_solr    ] o.a.s.c.ZkController Register node as live in ZooKeeper:/live_nodes/127.0.0.1:64095_solr
   [junit4]   2> 3397545 INFO  (jetty-launcher-3276-thread-2) [n:127.0.0.1:64092_solr    ] o.a.s.c.ZkController Register node as live in ZooKeeper:/live_nodes/127.0.0.1:64092_solr
   [junit4]   2> 3397545 INFO  (jetty-launcher-3276-thread-2) [n:127.0.0.1:64092_solr    ] o.a.s.c.c.SolrZkClient makePath: /live_nodes/127.0.0.1:64092_solr
   [junit4]   2> 3397545 INFO  (jetty-launcher-3276-thread-1) [n:127.0.0.1:64095_solr    ] o.a.s.c.c.SolrZkClient makePath: /live_nodes/127.0.0.1:64095_solr
   [junit4]   2> 3397549 INFO  (jetty-launcher-3276-thread-2) [n:127.0.0.1:64092_solr    ] o.a.s.c.c.SolrZkClient makePath: /overseer_elect
   [junit4]   2> 3397549 INFO  (jetty-launcher-3276-thread-1) [n:127.0.0.1:64095_solr    ] o.a.s.c.c.SolrZkClient makePath: /overseer_elect
   [junit4]   2> 3397552 INFO  (jetty-launcher-3276-thread-2) [n:127.0.0.1:64092_solr    ] o.a.s.c.c.SolrZkClient makePath: /overseer_elect/election
   [junit4]   2> 3397552 INFO  (jetty-launcher-3276-thread-1) [n:127.0.0.1:64095_solr    ] o.a.s.c.c.SolrZkClient makePath: /overseer_elect/election
   [junit4]   2> 3397555 INFO  (jetty-launcher-3276-thread-1) [n:127.0.0.1:64095_solr    ] o.a.s.c.Overseer Overseer (id=null) closing
   [junit4]   2> 3397555 INFO  (jetty-launcher-3276-thread-2) [n:127.0.0.1:64092_solr    ] o.a.s.c.Overseer Overseer (id=null) closing
   [junit4]   2> 3397556 INFO  (jetty-launcher-3276-thread-1) [n:127.0.0.1:64095_solr    ] o.a.s.c.LeaderElector Joined leadership election with path: /overseer_elect/election/96112380528295942-127.0.0.1:64095_solr-n_0000000000
   [junit4]   2> 3397556 INFO  (jetty-launcher-3276-thread-2) [n:127.0.0.1:64092_solr    ] o.a.s.c.LeaderElector Joined leadership election with path: /overseer_elect/election/96112380528295941-127.0.0.1:64092_solr-n_0000000001
   [junit4]   2> 3397558 INFO  (jetty-launcher-3276-thread-1) [n:127.0.0.1:64095_solr    ] o.a.s.c.OverseerElectionContext I am going to be the leader 127.0.0.1:64095_solr
   [junit4]   2> 3397558 INFO  (jetty-launcher-3276-thread-1) [n:127.0.0.1:64095_solr    ] o.a.s.c.c.SolrZkClient makePath: /overseer_elect/leader
   [junit4]   2> 3397558 INFO  (jetty-launcher-3276-thread-2) [n:127.0.0.1:64092_solr    ] o.a.s.c.LeaderElector Watching path /overseer_elect/election/96112380528295942-127.0.0.1:64095_solr-n_0000000000 to know if I could be the leader
   [junit4]   2> 3397558 INFO  (jetty-launcher-3276-thread-2) [n:127.0.0.1:64092_solr    ] o.a.s.c.c.ZkStateReader Updating cluster state from ZooKeeper... 
   [junit4]   2> 3397560 INFO  (jetty-launcher-3276-thread-1) [n:127.0.0.1:64095_solr    ] o.a.s.c.Overseer Overseer (id=96112380528295942-127.0.0.1:64095_solr-n_0000000000) starting
   [junit4]   2> 3397564 INFO  (jetty-launcher-3276-thread-1) [n:127.0.0.1:64095_solr    ] o.a.s.c.c.SolrZkClient makePath: /overseer/queue-work
   [junit4]   2> 3397574 INFO  (jetty-launcher-3276-thread-1) [n:127.0.0.1:64095_solr    ] o.a.s.c.OverseerAutoReplicaFailoverThread Starting OverseerAutoReplicaFailoverThread autoReplicaFailoverWorkLoopDelay=10000 autoReplicaFailoverWaitAfterExpiration=30000 autoReplicaFailoverBadNodeExpiration=60000
   [junit4]   2> 3397575 INFO  (jetty-launcher-3276-thread-1) [n:127.0.0.1:64095_solr    ] o.a.s.c.c.ZkStateReader Updating cluster state from ZooKeeper... 
   [junit4]   2> 3397578 INFO  (OverseerCollectionConfigSetProcessor-96112380528295942-127.0.0.1:64095_solr-n_0000000000) [n:127.0.0.1:64095_solr    ] o.a.s.c.OverseerTaskProcessor Process current queue of overseer operations
   [junit4]   2> 3397582 INFO  (OverseerStateUpdate-96112380528295942-127.0.0.1:64095_solr-n_0000000000) [n:127.0.0.1:64095_solr    ] o.a.s.c.Overseer Starting to work on the main queue
   [junit4]   2> 3397588 INFO  (jetty-launcher-3276-thread-2) [n:127.0.0.1:64092_solr    ] o.a.s.c.CoreContainer Security conf doesn't exist. Skipping setup for authorization module.
   [junit4]   2> 3397589 INFO  (jetty-launcher-3276-thread-2) [n:127.0.0.1:64092_solr    ] o.a.s.c.CoreContainer No authentication plugin used.
   [junit4]   2> 3397590 INFO  (jetty-launcher-3276-thread-2) [n:127.0.0.1:64092_solr    ] o.a.s.c.CorePropertiesLocator Looking for core definitions underneath C:\Users\jenkins\workspace\Lucene-Solr-5.5-Windows\solr\build\solr-core\test\J0\temp\solr.schema.TestManagedSchemaAPI_CD2CA3F263D747AD-001\tempDir-001\node2\.
   [junit4]   2> 3397591 INFO  (jetty-launcher-3276-thread-2) [n:127.0.0.1:64092_solr    ] o.a.s.c.CorePropertiesLocator Found 0 core definitions
   [junit4]   2> 3397592 INFO  (jetty-launcher-3276-thread-2) [n:127.0.0.1:64092_solr    ] o.a.s.s.SolrDispatchFilter user.dir=C:\Users\jenkins\workspace\Lucene-Solr-5.5-Windows\solr\build\solr-core\test\J0
   [junit4]   2> 3397592 INFO  (jetty-launcher-3276-thread-2) [n:127.0.0.1:64092_solr    ] o.a.s.s.SolrDispatchFilter SolrDispatchFilter.init() done
   [junit4]   2> 3397601 INFO  (jetty-launcher-3276-thread-1) [n:127.0.0.1:64095_solr    ] o.a.s.c.CoreContainer Security conf doesn't exist. Skipping setup for authorization module.
   [junit4]   2> 3397601 INFO  (jetty-launcher-3276-thread-1) [n:127.0.0.1:64095_solr    ] o.a.s.c.CoreContainer No authentication plugin used.
   [junit4]   2> 3397602 INFO  (jetty-launcher-3276-thread-1) [n:127.0.0.1:64095_solr    ] o.a.s.c.CorePropertiesLocator Looking for core definitions underneath C:\Users\jenkins\workspace\Lucene-Solr-5.5-Windows\solr\build\solr-core\test\J0\temp\solr.schema.TestManagedSchemaAPI_CD2CA3F263D747AD-001\tempDir-001\node1\.
   [junit4]   2> 3397602 INFO  (jetty-launcher-3276-thread-1) [n:127.0.0.1:64095_solr    ] o.a.s.c.CorePropertiesLocator Found 0 core definitions
   [junit4]   2> 3397603 INFO  (jetty-launcher-3276-thread-1) [n:127.0.0.1:64095_solr    ] o.a.s.s.SolrDispatchFilter user.dir=C:\Users\jenkins\workspace\Lucene-Solr-5.5-Windows\solr\build\solr-core\test\J0
   [junit4]   2> 3397604 INFO  (jetty-launcher-3276-thread-1) [n:127.0.0.1:64095_solr    ] o.a.s.s.SolrDispatchFilter SolrDispatchFilter.init() done
   [junit4]   2> 3397604 INFO  (TEST-TestManagedSchemaAPI.test-seed#[CD2CA3F263D747AD]) [    ] o.a.s.c.c.SolrZkClient Using default ZkCredentialsProvider
   [junit4]   2> 3397605 INFO  (TEST-TestManagedSchemaAPI.test-seed#[CD2CA3F263D747AD]) [    ] o.a.s.c.c.ConnectionManager Waiting for client to connect to ZooKeeper
   [junit4]   2> 3397681 INFO  (zkCallback-3288-thread-1) [    ] o.a.s.c.c.ConnectionManager Watcher org.apache.solr.common.cloud.ConnectionManager@22879e2b name:ZooKeeperConnection Watcher:127.0.0.1:64088 got event WatchedEvent state:SyncConnected type:None path:null path:null type:None
   [junit4]   2> 3397681 INFO  (TEST-TestManagedSchemaAPI.test-seed#[CD2CA3F263D747AD]) [    ] o.a.s.c.c.ConnectionManager Client is connected to ZooKeeper
   [junit4]   2> 3397682 INFO  (TEST-TestManagedSchemaAPI.test-seed#[CD2CA3F263D747AD]) [    ] o.a.s.c.c.SolrZkClient Using default ZkACLProvider
   [junit4]   2> 3397702 INFO  (TEST-TestManagedSchemaAPI.test-seed#[CD2CA3F263D747AD]) [    ] o.a.s.c.c.SolrZkClient Using default ZkCredentialsProvider
   [junit4]   2> 3397703 INFO  (TEST-TestManagedSchemaAPI.test-seed#[CD2CA3F263D747AD]) [    ] o.a.s.c.c.ConnectionManager Waiting for client to connect to ZooKeeper
   [junit4]   2> 3397788 INFO  (zkCallback-3290-thread-1) [    ] o.a.s.c.c.ConnectionManager Watcher org.apache.solr.common.cloud.ConnectionManager@4b99f009 name:ZooKeeperConnection Watcher:127.0.0.1:64088/solr got event WatchedEvent state:SyncConnected type:None path:null path:null type:None
   [junit4]   2> 3397788 INFO  (TEST-TestManagedSchemaAPI.test-seed#[CD2CA3F263D747AD]) [    ] o.a.s.c.c.ConnectionManager Client is connected to ZooKeeper
   [junit4]   2> 3397788 INFO  (TEST-TestManagedSchemaAPI.test-seed#[CD2CA3F263D747AD]) [    ] o.a.s.c.c.SolrZkClient Using default ZkACLProvider
   [junit4]   2> 3397798 INFO  (TEST-TestManagedSchemaAPI.test-seed#[CD2CA3F263D747AD]) [    ] o.a.s.c.c.SolrZkClient makePath: /configs/conf1/managed-schema
   [junit4]   2> 3397867 INFO  (TEST-TestManagedSchemaAPI.test-seed#[CD2CA3F263D747AD]) [    ] o.a.s.c.c.SolrZkClient makePath: /configs/conf1/solrconfig.xml
   [junit4]   2> 3397871 INFO  (TEST-TestManagedSchemaAPI.test-seed#[CD2CA3F263D747AD]) [    ] o.a.s.c.c.SolrZkClient Using default ZkCredentialsProvider
   [junit4]   2> 3397872 INFO  (TEST-TestManagedSchemaAPI.test-seed#[CD2CA3F263D747AD]) [    ] o.a.s.c.c.ConnectionManager Waiting for client to connect to ZooKeeper
   [junit4]   2> 3397914 INFO  (zkCallback-3291-thread-1) [    ] o.a.s.c.c.ConnectionManager Watcher org.apache.solr.common.cloud.ConnectionManager@57275a80 name:ZooKeeperConnection Watcher:127.0.0.1:64088/solr got event WatchedEvent state:SyncConnected type:None path:null path:null type:None
   [junit4]   2> 3397923 INFO  (TEST-TestManagedSchemaAPI.test-seed#[CD2CA3F263D747AD]) [    ] o.a.s.c.c.ConnectionManager Client is connected to ZooKeeper
   [junit4]   2> 3397923 INFO  (TEST-TestManagedSchemaAPI.test-seed#[CD2CA3F263D747AD]) [    ] o.a.s.c.c.SolrZkClient Using default ZkACLProvider
   [junit4]   2> 3397924 INFO  (TEST-TestManagedSchemaAPI.test-seed#[CD2CA3F263D747AD]) [    ] o.a.s.c.c.ZkStateReader Updating cluster state from ZooKeeper... 
   [junit4]   2> 3397990 INFO  (qtp795259837-22244) [n:127.0.0.1:64095_solr    ] o.a.s.h.a.CollectionsHandler Invoked Collection Action :create with params wt=javabin&action=CREATE&numShards=1&name=testschemaapi&collection.configName=conf1&version=2&replicationFactor=2 and sendToOCPQueue=true
   [junit4]   2> 3398065 INFO  (OverseerCollectionConfigSetProcessor-96112380528295942-127.0.0.1:64095_solr-n_0000000000) [n:127.0.0.1:64095_solr    ] o.a.s.c.OverseerTaskProcessor Overseer Collection Message Handler: Get the message id:/overseer/collection-queue-work/qn-0000000000 message:{
   [junit4]   2>   "name":"testschemaapi",
   [junit4]   2>   "fromApi":"true",
   [junit4]   2>   "replicationFactor":"2",
   [junit4]   2>   "collection.configName":"conf1",
   [junit4]   2>   "numShards":"1",
   [junit4]   2>   "stateFormat":"2",
   [junit4]   2>   "operation":"create"}
   [junit4]   2> 3398068 INFO  (OverseerThreadFactory-10009-thread-1-processing-n:127.0.0.1:64095_solr) [n:127.0.0.1:64095_solr    ] o.a.s.c.OverseerCollectionMessageHandler OverseerCollectionMessageHandler.processMessage : create , {
   [junit4]   2>   "name":"testschemaapi",
   [junit4]   2>   "fromApi":"true",
   [junit4]   2>   "replicationFactor":"2",
   [junit4]   2>   "collection.configName":"conf1",
   [junit4]   2>   "numShards":"1",
   [junit4]   2>   "stateFormat":"2",
   [junit4]   2>   "operation":"create"}
   [junit4]   2> 3398100 INFO  (OverseerThreadFactory-10009-thread-1-processing-n:127.0.0.1:64095_solr) [n:127.0.0.1:64095_solr    ] o.a.s.c.OverseerCollectionMessageHandler Create collection testschemaapi
   [junit4]   2> 3398122 INFO  (OverseerThreadFactory-10009-thread-1-processing-n:127.0.0.1:64095_solr) [n:127.0.0.1:64095_solr    ] o.a.s.c.OverseerCollectionMessageHandler creating collections conf node /collections/testschemaapi 
   [junit4]   2> 3398149 INFO  (OverseerThreadFactory-10009-thread-1-processing-n:127.0.0.1:64095_solr) [n:127.0.0.1:64095_solr    ] o.a.s.c.c.SolrZkClient makePath: /collections/testschemaapi
   [junit4]   2> 3398152 INFO  (zkCallback-3291-thread-1) [    ] o.a.s.c.c.ZkStateReader A collections change: [WatchedEvent state:SyncConnected type:NodeChildrenChanged path:/collections], has occurred - updating...
   [junit4]   2> 3398152 INFO  (zkCallback-3287-thread-1-processing-n:127.0.0.1:64095_solr) [n:127.0.0.1:64095_solr    ] o.a.s.c.c.ZkStateReader A collections change: [WatchedEvent state:SyncConnected type:NodeChildrenChanged path:/collections], has occurred - updating...
   [junit4]   2> 3398152 INFO  (zkCallback-3286-thread-1-processing-n:127.0.0.1:64092_solr) [n:127.0.0.1:64092_solr    ] o.a.s.c.c.ZkStateReader A collections change: [WatchedEvent state:SyncConnected type:NodeChildrenChanged path:/collections], has occurred - updating...
   [junit4]   2> 3398165 INFO  (OverseerStateUpdate-96112380528295942-127.0.0.1:64095_solr-n_0000000000) [n:127.0.0.1:64095_solr    ] o.a.s.c.Overseer processMessage: queueSize: 1, message = {
   [junit4]   2>   "name":"testschemaapi",
   [junit4]   2>   "fromApi":"true",
   [junit4]   2>   "replicationFactor":"2",
   [junit4]   2>   "collection.configName":"conf1",
   [junit4]   2>   "numShards":"1",
   [junit4]   2>   "stateFormat":"2",
   [junit4]   2>   "operation":"create"} current state version: 0
   [junit4]   2> 3398165 INFO  (OverseerStateUpdate-96112380528295942-127.0.0.1:64095_solr-n_0000000000) [n:127.0.0.1:64095_solr    ] o.a.s.c.o.ClusterStateMutator building a new cName: testschemaapi
   [junit4]   2> 3398166 INFO  (OverseerStateUpdate-96112380528295942-127.0.0.1:64095_solr-n_0000000000) [n:127.0.0.1:64095_solr    ] o.a.s.c.o.ZkStateWriter going to create_collection /collections/testschemaapi/state.json
   [junit4]   2> 3398292 INFO  (OverseerThreadFactory-10009-thread-1-processing-n:127.0.0.1:64095_solr) [n:127.0.0.1:64095_solr    ] o.a.s.c.OverseerCollectionMessageHandler Creating SolrCores for new collection testschemaapi, shardNames [shard1] , replicationFactor : 2
   [junit4]   2> 3398293 INFO  (OverseerThreadFactory-10009-thread-1-processing-n:127.0.0.1:64095_solr) [n:127.0.0.1:64095_solr    ] o.a.s.c.OverseerCollectionMessageHandler Creating core testschemaapi_shard1_replica2 as part of shard shard1 of collection testschemaapi on 127.0.0.1:64095_solr
   [junit4]   2> 3398309 INFO  (OverseerThreadFactory-10009-thread-1-processing-n:127.0.0.1:64095_solr) [n:127.0.0.1:64095_solr    ] o.a.s.c.OverseerCollectionMessageHandler Creating core testschemaapi_shard1_replica1 as part of shard shard1 of collection testschemaapi on 127.0.0.1:64092_solr
   [junit4]   2> 3398340 INFO  (qtp795259837-22245) [n:127.0.0.1:64095_solr    ] o.a.s.h.a.CoreAdminOperation core create command wt=javabin&action=CREATE&collection=testschemaapi&name=testschemaapi_shard1_replica2&numShards=1&shard=shard1&qt=/admin/cores&collection.configName=conf1&version=2
   [junit4]   2> 3398419 INFO  (qtp646579551-22233) [n:127.0.0.1:64092_solr    ] o.a.s.h.a.CoreAdminOperation core create command wt=javabin&action=CREATE&collection=testschemaapi&name=testschemaapi_shard1_replica1&numShards=1&shard=shard1&qt=/admin/cores&collection.configName=conf1&version=2
   [junit4]   2> 3398424 INFO  (qtp795259837-22245) [n:127.0.0.1:64095_solr    ] o.a.s.c.CoreDescriptor Created CoreDescriptor: {loadOnStartup=true, numShards=1, name=testschemaapi_shard1_replica2, configSetProperties=configsetprops.json, shard=shard1, dataDir=data\, collection.configName=conf1, config=solrconfig.xml, schema=schema.xml, transient=false, collection=testschemaapi}
   [junit4]   2> 3398425 INFO  (qtp646579551-22233) [n:127.0.0.1:64092_solr    ] o.a.s.c.CoreDescriptor Created CoreDescriptor: {shard=shard1, loadOnStartup=true, collection=testschemaapi, transient=false, numShards=1, config=solrconfig.xml, configSetProperties=configsetprops.json, collection.configName=conf1, dataDir=data\, schema=schema.xml, name=testschemaapi_shard1_replica1}
   [junit4]   2> 3398452 INFO  (qtp795259837-22245) [n:127.0.0.1:64095_solr c:testschemaapi s:shard1  x:testschemaapi_shard1_replica2] o.a.s.c.ZkController publishing state=down
   [junit4]   2> 3398453 INFO  (qtp646579551-22233) [n:127.0.0.1:64092_solr c:testschemaapi s:shard1  x:testschemaapi_shard1_replica1] o.a.s.c.ZkController publishing state=down
   [junit4]   2> 3398457 INFO  (qtp795259837-22245) [n:127.0.0.1:64095_solr c:testschemaapi s:shard1  x:testschemaapi_shard1_replica2] o.a.s.c.ZkController Registering watch for collection testschemaapi
   [junit4]   2> 3398457 INFO  (qtp795259837-22245) [n:127.0.0.1:64095_solr c:testschemaapi s:shard1  x:testschemaapi_shard1_replica2] o.a.s.c.c.ZkStateReader addZkWatch [testschemaapi]
   [junit4]   2> 3398458 INFO  (qtp646579551-22233) [n:127.0.0.1:64092_solr c:testschemaapi s:shard1  x:testschemaapi_shard1_replica1] o.a.s.c.ZkController Registering watch for collection testschemaapi
   [junit4]   2> 3398458 INFO  (OverseerStateUpdate-96112380528295942-127.0.0.1:64095_solr-n_0000000000) [n:127.0.0.1:64095_solr    ] o.a.s.c.Overseer processMessage: queueSize: 2, message = {
   [junit4]   2>   "state":"down",
   [junit4]   2>   "collection":"testschemaapi",
   [junit4]   2>   "numShards":"1",
   [junit4]   2>   "shard":"shard1",
   [junit4]   2>   "roles":null,
   [junit4]   2>   "node_name":"127.0.0.1:64095_solr",
   [junit4]   2>   "base_url":"http://127.0.0.1:64095/solr",
   [junit4]   2>   "core":"testschemaapi_shard1_replica2",
   [junit4]   2>   "operation":"state"} current state version: 0
   [junit4]   2> 3398458 INFO  (qtp646579551-22233) [n:127.0.0.1:64092_solr c:testschemaapi s:shard1  x:testschemaapi_shard1_replica1] o.a.s.c.c.ZkStateReader addZkWatch [testschemaapi]
   [junit4]   2> 3398470 INFO  (qtp795259837-22245) [n:127.0.0.1:64095_solr c:testschemaapi s:shard1  x:testschemaapi_shard1_replica2] o.a.s.c.c.ZkStateReader Add data for [testschemaapi] ver [0]
   [junit4]   2> 3398470 INFO  (qtp795259837-22245) [n:127.0.0.1:64095_solr c:testschemaapi s:shard1  x:testschemaapi_shard1_replica2] o.a.s.c.ZkController look for our core node name
   [junit4]   2> 3398481 INFO  (OverseerStateUpdate-96112380528295942-127.0.0.1:64095_solr-n_0000000000) [n:127.0.0.1:64095_solr    ] o.a.s.c.o.ReplicaMutator Update state numShards=1 message={
   [junit4]   2>   "state":"down",
   [junit4]   2>   "collection":"testschemaapi",
   [junit4]   2>   "numShards":"1",
   [junit4]   2>   "shard":"shard1",
   [junit4]   2>   "roles":null,
   [junit4]   2>   "node_name":"127.0.0.1:64095_solr",
   [junit4]   2>   "base_url":"http://127.0.0.1:64095/solr",
   [junit4]   2>   "core":"testschemaapi_shard1_replica2",
   [junit4]   2>   "operation":"state"}
   [junit4]   2> 3398481 INFO  (qtp646579551-22233) [n:127.0.0.1:64092_solr c:testschemaapi s:shard1  x:testschemaapi_shard1_replica1] o.a.s.c.c.ZkStateReader Add data for [testschemaapi] ver [0]
   [junit4]   2> 3398481 INFO  (qtp646579551-22233) [n:127.0.0.1:64092_solr c:testschemaapi s:shard1  x:testschemaapi_shard1_replica1] o.a.s.c.ZkController look for our core node name
   [junit4]   2> 3398489 INFO  (OverseerStateUpdate-96112380528295942-127.0.0.1:64095_solr-n_0000000000) [n:127.0.0.1:64095_solr    ] o.a.s.c.Overseer processMessage: queueSize: 2, message = {
   [junit4]   2>   "state":"down",
   [junit4]   2>   "collection":"testschemaapi",
   [junit4]   2>   "numShards":"1",
   [junit4]   2>   "shard":"shard1",
   [junit4]   2>   "roles":null,
   [junit4]   2>   "node_name":"127.0.0.1:64092_solr",
   [junit4]   2>   "base_url":"http://127.0.0.1:64092/solr",
   [junit4]   2>   "core":"testschemaapi_shard1_replica1",
   [junit4]   2>   "operation":"state"} current state version: 0
   [junit4]   2> 3398490 INFO  (OverseerStateUpdate-96112380528295942-127.0.0.1:64095_solr-n_0000000000) [n:127.0.0.1:64095_solr    ] o.a.s.c.o.ReplicaMutator Update state numShards=1 message={
   [junit4]   2>   "state":"down",
   [junit4]   2>   "collection":"testschemaapi",
   [junit4]   2>   "numShards":"1",
   [junit4]   2>   "shard":"shard1",
   [junit4]   2>   "roles":null,
   [junit4]   2>   "node_name":"127.0.0.1:64092_solr",
   [junit4]   2>   "base_url":"http://127.0.0.1:64092/solr",
   [junit4]   2>   "core":"testschemaapi_shard1_replica1",
   [junit4]   2>   "operation":"state"}
   [junit4]   2> 3398603 INFO  (OverseerStateUpdate-96112380528295942-127.0.0.1:64095_solr-n_0000000000) [n:127.0.0.1:64095_solr    ] o.a.s.c.o.ZkStateWriter going to update_collection /collections/testschemaapi/state.json version: 0
   [junit4]   2> 3398612 INFO  (zkCallback-3286-thread-1-processing-n:127.0.0.1:64092_solr) [n:127.0.0.1:64092_solr    ] o.a.s.c.c.ZkStateReader A cluster state change: [WatchedEvent state:SyncConnected type:NodeDataChanged path:/collections/testschemaapi/state.json] for collection [testschemaapi] has occurred - updating... (live nodes size: [2])
   [junit4]   2> 3398612 INFO  (zkCallback-3287-thread-2-processing-n:127.0.0.1:64095_solr) [n:127.0.0.1:64095_solr    ] o.a.s.c.c.ZkStateReader A cluster state change: [WatchedEvent state:SyncConnected type:NodeDataChanged path:/collections/testschemaapi/state.json] for collection [testschemaapi] has occurred - updating... (live nodes size: [2])
   [junit4]   2> 3398618 INFO  (zkCallback-3286-thread-1-processing-n:127.0.0.1:64092_solr) [n:127.0.0.1:64092_solr    ] o.a.s.c.c.ZkStateReader Updating data for [testschemaapi] from [0] to [1]
   [junit4]   2> 3398619 INFO  (zkCallback-3287-thread-2-processing-n:127.0.0.1:64095_solr) [n:127.0.0.1:64095_solr    ] o.a.s.c.c.ZkStateReader Updating data for [testschemaapi] from [0] to [1]
   [junit4]   2> 3399474 INFO  (qtp795259837-22245) [n:127.0.0.1:64095_solr c:testschemaapi s:shard1  x:testschemaapi_shard1_replica2] o.a.s.c.ZkController waiting to find shard id in clusterstate for testschemaapi_shard1_replica2
   [junit4]   2> 3399474 INFO  (qtp795259837-22245) [n:127.0.0.1:64095_solr c:testschemaapi s:shard1  x:testschemaapi_shard1_replica2] o.a.s.c.ZkController Check for collection zkNode:testschemaapi
   [junit4]   2> 3399485 INFO  (qtp646579551-22233) [n:127.0.0.1:64092_solr c:testschemaapi s:shard1  x:testschemaapi_shard1_replica1] o.a.s.c.ZkController waiting to find shard id in clusterstate for testschemaapi_shard1_replica1
   [junit4]   2> 3399485 INFO  (qtp646579551-22233) [n:127.0.0.1:64092_solr c:testschemaapi s:shard1  x:testschemaapi_shard1_replica1] o.a.s.c.ZkController Check for collection zkNode:testschemaapi
   [junit4]   2> 3399487 INFO  (qtp646579551-22233) [n:127.0.0.1:64092_solr c:testschemaapi s:shard1  x:testschemaapi_shard1_replica1] o.a.s.c.ZkController Collection zkNode exists
   [junit4]   2> 3399487 INFO  (qtp646579551-22233) [n:127.0.0.1:64092_solr c:testschemaapi s:shard1  x:testschemaapi_shard1_replica1] o.a.s.c.c.ZkStateReader Load collection config from: [/collections/testschemaapi]
   [junit4]   2> 3399493 INFO  (qtp795259837-22245) [n:127.0.0.1:64095_solr c:testschemaapi s:shard1  x:testschemaapi_shard1_replica2] o.a.s.c.ZkController Collection zkNode exists
   [junit4]   2> 3399493 INFO  (qtp795259837-22245) [n:127.0.0.1:64095_solr c:testschemaapi s:shard1  x:testschemaapi_shard1_replica2] o.a.s.c.c.ZkStateReader Load collection config from: [/collections/testschemaapi]
   [junit4]   2> 3399498 INFO  (qtp795259837-22245) [n:127.0.0.1:64095_solr c:testschemaapi s:shard1  x:testschemaapi_shard1_replica2] o.a.s.c.c.ZkStateReader path=[/collections/testschemaapi] [configName]=[conf1] specified config exists in ZooKeeper
   [junit4]   2> 3399498 INFO  (qtp795259837-22245) [n:127.0.0.1:64095_solr c:testschemaapi s:shard1  x:testschemaapi_shard1_replica2] o.a.s.c.SolrResourceLoader new SolrResourceLoader for directory: 'C:\Users\jenkins\workspace\Lucene-Solr-5.5-Windows\solr\build\solr-core\test\J0\temp\solr.schema.TestManagedSchemaAPI_CD2CA3F263D747AD-001\tempDir-001\node1\testschemaapi_shard1_replica2'
   [junit4]   2> 3399500 INFO  (qtp795259837-22245) [n:127.0.0.1:64095_solr c:testschemaapi s:shard1  x:testschemaapi_shard1_replica2] o.a.s.c.SolrResourceLoader JNDI not configured for solr (NoInitialContextEx)
   [junit4]   2> 3399500 INFO  (qtp795259837-22245) [n:127.0.0.1:64095_solr c:testschemaapi s:shard1  x:testschemaapi_shard1_replica2] o.a.s.c.SolrResourceLoader solr home defaulted to 'solr/' (could not find system property or JNDI)
   [junit4]   2> 3399504 INFO  (qtp646579551-22233) [n:127.0.0.1:64092_solr c:testschemaapi s:shard1  x:testschemaapi_shard1_replica1] o.a.s.c.c.ZkStateReader path=[/collections/testschemaapi] [configName]=[conf1] specified config exists in ZooKeeper
   [junit4]   2> 3399504 INFO  (qtp646579551-22233) [n:127.0.0.1:64092_solr c:testschemaapi s:shard1  x:testschemaapi_shard1_replica1] o.a.s.c.SolrResourceLoader new SolrResourceLoader for directory: 'C:\Users\jenkins\workspace\Lucene-Solr-5.5-Windows\solr\build\solr-core\test\J0\temp\solr.schema.TestManagedSchemaAPI_CD2CA3F263D747AD-001\tempDir-001\node2\testschemaapi_shard1_replica1'
   [junit4]   2> 3399504 INFO  (qtp646579551-22233) [n:127.0.0.1:64092_solr c:testschemaapi s:shard1  x:testschemaapi_shard1_replica1] o.a.s.c.SolrResourceLoader JNDI not configured for solr (NoInitialContextEx)
   [junit4]   2> 3399505 INFO  (qtp646579551-22233) [n:127.0.0.1:64092_solr c:testschemaapi s:shard1  x:testschemaapi_shard1_replica1] o.a.s.c.SolrResourceLoader solr home defaulted to 'solr/' (could not find system property or JNDI)
   [junit4]   2> 3399733 INFO  (qtp795259837-22245) [n:127.0.0.1:64095_solr c:testschemaapi s:shard1  x:testschemaapi_shard1_replica2] o.a.s.c.Config loaded config solrconfig.xml with version 0 
   [junit4]   2> 3399734 INFO  (qtp646579551-22233) [n:127.0.0.1:64092_solr c:testschemaapi s:shard1  x:testschemaapi_shard1_replica1] o.a.s.c.Config loaded config solrconfig.xml with version 0 
   [junit4]   2> 3400082 INFO  (qtp795259837-22245) [n:127.0.0.1:64095_solr c:testschemaapi s:shard1  x:testschemaapi_shard1_replica2] o.a.s.c.SolrConfig current version of requestparams : -1
   [junit4]   2> 3400084 INFO  (qtp646579551-22233) [n:127.0.0.1:64092_solr c:testschemaapi s:shard1  x:testschemaapi_shard1_replica1] o.a.s.c.SolrConfig current version of requestparams : -1
   [junit4]   2> 3400100 INFO  (qtp795259837-22245) [n:127.0.0.1:64095_solr c:testschemaapi s:shard1  x:testschemaapi_shard1_replica2] o.a.s.c.SolrConfig Using Lucene MatchVersion: 5.5.2
   [junit4]   2> 3400107 INFO  (qtp646579551-22233) [n:127.0.0.1:64092_solr c:testschemaapi s:shard1  x:testschemaapi_shard1_replica1] o.a.s.c.SolrConfig Using Lucene MatchVersion: 5.5.2
   [junit4]   2> 3400138 INFO  (qtp795259837-22245) [n:127.0.0.1:64095_solr c:testschemaapi s:shard1  x:testschemaapi_shard1_replica2] o.a.s.c.SolrConfig Loaded SolrConfig: solrconfig.xml
   [junit4]   2> 3400145 INFO  (qtp646579551-22233) [n:127.0.0.1:64092_solr c:testschemaapi s:shard1  x:testschemaapi_shard1_replica1] o.a.s.c.SolrConfig Loaded SolrConfig: solrconfig.xml
   [junit4]   2> 3400152 INFO  (qtp795259837-22245) [n:127.0.0.1:64095_solr c:testschemaapi s:shard1  x:testschemaapi_shard1_replica2] o.a.s.s.IndexSchema [testschemaapi_shard1_replica2] Schema name=minimal
   [junit4]   2> 3400210 INFO  (qtp646579551-22233) [n:127.0.0.1:64092_solr c:testschemaapi s:shard1  x:testschemaapi_shard1_replica1] o.a.s.s.IndexSchema [testschemaapi_shard1_replica1] Schema name=minimal
   [junit4]   2> 3400226 INFO  (qtp646579551-22233) [n:127.0.0.1:64092_solr c:testschemaapi s:shard1  x:testschemaapi_shard1_replica1] o.a.s.s.IndexSchema unique key field: id
   [junit4]   2> 3400228 INFO  (qtp646579551-22233) [n:127.0.0.1:64092_solr c:testschemaapi s:shard1  x:testschemaapi_shard1_replica1] o.a.s.c.ConfigSetProperties Did not find ConfigSet properties, assuming default properties: Can't find resource 'configsetprops.json' in classpath or '/configs/conf1', cwd=C:\Users\jenkins\workspace\Lucene-Solr-5.5-Windows\solr\build\solr-core\test\J0
   [junit4]   2> 3400228 INFO  (qtp646579551-22233) [n:127.0.0.1:64092_solr c:testschemaapi s:shard1  x:testschemaapi_shard1_replica1] o.a.s.c.CoreContainer Creating SolrCore 'testschemaapi_shard1_replica1' using configuration from collection testschemaapi
   [junit4]   2> 3400229 INFO  (qtp646579551-22233) [n:127.0.0.1:64092_solr c:testschemaapi s:shard1 r:core_node2 x:testschemaapi_shard1_replica1] o.a.s.c.SolrCore org.apache.solr.core.MockDirectoryFactory
   [junit4]   2> 3400229 INFO  (qtp646579551-22233) [n:127.0.0.1:64092_solr c:testschemaapi s:shard1 r:core_node2 x:testschemaapi_shard1_replica1] o.a.s.c.SolrCore [[testschemaapi_shard1_replica1] ] Opening new SolrCore at [C:\Users\jenkins\workspace\Lucene-Solr-5.5-Windows\solr\build\solr-core\test\J0\temp\solr.schema.TestManagedSchemaAPI_CD2CA3F263D747AD-001\tempDir-001\node2\testschemaapi_shard1_replica1], dataDir=[C:\Users\jenkins\workspace\Lucene-Solr-5.5-Windows\solr\build\solr-core\test\J0\temp\solr.schema.TestManagedSchemaAPI_CD2CA3F263D747AD-001\tempDir-001\node2\.\testschemaapi_shard1_replica1\data\]
   [junit4]   2> 3400229 INFO  (qtp646579551-22233) [n:127.0.0.1:64092_solr c:testschemaapi s:shard1 r:core_node2 x:testschemaapi_shard1_replica1] o.a.s.c.SolrCore JMX monitoring not detected for core: testschemaapi_shard1_replica1
   [junit4]   2> 3400230 INFO  (qtp646579551-22233) [n:127.0.0.1:64092_solr c:testschemaapi s:shard1 r:core_node2 x:testschemaapi_shard1_replica1] o.a.s.c.CachingDirectoryFactory return new directory for C:\Users\jenkins\workspace\Lucene-Solr-5.5-Windows\solr\build\solr-core\test\J0\temp\solr.schema.TestManagedSchemaAPI_CD2CA3F263D747AD-001\tempDir-001\node2\.\testschemaapi_shard1_replica1\data\
   [junit4]   2> 3400247 INFO  (qtp795259837-22245) [n:127.0.0.1:64095_solr c:testschemaapi s:shard1  x:testschemaapi_shard1_replica2] o.a.s.s.IndexSchema unique key field: id
   [junit4]   2> 3400249 INFO  (qtp795259837-22245) [n:127.0.0.1:64095_solr c:testschemaapi s:shard1  x:testschemaapi_shard1_replica2] o.a.s.c.ConfigSetProperties Did not find ConfigSet properties, assuming default properties: Can't find resource 'configsetprops.json' in classpath or '/configs/conf1', cwd=C:\Users\jenkins\workspace\Lucene-Solr-5.5-Windows\solr\build\solr-core\test\J0
   [junit4]   2> 3400250 INFO  (qtp795259837-22245) [n:127.0.0.1:64095_solr c:testschemaapi s:shard1  x:testschemaapi_shard1_replica2] o.a.s.c.CoreContainer Creating SolrCore 'testschemaapi_shard1_replica2' using configuration from collection testschemaapi
   [junit4]   2> 3400250 INFO  (qtp795259837-22245) [n:127.0.0.1:64095_solr c:testschemaapi s:shard1 r:core_node1 x:testschemaapi_shard1_replica2] o.a.s.c.SolrCore org.apache.solr.core.MockDirectoryFactory
   [junit4]   2> 3400250 INFO  (qtp795259837-22245) [n:127.0.0.1:64095_solr c:testschemaapi s:shard1 r:core_node1 x:testschemaapi_shard1_replica2] o.a.s.c.SolrCore [[testschemaapi_shard1_replica2] ] Opening new SolrCore at [C:\Users\jenkins\workspace\Lucene-Solr-5.5-Windows\solr\build\solr-core\test\J0\temp\solr.schema.TestManagedSchemaAPI_CD2CA3F263D747AD-001\tempDir-001\node1\testschemaapi_shard1_replica2], dataDir=[C:\Users\jenkins\workspace\Lucene-Solr-5.5-Windows\solr\build\solr-core\test\J0\temp\solr.schema.TestManagedSchemaAPI_CD2CA3F263D747AD-001\tempDir-001\node1\.\testschemaapi_shard1_replica2\data\]
   [junit4]   2> 3400250 INFO  (qtp795259837-22245) [n:127.0.0.1:64095_solr c:testschemaapi s:shard1 r:core_node1 x:testschemaapi_shard1_replica2] o.a.s.c.SolrCore JMX monitoring not detected for core: testschemaapi_shard1_replica2
   [junit4]   2> 3400251 INFO  (qtp795259837-22245) [n:127.0.0.1:64095_solr c:testschemaapi s:shard1 r:core_node1 x:testschemaapi_shard1_replica2] o.a.s.c.CachingDirectoryFactory return new directory for C:\Users\jenkins\workspace\Lucene-Solr-5.5-Windows\solr\build\solr-core\test\J0\temp\solr.schema.TestManagedSchemaAPI_CD2CA3F263D747AD-001\tempDir-001\node1\.\testschemaapi_shard1_replica2\data\
   [junit4]   2> 3400260 INFO  (qtp646579551-22233) [n:127.0.0.1:64092_solr c:testschemaapi s:shard1 r:core_node2 x:testschemaapi_shard1_replica1] o.a.s.c.SolrCore New index directory detected: old=null new=C:\Users\jenkins\workspace\Lucene-Solr-5.5-Windows\solr\build\solr-core\test\J0\temp\solr.schema.TestManagedSchemaAPI_CD2CA3F263D747AD-001\tempDir-001\node2\.\testschemaapi_shard1_replica1\data\index/
   [junit4]   2> 3400260 INFO  (qtp795259837-22245) [n:127.0.0.1:64095_solr c:testschemaapi s:shard1 r:core_node1 x:testschemaapi_shard1_replica2] o.a.s.c.SolrCore New index directory detected: old=null new=C:\Users\jenkins\workspace\Lucene-Solr-5.5-Windows\solr\build\solr-core\test\J0\temp\solr.schema.TestManagedSchemaAPI_CD2CA3F263D747AD-001\tempDir-001\node1\.\testschemaapi_shard1_replica2\data\index/
   [junit4]   2> 3400260 WARN  (qtp646579551-22233) [n:127.0.0.1:64092_solr c:testschemaapi s:shard1 r:core_node2 x:testschemaapi_shard1_replica1] o.a.s.c.SolrCore [testschemaapi_shard1_replica1] Solr index directory 'C:\Users\jenkins\workspace\Lucene-Solr-5.5-Windows\solr\build\solr-core\test\J0\temp\solr.schema.TestManagedSchemaAPI_CD2CA3F263D747AD-001\tempDir-001\node2\.\testschemaapi_shard1_replica1\data\index' doesn't exist. Creating new index...
   [junit4]   2> 3400260 WARN  (qtp795259837-22245) [n:127.0.0.1:64095_solr c:testschemaapi s:shard1 r:core_node1 x:testschemaapi_shard1_replica2] o.a.s.c.SolrCore [testschemaapi_shard1_replica2] Solr index directory 'C:\Users\jenkins\workspace\Lucene-Solr-5.5-Windows\solr\build\solr-core\test\J0\temp\solr.schema.TestManagedSchemaAPI_CD2CA3F263D747AD-001\tempDir-001\node1\.\testschemaapi_shard1_replica2\data\index' doesn't exist. Creating new index...
   [junit4]   2> 3400261 INFO  (qtp795259837-22245) [n:127.0.0.1:64095_solr c:testschemaapi s:shard1 r:core_node1 x:testschemaapi_shard1_replica2] o.a.s.c.CachingDirectoryFactory return new directory for C:\Users\jenkins\workspace\Lucene-Solr-5.5-Windows\solr\build\solr-core\test\J0\temp\solr.schema.TestManagedSchemaAPI_CD2CA3F263D747AD-001\tempDir-001\node1\.\testschemaapi_shard1_replica2\data\index
   [junit4]   2> 3400262 INFO  (qtp646579551-22233) [n:127.0.0.1:64092_solr c:testschemaapi s:shard1 r:core_node2 x:testschemaapi_shard1_replica1] o.a.s.c.CachingDirectoryFactory return new directory for C:\Users\jenkins\workspace\Lucene-Solr-5.5-Windows\solr\build\solr-core\test\J0\temp\solr.schema.TestManagedSchemaAPI_CD2CA3F263D747AD-001\tempDir-001\node2\.\testschemaapi_shard1_replica1\data\index
   [junit4]   2> 3400267 INFO  (qtp795259837-22245) [n:127.0.0.1:64095_solr c:testschemaapi s:shard1 r:core_node1 x:testschemaapi_shard1_replica2] o.a.s.c.SolrDeletionPolicy SolrDeletionPolicy.onCommit: commits: num=1
   [junit4]   2> 	commit{dir=MockDirectoryWrapper(RAMDirectory@720dc292 lockFactory=org.apache.lucene.store.SingleInstanceLockFactory@656139bd),segFN=segments_1,generation=1}
   [junit4]   2> 3400267 INFO  (qtp795259837-22245) [n:127.0.0.1:64095_solr c:testschemaapi s:shard1 r:core_node1 x:testschemaapi_shard1_replica2] o.a.s.c.SolrDeletionPolicy newest commit generation = 1
   [junit4]   2> 3400267 INFO  (qtp646579551-22233) [n:127.0.0.1:64092_solr c:testschemaapi s:shard1 r:core_node2 x:testschemaapi_shard1_replica1] o.a.s.c.SolrDeletionPolicy SolrDeletionPolicy.onCommit: commits: num=1
   [junit4]   2> 	commit{dir=MockDirectoryWrapper(RAMDirectory@5215db4a lockFactory=org.apache.lucene.store.SingleInstanceLockFactory@18f00160),segFN=segments_1,generation=1}
   [junit4]   2> 3400269 INFO  (qtp646579551-22233) [n:127.0.0.1:64092_solr c:testschemaapi s:shard1 r:core_node2 x:testschemaapi_shard1_replica1] o.a.s.c.SolrDeletionPolicy newest commit generation = 1
   [junit4]   2> 3400362 INFO  (OldIndexDirectoryCleanupThreadForCore-testschemaapi_shard1_replica1) [n:127.0.0.1:64092_solr c:testschemaapi s:shard1 r:core_node2 x:testschemaapi_shard1_replica1] o.a.s.c.SolrCore Looking for old index directories to cleanup for core testschemaapi_shard1_replica1 in C:\Users\jenkins\workspace\Lucene-Solr-5.5-Windows\solr\build\solr-core\test\J0\temp\solr.schema.TestManagedSchemaAPI_CD2CA3F263D747AD-001\tempDir-001\node2\.\testschemaapi_shard1_replica1\data\
   [junit4]   2> 3400364 INFO  (qtp646579551-22233) [n:127.0.0.1:64092_solr c:testschemaapi s:shard1 r:core_node2 x:testschemaapi_shard1_replica1] o.a.s.c.SolrCore no updateRequestProcessorChain defined as default, creating implicit default
   [junit4]   2> 3400368 INFO  (qtp795259837-22245) [n:127.0.0.1:64095_solr c:testschemaapi s:shard1 r:core_node1 x:testschemaapi_shard1_replica2] o.a.s.c.SolrCore no updateRequestProcessorChain defined as default, creating implicit default
   [junit4]   2> 3400362 INFO  (OldIndexDirectoryCleanupThreadForCore-testschemaapi_shard1_replica2) [n:127.0.0.1:64095_solr c:testschemaapi s:shard1 r:core_node1 x:testschemaapi_shard1_replica2] o.a.s.c.SolrCore Looking for old index directories to cleanup for core testschemaapi_shard1_replica2 in C:\Users\jenkins\workspace\Lucene-Solr-5.5-Windows\solr\build\solr-core\test\J0\temp\solr.schema.TestManagedSchemaAPI_CD2CA3F263D747AD-001\tempDir-001\node1\.\testschemaapi_shard1_replica2\data\
   [junit4]   2> 3400370 WARN  (OldIndexDirectoryCleanupThreadForCore-testschemaapi_shard1_replica2) [n:127.0.0.1:64095_solr c:testschemaapi s:shard1 r:core_node1 x:testschemaapi_shard1_replica2] o.a.s.c.DirectoryFactory C:\Users\jenkins\workspace\Lucene-Solr-5.5-Windows\solr\build\solr-core\test\J0\temp\solr.schema.TestManagedSchemaAPI_CD2CA3F263D747AD-001\tempDir-001\node1\.\testschemaapi_shard1_replica2\data\ does not point to a valid data directory; skipping clean-up of old index directories.
   [junit4]   2> 3400370 INFO  (qtp646579551-22233) [n:127.0.0.1:64092_solr c:testschemaapi s:shard1 r:core_node2 x:testschemaapi_shard1_replica1] o.a.s.h.l.XMLLoader xsltCacheLifetimeSeconds=60
   [junit4]   2> 3400374 INFO  (qtp646579551-22233) [n:127.0.0.1:64092_solr c:testschemaapi s:shard1 r:core_node2 x:testschemaapi_shard1_replica1] o.a.s.h.l.XMLLoader xsltCacheLifetimeSeconds=60
   [junit4]   2> 3400379 INFO  (qtp646579551-22233) [n:127.0.0.1:64092_solr c:testschemaapi s:shard1 r:core_node2 x:testschemaapi_shard1_replica1] o.a.s.h.l.XMLLoader xsltCacheLifetimeSeconds=60
   [junit4]   2> 3400389 INFO  (qtp646579551-22233) [n:127.0.0.1:64092_solr c:testschemaapi s:shard1 r:core_node2 x:testschemaapi_shard1_replica1] o.a.s.h.l.XMLLoader xsltCacheLifetimeSeconds=60
   [junit4]   2> 3400395 INFO  (qtp646579551-22233) [n:127.0.0.1:64092_solr c:testschemaapi s:shard1 r:core_node2 x:testschemaapi_shard1_replica1] o.a.s.c.RequestHandlers Registered paths: /replication,/admin/system,/admin/threads,/admin/plugins,/update/json,/schema,/admin/ping,/update/csv,/admin/file,/update/json/docs,/admin/luke,/update,/admin/properties,/admin/segments,/get,/admin/mbeans,/select,/admin/logging,/config
   [junit4]   2> 3400399 INFO  (qtp646579551-22233) [n:127.0.0.1:64092_solr c:testschemaapi s:shard1 r:core_node2 x:testschemaapi_shard1_replica1] o.a.s.c.SolrCore Using default statsCache cache: org.apache.solr.search.stats.LocalStatsCache
   [junit4]   2> 3400403 INFO  (qtp646579551-22233) [n:127.0.0.1:64092_solr c:testschemaapi s:shard1 r:core_node2 x:testschemaapi_shard1_replica1] o.a.s.u.UpdateHandler Using UpdateLog implementation: org.apache.solr.update.UpdateLog
   [junit4]   2> 3400403 INFO  (qtp646579551-22233) [n:127.0.0.1:64092_solr c:testschemaapi s:shard1 r:core_node2 x:testschemaapi_shard1_replica1] o.a.s.u.UpdateLog Initializing UpdateLog: dataDir=null defaultSyncLevel=FLUSH numRecordsToKeep=100 maxNumLogsToKeep=10 numVersionBuckets=65536
   [junit4]   2> 3400410 INFO  (qtp646579551-22233) [n:127.0.0.1:64092_solr c:testschemaapi s:shard1 r:core_node2 x:testschemaapi_shard1_replica1] o.a.s.u.CommitTracker Hard AutoCommit: disabled
   [junit4]   2> 3400410 INFO  (qtp646579551-22233) [n:127.0.0.1:64092_solr c:testschemaapi s:shard1 r:core_node2 x:testschemaapi_shard1_replica1] o.a.s.u.CommitTracker Soft AutoCommit: disabled
   [junit4]   2> 3400434 INFO  (qtp795259837-22245) [n:127.0.0.1:64095_solr c:testschemaapi s:shard1 r:core_node1 x:testschemaapi_shard1_replica2] o.a.s.h.l.XMLLoader xsltCacheLifetimeSeconds=60
   [junit4]   2> 3400442 INFO  (qtp795259837-22245) [n:127.0.0.1:64095_solr c:testschemaapi s:shard1 r:core_node1 x:testschemaapi_shard1_replica2] o.a.s.h.l.XMLLoader xsltCacheLifetimeSeconds=60
   [junit4]   2> 3400444 INFO  (qtp795259837-22245) [n:127.0.0.1:64095_solr c:testschemaapi s:shard1 r:core_node1 x:testschemaapi_shard1_replica2] o.a.s.h.l.XMLLoader xsltCacheLifetimeSeconds=60
   [junit4]   2> 3400447 INFO  (qtp795259837-22245) [n:127.0.0.1:64095_solr c:testschemaapi s:shard1 r:core_node1 x:testschemaapi_shard1_replica2] o.a.s.h.l.XMLLoader xsltCacheLifetimeSeconds=60
   [junit4]   2> 3400448 INFO  (qtp795259837-22245) [n:127.0.0.1:64095_solr c:testschemaapi s:shard1 r:core_node1 x:testschemaapi_shard1_replica2] o.a.s.c.RequestHandlers Registered paths: /replication,/admin/system,/admin/threads,/admin/plugins,/update/json,/schema,/admin/ping,/update/csv,/admin/file,/update/json/docs,/admin/luke,/update,/admin/properties,/admin/segments,/get,/admin/mbeans,/select,/admin/logging,/config
   [junit4]   2> 3400449 INFO  (qtp795259837-22245) [n:127.0.0.1:64095_solr c:testschemaapi s:shard1 r:core_node1 x:testschemaapi_shard1_replica2] o.a.s.c.SolrCore Using default statsCache cache: org.apache.solr.search.stats.LocalStatsCache
   [junit4]   2> 3400452 INFO  (qtp795259837-22245) [n:127.0.0.1:64095_solr c:testschemaapi s:shard1 r:core_node1 x:testschemaapi_shard1_replica2] o.a.s.u.UpdateHandler Using UpdateLog implementation: org.apache.solr.update.UpdateLog
   [junit4]   2> 3400452 INFO  (qtp795259837-22245) [n:127.0.0.1:64095_solr c:testschemaapi s:shard1 r:core_node1 x:testschemaapi_shard1_replica2] o.a.s.u.UpdateLog Initializing UpdateLog: dataDir=null defaultSyncLevel=FLUSH numRecordsToKeep=100 maxNumLogsToKeep=10 numVersionBuckets=65536
   [junit4]   2> 3400477 INFO  (qtp646579551-22233) [n:127.0.0.1:64092_solr c:testschemaapi s:shard1 r:core_node2 x:testschemaapi_shard1_replica1] o.a.s.c.SolrDeletionPolicy SolrDeletionPolicy.onInit: commits: num=1
   [junit4]   2> 	commit{dir=MockDirectoryWrapper(RAMDirectory@5215db4a lockFactory=org.apache.lucene.store.SingleInstanceLockFactory@18f00160),segFN=segments_1,generation=1}
   [junit4]   2> 3400477 INFO  (qtp646579551-22233) [n:127.0.0.1:64092_solr c:testschemaapi s:shard1 r:core_node2 x:testschemaapi_shard1_replica1] o.a.s.c.SolrDeletionPolicy newest commit generation = 1
   [junit4]   2> 3400477 INFO  (qtp646579551-22233) [n:127.0.0.1:64092_solr c:testschemaapi s:shard1 r:core_node2 x:testschemaapi_shard1_replica1] o.a.s.s.SolrIndexSearcher Opening Searcher@620b4c55[testschemaapi_shard1_replica1] main
   [junit4]   2> 3400478 INFO  (qtp646579551-22233) [n:127.0.0.1:64092_solr c:testschemaapi s:shard1 r:core_node2 x:testschemaapi_shard1_replica1] o.a.s.c.c.ZkStateReader Load collection config from: [/collections/testschemaapi]
   [junit4]   2> 3400484 INFO  (qtp795259837-22245) [n:127.0.0.1:64095_solr c:testschemaapi s:shard1 r:core_node1 x:testschemaapi_shard1_replica2] o.a.s.u.CommitTracker Hard AutoCommit: disabled
   [junit4]   2> 3400490 INFO  (qtp646579551-22233) [n:127.0.0.1:64092_solr c:testschemaapi s:shard1 r:core_node2 x:testschemaapi_shard1_replica1] o.a.s.c.c.ZkStateReader path=[/collections/testschemaapi] [configName]=[conf1] specified config exists in ZooKeeper
   [junit4]   2> 3400490 INFO  (qtp646579551-22233) [n:127.0.0.1:64092_solr c:testschemaapi s:shard1 r:core_node2 x:testschemaapi_shard1_replica1] o.a.s.r.ManagedResourceStorage Setting up ZooKeeper-based storage for the RestManager with znodeBase: /configs/conf1
   [junit4]   2> 3400491 INFO  (qtp646579551-22233) [n:127.0.0.1:64092_solr c:testschemaapi s:shard1 r:core_node2 x:testschemaapi_shard1_replica1] o.a.s.r.ManagedResourceStorage Configured ZooKeeperStorageIO with znodeBase: /configs/conf1
   [junit4]   2> 3400491 INFO  (qtp646579551-22233) [n:127.0.0.1:64092_solr c:testschemaapi s:shard1 r:core_node2 x:testschemaapi_shard1_replica1] o.a.s.r.RestManager Initializing RestManager with initArgs: {}
   [junit4]   2> 3400491 INFO  (qtp646579551-22233) [n:127.0.0.1:64092_solr c:testschemaapi s:shard1 r:core_node2 x:testschemaapi_shard1_replica1] o.a.s.r.ManagedResourceStorage Reading _rest_managed.json using ZooKeeperStorageIO:path=/configs/conf1
   [junit4]   2> 3400493 INFO  (qtp646579551-22233) [n:127.0.0.1:64092_solr c:testschemaapi s:shard1 r:core_node2 x:testschemaapi_shard1_replica1] o.a.s.r.ManagedResourceStorage No data found for znode /configs/conf1/_rest_managed.json
   [junit4]   2> 3400493 INFO  (qtp646579551-22233) [n:127.0.0.1:64092_solr c:testschemaapi s:shard1 r:core_node2 x:testschemaapi_shard1_replica1] o.a.s.r.ManagedResourceStorage Loaded null at path _rest_managed.json using ZooKeeperStorageIO:path=/configs/conf1
   [junit4]   2> 3400493 INFO  (qtp646579551-22233) [n:127.0.0.1:64092_solr c:testschemaapi s:shard1 r:core_node2 x:testschemaapi_shard1_replica1] o.a.s.r.RestManager Initializing 0 registered ManagedResources
   [junit4]   2> 3400493 INFO  (qtp646579551-22233) [n:127.0.0.1:64092_solr c:testschemaapi s:shard1 r:core_node2 x:testschemaapi_shard1_replica1] o.a.s.s.ZkIndexSchemaReader Creating ZooKeeper watch for the managed schema at /configs/conf1/managed-schema
   [junit4]   2> 3400494 INFO  (qtp646579551-22233) [n:127.0.0.1:64092_solr c:testschemaapi s:shard1 r:core_node2 x:testschemaapi_shard1_replica1] o.a.s.c.ZkController Added new OnReconnect listener ZkIndexSchemaReader: /configs/conf1/managed-schema, uniqueCoreId: testschemaapi_shard1_replica1:463767250630274
   [junit4]   2> 3400494 INFO  (qtp646579551-22233) [n:127.0.0.1:64092_solr c:testschemaapi s:shard1 r:core_node2 x:testschemaapi_shard1_replica1] o.a.s.h.ReplicationHandler Commits will be reserved for  10000
   [junit4]   2> 3400494 INFO  (qtp646579551-22233) [n:127.0.0.1:64092_solr c:testschemaapi s:shard1 r:core_node2 x:testschemaapi_shard1_replica1] o.a.s.u.UpdateLog Looking up max value of version field to seed version buckets
   [junit4]   2> 3400494 INFO  (qtp646579551-22233) [n:127.0.0.1:64092_solr c:testschemaapi s:shard1 r:core_node2 x:testschemaapi_shard1_replica1] o.a.s.u.VersionInfo Refreshing highest value of _version_ for 65536 version buckets from index
   [junit4]   2> 3400495 INFO  (qtp646579551-22233) [n:127.0.0.1:64092_solr c:testschemaapi s:shard1 r:core_node2 x:testschemaapi_shard1_replica1] o.a.s.u.VersionInfo No terms found for _version_, cannot seed version bucket highest value from index
   [junit4]   2> 3400495 INFO  (qtp646579551-22233) [n:127.0.0.1:64092_solr c:testschemaapi s:shard1 r:core_node2 x:testschemaapi_shard1_replica1] o.a.s.u.UpdateLog Could not find max version in index or recent updates, using new clock 1537798092349243392
   [junit4]   2> 3400496 INFO  (qtp646579551-22233) [n:127.0.0.1:64092_solr c:testschemaapi s:shard1 r:core_node2 x:testschemaapi_shard1_replica1] o.a.s.u.UpdateLog Took 1.0ms to seed version buckets with highest version 1537798092349243392
   [junit4]   2> 3400499 INFO  (qtp795259837-22245) [n:127.0.0.1:64095_solr c:testschemaapi s:shard1 r:core_node1 x:testschemaapi_shard1_replica2] o.a.s.u.CommitTracker Soft AutoCommit: disabled
   [junit4]   2> 3400500 INFO  (qtp646579551-22233) [n:127.0.0.1:64092_solr c:testschemaapi s:shard1 r:core_node2 x:testschemaapi_shard1_replica1] o.a.s.c.ZkController watch zkdir /configs/conf1
   [junit4]   2> 3400500 INFO  (searcherExecutor-10014-thread-1-processing-c:testschemaapi s:shard1 n:127.0.0.1:64092_solr r:core_node2 x:testschemaapi_shard1_replica1) [n:127.0.0.1:64092_solr c:testschemaapi s:shard1 r:core_node2 x:testschemaapi_shard1_replica1] o.a.s.c.SolrCore [testschemaapi_shard1_replica1] Registered new searcher Searcher@620b4c55[testschemaapi_shard1_replica1] main{ExitableDirectoryReader(UninvertingDirectoryReader())}
   [junit4]   2> 3400501 INFO  (qtp646579551-22233) [n:127.0.0.1:64092_solr c:testschemaapi s:shard1 r:core_node2 x:testschemaapi_shard1_replica1] o.a.s.c.CoreContainer registering core: testschemaapi_shard1_replica1
   [junit4]   2> 3400501 INFO  (qtp646579551-22233) [n:127.0.0.1:64092_solr c:testschemaapi s:shard1 r:core_node2 x:testschemaapi_shard1_replica1] o.a.s.c.ZkController Register replica - core:testschemaapi_shard1_replica1 address:http://127.0.0.1:64092/solr collection:testschemaapi shard:shard1
   [junit4]   2> 3400503 INFO  (qtp646579551-22233) [n:127.0.0.1:64092_solr c:testschemaapi s:shard1 r:core_node2 x:testschemaapi_shard1_replica1] o.a.s.c.c.SolrZkClient makePath: /collections/testschemaapi/leader_elect/shard1/election
   [junit4]   2> 3400512 INFO  (qtp646579551-22233) [n:127.0.0.1:64092_solr c:testschemaapi s:shard1 r:core_node2 x:testschemaapi_shard1_replica1] o.a.s.c.LeaderElector Joined leadership election with path: /collections/testschemaapi/leader_elect/shard1/election/96112380528295941-core_node2-n_0000000000
   [junit4]   2> 3400513 INFO  (qtp646579551-22233) [n:127.0.0.1:64092_solr c:testschemaapi s:shard1 r:core_node2 x:testschemaapi_shard1_replica1] o.a.s.c.ShardLeaderElectionContext Running the leader process for shard=shard1 and weAreReplacement=false and leaderVoteWait=10000
   [junit4]   2> 3400517 INFO  (qtp646579551-22233) [n:127.0.0.1:64092_solr c:testschemaapi s:shard1 r:core_node2 x:testschemaapi_shard1_replica1] o.a.s.c.ShardLeaderElectionContext Waiting until we see more replicas up for shard shard1: total=2 found=1 timeoutin=9999ms
   [junit4]   2> 3400518 INFO  (OverseerStateUpdate-96112380528295942-127.0.0.1:64095_solr-n_0000000000) [n:127.0.0.1:64095_solr    ] o.a.s.c.Overseer processMessage: queueSize: 1, message = {
   [junit4]   2>   "operation":"leader",
   [junit4]   2>   "shard":"shard1",
   [junit4]   2>   "collection":"testschemaapi"} current state version: 0
   [junit4]   2> 3400519 INFO  (qtp795259837-22245) [n:127.0.0.1:64095_solr c:testschemaapi s:shard1 r:core_node1 x:testschemaapi_shard1_replica2] o.a.s.c.SolrDeletionPolicy SolrDeletionPolicy.onInit: commits: num=1
   [junit4]   2> 	commit{dir=MockDirectoryWrapper(RAMDirectory@720dc292 lockFactory=org.apache.lucene.store.SingleInstanceLockFactory@656139bd),segFN=segments_1,generation=1}
   [junit4]   2> 3400519 INFO  (qtp795259837-22245) [n:127.0.0.1:64095_solr c:testschemaapi s:shard1 r:core_node1 x:testschemaapi_shard1_replica2] o.a.s.c.SolrDeletionPolicy newest commit generation = 1
   [junit4]   2> 3400519 INFO  (OverseerStateUpdate-96112380528295942-127.0.0.1:64095_solr-n_0000000000) [n:127.0.0.1:64095_solr    ] o.a.s.c.o.ZkStateWriter going to update_collection /collections/testschemaapi/state.json version: 1
   [junit4]   2> 3400520 INFO  (qtp795259837-22245) [n:127.0.0.1:64095_solr c:testschemaapi s:shard1 r:core_node1 x:testschemaapi_shard1_replica2] o.a.s.s.SolrIndexSearcher Opening Searcher@27e55e1d[testschemaapi_shard1_replica2] main
   [junit4]   2> 3400520 INFO  (qtp795259837-22245) [n:127.0.0.1:64095_solr c:testschemaapi s:shard1 r:core_node1 x:testschemaapi_shard1_replica2] o.a.s.c.c.ZkStateReader Load collection config from: [/collections/testschemaapi]
   [junit4]   2> 3400520 INFO  (zkCallback-3286-thread-1-processing-n:127.0.0.1:64092_solr) [n:127.0.0.1:64092_solr    ] o.a.s.c.c.ZkStateReader A cluster state change: [WatchedEvent state:SyncConnected type:NodeDataChanged path:/collections/testschemaapi/state.json] for collection [testschemaapi] has occurred - updating... (live nodes size: [2])
   [junit4]   2> 3400521 INFO  (zkCallback-3287-thread-1-processing-n:127.0.0.1:64095_solr) [n:127.0.0.1:64095_solr    ] o.a.s.c.c.ZkStateReader A cluster state change: [WatchedEvent state:SyncConnected type:NodeDataChanged path:/collections/testschemaapi/state.json] for collection [testschemaapi] has occurred - updating... (live nodes size: [2])
   [junit4]   2> 3400521 INFO  (zkCallback-3286-thread-1-processing-n:127.0.0.1:64092_solr) [n:127.0.0.1:64092_solr    ] o.a.s.c.c.ZkStateReader Updating data for [testschemaapi] from [1] to [2]
   [junit4]   2> 3400521 INFO  (qtp795259837-22245) [n:127.0.0.1:64095_solr c:testschemaapi s:shard1 r:core_node1 x:testschemaapi_shard1_replica2] o.a.s.c.c.ZkStateReader path=[/collections/testschemaapi] [configName]=[conf1] specified config exists in ZooKeeper
   [junit4]   2> 3400521 INFO  (qtp795259837-22245) [n:127.0.0.1:64095_solr c:testschemaapi s:shard1 r:core_node1 x:testschemaapi_shard1_replica2] o.a.s.r.ManagedResourceStorage Setting up ZooKeeper-based storage for the RestManager with znodeBase: /configs/conf1
   [junit4]   2> 3400522 INFO  (zkCallback-3287-thread-1-processing-n:127.0.0.1:64095_solr) [n:127.0.0.1:64095_solr    ] o.a.s.c.c.ZkStateReader Updating data for [testschemaapi] from [1] to [2]
   [junit4]   2> 3400522 INFO  (qtp795259837-22245) [n:127.0.0.1:64095_solr c:testschemaapi s:shard1 r:core_node1 x:testschemaapi_shard1_replica2] o.a.s.r.ManagedResourceStorage Configured ZooKeeperStorageIO with znodeBase: /configs/conf1
   [junit4]   2> 3400522 INFO  (qtp795259837-22245) [n:127.0.0.1:64095_solr c:testschemaapi s:shard1 r:core_node1 x:testschemaapi_shard1_replica2] o.a.s.r.RestManager Initializing RestManager with initArgs: {}
   [junit4]   2> 3400522 INFO  (qtp795259837-22245) [n:127.0.0.1:64095_solr c:testschemaapi s:shard1 r:core_node1 x:testschemaapi_shard1_replica2] o.a.s.r.ManagedResourceStorage Reading _rest_managed.json using ZooKeeperStorageIO:path=/configs/conf1
   [junit4]   2> 3400523 INFO  (qtp795259837-22245) [n:127.0.0.1:64095_solr c:testschemaapi s:shard1 r:core_node1 x:testschemaapi_shard1_replica2] o.a.s.r.ManagedResourceStorage No data found for znode /configs/conf1/_rest_managed.json
   [junit4]   2> 3400523 INFO  (qtp795259837-22245) [n:127.0.0.1:64095_solr c:testschemaapi s:shard1 r:core_node1 x:testschemaapi_shard1_replica2] o.a.s.r.ManagedResourceStorage Loaded null at path _rest_managed.json using ZooKeeperStorageIO:path=/configs/conf1
   [junit4]   2> 3400523 INFO  (qtp795259837-22245) [n:127.0.0.1:64095_solr c:testschemaapi s:shard1 r:core_node1 x:testschemaapi_shard1_replica2] o.a.s.r.RestManager Initializing 0 registered ManagedResources
   [junit4]   2> 3400523 INFO  (qtp795259837-22245) [n:127.0.0.1:64095_solr c:testschemaapi s:shard1 r:core_node1 x:testschemaapi_shard1_replica2] o.a.s.s.ZkIndexSchemaReader Creating ZooKeeper watch for the managed schema at /configs/conf1/managed-schema
   [junit4]   2> 3400525 INFO  (qtp795259837-22245) [n:127.0.0.1:64095_solr c:testschemaapi s:shard1 r:core_node1 x:testschemaapi_shard1_replica2] o.a.s.c.ZkController Added new OnReconnect listener ZkIndexSchemaReader: /configs/conf1/managed-schema, uniqueCoreId: testschemaapi_shard1_replica2:463767271389834
   [junit4]   2> 3400525 INFO  (qtp795259837-22245) [n:127.0.0.1:64095_solr c:testschemaapi s:shard1 r:core_node1 x:testschemaapi_shard1_replica2] o.a.s.h.ReplicationHandler Commits will be reserved for  10000
   [junit4]   2> 3400525 INFO  (qtp795259837-22245) [n:127.0.0.1:64095_solr c:testschemaapi s:shard1 r:core_node1 x:testschemaapi_shard1_replica2] o.a.s.u.UpdateLog Looking up max value of version field to seed version buckets
   [junit4]   2> 3400525 INFO  (searcherExecutor-10015-thread-1-processing-c:testschemaapi s:shard1 n:127.0.0.1:64095_solr r:core_node1 x:testschemaapi_shard1_replica2) [n:127.0.0.1:64095_solr c:testschemaapi s:shard1 r:core_node1 x:testschemaapi_shard1_replica2] o.a.s.c.SolrCore [testschemaapi_shard1_replica2] Registered new searcher Searcher@27e55e1d[testschemaapi_shard1_replica2] main{ExitableDirectoryReader(UninvertingDirectoryReader())}
   [junit4]   2> 3400525 INFO  (qtp795259837-22245) [n:127.0.0.1:64095_solr c:testschemaapi s:shard1 r:core_node1 x:testschemaapi_shard1_replica2] o.a.s.u.VersionInfo Refreshing highest value of _version_ for 65536 version buckets from index
   [junit4]   2> 3400525 INFO  (qtp795259837-22245) [n:127.0.0.1:64095_solr c:testschemaapi s:shard1 r:core_node1 x:testschemaapi_shard1_replica2] o.a.s.u.VersionInfo No terms found for _version_, cannot seed version bucket highest value from index
   [junit4]   2> 3400525 INFO  (qtp795259837-22245) [n:127.0.0.1:64095_solr c:testschema

[...truncated too long message...]

st, DOMUtilTest, RAMDirectoryFactoryTest, TestLRUCache, TestUtils, TestDocumentBuilder, SliceStateTest, SystemInfoHandlerTest, CircularListTest, CursorPagingTest, TestCursorMarkWithoutUniqueKey, TestHighlightDedupGrouping, TestSimpleTrackingShardHandler, TestTolerantSearch, TestEmbeddedSolrServerConstructors, ActionThrottleTest, AliasIntegrationTest, ConcurrentDeleteAndCreateCollectionTest, CustomCollectionTest, DistribCursorPagingTest, DistribJoinFromCollectionTest, LeaderFailoverAfterPartitionTest, LeaderInitiatedRecoveryOnCommitTest, OutOfBoxZkACLAndCredentialsProvidersTest, OverriddenZkACLAndCredentialsProvidersTest, OverseerRolesTest, ReplicationFactorTest, RestartWhileUpdatingTest, RollingRestartTest, SharedFSAutoReplicaFailoverTest, SharedFSAutoReplicaFailoverUtilsTest, SimpleCollectionCreateDeleteTest, TestCloudInspectUtil, TestCollectionAPI, TestDistribDocBasedVersion, TestDownShardTolerantSearch, TestLeaderInitiatedRecoveryThread, TestRandomRequestDistribution, TestSolrCloudWithKerberosAlt, TriLevelCompositeIdRoutingTest, HdfsChaosMonkeyNothingIsSafeTest, HdfsChaosMonkeySafeLeaderTest, HdfsNNFailoverTest, HdfsRecoverLeaseTest, HdfsRestartWhileUpdatingTest, HdfsUnloadDistributedZkTest, HdfsWriteToMultipleCollectionsTest, TestClusterStateMutator, ZkStateWriterTest, RuleEngineTest, RulesTest, TestSolrConfigHandlerConcurrent, CoreAdminCreateDiscoverTest, CoreMergeIndexesAdminHandlerTest, SegmentsInfoRequestHandlerTest, DistributedDebugComponentTest, DistributedExpandComponentTest, DistributedFacetPivotLargeTest, DistributedFacetPivotSmallTest, DistributedQueryComponentOptimizationTest, SpatialHeatmapFacetsTest, TestExpandComponent, TestTrackingShardHandlerFactory, JavabinLoaderTest, HighlighterMaxOffsetTest, TestIntervalFaceting, TestRawTransformer, TestManagedResource, TestRestManager, TestBulkSchemaAPI, TestCopyFieldCollectionResource, TestDynamicFieldResource, TestManagedSchemaFieldResource, TestSchemaNameResource, TestSolrQueryParserDefaultOperatorResource, TestSolrQueryParserResource, TestUniqueKeyFieldResource, TestManagedStopFilterFactory, TestManagedSynonymFilterFactory, EnumFieldTest, TestCloudManagedSchema, TestCloudSchemaless, TestCollationFieldDocValues, TestManagedSchemaAPI]
   [junit4]   2> NOTE: reproduce with: ant test  -Dtestcase=TestManagedSchemaAPI -Dtests.seed=CD2CA3F263D747AD -Dtests.slow=true -Dtests.locale=fi-FI -Dtests.timezone=Pacific/Nauru -Dtests.asserts=true -Dtests.file.encoding=ISO-8859-1
   [junit4] ERROR   0.00s J0 | TestManagedSchemaAPI (suite) <<<
   [junit4]    > Throwable #1: java.lang.AssertionError: ObjectTracker found 8 object(s) that were not released!!! [MDCAwareThreadPoolExecutor, TransactionLog, MockDirectoryWrapper, MockDirectoryWrapper, MockDirectoryWrapper, TransactionLog, MDCAwareThreadPoolExecutor, MockDirectoryWrapper]
   [junit4]    > 	at __randomizedtesting.SeedInfo.seed([CD2CA3F263D747AD]:0)
   [junit4]    > 	at org.apache.solr.SolrTestCaseJ4.afterClass(SolrTestCaseJ4.java:238)
   [junit4]    > 	at java.lang.Thread.run(Thread.java:745)Throwable #2: java.io.IOException: Could not remove the following files (in the order of attempts):
   [junit4]    >    C:\Users\jenkins\workspace\Lucene-Solr-5.5-Windows\solr\build\solr-core\test\J0\temp\solr.schema.TestManagedSchemaAPI_CD2CA3F263D747AD-001\tempDir-001\node2\testschemaapi_shard1_replica1\data\tlog\tlog.0000000000000000001: java.nio.file.FileSystemException: C:\Users\jenkins\workspace\Lucene-Solr-5.5-Windows\solr\build\solr-core\test\J0\temp\solr.schema.TestManagedSchemaAPI_CD2CA3F263D747AD-001\tempDir-001\node2\testschemaapi_shard1_replica1\data\tlog\tlog.0000000000000000001: The process cannot access the file because it is being used by another process.
   [junit4]    >    C:\Users\jenkins\workspace\Lucene-Solr-5.5-Windows\solr\build\solr-core\test\J0\temp\solr.schema.TestManagedSchemaAPI_CD2CA3F263D747AD-001\tempDir-001\node2\testschemaapi_shard1_replica1\data\tlog: java.nio.file.DirectoryNotEmptyException: C:\Users\jenkins\workspace\Lucene-Solr-5.5-Windows\solr\build\solr-core\test\J0\temp\solr.schema.TestManagedSchemaAPI_CD2CA3F263D747AD-001\tempDir-001\node2\testschemaapi_shard1_replica1\data\tlog
   [junit4]    >    C:\Users\jenkins\workspace\Lucene-Solr-5.5-Windows\solr\build\solr-core\test\J0\temp\solr.schema.TestManagedSchemaAPI_CD2CA3F263D747AD-001\tempDir-001\node2\testschemaapi_shard1_replica1\data: java.nio.file.DirectoryNotEmptyException: C:\Users\jenkins\workspace\Lucene-Solr-5.5-Windows\solr\build\solr-core\test\J0\temp\solr.schema.TestManagedSchemaAPI_CD2CA3F263D747AD-001\tempDir-001\node2\testschemaapi_shard1_replica1\data
   [junit4]    >    C:\Users\jenkins\workspace\Lucene-Solr-5.5-Windows\solr\build\solr-core\test\J0\temp\solr.schema.TestManagedSchemaAPI_CD2CA3F263D747AD-001\tempDir-001\node2\testschemaapi_shard1_replica1: java.nio.file.DirectoryNotEmptyException: C:\Users\jenkins\workspace\Lucene-Solr-5.5-Windows\solr\build\solr-core\test\J0\temp\solr.schema.TestManagedSchemaAPI_CD2CA3F263D747AD-001\tempDir-001\node2\testschemaapi_shard1_replica1
   [junit4]    >    C:\Users\jenkins\workspace\Lucene-Solr-5.5-Windows\solr\build\solr-core\test\J0\temp\solr.schema.TestManagedSchemaAPI_CD2CA3F263D747AD-001\tempDir-001\node2: java.nio.file.DirectoryNotEmptyException: C:\Users\jenkins\workspace\Lucene-Solr-5.5-Windows\solr\build\solr-core\test\J0\temp\solr.schema.TestManagedSchemaAPI_CD2CA3F263D747AD-001\tempDir-001\node2
   [junit4]    >    C:\Users\jenkins\workspace\Lucene-Solr-5.5-Windows\solr\build\solr-core\test\J0\temp\solr.schema.TestManagedSchemaAPI_CD2CA3F263D747AD-001\tempDir-001\node1\testschemaapi_shard1_replica2\data\tlog\tlog.0000000000000000000: java.nio.file.FileSystemException: C:\Users\jenkins\workspace\Lucene-Solr-5.5-Windows\solr\build\solr-core\test\J0\temp\solr.schema.TestManagedSchemaAPI_CD2CA3F263D747AD-001\tempDir-001\node1\testschemaapi_shard1_replica2\data\tlog\tlog.0000000000000000000: The process cannot access the file because it is being used by another process.
   [junit4]    >    C:\Users\jenkins\workspace\Lucene-Solr-5.5-Windows\solr\build\solr-core\test\J0\temp\solr.schema.TestManagedSchemaAPI_CD2CA3F263D747AD-001\tempDir-001\node1\testschemaapi_shard1_replica2\data\tlog: java.nio.file.DirectoryNotEmptyException: C:\Users\jenkins\workspace\Lucene-Solr-5.5-Windows\solr\build\solr-core\test\J0\temp\solr.schema.TestManagedSchemaAPI_CD2CA3F263D747AD-001\tempDir-001\node1\testschemaapi_shard1_replica2\data\tlog
   [junit4]    >    C:\Users\jenkins\workspace\Lucene-Solr-5.5-Windows\solr\build\solr-core\test\J0\temp\solr.schema.TestManagedSchemaAPI_CD2CA3F263D747AD-001\tempDir-001\node1\testschemaapi_shard1_replica2\data: java.nio.file.DirectoryNotEmptyException: C:\Users\jenkins\workspace\Lucene-Solr-5.5-Windows\solr\build\solr-core\test\J0\temp\solr.schema.TestManagedSchemaAPI_CD2CA3F263D747AD-001\tempDir-001\node1\testschemaapi_shard1_replica2\data
   [junit4]    >    C:\Users\jenkins\workspace\Lucene-Solr-5.5-Windows\solr\build\solr-core\test\J0\temp\solr.schema.TestManagedSchemaAPI_CD2CA3F263D747AD-001\tempDir-001\node1\testschemaapi_shard1_replica2: java.nio.file.DirectoryNotEmptyException: C:\Users\jenkins\workspace\Lucene-Solr-5.5-Windows\solr\build\solr-core\test\J0\temp\solr.schema.TestManagedSchemaAPI_CD2CA3F263D747AD-001\tempDir-001\node1\testschemaapi_shard1_replica2
   [junit4]    >    C:\Users\jenkins\workspace\Lucene-Solr-5.5-Windows\solr\build\solr-core\test\J0\temp\solr.schema.TestManagedSchemaAPI_CD2CA3F263D747AD-001\tempDir-001\node1: java.nio.file.DirectoryNotEmptyException: C:\Users\jenkins\workspace\Lucene-Solr-5.5-Windows\solr\build\solr-core\test\J0\temp\solr.schema.TestManagedSchemaAPI_CD2CA3F263D747AD-001\tempDir-001\node1
   [junit4]    >    C:\Users\jenkins\workspace\Lucene-Solr-5.5-Windows\solr\build\solr-core\test\J0\temp\solr.schema.TestManagedSchemaAPI_CD2CA3F263D747AD-001\tempDir-001: java.nio.file.DirectoryNotEmptyException: C:\Users\jenkins\workspace\Lucene-Solr-5.5-Windows\solr\build\solr-core\test\J0\temp\solr.schema.TestManagedSchemaAPI_CD2CA3F263D747AD-001\tempDir-001
   [junit4]    >    C:\Users\jenkins\workspace\Lucene-Solr-5.5-Windows\solr\build\solr-core\test\J0\temp\solr.schema.TestManagedSchemaAPI_CD2CA3F263D747AD-001: java.nio.file.DirectoryNotEmptyException: C:\Users\jenkins\workspace\Lucene-Solr-5.5-Windows\solr\build\solr-core\test\J0\temp\solr.schema.TestManagedSchemaAPI_CD2CA3F263D747AD-001
   [junit4]    > 	at org.apache.lucene.util.IOUtils.rm(IOUtils.java:295)
   [junit4]    > 	at java.lang.Thread.run(Thread.java:745)
   [junit4] Completed [527/573 (1!)] on J0 in 18.82s, 1 test, 1 failure, 1 error <<< FAILURES!

[...truncated 157 lines...]
BUILD FAILED
C:\Users\jenkins\workspace\Lucene-Solr-5.5-Windows\build.xml:750: The following error occurred while executing this line:
C:\Users\jenkins\workspace\Lucene-Solr-5.5-Windows\build.xml:694: The following error occurred while executing this line:
C:\Users\jenkins\workspace\Lucene-Solr-5.5-Windows\build.xml:59: The following error occurred while executing this line:
C:\Users\jenkins\workspace\Lucene-Solr-5.5-Windows\solr\build.xml:233: The following error occurred while executing this line:
C:\Users\jenkins\workspace\Lucene-Solr-5.5-Windows\solr\common-build.xml:534: The following error occurred while executing this line:
C:\Users\jenkins\workspace\Lucene-Solr-5.5-Windows\lucene\common-build.xml:1477: The following error occurred while executing this line:
C:\Users\jenkins\workspace\Lucene-Solr-5.5-Windows\lucene\common-build.xml:1033: There were test failures: 573 suites (7 ignored), 2319 tests, 2 suite-level errors, 94 ignored (49 assumptions) [seed: CD2CA3F263D747AD]

Total time: 86 minutes 14 seconds
Build step 'Invoke Ant' marked build as failure
Archiving artifacts
[WARNINGS] Skipping publisher since build result is FAILURE
Recording test results
Email was triggered for: Failure - Any
Sending email for trigger: Failure - Any



Mime
View raw message