lucene-dev mailing list archives

Site index · List index
Message view « Date » · « Thread »
Top « Date » · « Thread »
From Karl Wright <daddy...@gmail.com>
Subject Re: [JENKINS-EA] Lucene-Solr-6.x-Linux (64bit/jdk-9-ea+120) - Build # 797 - Failure!
Date Wed, 01 Jun 2016 12:37:46 GMT
Created LUCENE-7310 for this failure.

Karl


On Wed, Jun 1, 2016 at 8:30 AM, Policeman Jenkins Server <
jenkins@thetaphi.de> wrote:

> Build: http://jenkins.thetaphi.de/job/Lucene-Solr-6.x-Linux/797/
> Java: 64bit/jdk-9-ea+120 -XX:-UseCompressedOops -XX:+UseConcMarkSweepGC
>
> 1 tests failed.
> FAILED:  org.apache.lucene.spatial3d.TestGeo3DPoint.testGeo3DRelations
>
> Error Message:
> invalid hits for shape=GeoRectangle: {planetmodel=PlanetModel.WGS84,
> toplat=2.4457272005608357E-47(1.401298464324817E-45),
> bottomlat=-1.2214695902376758(-69.98505232419288),
> leftlon=-2.747582498523687E-12(-1.57424881029417E-10), rightlon=0.0(0.0)}
>
> Stack Trace:
> java.lang.AssertionError: invalid hits for shape=GeoRectangle:
> {planetmodel=PlanetModel.WGS84,
> toplat=2.4457272005608357E-47(1.401298464324817E-45),
> bottomlat=-1.2214695902376758(-69.98505232419288),
> leftlon=-2.747582498523687E-12(-1.57424881029417E-10), rightlon=0.0(0.0)}
>         at
> __randomizedtesting.SeedInfo.seed([30FD3EA71A75FA1E:8082433395385482]:0)
>         at org.junit.Assert.fail(Assert.java:93)
>         at
> org.apache.lucene.spatial3d.TestGeo3DPoint.testGeo3DRelations(TestGeo3DPoint.java:441)
>         at
> jdk.internal.reflect.NativeMethodAccessorImpl.invoke0(java.base@9-ea/Native
> Method)
>         at
> jdk.internal.reflect.NativeMethodAccessorImpl.invoke(java.base@9-ea
> /NativeMethodAccessorImpl.java:62)
>         at
> jdk.internal.reflect.DelegatingMethodAccessorImpl.invoke(java.base@9-ea
> /DelegatingMethodAccessorImpl.java:43)
>         at java.lang.reflect.Method.invoke(java.base@9-ea/Method.java:531)
>         at
> com.carrotsearch.randomizedtesting.RandomizedRunner.invoke(RandomizedRunner.java:1764)
>         at
> com.carrotsearch.randomizedtesting.RandomizedRunner$8.evaluate(RandomizedRunner.java:871)
>         at
> com.carrotsearch.randomizedtesting.RandomizedRunner$9.evaluate(RandomizedRunner.java:907)
>         at
> com.carrotsearch.randomizedtesting.RandomizedRunner$10.evaluate(RandomizedRunner.java:921)
>         at
> org.apache.lucene.util.TestRuleSetupTeardownChained$1.evaluate(TestRuleSetupTeardownChained.java:49)
>         at
> org.apache.lucene.util.AbstractBeforeAfterRule$1.evaluate(AbstractBeforeAfterRule.java:45)
>         at
> org.apache.lucene.util.TestRuleThreadAndTestName$1.evaluate(TestRuleThreadAndTestName.java:48)
>         at
> org.apache.lucene.util.TestRuleIgnoreAfterMaxFailures$1.evaluate(TestRuleIgnoreAfterMaxFailures.java:64)
>         at
> org.apache.lucene.util.TestRuleMarkFailure$1.evaluate(TestRuleMarkFailure.java:47)
>         at
> com.carrotsearch.randomizedtesting.rules.StatementAdapter.evaluate(StatementAdapter.java:36)
>         at
> com.carrotsearch.randomizedtesting.ThreadLeakControl$StatementRunner.run(ThreadLeakControl.java:367)
>         at
> com.carrotsearch.randomizedtesting.ThreadLeakControl.forkTimeoutingTask(ThreadLeakControl.java:809)
>         at
> com.carrotsearch.randomizedtesting.ThreadLeakControl$3.evaluate(ThreadLeakControl.java:460)
>         at
> com.carrotsearch.randomizedtesting.RandomizedRunner.runSingleTest(RandomizedRunner.java:880)
>         at
> com.carrotsearch.randomizedtesting.RandomizedRunner$5.evaluate(RandomizedRunner.java:781)
>         at
> com.carrotsearch.randomizedtesting.RandomizedRunner$6.evaluate(RandomizedRunner.java:816)
>         at
> com.carrotsearch.randomizedtesting.RandomizedRunner$7.evaluate(RandomizedRunner.java:827)
>         at
> org.apache.lucene.util.AbstractBeforeAfterRule$1.evaluate(AbstractBeforeAfterRule.java:45)
>         at
> com.carrotsearch.randomizedtesting.rules.StatementAdapter.evaluate(StatementAdapter.java:36)
>         at
> org.apache.lucene.util.TestRuleStoreClassName$1.evaluate(TestRuleStoreClassName.java:41)
>         at
> com.carrotsearch.randomizedtesting.rules.NoShadowingOrOverridesOnMethodsRule$1.evaluate(NoShadowingOrOverridesOnMethodsRule.java:40)
>         at
> com.carrotsearch.randomizedtesting.rules.NoShadowingOrOverridesOnMethodsRule$1.evaluate(NoShadowingOrOverridesOnMethodsRule.java:40)
>         at
> com.carrotsearch.randomizedtesting.rules.StatementAdapter.evaluate(StatementAdapter.java:36)
>         at
> com.carrotsearch.randomizedtesting.rules.StatementAdapter.evaluate(StatementAdapter.java:36)
>         at
> com.carrotsearch.randomizedtesting.rules.StatementAdapter.evaluate(StatementAdapter.java:36)
>         at
> org.apache.lucene.util.TestRuleAssertionsRequired$1.evaluate(TestRuleAssertionsRequired.java:53)
>         at
> org.apache.lucene.util.TestRuleMarkFailure$1.evaluate(TestRuleMarkFailure.java:47)
>         at
> org.apache.lucene.util.TestRuleIgnoreAfterMaxFailures$1.evaluate(TestRuleIgnoreAfterMaxFailures.java:64)
>         at
> org.apache.lucene.util.TestRuleIgnoreTestSuites$1.evaluate(TestRuleIgnoreTestSuites.java:54)
>         at
> com.carrotsearch.randomizedtesting.rules.StatementAdapter.evaluate(StatementAdapter.java:36)
>         at
> com.carrotsearch.randomizedtesting.ThreadLeakControl$StatementRunner.run(ThreadLeakControl.java:367)
>         at java.lang.Thread.run(java.base@9-ea/Thread.java:843)
>
>
>
>
> Build Log:
> [...truncated 8949 lines...]
>    [junit4] Suite: org.apache.lucene.spatial3d.TestGeo3DPoint
>    [junit4]   1> doc=1862 should match but did not
>    [junit4]   1>   point=[X=-0.357731347617304, Y=-2.3309114714909325E-10,
> Z=-0.9318876358594385]
>    [junit4]   1>   mappedPoint=[lat=-1.20426483861026,
> lon=-3.141592653589793([X=-0.3577313476925353, Y=-4.380945499063322E-17,
> Z=-0.9318876356952587])]
>    [junit4]   2> NOTE: reproduce with: ant test  -Dtestcase=TestGeo3DPoint
> -Dtests.method=testGeo3DRelations -Dtests.seed=30FD3EA71A75FA1E
> -Dtests.multiplier=3 -Dtests.slow=true -Dtests.locale=ast
> -Dtests.timezone=Europe/Brussels -Dtests.asserts=true
> -Dtests.file.encoding=ISO-8859-1
>    [junit4] FAILURE 6.20s J1 | TestGeo3DPoint.testGeo3DRelations <<<
>    [junit4]    > Throwable #1: java.lang.AssertionError: invalid hits for
> shape=GeoRectangle: {planetmodel=PlanetModel.WGS84,
> toplat=2.4457272005608357E-47(1.401298464324817E-45),
> bottomlat=-1.2214695902376758(-69.98505232419288),
> leftlon=-2.747582498523687E-12(-1.57424881029417E-10), rightlon=0.0(0.0)}
>    [junit4]    >        at
> __randomizedtesting.SeedInfo.seed([30FD3EA71A75FA1E:8082433395385482]:0)
>    [junit4]    >        at
> org.apache.lucene.spatial3d.TestGeo3DPoint.testGeo3DRelations(TestGeo3DPoint.java:441)
>    [junit4]    >        at
> jdk.internal.reflect.NativeMethodAccessorImpl.invoke0(java.base@9-ea/Native
> Method)
>    [junit4]    >        at
> jdk.internal.reflect.NativeMethodAccessorImpl.invoke(java.base@9-ea
> /NativeMethodAccessorImpl.java:62)
>    [junit4]    >        at
> jdk.internal.reflect.DelegatingMethodAccessorImpl.invoke(java.base@9-ea
> /DelegatingMethodAccessorImpl.java:43)
>    [junit4]    >        at java.lang.Thread.run(java.base@9-ea
> /Thread.java:843)
>    [junit4] IGNOR/A 0.00s J1 | TestGeo3DPoint.testRandomBig
>    [junit4]    > Assumption #1: 'nightly' test group is disabled
> (@Nightly())
>    [junit4]   2> NOTE: test params are: codec=Asserting(Lucene60),
> sim=ClassicSimilarity, locale=ast, timezone=Europe/Brussels
>    [junit4]   2> NOTE: Linux 4.4.0-21-generic amd64/Oracle Corporation
> 9-ea (64-bit)/cpus=12,threads=1,free=469343816,total=508887040
>    [junit4]   2> NOTE: All tests run in this JVM: [TestGeo3DPoint]
>    [junit4] Completed [10/11 (1!)] on J1 in 79.03s, 13 tests, 1 failure, 1
> skipped <<< FAILURES!
>
> [...truncated 14 lines...]
> BUILD FAILED
> /home/jenkins/workspace/Lucene-Solr-6.x-Linux/build.xml:740: The following
> error occurred while executing this line:
> /home/jenkins/workspace/Lucene-Solr-6.x-Linux/build.xml:684: The following
> error occurred while executing this line:
> /home/jenkins/workspace/Lucene-Solr-6.x-Linux/build.xml:59: The following
> error occurred while executing this line:
> /home/jenkins/workspace/Lucene-Solr-6.x-Linux/lucene/build.xml:476: The
> following error occurred while executing this line:
> /home/jenkins/workspace/Lucene-Solr-6.x-Linux/lucene/common-build.xml:2161:
> The following error occurred while executing this line:
> /home/jenkins/workspace/Lucene-Solr-6.x-Linux/lucene/module-build.xml:58:
> The following error occurred while executing this line:
> /home/jenkins/workspace/Lucene-Solr-6.x-Linux/lucene/common-build.xml:1427:
> The following error occurred while executing this line:
> /home/jenkins/workspace/Lucene-Solr-6.x-Linux/lucene/common-build.xml:984:
> There were test failures: 11 suites, 56 tests, 1 failure, 1 ignored (1
> assumption) [seed: 30FD3EA71A75FA1E]
>
> Total time: 21 minutes 13 seconds
> Build step 'Invoke Ant' marked build as failure
> Archiving artifacts
> [WARNINGS] Skipping publisher since build result is FAILURE
> Recording test results
> Email was triggered for: Failure - Any
> Sending email for trigger: Failure - Any
>
>
>
>
> ---------------------------------------------------------------------
> To unsubscribe, e-mail: dev-unsubscribe@lucene.apache.org
> For additional commands, e-mail: dev-help@lucene.apache.org
>

Mime
View raw message