lucene-dev mailing list archives

Site index · List index
Message view « Date » · « Thread »
Top « Date » · « Thread »
From Alan Woodward <a...@flax.co.uk>
Subject Re: [JENKINS-EA] Lucene-Solr-master-Linux (64bit/jdk-9-ea+120) - Build # 16886 - Still Failing!
Date Wed, 01 Jun 2016 12:53:40 GMT
Not sure why this has suddenly started failing so often, but from the logs it appears that it's due to a stopped node not starting up again properly - it's timing out at ZkController.publishAndWaitForDownNodes().

Alan Woodward
www.flax.co.uk


On 1 Jun 2016, at 06:46, Policeman Jenkins Server wrote:

> Build: http://jenkins.thetaphi.de/job/Lucene-Solr-master-Linux/16886/
> Java: 64bit/jdk-9-ea+120 -XX:-UseCompressedOops -XX:+UseConcMarkSweepGC
> 
> 1 tests failed.
> FAILED:  org.apache.solr.common.cloud.TestCollectionStateWatchers.testWaitForStateWatcherIsRetainedOnPredicateFailure
> 
> Error Message:
> Did not see a fully active cluster after 30 seconds
> 
> Stack Trace:
> java.lang.AssertionError: Did not see a fully active cluster after 30 seconds
> 	at __randomizedtesting.SeedInfo.seed([34E75E20242312A2:BCD1FC73FC8CFAB0]:0)
> 	at org.junit.Assert.fail(Assert.java:93)
> 	at org.junit.Assert.assertTrue(Assert.java:43)
> 	at org.apache.solr.common.cloud.TestCollectionStateWatchers.testWaitForStateWatcherIsRetainedOnPredicateFailure(TestCollectionStateWatchers.java:227)
> 	at jdk.internal.reflect.NativeMethodAccessorImpl.invoke0(java.base@9-ea/Native Method)
> 	at jdk.internal.reflect.NativeMethodAccessorImpl.invoke(java.base@9-ea/NativeMethodAccessorImpl.java:62)
> 	at jdk.internal.reflect.DelegatingMethodAccessorImpl.invoke(java.base@9-ea/DelegatingMethodAccessorImpl.java:43)
> 	at java.lang.reflect.Method.invoke(java.base@9-ea/Method.java:531)
> 	at com.carrotsearch.randomizedtesting.RandomizedRunner.invoke(RandomizedRunner.java:1764)
> 	at com.carrotsearch.randomizedtesting.RandomizedRunner$8.evaluate(RandomizedRunner.java:871)
> 	at com.carrotsearch.randomizedtesting.RandomizedRunner$9.evaluate(RandomizedRunner.java:907)
> 	at com.carrotsearch.randomizedtesting.RandomizedRunner$10.evaluate(RandomizedRunner.java:921)
> 	at com.carrotsearch.randomizedtesting.rules.SystemPropertiesRestoreRule$1.evaluate(SystemPropertiesRestoreRule.java:57)
> 	at org.apache.lucene.util.TestRuleSetupTeardownChained$1.evaluate(TestRuleSetupTeardownChained.java:49)
> 	at org.apache.lucene.util.AbstractBeforeAfterRule$1.evaluate(AbstractBeforeAfterRule.java:45)
> 	at org.apache.lucene.util.TestRuleThreadAndTestName$1.evaluate(TestRuleThreadAndTestName.java:48)
> 	at org.apache.lucene.util.TestRuleIgnoreAfterMaxFailures$1.evaluate(TestRuleIgnoreAfterMaxFailures.java:64)
> 	at org.apache.lucene.util.TestRuleMarkFailure$1.evaluate(TestRuleMarkFailure.java:47)
> 	at com.carrotsearch.randomizedtesting.rules.StatementAdapter.evaluate(StatementAdapter.java:36)
> 	at com.carrotsearch.randomizedtesting.ThreadLeakControl$StatementRunner.run(ThreadLeakControl.java:367)
> 	at com.carrotsearch.randomizedtesting.ThreadLeakControl.forkTimeoutingTask(ThreadLeakControl.java:809)
> 	at com.carrotsearch.randomizedtesting.ThreadLeakControl$3.evaluate(ThreadLeakControl.java:460)
> 	at com.carrotsearch.randomizedtesting.RandomizedRunner.runSingleTest(RandomizedRunner.java:880)
> 	at com.carrotsearch.randomizedtesting.RandomizedRunner$5.evaluate(RandomizedRunner.java:781)
> 	at com.carrotsearch.randomizedtesting.RandomizedRunner$6.evaluate(RandomizedRunner.java:816)
> 	at com.carrotsearch.randomizedtesting.RandomizedRunner$7.evaluate(RandomizedRunner.java:827)
> 	at com.carrotsearch.randomizedtesting.rules.StatementAdapter.evaluate(StatementAdapter.java:36)
> 	at com.carrotsearch.randomizedtesting.rules.SystemPropertiesRestoreRule$1.evaluate(SystemPropertiesRestoreRule.java:57)
> 	at org.apache.lucene.util.AbstractBeforeAfterRule$1.evaluate(AbstractBeforeAfterRule.java:45)
> 	at com.carrotsearch.randomizedtesting.rules.StatementAdapter.evaluate(StatementAdapter.java:36)
> 	at org.apache.lucene.util.TestRuleStoreClassName$1.evaluate(TestRuleStoreClassName.java:41)
> 	at com.carrotsearch.randomizedtesting.rules.NoShadowingOrOverridesOnMethodsRule$1.evaluate(NoShadowingOrOverridesOnMethodsRule.java:40)
> 	at com.carrotsearch.randomizedtesting.rules.NoShadowingOrOverridesOnMethodsRule$1.evaluate(NoShadowingOrOverridesOnMethodsRule.java:40)
> 	at com.carrotsearch.randomizedtesting.rules.StatementAdapter.evaluate(StatementAdapter.java:36)
> 	at com.carrotsearch.randomizedtesting.rules.StatementAdapter.evaluate(StatementAdapter.java:36)
> 	at com.carrotsearch.randomizedtesting.rules.StatementAdapter.evaluate(StatementAdapter.java:36)
> 	at org.apache.lucene.util.TestRuleAssertionsRequired$1.evaluate(TestRuleAssertionsRequired.java:53)
> 	at org.apache.lucene.util.TestRuleMarkFailure$1.evaluate(TestRuleMarkFailure.java:47)
> 	at org.apache.lucene.util.TestRuleIgnoreAfterMaxFailures$1.evaluate(TestRuleIgnoreAfterMaxFailures.java:64)
> 	at org.apache.lucene.util.TestRuleIgnoreTestSuites$1.evaluate(TestRuleIgnoreTestSuites.java:54)
> 	at com.carrotsearch.randomizedtesting.rules.StatementAdapter.evaluate(StatementAdapter.java:36)
> 	at com.carrotsearch.randomizedtesting.ThreadLeakControl$StatementRunner.run(ThreadLeakControl.java:367)
> 	at java.lang.Thread.run(java.base@9-ea/Thread.java:843)
> 
> 
> 
> 
> Build Log:
> [...truncated 13103 lines...]
>   [junit4] Suite: org.apache.solr.common.cloud.TestCollectionStateWatchers
>   [junit4]   2> Creating dataDir: /home/jenkins/workspace/Lucene-Solr-master-Linux/solr/build/solr-solrj/test/J2/temp/solr.common.cloud.TestCollectionStateWatchers_34E75E20242312A2-001/init-core-data-001
>   [junit4]   2> 60595 INFO  (SUITE-TestCollectionStateWatchers-seed#[34E75E20242312A2]-worker) [    ] o.a.s.SolrTestCaseJ4 Randomized ssl (false) and clientAuth (false)
>   [junit4]   2> 60597 INFO  (SUITE-TestCollectionStateWatchers-seed#[34E75E20242312A2]-worker) [    ] o.a.s.c.ZkTestServer STARTING ZK TEST SERVER
>   [junit4]   2> 60597 INFO  (Thread-237) [    ] o.a.s.c.ZkTestServer client port:0.0.0.0/0.0.0.0:0
>   [junit4]   2> 60597 INFO  (Thread-237) [    ] o.a.s.c.ZkTestServer Starting server
>   [junit4]   2> 60697 INFO  (SUITE-TestCollectionStateWatchers-seed#[34E75E20242312A2]-worker) [    ] o.a.s.c.ZkTestServer start zk server on port:34609
>   [junit4]   2> 60697 INFO  (SUITE-TestCollectionStateWatchers-seed#[34E75E20242312A2]-worker) [    ] o.a.s.c.c.SolrZkClient Using default ZkCredentialsProvider
>   [junit4]   2> 60698 INFO  (SUITE-TestCollectionStateWatchers-seed#[34E75E20242312A2]-worker) [    ] o.a.s.c.c.ConnectionManager Waiting for client to connect to ZooKeeper
>   [junit4]   2> 60699 INFO  (zkCallback-159-thread-1) [    ] o.a.s.c.c.ConnectionManager Watcher org.apache.solr.common.cloud.ConnectionManager@127353ce name:ZooKeeperConnection Watcher:127.0.0.1:34609 got event WatchedEvent state:SyncConnected type:None path:null path:null type:None
>   [junit4]   2> 60699 INFO  (SUITE-TestCollectionStateWatchers-seed#[34E75E20242312A2]-worker) [    ] o.a.s.c.c.ConnectionManager Client is connected to ZooKeeper
>   [junit4]   2> 60700 INFO  (SUITE-TestCollectionStateWatchers-seed#[34E75E20242312A2]-worker) [    ] o.a.s.c.c.SolrZkClient Using default ZkACLProvider
>   [junit4]   2> 60700 INFO  (SUITE-TestCollectionStateWatchers-seed#[34E75E20242312A2]-worker) [    ] o.a.s.c.c.SolrZkClient makePath: /solr/solr.xml
>   [junit4]   2> 60705 INFO  (jetty-launcher-158-thread-1) [    ] o.e.j.s.Server jetty-9.3.8.v20160314
>   [junit4]   2> 60707 INFO  (jetty-launcher-158-thread-2) [    ] o.e.j.s.Server jetty-9.3.8.v20160314
>   [junit4]   2> 60708 INFO  (jetty-launcher-158-thread-1) [    ] o.e.j.s.h.ContextHandler Started o.e.j.s.ServletContextHandler@5e79a700{/solr,null,AVAILABLE}
>   [junit4]   2> 60709 INFO  (jetty-launcher-158-thread-1) [    ] o.e.j.s.ServerConnector Started ServerConnector@513e6509{HTTP/1.1,[http/1.1]}{127.0.0.1:44223}
>   [junit4]   2> 60709 INFO  (jetty-launcher-158-thread-1) [    ] o.e.j.s.Server Started @62641ms
>   [junit4]   2> 60710 INFO  (jetty-launcher-158-thread-1) [    ] o.a.s.c.s.e.JettySolrRunner Jetty properties: {hostContext=/solr, hostPort=44223}
>   [junit4]   2> 60710 INFO  (jetty-launcher-158-thread-1) [    ] o.a.s.s.SolrDispatchFilter SolrDispatchFilter.init(): jdk.internal.loader.ClassLoaders$AppClassLoader@224aed64
>   [junit4]   2> 60710 INFO  (jetty-launcher-158-thread-1) [    ] o.a.s.c.SolrResourceLoader new SolrResourceLoader for directory: '/home/jenkins/workspace/Lucene-Solr-master-Linux/solr/build/solr-solrj/test/J2/temp/solr.common.cloud.TestCollectionStateWatchers_34E75E20242312A2-001/tempDir-001/node1'
>   [junit4]   2> 60710 INFO  (jetty-launcher-158-thread-1) [    ] o.a.s.c.SolrResourceLoader JNDI not configured for solr (NoInitialContextEx)
>   [junit4]   2> 60710 INFO  (jetty-launcher-158-thread-1) [    ] o.a.s.c.SolrResourceLoader solr home defaulted to 'solr/' (could not find system property or JNDI)
>   [junit4]   2> 60710 INFO  (jetty-launcher-158-thread-1) [    ] o.a.s.c.c.SolrZkClient Using default ZkCredentialsProvider
>   [junit4]   2> 60710 INFO  (jetty-launcher-158-thread-3) [    ] o.e.j.s.Server jetty-9.3.8.v20160314
>   [junit4]   2> 60711 INFO  (jetty-launcher-158-thread-4) [    ] o.e.j.s.Server jetty-9.3.8.v20160314
>   [junit4]   2> 60722 INFO  (jetty-launcher-158-thread-1) [    ] o.a.s.c.c.ConnectionManager Waiting for client to connect to ZooKeeper
>   [junit4]   2> 60727 INFO  (jetty-launcher-158-thread-2) [    ] o.e.j.s.h.ContextHandler Started o.e.j.s.ServletContextHandler@1d182483{/solr,null,AVAILABLE}
>   [junit4]   2> 60728 INFO  (zkCallback-160-thread-1) [    ] o.a.s.c.c.ConnectionManager Watcher org.apache.solr.common.cloud.ConnectionManager@63f084a9 name:ZooKeeperConnection Watcher:127.0.0.1:34609/solr got event WatchedEvent state:SyncConnected type:None path:null path:null type:None
>   [junit4]   2> 60728 INFO  (jetty-launcher-158-thread-2) [    ] o.e.j.s.ServerConnector Started ServerConnector@d2afd18{HTTP/1.1,[http/1.1]}{127.0.0.1:40525}
>   [junit4]   2> 60728 INFO  (jetty-launcher-158-thread-1) [    ] o.a.s.c.c.ConnectionManager Client is connected to ZooKeeper
>   [junit4]   2> 60728 INFO  (jetty-launcher-158-thread-2) [    ] o.e.j.s.Server Started @62659ms
>   [junit4]   2> 60728 INFO  (jetty-launcher-158-thread-2) [    ] o.a.s.c.s.e.JettySolrRunner Jetty properties: {hostContext=/solr, hostPort=40525}
>   [junit4]   2> 60728 INFO  (jetty-launcher-158-thread-1) [    ] o.a.s.c.c.SolrZkClient Using default ZkACLProvider
>   [junit4]   2> 60728 INFO  (jetty-launcher-158-thread-2) [    ] o.a.s.s.SolrDispatchFilter SolrDispatchFilter.init(): jdk.internal.loader.ClassLoaders$AppClassLoader@224aed64
>   [junit4]   2> 60728 INFO  (jetty-launcher-158-thread-2) [    ] o.a.s.c.SolrResourceLoader new SolrResourceLoader for directory: '/home/jenkins/workspace/Lucene-Solr-master-Linux/solr/build/solr-solrj/test/J2/temp/solr.common.cloud.TestCollectionStateWatchers_34E75E20242312A2-001/tempDir-001/node2'
>   [junit4]   2> 60728 INFO  (jetty-launcher-158-thread-1) [    ] o.a.s.s.SolrDispatchFilter solr.xml found in ZooKeeper. Loading...
>   [junit4]   2> 60728 INFO  (jetty-launcher-158-thread-2) [    ] o.a.s.c.SolrResourceLoader JNDI not configured for solr (NoInitialContextEx)
>   [junit4]   2> 60728 INFO  (jetty-launcher-158-thread-2) [    ] o.a.s.c.SolrResourceLoader solr home defaulted to 'solr/' (could not find system property or JNDI)
>   [junit4]   2> 60728 INFO  (jetty-launcher-158-thread-2) [    ] o.a.s.c.c.SolrZkClient Using default ZkCredentialsProvider
>   [junit4]   2> 60729 INFO  (jetty-launcher-158-thread-3) [    ] o.e.j.s.h.ContextHandler Started o.e.j.s.ServletContextHandler@4c3addcc{/solr,null,AVAILABLE}
>   [junit4]   2> 60729 INFO  (jetty-launcher-158-thread-2) [    ] o.a.s.c.c.ConnectionManager Waiting for client to connect to ZooKeeper
>   [junit4]   2> 60741 INFO  (zkCallback-161-thread-1) [    ] o.a.s.c.c.ConnectionManager Watcher org.apache.solr.common.cloud.ConnectionManager@5f9a192f name:ZooKeeperConnection Watcher:127.0.0.1:34609/solr got event WatchedEvent state:SyncConnected type:None path:null path:null type:None
>   [junit4]   2> 60741 INFO  (jetty-launcher-158-thread-2) [    ] o.a.s.c.c.ConnectionManager Client is connected to ZooKeeper
>   [junit4]   2> 60741 INFO  (jetty-launcher-158-thread-2) [    ] o.a.s.c.c.SolrZkClient Using default ZkACLProvider
>   [junit4]   2> 60741 INFO  (jetty-launcher-158-thread-1) [    ] o.a.s.c.CorePropertiesLocator Config-defined core root directory: /home/jenkins/workspace/Lucene-Solr-master-Linux/solr/build/solr-solrj/test/J2/temp/solr.common.cloud.TestCollectionStateWatchers_34E75E20242312A2-001/tempDir-001/node1/.
>   [junit4]   2> 60741 INFO  (jetty-launcher-158-thread-3) [    ] o.e.j.s.ServerConnector Started ServerConnector@5428126a{HTTP/1.1,[http/1.1]}{127.0.0.1:36383}
>   [junit4]   2> 60741 INFO  (jetty-launcher-158-thread-1) [    ] o.a.s.c.CoreContainer New CoreContainer 569429382
>   [junit4]   2> 60741 INFO  (jetty-launcher-158-thread-1) [    ] o.a.s.c.CoreContainer Loading cores into CoreContainer [instanceDir=/home/jenkins/workspace/Lucene-Solr-master-Linux/solr/build/solr-solrj/test/J2/temp/solr.common.cloud.TestCollectionStateWatchers_34E75E20242312A2-001/tempDir-001/node1]
>   [junit4]   2> 60742 WARN  (jetty-launcher-158-thread-1) [    ] o.a.s.c.CoreContainer Couldn't add files from /home/jenkins/workspace/Lucene-Solr-master-Linux/solr/build/solr-solrj/test/J2/temp/solr.common.cloud.TestCollectionStateWatchers_34E75E20242312A2-001/tempDir-001/node1/lib to classpath: /home/jenkins/workspace/Lucene-Solr-master-Linux/solr/build/solr-solrj/test/J2/temp/solr.common.cloud.TestCollectionStateWatchers_34E75E20242312A2-001/tempDir-001/node1/lib
>   [junit4]   2> 60742 INFO  (jetty-launcher-158-thread-1) [    ] o.a.s.h.c.HttpShardHandlerFactory created with socketTimeout : 90000,urlScheme : ,connTimeout : 15000,maxConnectionsPerHost : 20,maxConnections : 10000,corePoolSize : 0,maximumPoolSize : 2147483647,maxThreadIdleTime : 5,sizeOfQueue : -1,fairnessPolicy : false,
>   [junit4]   2> 60742 INFO  (jetty-launcher-158-thread-3) [    ] o.e.j.s.Server Started @62674ms
>   [junit4]   2> 60742 INFO  (jetty-launcher-158-thread-3) [    ] o.a.s.c.s.e.JettySolrRunner Jetty properties: {hostContext=/solr, hostPort=36383}
>   [junit4]   2> 60742 INFO  (jetty-launcher-158-thread-3) [    ] o.a.s.s.SolrDispatchFilter SolrDispatchFilter.init(): jdk.internal.loader.ClassLoaders$AppClassLoader@224aed64
>   [junit4]   2> 60742 INFO  (jetty-launcher-158-thread-3) [    ] o.a.s.c.SolrResourceLoader new SolrResourceLoader for directory: '/home/jenkins/workspace/Lucene-Solr-master-Linux/solr/build/solr-solrj/test/J2/temp/solr.common.cloud.TestCollectionStateWatchers_34E75E20242312A2-001/tempDir-001/node4'
>   [junit4]   2> 60741 INFO  (jetty-launcher-158-thread-4) [    ] o.e.j.s.h.ContextHandler Started o.e.j.s.ServletContextHandler@19f7474b{/solr,null,AVAILABLE}
>   [junit4]   2> 60742 INFO  (jetty-launcher-158-thread-3) [    ] o.a.s.c.SolrResourceLoader JNDI not configured for solr (NoInitialContextEx)
>   [junit4]   2> 60742 INFO  (jetty-launcher-158-thread-3) [    ] o.a.s.c.SolrResourceLoader solr home defaulted to 'solr/' (could not find system property or JNDI)
>   [junit4]   2> 60743 INFO  (jetty-launcher-158-thread-3) [    ] o.a.s.c.c.SolrZkClient Using default ZkCredentialsProvider
>   [junit4]   2> 60743 INFO  (jetty-launcher-158-thread-4) [    ] o.e.j.s.ServerConnector Started ServerConnector@a0b9885{HTTP/1.1,[http/1.1]}{127.0.0.1:35367}
>   [junit4]   2> 60743 INFO  (jetty-launcher-158-thread-1) [    ] o.a.s.u.UpdateShardHandler Creating UpdateShardHandler HTTP client with params: 
>   [junit4]   2> 60743 INFO  (jetty-launcher-158-thread-4) [    ] o.e.j.s.Server Started @62675ms
>   [junit4]   2> 60743 INFO  (jetty-launcher-158-thread-2) [    ] o.a.s.s.SolrDispatchFilter solr.xml found in ZooKeeper. Loading...
>   [junit4]   2> 60743 INFO  (jetty-launcher-158-thread-4) [    ] o.a.s.c.s.e.JettySolrRunner Jetty properties: {hostContext=/solr, hostPort=35367}
>   [junit4]   2> 60743 INFO  (jetty-launcher-158-thread-4) [    ] o.a.s.s.SolrDispatchFilter SolrDispatchFilter.init(): jdk.internal.loader.ClassLoaders$AppClassLoader@224aed64
>   [junit4]   2> 60743 INFO  (jetty-launcher-158-thread-4) [    ] o.a.s.c.SolrResourceLoader new SolrResourceLoader for directory: '/home/jenkins/workspace/Lucene-Solr-master-Linux/solr/build/solr-solrj/test/J2/temp/solr.common.cloud.TestCollectionStateWatchers_34E75E20242312A2-001/tempDir-001/node3'
>   [junit4]   2> 60743 INFO  (jetty-launcher-158-thread-4) [    ] o.a.s.c.SolrResourceLoader JNDI not configured for solr (NoInitialContextEx)
>   [junit4]   2> 60743 INFO  (jetty-launcher-158-thread-4) [    ] o.a.s.c.SolrResourceLoader solr home defaulted to 'solr/' (could not find system property or JNDI)
>   [junit4]   2> 60744 INFO  (jetty-launcher-158-thread-4) [    ] o.a.s.c.c.SolrZkClient Using default ZkCredentialsProvider
>   [junit4]   2> 60744 INFO  (jetty-launcher-158-thread-3) [    ] o.a.s.c.c.ConnectionManager Waiting for client to connect to ZooKeeper
>   [junit4]   2> 60744 INFO  (jetty-launcher-158-thread-4) [    ] o.a.s.c.c.ConnectionManager Waiting for client to connect to ZooKeeper
>   [junit4]   2> 60745 INFO  (zkCallback-165-thread-1) [    ] o.a.s.c.c.ConnectionManager Watcher org.apache.solr.common.cloud.ConnectionManager@372a4ec1 name:ZooKeeperConnection Watcher:127.0.0.1:34609/solr got event WatchedEvent state:SyncConnected type:None path:null path:null type:None
>   [junit4]   2> 60745 INFO  (jetty-launcher-158-thread-4) [    ] o.a.s.c.c.ConnectionManager Client is connected to ZooKeeper
>   [junit4]   2> 60745 INFO  (jetty-launcher-158-thread-4) [    ] o.a.s.c.c.SolrZkClient Using default ZkACLProvider
>   [junit4]   2> 60745 INFO  (jetty-launcher-158-thread-4) [    ] o.a.s.s.SolrDispatchFilter solr.xml found in ZooKeeper. Loading...
>   [junit4]   2> 60748 INFO  (jetty-launcher-158-thread-1) [    ] o.a.s.l.LogWatcher SLF4J impl is org.slf4j.impl.Log4jLoggerFactory
>   [junit4]   2> 60748 INFO  (jetty-launcher-158-thread-1) [    ] o.a.s.l.LogWatcher Registering Log Listener [Log4j (org.slf4j.impl.Log4jLoggerFactory)]
>   [junit4]   2> 60748 INFO  (jetty-launcher-158-thread-1) [    ] o.a.s.c.ZkContainer Zookeeper client=127.0.0.1:34609/solr
>   [junit4]   2> 60748 INFO  (jetty-launcher-158-thread-1) [    ] o.a.s.c.ZkController zkHost includes chroot
>   [junit4]   2> 60748 INFO  (jetty-launcher-158-thread-1) [    ] o.a.s.c.c.SolrZkClient Using default ZkCredentialsProvider
>   [junit4]   2> 60749 INFO  (jetty-launcher-158-thread-1) [    ] o.a.s.c.c.ConnectionManager Waiting for client to connect to ZooKeeper
>   [junit4]   2> 60751 INFO  (zkCallback-162-thread-1) [    ] o.a.s.c.c.ConnectionManager Watcher org.apache.solr.common.cloud.ConnectionManager@5b47b5aa name:ZooKeeperConnection Watcher:127.0.0.1:34609/solr got event WatchedEvent state:SyncConnected type:None path:null path:null type:None
>   [junit4]   2> 60751 INFO  (jetty-launcher-158-thread-3) [    ] o.a.s.c.c.ConnectionManager Client is connected to ZooKeeper
>   [junit4]   2> 60751 INFO  (jetty-launcher-158-thread-3) [    ] o.a.s.c.c.SolrZkClient Using default ZkACLProvider
>   [junit4]   2> 60753 INFO  (jetty-launcher-158-thread-3) [    ] o.a.s.s.SolrDispatchFilter solr.xml found in ZooKeeper. Loading...
>   [junit4]   2> 60765 INFO  (zkCallback-166-thread-1) [    ] o.a.s.c.c.ConnectionManager Watcher org.apache.solr.common.cloud.ConnectionManager@630c90ae name:ZooKeeperConnection Watcher:127.0.0.1:34609 got event WatchedEvent state:SyncConnected type:None path:null path:null type:None
>   [junit4]   2> 60765 INFO  (jetty-launcher-158-thread-2) [    ] o.a.s.c.CorePropertiesLocator Config-defined core root directory: /home/jenkins/workspace/Lucene-Solr-master-Linux/solr/build/solr-solrj/test/J2/temp/solr.common.cloud.TestCollectionStateWatchers_34E75E20242312A2-001/tempDir-001/node2/.
>   [junit4]   2> 60766 INFO  (jetty-launcher-158-thread-2) [    ] o.a.s.c.CoreContainer New CoreContainer 1065448577
>   [junit4]   2> 60766 INFO  (jetty-launcher-158-thread-2) [    ] o.a.s.c.CoreContainer Loading cores into CoreContainer [instanceDir=/home/jenkins/workspace/Lucene-Solr-master-Linux/solr/build/solr-solrj/test/J2/temp/solr.common.cloud.TestCollectionStateWatchers_34E75E20242312A2-001/tempDir-001/node2]
>   [junit4]   2> 60766 WARN  (jetty-launcher-158-thread-2) [    ] o.a.s.c.CoreContainer Couldn't add files from /home/jenkins/workspace/Lucene-Solr-master-Linux/solr/build/solr-solrj/test/J2/temp/solr.common.cloud.TestCollectionStateWatchers_34E75E20242312A2-001/tempDir-001/node2/lib to classpath: /home/jenkins/workspace/Lucene-Solr-master-Linux/solr/build/solr-solrj/test/J2/temp/solr.common.cloud.TestCollectionStateWatchers_34E75E20242312A2-001/tempDir-001/node2/lib
>   [junit4]   2> 60766 INFO  (jetty-launcher-158-thread-2) [    ] o.a.s.h.c.HttpShardHandlerFactory created with socketTimeout : 90000,urlScheme : ,connTimeout : 15000,maxConnectionsPerHost : 20,maxConnections : 10000,corePoolSize : 0,maximumPoolSize : 2147483647,maxThreadIdleTime : 5,sizeOfQueue : -1,fairnessPolicy : false,
>   [junit4]   2> 60765 INFO  (jetty-launcher-158-thread-1) [    ] o.a.s.c.c.ConnectionManager Client is connected to ZooKeeper
>   [junit4]   2> 60767 INFO  (jetty-launcher-158-thread-1) [    ] o.a.s.c.c.SolrZkClient Using default ZkACLProvider
>   [junit4]   2> 60767 INFO  (jetty-launcher-158-thread-2) [    ] o.a.s.u.UpdateShardHandler Creating UpdateShardHandler HTTP client with params: 
>   [junit4]   2> 60768 INFO  (jetty-launcher-158-thread-2) [    ] o.a.s.l.LogWatcher SLF4J impl is org.slf4j.impl.Log4jLoggerFactory
>   [junit4]   2> 60768 INFO  (jetty-launcher-158-thread-2) [    ] o.a.s.l.LogWatcher Registering Log Listener [Log4j (org.slf4j.impl.Log4jLoggerFactory)]
>   [junit4]   2> 60768 INFO  (jetty-launcher-158-thread-2) [    ] o.a.s.c.ZkContainer Zookeeper client=127.0.0.1:34609/solr
>   [junit4]   2> 60768 INFO  (jetty-launcher-158-thread-2) [    ] o.a.s.c.ZkController zkHost includes chroot
>   [junit4]   2> 60768 INFO  (jetty-launcher-158-thread-2) [    ] o.a.s.c.c.SolrZkClient Using default ZkCredentialsProvider
>   [junit4]   2> 60768 INFO  (jetty-launcher-158-thread-2) [    ] o.a.s.c.c.ConnectionManager Waiting for client to connect to ZooKeeper
>   [junit4]   2> 60769 INFO  (zkCallback-169-thread-1) [    ] o.a.s.c.c.ConnectionManager Watcher org.apache.solr.common.cloud.ConnectionManager@74286869 name:ZooKeeperConnection Watcher:127.0.0.1:34609 got event WatchedEvent state:SyncConnected type:None path:null path:null type:None
>   [junit4]   2> 60787 INFO  (jetty-launcher-158-thread-2) [    ] o.a.s.c.c.ConnectionManager Client is connected to ZooKeeper
>   [junit4]   2> 60787 INFO  (jetty-launcher-158-thread-3) [    ] o.a.s.c.CorePropertiesLocator Config-defined core root directory: /home/jenkins/workspace/Lucene-Solr-master-Linux/solr/build/solr-solrj/test/J2/temp/solr.common.cloud.TestCollectionStateWatchers_34E75E20242312A2-001/tempDir-001/node4/.
>   [junit4]   2> 60787 INFO  (jetty-launcher-158-thread-2) [    ] o.a.s.c.c.SolrZkClient Using default ZkACLProvider
>   [junit4]   2> 60787 INFO  (jetty-launcher-158-thread-3) [    ] o.a.s.c.CoreContainer New CoreContainer 1324087738
>   [junit4]   2> 60787 INFO  (jetty-launcher-158-thread-3) [    ] o.a.s.c.CoreContainer Loading cores into CoreContainer [instanceDir=/home/jenkins/workspace/Lucene-Solr-master-Linux/solr/build/solr-solrj/test/J2/temp/solr.common.cloud.TestCollectionStateWatchers_34E75E20242312A2-001/tempDir-001/node4]
>   [junit4]   2> 60788 WARN  (jetty-launcher-158-thread-3) [    ] o.a.s.c.CoreContainer Couldn't add files from /home/jenkins/workspace/Lucene-Solr-master-Linux/solr/build/solr-solrj/test/J2/temp/solr.common.cloud.TestCollectionStateWatchers_34E75E20242312A2-001/tempDir-001/node4/lib to classpath: /home/jenkins/workspace/Lucene-Solr-master-Linux/solr/build/solr-solrj/test/J2/temp/solr.common.cloud.TestCollectionStateWatchers_34E75E20242312A2-001/tempDir-001/node4/lib
>   [junit4]   2> 60788 INFO  (jetty-launcher-158-thread-1) [    ] o.a.s.c.ZkController Added new OnReconnect listener org.apache.solr.cloud.ZkController$$Lambda$143/1928982266@78678621
>   [junit4]   2> 60789 INFO  (jetty-launcher-158-thread-2) [    ] o.a.s.c.ZkController Added new OnReconnect listener org.apache.solr.cloud.ZkController$$Lambda$143/1928982266@143daa31
>   [junit4]   2> 60789 INFO  (jetty-launcher-158-thread-3) [    ] o.a.s.h.c.HttpShardHandlerFactory created with socketTimeout : 90000,urlScheme : ,connTimeout : 15000,maxConnectionsPerHost : 20,maxConnections : 10000,corePoolSize : 0,maximumPoolSize : 2147483647,maxThreadIdleTime : 5,sizeOfQueue : -1,fairnessPolicy : false,
>   [junit4]   2> 60788 INFO  (jetty-launcher-158-thread-4) [    ] o.a.s.c.CorePropertiesLocator Config-defined core root directory: /home/jenkins/workspace/Lucene-Solr-master-Linux/solr/build/solr-solrj/test/J2/temp/solr.common.cloud.TestCollectionStateWatchers_34E75E20242312A2-001/tempDir-001/node3/.
>   [junit4]   2> 60789 INFO  (jetty-launcher-158-thread-4) [    ] o.a.s.c.CoreContainer New CoreContainer 2012375739
>   [junit4]   2> 60789 INFO  (jetty-launcher-158-thread-4) [    ] o.a.s.c.CoreContainer Loading cores into CoreContainer [instanceDir=/home/jenkins/workspace/Lucene-Solr-master-Linux/solr/build/solr-solrj/test/J2/temp/solr.common.cloud.TestCollectionStateWatchers_34E75E20242312A2-001/tempDir-001/node3]
>   [junit4]   2> 60789 WARN  (jetty-launcher-158-thread-4) [    ] o.a.s.c.CoreContainer Couldn't add files from /home/jenkins/workspace/Lucene-Solr-master-Linux/solr/build/solr-solrj/test/J2/temp/solr.common.cloud.TestCollectionStateWatchers_34E75E20242312A2-001/tempDir-001/node3/lib to classpath: /home/jenkins/workspace/Lucene-Solr-master-Linux/solr/build/solr-solrj/test/J2/temp/solr.common.cloud.TestCollectionStateWatchers_34E75E20242312A2-001/tempDir-001/node3/lib
>   [junit4]   2> 60802 INFO  (jetty-launcher-158-thread-4) [    ] o.a.s.h.c.HttpShardHandlerFactory created with socketTimeout : 90000,urlScheme : ,connTimeout : 15000,maxConnectionsPerHost : 20,maxConnections : 10000,corePoolSize : 0,maximumPoolSize : 2147483647,maxThreadIdleTime : 5,sizeOfQueue : -1,fairnessPolicy : false,
>   [junit4]   2> 60798 INFO  (jetty-launcher-158-thread-2) [    ] o.a.s.c.c.ConnectionManager Waiting for client to connect to ZooKeeper
>   [junit4]   2> 60797 INFO  (jetty-launcher-158-thread-3) [    ] o.a.s.u.UpdateShardHandler Creating UpdateShardHandler HTTP client with params: 
>   [junit4]   2> 60797 INFO  (jetty-launcher-158-thread-1) [    ] o.a.s.c.c.ConnectionManager Waiting for client to connect to ZooKeeper
>   [junit4]   2> 60804 INFO  (jetty-launcher-158-thread-4) [    ] o.a.s.u.UpdateShardHandler Creating UpdateShardHandler HTTP client with params: 
>   [junit4]   2> 60804 INFO  (jetty-launcher-158-thread-4) [    ] o.a.s.l.LogWatcher SLF4J impl is org.slf4j.impl.Log4jLoggerFactory
>   [junit4]   2> 60804 INFO  (jetty-launcher-158-thread-4) [    ] o.a.s.l.LogWatcher Registering Log Listener [Log4j (org.slf4j.impl.Log4jLoggerFactory)]
>   [junit4]   2> 60804 INFO  (jetty-launcher-158-thread-4) [    ] o.a.s.c.ZkContainer Zookeeper client=127.0.0.1:34609/solr
>   [junit4]   2> 60804 INFO  (jetty-launcher-158-thread-4) [    ] o.a.s.c.ZkController zkHost includes chroot
>   [junit4]   2> 60804 INFO  (jetty-launcher-158-thread-4) [    ] o.a.s.c.c.SolrZkClient Using default ZkCredentialsProvider
>   [junit4]   2> 60805 INFO  (jetty-launcher-158-thread-4) [    ] o.a.s.c.c.ConnectionManager Waiting for client to connect to ZooKeeper
>   [junit4]   2> 60806 INFO  (zkCallback-176-thread-1) [    ] o.a.s.c.c.ConnectionManager Watcher org.apache.solr.common.cloud.ConnectionManager@98a39f0 name:ZooKeeperConnection Watcher:127.0.0.1:34609 got event WatchedEvent state:SyncConnected type:None path:null path:null type:None
>   [junit4]   2> 60808 INFO  (jetty-launcher-158-thread-4) [    ] o.a.s.c.c.ConnectionManager Client is connected to ZooKeeper
>   [junit4]   2> 60809 INFO  (jetty-launcher-158-thread-4) [    ] o.a.s.c.c.SolrZkClient Using default ZkACLProvider
>   [junit4]   2> 60811 INFO  (jetty-launcher-158-thread-3) [    ] o.a.s.l.LogWatcher SLF4J impl is org.slf4j.impl.Log4jLoggerFactory
>   [junit4]   2> 60811 INFO  (jetty-launcher-158-thread-3) [    ] o.a.s.l.LogWatcher Registering Log Listener [Log4j (org.slf4j.impl.Log4jLoggerFactory)]
>   [junit4]   2> 60811 INFO  (jetty-launcher-158-thread-3) [    ] o.a.s.c.ZkContainer Zookeeper client=127.0.0.1:34609/solr
>   [junit4]   2> 60811 INFO  (jetty-launcher-158-thread-3) [    ] o.a.s.c.ZkController zkHost includes chroot
>   [junit4]   2> 60811 INFO  (jetty-launcher-158-thread-3) [    ] o.a.s.c.c.SolrZkClient Using default ZkCredentialsProvider
>   [junit4]   2> 60811 WARN  (NIOServerCxn.Factory:0.0.0.0/0.0.0.0:0) [    ] o.a.z.s.NIOServerCnxn caught end of stream exception
>   [junit4]   2> EndOfStreamException: Unable to read additional data from client sessionid 0x1550a7e91980009, likely client has closed socket
>   [junit4]   2> 	at org.apache.zookeeper.server.NIOServerCnxn.doIO(NIOServerCnxn.java:228)
>   [junit4]   2> 	at org.apache.zookeeper.server.NIOServerCnxnFactory.run(NIOServerCnxnFactory.java:208)
>   [junit4]   2> 	at java.lang.Thread.run(java.base@9-ea/Thread.java:843)
>   [junit4]   2> 60825 INFO  (zkCallback-170-thread-1) [    ] o.a.s.c.c.ConnectionManager Watcher org.apache.solr.common.cloud.ConnectionManager@3e6f94e name:ZooKeeperConnection Watcher:127.0.0.1:34609/solr got event WatchedEvent state:SyncConnected type:None path:null path:null type:None
>   [junit4]   2> 60825 INFO  (jetty-launcher-158-thread-1) [    ] o.a.s.c.c.ConnectionManager Client is connected to ZooKeeper
>   [junit4]   2> 60812 INFO  (jetty-launcher-158-thread-4) [    ] o.a.s.c.ZkController Added new OnReconnect listener org.apache.solr.cloud.ZkController$$Lambda$143/1928982266@70f36501
>   [junit4]   2> 60827 INFO  (jetty-launcher-158-thread-1) [    ] o.a.s.c.c.SolrZkClient makePath: /overseer/queue
>   [junit4]   2> 60829 INFO  (jetty-launcher-158-thread-4) [    ] o.a.s.c.c.ConnectionManager Waiting for client to connect to ZooKeeper
>   [junit4]   2> 60829 INFO  (zkCallback-171-thread-1) [    ] o.a.s.c.c.ConnectionManager Watcher org.apache.solr.common.cloud.ConnectionManager@6f316c93 name:ZooKeeperConnection Watcher:127.0.0.1:34609/solr got event WatchedEvent state:SyncConnected type:None path:null path:null type:None
>   [junit4]   2> 60829 INFO  (jetty-launcher-158-thread-2) [    ] o.a.s.c.c.ConnectionManager Client is connected to ZooKeeper
>   [junit4]   2> 60830 INFO  (jetty-launcher-158-thread-3) [    ] o.a.s.c.c.ConnectionManager Waiting for client to connect to ZooKeeper
>   [junit4]   2> 60830 INFO  (zkCallback-178-thread-1) [    ] o.a.s.c.c.ConnectionManager Watcher org.apache.solr.common.cloud.ConnectionManager@de5407e name:ZooKeeperConnection Watcher:127.0.0.1:34609/solr got event WatchedEvent state:SyncConnected type:None path:null path:null type:None
>   [junit4]   2> 60830 INFO  (jetty-launcher-158-thread-4) [    ] o.a.s.c.c.ConnectionManager Client is connected to ZooKeeper
>   [junit4]   2> 60831 INFO  (jetty-launcher-158-thread-1) [    ] o.a.s.c.c.SolrZkClient makePath: /overseer/collection-queue-work
>   [junit4]   2> 60831 INFO  (jetty-launcher-158-thread-2) [    ] o.a.s.c.c.SolrZkClient makePath: /overseer/collection-queue-work
>   [junit4]   2> 60835 INFO  (zkCallback-177-thread-1) [    ] o.a.s.c.c.ConnectionManager Watcher org.apache.solr.common.cloud.ConnectionManager@419610c7 name:ZooKeeperConnection Watcher:127.0.0.1:34609 got event WatchedEvent state:SyncConnected type:None path:null path:null type:None
>   [junit4]   2> 60835 INFO  (jetty-launcher-158-thread-3) [    ] o.a.s.c.c.ConnectionManager Client is connected to ZooKeeper
>   [junit4]   2> 60835 INFO  (jetty-launcher-158-thread-3) [    ] o.a.s.c.c.SolrZkClient Using default ZkACLProvider
>   [junit4]   2> 60837 INFO  (jetty-launcher-158-thread-4) [    ] o.a.s.c.c.SolrZkClient makePath: /overseer/collection-map-running
>   [junit4]   2> 60838 INFO  (jetty-launcher-158-thread-1) [    ] o.a.s.c.c.SolrZkClient makePath: /overseer/collection-map-running
>   [junit4]   2> 60838 INFO  (jetty-launcher-158-thread-3) [    ] o.a.s.c.ZkController Added new OnReconnect listener org.apache.solr.cloud.ZkController$$Lambda$143/1928982266@3ecbc0ab
>   [junit4]   2> 60838 INFO  (jetty-launcher-158-thread-2) [    ] o.a.s.c.c.SolrZkClient makePath: /overseer/collection-map-running
>   [junit4]   2> 60841 INFO  (jetty-launcher-158-thread-1) [    ] o.a.s.c.c.SolrZkClient makePath: /overseer/collection-map-completed
>   [junit4]   2> 60841 INFO  (jetty-launcher-158-thread-4) [    ] o.a.s.c.c.SolrZkClient makePath: /overseer/collection-map-completed
>   [junit4]   2> 60841 INFO  (jetty-launcher-158-thread-2) [    ] o.a.s.c.c.SolrZkClient makePath: /overseer/collection-map-completed
>   [junit4]   2> 60846 INFO  (jetty-launcher-158-thread-3) [    ] o.a.s.c.c.ConnectionManager Waiting for client to connect to ZooKeeper
>   [junit4]   2> 60847 INFO  (jetty-launcher-158-thread-2) [    ] o.a.s.c.c.SolrZkClient makePath: /overseer/collection-map-failure
>   [junit4]   2> 60847 INFO  (jetty-launcher-158-thread-4) [    ] o.a.s.c.c.SolrZkClient makePath: /overseer/collection-map-failure
>   [junit4]   2> 60847 INFO  (jetty-launcher-158-thread-1) [    ] o.a.s.c.c.SolrZkClient makePath: /overseer/collection-map-failure
>   [junit4]   2> 60848 INFO  (zkCallback-179-thread-1) [    ] o.a.s.c.c.ConnectionManager Watcher org.apache.solr.common.cloud.ConnectionManager@2e385837 name:ZooKeeperConnection Watcher:127.0.0.1:34609/solr got event WatchedEvent state:SyncConnected type:None path:null path:null type:None
>   [junit4]   2> 60848 INFO  (jetty-launcher-158-thread-3) [    ] o.a.s.c.c.ConnectionManager Client is connected to ZooKeeper
>   [junit4]   2> 60849 INFO  (jetty-launcher-158-thread-4) [    ] o.a.s.c.c.SolrZkClient makePath: /live_nodes
>   [junit4]   2> 60849 INFO  (jetty-launcher-158-thread-1) [    ] o.a.s.c.c.SolrZkClient makePath: /live_nodes
>   [junit4]   2> 60850 INFO  (jetty-launcher-158-thread-2) [    ] o.a.s.c.c.SolrZkClient makePath: /live_nodes
>   [junit4]   2> 60851 INFO  (jetty-launcher-158-thread-4) [    ] o.a.s.c.c.SolrZkClient makePath: /collections
>   [junit4]   2> 60851 INFO  (jetty-launcher-158-thread-1) [    ] o.a.s.c.c.SolrZkClient makePath: /collections
>   [junit4]   2> 60851 INFO  (jetty-launcher-158-thread-2) [    ] o.a.s.c.c.SolrZkClient makePath: /collections
>   [junit4]   2> 60852 INFO  (jetty-launcher-158-thread-1) [    ] o.a.s.c.c.SolrZkClient makePath: /aliases.json
>   [junit4]   2> 60852 INFO  (jetty-launcher-158-thread-2) [    ] o.a.s.c.c.SolrZkClient makePath: /aliases.json
>   [junit4]   2> 60853 INFO  (jetty-launcher-158-thread-4) [    ] o.a.s.c.c.SolrZkClient makePath: /aliases.json
>   [junit4]   2> 60854 INFO  (jetty-launcher-158-thread-2) [    ] o.a.s.c.c.SolrZkClient makePath: /clusterstate.json
>   [junit4]   2> 60854 INFO  (jetty-launcher-158-thread-4) [    ] o.a.s.c.c.SolrZkClient makePath: /clusterstate.json
>   [junit4]   2> 60854 INFO  (jetty-launcher-158-thread-1) [    ] o.a.s.c.c.SolrZkClient makePath: /clusterstate.json
>   [junit4]   2> 60855 INFO  (jetty-launcher-158-thread-4) [    ] o.a.s.c.c.SolrZkClient makePath: /security.json
>   [junit4]   2> 60856 INFO  (jetty-launcher-158-thread-2) [    ] o.a.s.c.c.SolrZkClient makePath: /security.json
>   [junit4]   2> 60856 INFO  (jetty-launcher-158-thread-1) [    ] o.a.s.c.c.SolrZkClient makePath: /security.json
>   [junit4]   2> 60857 INFO  (jetty-launcher-158-thread-2) [    ] o.a.s.c.c.ZkStateReader Updating cluster state from ZooKeeper... 
>   [junit4]   2> 60858 INFO  (jetty-launcher-158-thread-4) [    ] o.a.s.c.c.ZkStateReader Updating cluster state from ZooKeeper... 
>   [junit4]   2> 60858 INFO  (jetty-launcher-158-thread-1) [    ] o.a.s.c.c.ZkStateReader Updating cluster state from ZooKeeper... 
>   [junit4]   2> 60858 INFO  (jetty-launcher-158-thread-2) [    ] o.a.s.c.c.ZkStateReader Loaded empty cluster properties
>   [junit4]   2> 60859 INFO  (jetty-launcher-158-thread-4) [    ] o.a.s.c.c.ZkStateReader Loaded empty cluster properties
>   [junit4]   2> 60859 INFO  (jetty-launcher-158-thread-1) [    ] o.a.s.c.c.ZkStateReader Loaded empty cluster properties
>   [junit4]   2> 60859 INFO  (jetty-launcher-158-thread-2) [    ] o.a.s.c.c.ZkStateReader Updated live nodes from ZooKeeper... (0) -> (0)
>   [junit4]   2> 60860 INFO  (jetty-launcher-158-thread-4) [    ] o.a.s.c.c.ZkStateReader Updated live nodes from ZooKeeper... (0) -> (0)
>   [junit4]   2> 60860 INFO  (jetty-launcher-158-thread-1) [    ] o.a.s.c.c.ZkStateReader Updated live nodes from ZooKeeper... (0) -> (0)
>   [junit4]   2> 60864 INFO  (jetty-launcher-158-thread-2) [    ] o.a.s.c.c.SolrZkClient makePath: /overseer_elect
>   [junit4]   2> 60865 INFO  (jetty-launcher-158-thread-4) [    ] o.a.s.c.c.SolrZkClient makePath: /overseer_elect
>   [junit4]   2> 60865 INFO  (jetty-launcher-158-thread-1) [    ] o.a.s.c.c.SolrZkClient makePath: /overseer_elect
>   [junit4]   2> 60867 INFO  (jetty-launcher-158-thread-4) [    ] o.a.s.c.c.SolrZkClient makePath: /overseer_elect/election
>   [junit4]   2> 60867 INFO  (jetty-launcher-158-thread-2) [    ] o.a.s.c.c.SolrZkClient makePath: /overseer_elect/election
>   [junit4]   2> 60867 INFO  (jetty-launcher-158-thread-1) [    ] o.a.s.c.c.SolrZkClient makePath: /overseer_elect/election
>   [junit4]   2> 60870 INFO  (jetty-launcher-158-thread-2) [    ] o.a.s.c.Overseer Overseer (id=null) closing
>   [junit4]   2> 60870 INFO  (jetty-launcher-158-thread-1) [    ] o.a.s.c.Overseer Overseer (id=null) closing
>   [junit4]   2> 60870 INFO  (jetty-launcher-158-thread-4) [    ] o.a.s.c.Overseer Overseer (id=null) closing
>   [junit4]   2> 60871 INFO  (jetty-launcher-158-thread-2) [    ] o.a.s.c.LeaderElector Joined leadership election with path: /overseer_elect/election/95994505783148552-127.0.0.1:40525_solr-n_0000000000
>   [junit4]   2> 60871 INFO  (jetty-launcher-158-thread-1) [    ] o.a.s.c.LeaderElector Joined leadership election with path: /overseer_elect/election/95994505783148551-127.0.0.1:44223_solr-n_0000000001
>   [junit4]   2> 60871 INFO  (jetty-launcher-158-thread-4) [    ] o.a.s.c.LeaderElector Joined leadership election with path: /overseer_elect/election/95994505783148554-127.0.0.1:35367_solr-n_0000000002
>   [junit4]   2> 60871 INFO  (jetty-launcher-158-thread-2) [    ] o.a.s.c.OverseerElectionContext I am going to be the leader 127.0.0.1:40525_solr
>   [junit4]   2> 60872 INFO  (jetty-launcher-158-thread-2) [    ] o.a.s.c.c.SolrZkClient makePath: /overseer_elect/leader
>   [junit4]   2> 60873 INFO  (jetty-launcher-158-thread-1) [    ] o.a.s.c.LeaderElector Watching path /overseer_elect/election/95994505783148552-127.0.0.1:40525_solr-n_0000000000 to know if I could be the leader
>   [junit4]   2> 60873 INFO  (jetty-launcher-158-thread-4) [    ] o.a.s.c.LeaderElector Watching path /overseer_elect/election/95994505783148551-127.0.0.1:44223_solr-n_0000000001 to know if I could be the leader
>   [junit4]   2> 60873 INFO  (jetty-launcher-158-thread-1) [    ] o.a.s.c.ZkController Register node as live in ZooKeeper:/live_nodes/127.0.0.1:44223_solr
>   [junit4]   2> 60874 INFO  (jetty-launcher-158-thread-4) [    ] o.a.s.c.ZkController Register node as live in ZooKeeper:/live_nodes/127.0.0.1:35367_solr
>   [junit4]   2> 60874 INFO  (jetty-launcher-158-thread-1) [    ] o.a.s.c.c.SolrZkClient makePath: /live_nodes/127.0.0.1:44223_solr
>   [junit4]   2> 60875 INFO  (jetty-launcher-158-thread-4) [    ] o.a.s.c.c.SolrZkClient makePath: /live_nodes/127.0.0.1:35367_solr
>   [junit4]   2> 60875 INFO  (jetty-launcher-158-thread-2) [    ] o.a.s.c.Overseer Overseer (id=95994505783148552-127.0.0.1:40525_solr-n_0000000000) starting
>   [junit4]   2> 60875 INFO  (jetty-launcher-158-thread-3) [    ] o.a.s.c.c.ZkStateReader Updating cluster state from ZooKeeper... 
>   [junit4]   2> 60876 INFO  (jetty-launcher-158-thread-3) [    ] o.a.s.c.c.ZkStateReader Loaded empty cluster properties
>   [junit4]   2> 60877 INFO  (zkCallback-170-thread-1) [    ] o.a.s.c.c.ZkStateReader A live node change: [WatchedEvent state:SyncConnected type:NodeChildrenChanged path:/live_nodes], has occurred - updating... (live nodes size: [0])
>   [junit4]   2> 60877 INFO  (zkCallback-171-thread-1) [    ] o.a.s.c.c.ZkStateReader A live node change: [WatchedEvent state:SyncConnected type:NodeChildrenChanged path:/live_nodes], has occurred - updating... (live nodes size: [0])
>   [junit4]   2> 60879 INFO  (zkCallback-170-thread-1) [    ] o.a.s.c.c.ZkStateReader Updated live nodes from ZooKeeper... (0) -> (2)
>   [junit4]   2> 60881 INFO  (zkCallback-178-thread-1) [    ] o.a.s.c.c.ZkStateReader A live node change: [WatchedEvent state:SyncConnected type:NodeChildrenChanged path:/live_nodes], has occurred - updating... (live nodes size: [0])
>   [junit4]   2> 60884 INFO  (zkCallback-171-thread-1) [    ] o.a.s.c.c.ZkStateReader Updated live nodes from ZooKeeper... (0) -> (2)
>   [junit4]   2> 60884 INFO  (jetty-launcher-158-thread-3) [    ] o.a.s.c.c.ZkStateReader Updated live nodes from ZooKeeper... (0) -> (2)
>   [junit4]   2> 60886 INFO  (zkCallback-178-thread-1) [    ] o.a.s.c.c.ZkStateReader Updated live nodes from ZooKeeper... (0) -> (2)
>   [junit4]   2> 60894 INFO  (jetty-launcher-158-thread-2) [    ] o.a.s.c.c.SolrZkClient makePath: /overseer/queue-work
>   [junit4]   2> 60896 INFO  (jetty-launcher-158-thread-3) [    ] o.a.s.c.Overseer Overseer (id=null) closing
>   [junit4]   2> 60897 INFO  (jetty-launcher-158-thread-3) [    ] o.a.s.c.LeaderElector Joined leadership election with path: /overseer_elect/election/95994505783148556-127.0.0.1:36383_solr-n_0000000003
>   [junit4]   2> 60898 INFO  (jetty-launcher-158-thread-3) [    ] o.a.s.c.LeaderElector Watching path /overseer_elect/election/95994505783148554-127.0.0.1:35367_solr-n_0000000002 to know if I could be the leader
>   [junit4]   2> 60898 INFO  (jetty-launcher-158-thread-3) [    ] o.a.s.c.ZkController Publish node=127.0.0.1:36383_solr as DOWN
>   [junit4]   2> 60957 INFO  (jetty-launcher-158-thread-2) [    ] o.a.s.c.OverseerAutoReplicaFailoverThread Starting OverseerAutoReplicaFailoverThread autoReplicaFailoverWorkLoopDelay=10000 autoReplicaFailoverWaitAfterExpiration=30000 autoReplicaFailoverBadNodeExpiration=60000
>   [junit4]   2> 60957 INFO  (OverseerCollectionConfigSetProcessor-95994505783148552-127.0.0.1:40525_solr-n_0000000000) [    ] o.a.s.c.OverseerTaskProcessor Process current queue of overseer operations
>   [junit4]   2> 60958 INFO  (jetty-launcher-158-thread-2) [    ] o.a.s.c.ZkController Publish node=127.0.0.1:40525_solr as DOWN
>   [junit4]   2> 60958 INFO  (OverseerStateUpdate-95994505783148552-127.0.0.1:40525_solr-n_0000000000) [    ] o.a.s.c.Overseer Starting to work on the main queue
>   [junit4]   2> 60959 INFO  (OverseerStateUpdate-95994505783148552-127.0.0.1:40525_solr-n_0000000000) [    ] o.a.s.c.c.ZkStateReader Updated live nodes from ZooKeeper... (2) -> (2)
>   [junit4]   2> 60960 INFO  (OverseerStateUpdate-95994505783148552-127.0.0.1:40525_solr-n_0000000000) [    ] o.a.s.c.Overseer processMessage: queueSize: 2, message = {
>   [junit4]   2>   "operation":"downnode",
>   [junit4]   2>   "node_name":"127.0.0.1:36383_solr"} current state version: 0
>   [junit4]   2> 60960 INFO  (OverseerStateUpdate-95994505783148552-127.0.0.1:40525_solr-n_0000000000) [    ] o.a.s.c.o.NodeMutator DownNode state invoked for node: 127.0.0.1:36383_solr
>   [junit4]   2> 60960 INFO  (jetty-launcher-158-thread-1) [    ] o.a.s.c.CoreContainer Security conf doesn't exist. Skipping setup for authorization module.
>   [junit4]   2> 60960 INFO  (jetty-launcher-158-thread-1) [    ] o.a.s.c.CoreContainer No authentication plugin used.
>   [junit4]   2> 60960 INFO  (jetty-launcher-158-thread-4) [    ] o.a.s.c.CoreContainer Security conf doesn't exist. Skipping setup for authorization module.
>   [junit4]   2> 60960 INFO  (jetty-launcher-158-thread-4) [    ] o.a.s.c.CoreContainer No authentication plugin used.
>   [junit4]   2> 60961 INFO  (OverseerStateUpdate-95994505783148552-127.0.0.1:40525_solr-n_0000000000) [    ] o.a.s.c.Overseer processMessage: queueSize: 2, message = {
>   [junit4]   2>   "operation":"downnode",
>   [junit4]   2>   "node_name":"127.0.0.1:40525_solr"} current state version: 0
>   [junit4]   2> 60961 INFO  (OverseerStateUpdate-95994505783148552-127.0.0.1:40525_solr-n_0000000000) [    ] o.a.s.c.o.NodeMutator DownNode state invoked for node: 127.0.0.1:40525_solr
>   [junit4]   2> 60961 INFO  (jetty-launcher-158-thread-4) [    ] o.a.s.c.CorePropertiesLocator Looking for core definitions underneath /home/jenkins/workspace/Lucene-Solr-master-Linux/solr/build/solr-solrj/test/J2/temp/solr.common.cloud.TestCollectionStateWatchers_34E75E20242312A2-001/tempDir-001/node3/.
>   [junit4]   2> 60962 INFO  (jetty-launcher-158-thread-4) [    ] o.a.s.c.CorePropertiesLocator Found 0 core definitions
>   [junit4]   2> 60962 INFO  (jetty-launcher-158-thread-1) [    ] o.a.s.c.CorePropertiesLocator Looking for core definitions underneath /home/jenkins/workspace/Lucene-Solr-master-Linux/solr/build/solr-solrj/test/J2/temp/solr.common.cloud.TestCollectionStateWatchers_34E75E20242312A2-001/tempDir-001/node1/.
>   [junit4]   2> 60963 INFO  (jetty-launcher-158-thread-1) [    ] o.a.s.c.CorePropertiesLocator Found 0 core definitions
>   [junit4]   2> 60965 INFO  (jetty-launcher-158-thread-4) [    ] o.a.s.s.SolrDispatchFilter user.dir=/home/jenkins/workspace/Lucene-Solr-master-Linux/solr/build/solr-solrj/test/J2
>   [junit4]   2> 60965 INFO  (jetty-launcher-158-thread-4) [    ] o.a.s.s.SolrDispatchFilter SolrDispatchFilter.init() done
>   [junit4]   2> 60965 INFO  (jetty-launcher-158-thread-1) [    ] o.a.s.s.SolrDispatchFilter user.dir=/home/jenkins/workspace/Lucene-Solr-master-Linux/solr/build/solr-solrj/test/J2
>   [junit4]   2> 60965 INFO  (jetty-launcher-158-thread-1) [    ] o.a.s.s.SolrDispatchFilter SolrDispatchFilter.init() done
>   [junit4]   2> 61899 INFO  (jetty-launcher-158-thread-3) [    ] o.a.s.c.ZkController Register node as live in ZooKeeper:/live_nodes/127.0.0.1:36383_solr
>   [junit4]   2> 61899 INFO  (jetty-launcher-158-thread-3) [    ] o.a.s.c.c.SolrZkClient makePath: /live_nodes/127.0.0.1:36383_solr
>   [junit4]   2> 61900 INFO  (zkCallback-171-thread-1) [    ] o.a.s.c.c.ZkStateReader A live node change: [WatchedEvent state:SyncConnected type:NodeChildrenChanged path:/live_nodes], has occurred - updating... (live nodes size: [2])
>   [junit4]   2> 61900 INFO  (zkCallback-170-thread-1) [    ] o.a.s.c.c.ZkStateReader A live node change: [WatchedEvent state:SyncConnected type:NodeChildrenChanged path:/live_nodes], has occurred - updating... (live nodes size: [2])
>   [junit4]   2> 61900 INFO  (zkCallback-178-thread-1) [    ] o.a.s.c.c.ZkStateReader A live node change: [WatchedEvent state:SyncConnected type:NodeChildrenChanged path:/live_nodes], has occurred - updating... (live nodes size: [2])
>   [junit4]   2> 61902 INFO  (zkCallback-179-thread-1) [    ] o.a.s.c.c.ZkStateReader A live node change: [WatchedEvent state:SyncConnected type:NodeChildrenChanged path:/live_nodes], has occurred - updating... (live nodes size: [2])
>   [junit4]   2> 61903 INFO  (zkCallback-178-thread-1) [    ] o.a.s.c.c.ZkStateReader Updated live nodes from ZooKeeper... (2) -> (3)
>   [junit4]   2> 61903 INFO  (zkCallback-171-thread-1) [    ] o.a.s.c.c.ZkStateReader Updated live nodes from ZooKeeper... (2) -> (3)
>   [junit4]   2> 61903 INFO  (zkCallback-170-thread-1) [    ] o.a.s.c.c.ZkStateReader Updated live nodes from ZooKeeper... (2) -> (3)
>   [junit4]   2> 61907 INFO  (zkCallback-179-thread-1) [    ] o.a.s.c.c.ZkStateReader Updated live nodes from ZooKeeper... (2) -> (3)
>   [junit4]   2> 61913 INFO  (jetty-launcher-158-thread-3) [    ] o.a.s.c.CoreContainer Security conf doesn't exist. Skipping setup for authorization module.
>   [junit4]   2> 61914 INFO  (jetty-launcher-158-thread-3) [    ] o.a.s.c.CoreContainer No authentication plugin used.
>   [junit4]   2> 61915 INFO  (jetty-launcher-158-thread-3) [    ] o.a.s.c.CorePropertiesLocator Looking for core definitions underneath /home/jenkins/workspace/Lucene-Solr-master-Linux/solr/build/solr-solrj/test/J2/temp/solr.common.cloud.TestCollectionStateWatchers_34E75E20242312A2-001/tempDir-001/node4/.
>   [junit4]   2> 61915 INFO  (jetty-launcher-158-thread-3) [    ] o.a.s.c.CorePropertiesLocator Found 0 core definitions
>   [junit4]   2> 61916 INFO  (jetty-launcher-158-thread-3) [    ] o.a.s.s.SolrDispatchFilter user.dir=/home/jenkins/workspace/Lucene-Solr-master-Linux/solr/build/solr-solrj/test/J2
>   [junit4]   2> 61916 INFO  (jetty-launcher-158-thread-3) [    ] o.a.s.s.SolrDispatchFilter SolrDispatchFilter.init() done
>   [junit4]   2> 61959 INFO  (jetty-launcher-158-thread-2) [    ] o.a.s.c.ZkController Register node as live in ZooKeeper:/live_nodes/127.0.0.1:40525_solr
>   [junit4]   2> 61962 INFO  (jetty-launcher-158-thread-2) [    ] o.a.s.c.c.SolrZkClient makePath: /live_nodes/127.0.0.1:40525_solr
>   [junit4]   2> 61963 INFO  (zkCallback-171-thread-1) [    ] o.a.s.c.c.ZkStateReader A live node change: [WatchedEvent state:SyncConnected type:NodeChildrenChanged path:/live_nodes], has occurred - updating... (live nodes size: [3])
>   [junit4]   2> 61963 INFO  (zkCallback-178-thread-1) [    ] o.a.s.c.c.ZkStateReader A live node change: [WatchedEvent state:SyncConnected type:NodeChildrenChanged path:/live_nodes], has occurred - updating... (live nodes size: [3])
>   [junit4]   2> 61963 INFO  (zkCallback-170-thread-1) [    ] o.a.s.c.c.ZkStateReader A live node change: [WatchedEvent state:SyncConnected type:NodeChildrenChanged path:/live_nodes], has occurred - updating... (live nodes size: [3])
>   [junit4]   2> 61963 INFO  (zkCallback-171-thread-1) [    ] o.a.s.c.c.ZkStateReader Updated live nodes from ZooKeeper... (3) -> (4)
>   [junit4]   2> 61963 INFO  (zkCallback-170-thread-1) [    ] o.a.s.c.c.ZkStateReader Updated live nodes from ZooKeeper... (3) -> (4)
>   [junit4]   2> 61963 INFO  (zkCallback-178-thread-1) [    ] o.a.s.c.c.ZkStateReader Updated live nodes from ZooKeeper... (3) -> (4)
>   [junit4]   2> 61965 INFO  (zkCallback-179-thread-1) [    ] o.a.s.c.c.ZkStateReader A live node change: [WatchedEvent state:SyncConnected type:NodeChildrenChanged path:/live_nodes], has occurred - updating... (live nodes size: [3])
>   [junit4]   2> 61969 INFO  (zkCallback-179-thread-1) [    ] o.a.s.c.c.ZkStateReader Updated live nodes from ZooKeeper... (3) -> (4)
>   [junit4]   2> 61971 INFO  (jetty-launcher-158-thread-2) [    ] o.a.s.c.CoreContainer Security conf doesn't exist. Skipping setup for authorization module.
>   [junit4]   2> 61971 INFO  (jetty-launcher-158-thread-2) [    ] o.a.s.c.CoreContainer No authentication plugin used.
>   [junit4]   2> 61971 INFO  (jetty-launcher-158-thread-2) [    ] o.a.s.c.CorePropertiesLocator Looking for core definitions underneath /home/jenkins/workspace/Lucene-Solr-master-Linux/solr/build/solr-solrj/test/J2/temp/solr.common.cloud.TestCollectionStateWatchers_34E75E20242312A2-001/tempDir-001/node2/.
>   [junit4]   2> 61971 INFO  (jetty-launcher-158-thread-2) [    ] o.a.s.c.CorePropertiesLocator Found 0 core definitions
>   [junit4]   2> 61972 INFO  (jetty-launcher-158-thread-2) [    ] o.a.s.s.SolrDispatchFilter user.dir=/home/jenkins/workspace/Lucene-Solr-master-Linux/solr/build/solr-solrj/test/J2
>   [junit4]   2> 61972 INFO  (jetty-launcher-158-thread-2) [    ] o.a.s.s.SolrDispatchFilter SolrDispatchFilter.init() done
>   [junit4]   2> 61972 INFO  (SUITE-TestCollectionStateWatchers-seed#[34E75E20242312A2]-worker) [    ] o.a.s.c.c.SolrZkClient Using default ZkCredentialsProvider
>   [junit4]   2> 61972 INFO  (SUITE-TestCollectionStateWatchers-seed#[34E75E20242312A2]-worker) [    ] o.a.s.c.c.ConnectionManager Waiting for client to connect to ZooKeeper
>   [junit4]   2> 61974 INFO  (zkCallback-184-thread-1) [    ] o.a.s.c.c.ConnectionManager Watcher org.apache.solr.common.cloud.ConnectionManager@2774d028 name:ZooKeeperConnection Watcher:127.0.0.1:34609 got event WatchedEvent state:SyncConnected type:None path:null path:null type:None
>   [junit4]   2> 61975 INFO  (SUITE-TestCollectionStateWatchers-seed#[34E75E20242312A2]-worker) [    ] o.a.s.c.c.ConnectionManager Client is connected to ZooKeeper
>   [junit4]   2> 61975 INFO  (SUITE-TestCollectionStateWatchers-seed#[34E75E20242312A2]-worker) [    ] o.a.s.c.c.SolrZkClient Using default ZkACLProvider
>   [junit4]   2> 61976 INFO  (SUITE-TestCollectionStateWatchers-seed#[34E75E20242312A2]-worker) [    ] o.a.s.c.s.i.CloudSolrClient Final constructed zkHost string: 127.0.0.1:34609/solr
>   [junit4]   2> 61976 INFO  (SUITE-TestCollectionStateWatchers-seed#[34E75E20242312A2]-worker) [    ] o.a.s.c.c.SolrZkClient Using default ZkCredentialsProvider
>   [junit4]   2> 61977 INFO  (SUITE-TestCollectionStateWatchers-seed#[34E75E20242312A2]-worker) [    ] o.a.s.c.c.ConnectionManager Waiting for client to connect to ZooKeeper
>   [junit4]   2> 61978 INFO  (zkCallback-187-thread-1) [    ] o.a.s.c.c.ConnectionManager Watcher org.apache.solr.common.cloud.ConnectionManager@4670bc0 name:ZooKeeperConnection Watcher:127.0.0.1:34609/solr got event WatchedEvent state:SyncConnected type:None path:null path:null type:None
>   [junit4]   2> 61978 INFO  (SUITE-TestCollectionStateWatchers-seed#[34E75E20242312A2]-worker) [    ] o.a.s.c.c.ConnectionManager Client is connected to ZooKeeper
>   [junit4]   2> 61978 INFO  (SUITE-TestCollectionStateWatchers-seed#[34E75E20242312A2]-worker) [    ] o.a.s.c.c.SolrZkClient Using default ZkACLProvider
>   [junit4]   2> 61978 INFO  (SUITE-TestCollectionStateWatchers-seed#[34E75E20242312A2]-worker) [    ] o.a.s.c.c.ZkStateReader Updating cluster state from ZooKeeper... 
>   [junit4]   2> 61978 INFO  (SUITE-TestCollectionStateWatchers-seed#[34E75E20242312A2]-worker) [    ] o.a.s.c.c.ZkStateReader Loaded empty cluster properties
>   [junit4]   2> 61978 INFO  (SUITE-TestCollectionStateWatchers-seed#[34E75E20242312A2]-worker) [    ] o.a.s.c.c.ZkStateReader Updated live nodes from ZooKeeper... (0) -> (4)
>   [junit4]   2> 61979 INFO  (SUITE-TestCollectionStateWatchers-seed#[34E75E20242312A2]-worker) [    ] o.a.s.c.c.SolrZkClient makePath: /configs/config/solrconfig.xml
>   [junit4]   2> 61980 INFO  (SUITE-TestCollectionStateWatchers-seed#[34E75E20242312A2]-worker) [    ] o.a.s.c.c.SolrZkClient makePath: /configs/config/schema-sql.xml
>   [junit4]   2> 61981 INFO  (SUITE-TestCollectionStateWatchers-seed#[34E75E20242312A2]-worker) [    ] o.a.s.c.c.SolrZkClient makePath: /configs/config/solrconfig-sql.xml
>   [junit4]   2> 61982 INFO  (SUITE-TestCollectionStateWatchers-seed#[34E75E20242312A2]-worker) [    ] o.a.s.c.c.SolrZkClient makePath: /configs/config/solrconfig-slave1.xml
>   [junit4]   2> 61983 INFO  (SUITE-TestCollectionStateWatchers-seed#[34E75E20242312A2]-worker) [    ] o.a.s.c.c.SolrZkClient makePath: /configs/config/schema.xml
>   [junit4]   2> 61999 INFO  (SUITE-TestCollectionStateWatchers-seed#[34E75E20242312A2]-worker) [    ] o.a.s.c.c.SolrZkClient makePath: /configs/config/schema-replication1.xml
>   [junit4]   2> 62001 INFO  (SUITE-TestCollectionStateWatchers-seed#[34E75E20242312A2]-worker) [    ] o.a.s.c.c.SolrZkClient makePath: /configs/config/solrconfig-managed-schema.xml
>   [junit4]   2> 62032 INFO  (TEST-TestCollectionStateWatchers.testWatcherIsRemovedAfterTimeout-seed#[34E75E20242312A2]) [    ] o.a.s.SolrTestCaseJ4 ###Starting testWatcherIsRemovedAfterTimeout
>   [junit4]   2> 62032 INFO  (TEST-TestCollectionStateWatchers.testWatcherIsRemovedAfterTimeout-seed#[34E75E20242312A2]) [    ] o.a.s.c.c.SolrZkClient Using default ZkCredentialsProvider
>   [junit4]   2> 62032 INFO  (TEST-TestCollectionStateWatchers.testWatcherIsRemovedAfterTimeout-seed#[34E75E20242312A2]) [    ] o.a.s.c.c.ConnectionManager Waiting for client to connect to ZooKeeper
>   [junit4]   2> 62042 INFO  (zkCallback-188-thread-1) [    ] o.a.s.c.c.ConnectionManager Watcher org.apache.solr.common.cloud.ConnectionManager@1e87e8e6 name:ZooKeeperConnection Watcher:127.0.0.1:34609 got event WatchedEvent state:SyncConnected type:None path:null path:null type:None
>   [junit4]   2> 62042 INFO  (TEST-TestCollectionStateWatchers.testWatcherIsRemovedAfterTimeout-seed#[34E75E20242312A2]) [    ] o.a.s.c.c.ConnectionManager Client is connected to ZooKeeper
>   [junit4]   2> 62042 INFO  (TEST-TestCollectionStateWatchers.testWatcherIsRemovedAfterTimeout-seed#[34E75E20242312A2]) [    ] o.a.s.c.c.SolrZkClient Using default ZkACLProvider
>   [junit4]   2> 62079 INFO  (TEST-TestCollectionStateWatchers.testWatcherIsRemovedAfterTimeout-seed#[34E75E20242312A2]) [    ] o.a.s.c.c.ZkStateReader Deleting data for [no-such-collection]
>   [junit4]   2> 62090 INFO  (TEST-TestCollectionStateWatchers.testWatcherIsRemovedAfterTimeout-seed#[34E75E20242312A2]) [    ] o.a.s.SolrTestCaseJ4 ###Ending testWatcherIsRemovedAfterTimeout
>   [junit4]   2> 62112 INFO  (TEST-TestCollectionStateWatchers.testWaitForStateWatcherIsRetainedOnPredicateFailure-seed#[34E75E20242312A2]) [    ] o.a.s.SolrTestCaseJ4 ###Starting testWaitForStateWatcherIsRetainedOnPredicateFailure
>   [junit4]   2> 62112 INFO  (TEST-TestCollectionStateWatchers.testWaitForStateWatcherIsRetainedOnPredicateFailure-seed#[34E75E20242312A2]) [    ] o.a.s.c.c.SolrZkClient Using default ZkCredentialsProvider
>   [junit4]   2> 62112 INFO  (TEST-TestCollectionStateWatchers.testWaitForStateWatcherIsRetainedOnPredicateFailure-seed#[34E75E20242312A2]) [    ] o.a.s.c.c.ConnectionManager Waiting for client to connect to ZooKeeper
>   [junit4]   2> 62114 INFO  (zkCallback-189-thread-1) [    ] o.a.s.c.c.ConnectionManager Watcher org.apache.solr.common.cloud.ConnectionManager@fedc32e name:ZooKeeperConnection Watcher:127.0.0.1:34609 got event WatchedEvent state:SyncConnected type:None path:null path:null type:None
>   [junit4]   2> 62114 INFO  (TEST-TestCollectionStateWatchers.testWaitForStateWatcherIsRetainedOnPredicateFailure-seed#[34E75E20242312A2]) [    ] o.a.s.c.c.ConnectionManager Client is connected to ZooKeeper
>   [junit4]   2> 62114 INFO  (TEST-TestCollectionStateWatchers.testWaitForStateWatcherIsRetainedOnPredicateFailure-seed#[34E75E20242312A2]) [    ] o.a.s.c.c.SolrZkClient Using default ZkACLProvider
>   [junit4]   2> 62119 INFO  (qtp421581055-907) [    ] o.a.s.h.a.CollectionsHandler Invoked Collection Action :create with params async=b62ad6d3-50b5-4da1-8b8e-e81c98bb1d6d&replicationFactor=1&collection.configName=config&name=falsepredicate&action=CREATE&numShards=4&wt=javabin&version=2 and sendToOCPQueue=true
>   [junit4]   2> 62120 INFO  (qtp421581055-907) [    ] o.a.s.s.HttpSolrCall [admin] webapp=null path=/admin/collections params={async=b62ad6d3-50b5-4da1-8b8e-e81c98bb1d6d&replicationFactor=1&collection.configName=config&name=falsepredicate&action=CREATE&numShards=4&wt=javabin&version=2} status=0 QTime=1
>   [junit4]   2> 62121 INFO  (qtp421581055-908) [    ] o.a.s.h.a.CollectionsHandler Invoked Collection Action :requeststatus with params requestid=b62ad6d3-50b5-4da1-8b8e-e81c98bb1d6d&action=REQUESTSTATUS&wt=javabin&version=2 and sendToOCPQueue=true
>   [junit4]   2> 62122 INFO  (OverseerCollectionConfigSetProcessor-95994505783148552-127.0.0.1:40525_solr-n_0000000000) [    ] o.a.s.c.c.SolrZkClient makePath: /overseer/collection-map-running/mn-b62ad6d3-50b5-4da1-8b8e-e81c98bb1d6d
>   [junit4]   2> 62122 INFO  (qtp421581055-908) [    ] o.a.s.s.HttpSolrCall [admin] webapp=null path=/admin/collections params={requestid=b62ad6d3-50b5-4da1-8b8e-e81c98bb1d6d&action=REQUESTSTATUS&wt=javabin&version=2} status=0 QTime=0
>   [junit4]   2> 62123 INFO  (OverseerCollectionConfigSetProcessor-95994505783148552-127.0.0.1:40525_solr-n_0000000000) [    ] o.a.s.c.OverseerTaskProcessor Overseer Collection Message Handler: Get the message id:/overseer/collection-queue-work/qn-0000000000 message:{
>   [junit4]   2>   "name":"falsepredicate",
>   [junit4]   2>   "fromApi":"true",
>   [junit4]   2>   "replicationFactor":"1",
>   [junit4]   2>   "collection.configName":"config",
>   [junit4]   2>   "numShards":"4",
>   [junit4]   2>   "stateFormat":"2",
>   [junit4]   2>   "async":"b62ad6d3-50b5-4da1-8b8e-e81c98bb1d6d",
>   [junit4]   2>   "operation":"create"}
>   [junit4]   2> 62123 INFO  (OverseerThreadFactory-368-thread-1) [    ] o.a.s.c.OverseerCollectionMessageHandler OverseerCollectionMessageHandler.processMessage : create , {
>   [junit4]   2>   "name":"falsepredicate",
>   [junit4]   2>   "fromApi":"true",
>   [junit4]   2>   "replicationFactor":"1",
>   [junit4]   2>   "collection.configName":"config",
>   [junit4]   2>   "numShards":"4",
>   [junit4]   2>   "stateFormat":"2",
>   [junit4]   2>   "async":"b62ad6d3-50b5-4da1-8b8e-e81c98bb1d6d",
>   [junit4]   2>   "operation":"create"}
>   [junit4]   2> 62123 INFO  (OverseerThreadFactory-368-thread-1) [    ] o.a.s.c.OverseerCollectionMessageHandler Create collection falsepredicate
>   [junit4]   2> 62123 INFO  (OverseerThreadFactory-368-thread-1) [    ] o.a.s.c.OverseerCollectionMessageHandler creating collections conf node /collections/falsepredicate 
>   [junit4]   2> 62123 INFO  (OverseerThreadFactory-368-thread-1) [    ] o.a.s.c.c.SolrZkClient makePath: /collections/falsepredicate
>   [junit4]   2> 62125 INFO  (zkCallback-171-thread-1) [    ] o.a.s.c.c.ZkStateReader A collections change: [WatchedEvent state:SyncConnected type:NodeChildrenChanged path:/collections], has occurred - updating...
>   [junit4]   2> 62125 INFO  (zkCallback-170-thread-1) [    ] o.a.s.c.c.ZkStateReader A collections change: [WatchedEvent state:SyncConnected type:NodeChildrenChanged path:/collections], has occurred - updating...
>   [junit4]   2> 62125 INFO  (zkCallback-178-thread-1) [    ] o.a.s.c.c.ZkStateReader A collections change: [WatchedEvent state:SyncConnected type:NodeChildrenChanged path:/collections], has occurred - updating...
>   [junit4]   2> 62125 INFO  (zkCallback-179-thread-1) [    ] o.a.s.c.c.ZkStateReader A collections change: [WatchedEvent state:SyncConnected type:NodeChildrenChanged path:/collections], has occurred - updating...
>   [junit4]   2> 62125 INFO  (zkCallback-187-thread-1) [    ] o.a.s.c.c.ZkStateReader A collections change: [WatchedEvent state:SyncConnected type:NodeChildrenChanged path:/collections], has occurred - updating...
>   [junit4]   2> 62126 INFO  (OverseerStateUpdate-95994505783148552-127.0.0.1:40525_solr-n_0000000000) [    ] o.a.s.c.Overseer processMessage: queueSize: 1, message = {
>   [junit4]   2>   "name":"falsepredicate",
>   [junit4]   2>   "fromApi":"true",
>   [junit4]   2>   "replicationFactor":"1",
>   [junit4]   2>   "collection.configName":"config",
>   [junit4]   2>   "numShards":"4",
>   [junit4]   2>   "stateFormat":"2",
>   [junit4]   2>   "async":"b62ad6d3-50b5-4da1-8b8e-e81c98bb1d6d",
>   [junit4]   2>   "operation":"create"} current state version: 0
>   [junit4]   2> 62126 INFO  (OverseerStateUpdate-95994505783148552-127.0.0.1:40525_solr-n_0000000000) [    ] o.a.s.c.o.ClusterStateMutator building a new cName: falsepredicate
>   [junit4]   2> 62126 INFO  (OverseerStateUpdate-95994505783148552-127.0.0.1:40525_solr-n_0000000000) [    ] o.a.s.c.o.ZkStateWriter going to create_collection /collections/falsepredicate/state.json
>   [junit4]   2> 62226 INFO  (OverseerThreadFactory-368-thread-1) [    ] o.a.s.c.OverseerCollectionMessageHandler Creating SolrCores for new collection falsepredicate, shardNames [shard1, shard2, shard3, shard4] , replicationFactor : 1
>   [junit4]   2> 62226 INFO  (OverseerThreadFactory-368-thread-1) [    ] o.a.s.c.OverseerCollectionMessageHandler Creating core falsepredicate_shard4_replica1 as part of shard shard4 of collection falsepredicate on 127.0.0.1:36383_solr
>   [junit4]   2> 62227 INFO  (OverseerThreadFactory-368-thread-1) [    ] o.a.s.c.OverseerCollectionMessageHandler Creating core falsepredicate_shard1_replica1 as part of shard shard1 of collection falsepredicate on 127.0.0.1:44223_solr
>   [junit4]   2> 62227 INFO  (OverseerThreadFactory-368-thread-1) [    ] o.a.s.c.OverseerCollectionMessageHandler Creating core falsepredicate_shard2_replica1 as part of shard shard2 of collection falsepredicate on 127.0.0.1:35367_solr
>   [junit4]   2> 62227 INFO  (OverseerThreadFactory-368-thread-1) [    ] o.a.s.c.OverseerCollectionMessageHandler Creating core falsepredicate_shard3_replica1 as part of shard shard3 of collection falsepredicate on 127.0.0.1:40525_solr
>   [junit4]   2> 62233 INFO  (qtp830934674-940) [    ] o.a.s.s.HttpSolrCall [admin] webapp=null path=/admin/cores params={async=b62ad6d3-50b5-4da1-8b8e-e81c98bb1d6d2218076501941404&qt=/admin/cores&collection.configName=config&name=falsepredicate_shard2_replica1&action=CREATE&numShards=4&collection=falsepredicate&shard=shard2&wt=javabin&version=2} status=0 QTime=0
>   [junit4]   2> 62234 INFO  (parallelCoreAdminExecutor-369-thread-1) [    ] o.a.s.h.a.CoreAdminOperation core create command async=b62ad6d3-50b5-4da1-8b8e-e81c98bb1d6d2218076501941404&qt=/admin/cores&collection.configName=config&name=falsepredicate_shard2_replica1&action=CREATE&numShards=4&collection=falsepredicate&shard=shard2&wt=javabin&version=2
>   [junit4]   2> 62235 INFO  (parallelCoreAdminExecutor-369-thread-1) [    ] o.a.s.c.CoreDescriptor Created CoreDescriptor: {schema=schema.xml, dataDir=data/, collection.configName=config, collection=falsepredicate, loadOnStartup=true, transient=false, name=falsepredicate_shard2_replica1, numShards=4, shard=shard2, config=solrconfig.xml, configSetProperties=configsetprops.json}
>   [junit4]   2> 62236 INFO  (qtp421581055-906) [    ] o.a.s.s.HttpSolrCall [admin] webapp=null path=/admin/cores params={async=b62ad6d3-50b5-4da1-8b8e-e81c98bb1d6d2218076501756997&qt=/admin/cores&collection.configName=config&name=falsepredicate_shard1_replica1&action=CREATE&numShards=4&collection=falsepredicate&shard=shard1&wt=javabin&version=2} status=0 QTime=1
>   [junit4]   2> 62237 INFO  (parallelCoreAdminExecutor-369-thread-1) [    ] o.a.s.c.ZkController publishing state=down
>   [junit4]   2> 62237 INFO  (parallelCoreAdminExecutor-371-thread-1) [    ] o.a.s.h.a.CoreAdminOperation core create command async=b62ad6d3-50b5-4da1-8b8e-e81c98bb1d6d2218076501756997&qt=/admin/cores&collection.configName=config&name=falsepredicate_shard1_replica1&action=CREATE&numShards=4&collection=falsepredicate&shard=shard1&wt=javabin&version=2
>   [junit4]   2> 62237 INFO  (qtp1728058158-915) [    ] o.a.s.s.HttpSolrCall [admin] webapp=null path=/admin/cores params={async=b62ad6d3-50b5-4da1-8b8e-e81c98bb1d6d2218076502128578&qt=/admin/cores&collection.configName=config&name=falsepredicate_shard3_replica1&action=CREATE&numShards=4&collection=falsepredicate&shard=shard3&wt=javabin&version=2} status=0 QTime=2
>   [junit4]   2> 62239 INFO  (parallelCoreAdminExecutor-375-thread-1) [    ] o.a.s.h.a.CoreAdminOperation core create command async=b62ad6d3-50b5-4da1-8b8e-e81c98bb1d6d2218076502128578&qt=/admin/cores&collection.configName=config&name=falsepredicate_shard3_replica1&action=CREATE&numShards=4&collection=falsepredicate&shard=shard3&wt=javabin&version=2
>   [junit4]   2> 62239 INFO  (parallelCoreAdminExecutor-371-thread-1) [    ] o.a.s.c.CoreDescriptor Created CoreDescriptor: {schema=schema.xml, dataDir=data/, collection.configName=config, collection=falsepredicate, loadOnStartup=true, transient=false, name=falsepredicate_shard1_replica1, numShards=4, shard=shard1, config=solrconfig.xml, configSetProperties=configsetprops.json}
>   [junit4]   2> 62239 INFO  (parallelCoreAdminExecutor-375-thread-1) [    ] o.a.s.c.CoreDescriptor Created CoreDescriptor: {schema=schema.xml, dataDir=data/, collection.configName=config, collection=falsepredicate, loadOnStartup=true, transient=false, name=falsepredicate_shard3_replica1, numShards=4, shard=shard3, config=solrconfig.xml, configSetProperties=configsetprops.json}
>   [junit4]   2> 62245 INFO  (qtp2083204005-930) [    ] o.a.s.s.HttpSolrCall [admin] webapp=null path=/admin/cores params={async=b62ad6d3-50b5-4da1-8b8e-e81c98bb1d6d2218076501444546&qt=/admin/cores&collection.configName=config&name=falsepredicate_shard4_replica1&action=CREATE&numShards=4&collection=falsepredicate&shard=shard4&wt=javabin&version=2} status=0 QTime=0
>   [junit4]   2> 62246 INFO  (parallelCoreAdminExecutor-371-thread-1) [    ] o.a.s.c.ZkController publishing state=down
>   [junit4]   2> 62246 INFO  (parallelCoreAdminExecutor-369-thread-1) [    ] o.a.s.c.ZkController Registering watch for collection falsepredicate
>   [junit4]   2> 62246 INFO  (parallelCoreAdminExecutor-373-thread-1) [    ] o.a.s.h.a.CoreAdminOperation core create command async=b62ad6d3-50b5-4da1-8b8e-e81c98bb1d6d2218076501444546&qt=/admin/cores&collection.configName=config&name=falsepredicate_shard4_replica1&action=CREATE&numShards=4&collection=falsepredicate&shard=shard4&wt=javabin&version=2
>   [junit4]   2> 62246 INFO  (parallelCoreAdminExecutor-373-thread-1) [    ] o.a.s.c.CoreDescriptor Created CoreDescriptor: {schema=schema.xml, dataDir=data/, collection.configName=config, collection=falsepredicate, loadOnStartup=true, transient=false, name=falsepredicate_shard4_replica1, numShards=4, shard=shard4, config=solrconfig.xml, configSetProperties=configsetprops.json}
>   [junit4]   2> 62248 INFO  (parallelCoreAdminExecutor-375-thread-1) [    ] o.a.s.c.ZkController publishing state=down
>   [junit4]   2> 62250 INFO  (qtp830934674-939) [    ] o.a.s.h.a.CoreAdminOperation Checking request status for : b62ad6d3-50b5-4da1-8b8e-e81c98bb1d6d2218076501941404
>   [junit4]   2> 62253 INFO  (parallelCoreAdminExecutor-373-thread-1) [    ] o.a.s.c.ZkController publishing state=down
>   [junit4]   2> 62255 INFO  (qtp830934674-939) [    ] o.a.s.s.HttpSolrCall [admin] webapp=null path=/admin/cores params={qt=/admin/cores&requestid=b62ad6d3-50b5-4da1-8b8e-e81c98bb1d6d2218076501941404&action=REQUESTSTATUS&wt=javabin&version=2} status=0 QTime=4
>   [junit4]   2> 62255 INFO  (parallelCoreAdminExecutor-371-thread-1) [    ] o.a.s.c.ZkController Registering watch for collection falsepredicate
>   [junit4]   2> 62255 INFO  (OverseerStateUpdate-95994505783148552-127.0.0.1:40525_solr-n_0000000000) [    ] o.a.s.c.Overseer processMessage: queueSize: 2, message = {
>   [junit4]   2>   "core":"falsepredicate_shard2_replica1",
>   [junit4]   2>   "roles":null,
>   [junit4]   2>   "base_url":"http://127.0.0.1:35367/solr",
>   [junit4]   2>   "node_name":"127.0.0.1:35367_solr",
>   [junit4]   2>   "numShards":"4",
>   [junit4]   2>   "state":"down",
>   [junit4]   2>   "shard":"shard2",
>   [junit4]   2>   "collection":"falsepredicate",
>   [junit4]   2>   "operation":"state"} current state version: 0
>   [junit4]   2> 62255 INFO  (OverseerStateUpdate-95994505783148552-127.0.0.1:40525_solr-n_0000000000) [    ] o.a.s.c.o.ReplicaMutator Update state numShards=4 message={
>   [junit4]   2>   "core":"falsepredicate_shard2_replica1",
>   [junit4]   2>   "roles":null,
>   [junit4]   2>   "base_url":"http://127.0.0.1:35367/solr",
>   [junit4]   2>   "node_name":"127.0.0.1:35367_solr",
>   [junit4]   2>   "numShards":"4",
>   [junit4]   2>   "state":"down",
>   [junit4]   2>   "shard":"shard2",
>   [junit4]   2>   "collection":"falsepredicate",
>   [junit4]   2>   "operation":"state"}
>   [junit4]   2> 62257 INFO  (parallelCoreAdminExecutor-369-thread-1) [    ] o.a.s.c.c.ZkStateReader Add data for [falsepredicate] ver [0]
>   [junit4]   2> 62257 INFO  (parallelCoreAdminExecutor-369-thread-1) [    ] o.a.s.c.ZkController look for our core node name
>   [junit4]   2> 62257 INFO  (parallelCoreAdminExecutor-373-thread-1) [    ] o.a.s.c.ZkController Registering watch for collection falsepredicate
>   [junit4]   2> 62257 INFO  (parallelCoreAdminExecutor-371-thread-1) [    ] o.a.s.c.c.ZkStateReader Add data for [falsepredicate] ver [0]
>   [junit4]   2> 62257 INFO  (parallelCoreAdminExecutor-371-thread-1) [    ] o.a.s.c.ZkController look for our core node name
>   [junit4]   2> 62258 INFO  (parallelCoreAdminExecutor-375-thread-1) [    ] o.a.s.c.ZkController Registering watch for collection falsepredicate
>   [junit4]   2> 62258 INFO  (parallelCoreAdminExecutor-375-thread-1) [    ] o.a.s.c.c.ZkStateReader Add data for [falsepredicate] ver [0]
>   [junit4]   2> 62258 INFO  (parallelCoreAdminExecutor-375-thread-1) [    ] o.a.s.c.ZkController look for our core node name
>   [junit4]   2> 62259 INFO  (parallelCoreAdminExecutor-373-thread-1) [    ] o.a.s.c.c.ZkStateReader Add data for [falsepredicate] ver [0]
>   [junit4]   2> 62259 INFO  (OverseerStateUpdate-95994505783148552-127.0.0.1:40525_solr-n_0000000000) [    ] o.a.s.c.Overseer processMessage: queueSize: 2, message = {
>   [junit4]   2>   "core":"falsepredicate_shard1_replica1",
>   [junit4]   2>   "roles":null,
>   [junit4]   2>   "base_url":"http://127.0.0.1:44223/solr",
>   [junit4]   2>   "node_name":"127.0.0.1:44223_solr",
>   [junit4]   2>   "numShards":"4",
>   [junit4]   2>   "state":"down",
>   [junit4]   2>   "shard":"shard1",
>   [junit4]   2>   "collection":"falsepredicate",
>   [junit4]   2>   "operation":"state"} current state version: 0
>   [junit4]   2> 62259 INFO  (parallelCoreAdminExecutor-373-thread-1) [    ] o.a.s.c.ZkController look for our core node name
>   [junit4]   2> 62259 INFO  (OverseerStateUpdate-95994505783148552-127.0.0.1:40525_solr-n_0000000000) [    ] o.a.s.c.o.ReplicaMutator Update state numShards=4 message={
>   [junit4]   2>   "core":"falsepredicate_shard1_replica1",
>   [junit4]   2>   "roles":null,
>   [junit4]   2>   "base_url":"http://127.0.0.1:44223/solr",
>   [junit4]   2>   "node_name":"127.0.0.1:44223_solr",
>   [junit4]   2>   "numShards":"4",
>   [junit4]   2>   "state":"down",
>   [junit4]   2>   "shard":"shard1",
>   [junit4]   2>   "collection":"falsepredicate",
>   [junit4]   2>   "operation":"state"}
>   [junit4]   2> 62260 INFO  (OverseerStateUpdate-95994505783148552-127.0.0.1:40525_solr-n_0000000000) [    ] o.a.s.c.Overseer processMessage: queueSize: 2, message = {
>   [junit4]   2>   "core":"falsepredicate_shard3_replica1",
>   [junit4]   2>   "roles":null,
>   [junit4]   2>   "base_url":"http://127.0.0.1:40525/solr",
>   [junit4]   2>   "node_name":"127.0.0.1:40525_solr",
>   [junit4]   2>   "numShards":"4",
>   [junit4]   2>   "state":"down",
>   [junit4]   2>   "shard":"shard3",
>   [junit4]   2>   "collection":"falsepredicate",
>   [junit4]   2>   "operation":"state"} current state version: 0
>   [junit4]   2> 62260 INFO  (OverseerStateUpdate-95994505783148552-127.0.0.1:40525_solr-n_0000000000) [    ] o.a.s.c.o.ReplicaMutator Update state numShards=4 message={
>   [junit4]   2>   "core":"falsepredicate_shard3_replica1",
>   [junit4]   2>   "roles":null,
>   [junit4]   2>   "base_url":"http://127.0.0.1:40525/solr",
>   [junit4]   2>   "node_name":"127.0.0.1:40525_solr",
>   [junit4]   2>   "numShards":"4",
>   [junit4]   2>   "state":"down",
>   [junit4]   2>   "shard":"shard3",
>   [junit4]   2>   "collection":"falsepredicate",
>   [junit4]   2>   "operation":"state"}
>   [junit4]   2> 62262 INFO  (OverseerStateUpdate-95994505783148552-127.0.0.1:40525_solr-n_0000000000) [    ] o.a.s.c.Overseer processMessage: queueSize: 2, message = {
>   [junit4]   2>   "core":"falsepredicate_shard4_replica1",
>   [junit4]   2>   "roles":null,
>   [junit4]   2>   "base_url":"http://127.0.0.1:36383/solr",
>   [junit4]   2>   "node_name":"127.0.0.1:36383_solr",
>   [junit4]   2>   "numShards":"4",
>   [junit4]   2>   "state":"down",
>   [junit4]   2>   "shard":"shard4",
>   [junit4]   2>   "collection":"falsepredicate",
>   [junit4]   2>   "operation":"state"} current state version: 0
>   [junit4]   2> 62262 INFO  (OverseerStateUpdate-95994505783148552-127.0.0.1:40525_solr-n_0000000000) [    ] o.a.s.c.o.ReplicaMutator Update state numShards=4 message={
>   [junit4]   2>   "core":"falsepredicate_shard4_replica1",
>   [junit4]   2>   "roles":null,
>   [junit4]   2>   "base_url":"http://127.0.0.1:36383/solr",
>   [junit4]   2>   "node_name":"127.0.0.1:36383_solr",
>   [junit4]   2>   "numShards":"4",
>   [junit4]   2>   "state":"down",
>   [junit4]   2>   "shard":"shard4",
>   [junit4]   2>   "collection":"falsepredicate",
>   [junit4]   2>   "operation":"state"}
>   [junit4]   2> 62367 INFO  (OverseerStateUpdate-95994505783148552-127.0.0.1:40525_solr-n_0000000000) [    ] o.a.s.c.o.ZkStateWriter going to update_collection /collections/falsepredicate/state.json version: 0
>   [junit4]   2> 62368 INFO  (zkCallback-178-thread-1) [    ] o.a.s.c.c.ZkStateReader A cluster state change: [WatchedEvent state:SyncConnected type:NodeDataChanged path:/collections/falsepredicate/state.json] for collection [falsepredicate] has occurred - updating... (live nodes size: [4])
>   [junit4]   2> 62368 INFO  (zkCallback-170-thread-1) [    ] o.a.s.c.c.ZkStateReader A cluster state change: [WatchedEvent state:SyncConnected type:NodeDataChanged path:/collections/falsepredicate/state.json] for collection [falsepredicate] has occurred - updating... (live nodes size: [4])
>   [junit4]   2> 62368 INFO  (zkCallback-171-thread-1) [    ] o.a.s.c.c.ZkStateReader A cluster state change: [WatchedEvent state:SyncConnected type:NodeDataChanged path:/collections/falsepredicate/state.json] for collection [falsepredicate] has occurred - updating... (live nodes size: [4])
>   [junit4]   2> 62368 INFO  (zkCallback-179-thread-1) [    ] o.a.s.c.c.ZkStateReader A cluster state change: [WatchedEvent state:SyncConnected type:NodeDataChanged path:/collections/falsepredicate/state.json] for collection [falsepredicate] has occurred - updating... (live nodes size: [4])
>   [junit4]   2> 62370 INFO  (zkCallback-178-thread-1) [    ] o.a.s.c.c.ZkStateReader Updating data for [falsepredicate] from [0] to [1]
>   [junit4]   2> 62370 INFO  (zkCallback-171-thread-1) [    ] o.a.s.c.c.ZkStateReader Updating data for [falsepredicate] from [0] to [1]
>   [junit4]   2> 62370 INFO  (zkCallback-179-thread-1) [    ] o.a.s.c.c.ZkStateReader Updating data for [falsepredicate] from [0] to [1]
>   [junit4]   2> 62370 INFO  (zkCallback-170-thread-1) [    ] o.a.s.c.c.ZkStateReader Updating data for [falsepredicate] from [0] to [1]
>   [junit4]   2> 63123 INFO  (qtp421581055-901) [    ] o.a.s.h.a.CollectionsHandler Invoked Collection Action :requeststatus with params requestid=b62ad6d3-50b5-4da1-8b8e-e81c98bb1d6d&action=REQUESTSTATUS&wt=javabin&version=2 and sendToOCPQueue=true
>   [junit4]   2> 63123 INFO  (qtp421581055-901) [    ] o.a.s.s.HttpSolrCall [admin] webapp=null path=/admin/collections params={requestid=b62ad6d3-50b5-4da1-8b8e-e81c98bb1d6d&action=REQUESTSTATUS&wt=javabin&version=2} status=0 QTime=0
>   [junit4]   2> 63258 INFO  (parallelCoreAdminExecutor-369-thread-1) [    ] o.a.s.c.ZkController waiting to find shard id in clusterstate for falsepredicate_shard2_replica1
>   [junit4]   2> 63258 INFO  (parallelCoreAdminExecutor-369-thread-1) [    ] o.a.s.c.ZkController Check for collection zkNode:falsepredicate
>   [junit4]   2> 63258 INFO  (parallelCoreAdminExecutor-371-thread-1) [    ] o.a.s.c.ZkController waiting to find shard id in clusterstate for falsepredicate_shard1_replica1
>   [junit4]   2> 63258 INFO  (parallelCoreAdminExecutor-371-thread-1) [    ] o.a.s.c.ZkController Check for collection zkNode:falsepredicate
>   [junit4]   2> 63258 INFO  (qtp830934674-938) [    ] o.a.s.h.a.CoreAdminOperation Checking request status for : b62ad6d3-50b5-4da1-8b8e-e81c98bb1d6d2218076501941404
>   [junit4]   2> 63258 INFO  (qtp830934674-938) [    ] o.a.s.s.HttpSolrCall [admin] webapp=null path=/admin/cores params={qt=/admin/cores&requestid=b62ad6d3-50b5-4da1-8b8e-e81c98bb1d6d2218076501941404&action=REQUESTSTATUS&wt=javabin&version=2} status=0 QTime=0
>   [junit4]   2> 63259 INFO  (parallelCoreAdminExecutor-369-thread-1) [    ] o.a.s.c.ZkController Collection zkNode exists
>   [junit4]   2> 63259 INFO  (parallelCoreAdminExecutor-369-thread-1) [    ] o.a.s.c.c.ZkStateReader Load collection config from: [/collections/falsepredicate]
>   [junit4]   2> 63259 INFO  (parallelCoreAdminExecutor-375-thread-1) [    ] o.a.s.c.ZkController waiting to find shard id in clusterstate for falsepredicate_shard3_replica1
>   [junit4]   2> 63259 INFO  (parallelCoreAdminExecutor-375-thread-1) [    ] o.a.s.c.ZkController Check for collection zkNode:falsepredicate
>   [junit4]   2> 63259 INFO  (parallelCoreAdminExecutor-371-thread-1) [    ] o.a.s.c.ZkController Collection zkNode exists
>   [junit4]   2> 63259 INFO  (parallelCoreAdminExecutor-371-thread-1) [    ] o.a.s.c.c.ZkStateReader Load collection config from: [/collections/falsepredicate]
>   [junit4]   2> 63259 INFO  (parallelCoreAdminExecutor-369-thread-1) [    ] o.a.s.c.c.ZkStateReader path=[/collections/falsepredicate] [configName]=[config] specified config exists in ZooKeeper
>   [junit4]   2> 63259 INFO  (parallelCoreAdminExecutor-369-thread-1) [    ] o.a.s.c.SolrResourceLoader new SolrResourceLoader for directory: '/home/jenkins/workspace/Lucene-Solr-master-Linux/solr/build/solr-solrj/test/J2/temp/solr.common.cloud.TestCollectionStateWatchers_34E75E20242312A2-001/tempDir-001/node3/falsepredicate_shard2_replica1'
>   [junit4]   2> 63259 INFO  (parallelCoreAdminExecutor-375-thread-1) [    ] o.a.s.c.ZkController Collection zkNode exists
>   [junit4]   2> 63259 INFO  (parallelCoreAdminExecutor-375-thread-1) [    ] o.a.s.c.c.ZkStateReader Load collection config from: [/collections/falsepredicate]
>   [junit4]   2> 63259 INFO  (parallelCoreAdminExecutor-369-thread-1) [    ] o.a.s.c.SolrResourceLoader JNDI not configured for solr (NoInitialContextEx)
>   [junit4]   2> 63259 INFO  (parallelCoreAdminExecutor-369-thread-1) [    ] o.a.s.c.SolrResourceLoader solr home defaulted to 'solr/' (could not find system property or JNDI)
>   [junit4]   2> 63259 INFO  (parallelCoreAdminExecutor-373-thread-1) [    ] o.a.s.c.ZkController waiting to find shard id in clusterstate for falsepredicate_shard4_replica1
>   [junit4]   2> 63259 INFO  (parallelCoreAdminExecutor-373-thread-1) [    ] o.a.s.c.ZkController Check for collection zkNode:falsepredicate
>   [junit4]   2> 63260 INFO  (parallelCoreAdminExecutor-371-thread-1) [    ] o.a.s.c.c.ZkStateReader path=[/collections/falsepredicate] [configName]=[config] specified config exists in ZooKeeper
>   [junit4]   2> 63260 INFO  (parallelCoreAdminExecutor-371-thread-1) [    ] o.a.s.c.SolrResourceLoader new SolrResourceLoader for directory: '/home/jenkins/workspace/Lucene-Solr-master-Linux/solr/build/solr-solrj/test/J2/temp/solr.common.cloud.TestCollectionStateWatchers_34E75E20242312A2-001/tempDir-001/node1/falsepredicate_shard1_replica1'
>   [junit4]   2> 63260 INFO  (parallelCoreAdminExecutor-371-thread-1) [    ] o.a.s.c.SolrResourceLoader JNDI not configured for solr (NoInitialContextEx)
>   [junit4]   2> 63260 INFO  (parallelCoreAdminExecutor-371-thread-1) [    ] o.a.s.c.SolrResourceLoader solr home defaulted to 'solr/' (could not find system property or JNDI)
>   [junit4]   2> 63261 INFO  (parallelCoreAdminExecutor-369-thread-1) [    ] o.a.s.c.Config loaded config solrconfig.xml with version 0 
>   [junit4]   2> 63261 INFO  (parallelCoreAdminExecutor-375-thread-1) [    ] o.a.s.c.c.ZkStateReader path=[/collections/falsepredicate] [configName]=[config] specified config exists in ZooKeeper
>   [junit4]   2> 63261 INFO  (parallelCoreAdminExecutor-375-thread-1) [    ] o.a.s.c.SolrResourceLoader new SolrResourceLoader for directory: '/home/jenkins/workspace/Lucene-Solr-master-Linux/solr/build/solr-solrj/test/J2/temp/solr.common.cloud.TestCollectionStateWatchers_34E75E20242312A2-001/tempDir-001/node2/falsepredicate_shard3_replica1'
>   [junit4]   2> 63261 INFO  (parallelCoreAdminExecutor-375-thread-1) [    ] o.a.s.c.SolrResourceLoader JNDI not configured for solr (NoInitialContextEx)
>   [junit4]   2> 63261 INFO  (parallelCoreAdminExecutor-375-thread-1) [    ] o.a.s.c.SolrResourceLoader solr home defaulted to 'solr/' (could not find system property or JNDI)
>   [junit4]   2> 63262 INFO  (parallelCoreAdminExecutor-373-thread-1) [    ] o.a.s.c.ZkController Collection zkNode exists
>   [junit4]   2> 63262 INFO  (parallelCoreAdminExecutor-373-thread-1) [    ] o.a.s.c.c.ZkStateReader Load collection config from: [/collections/falsepredicate]
>   [junit4]   2> 63264 INFO  (parallelCoreAdminExecutor-371-thread-1) [    ] o.a.s.c.Config loaded config solrconfig.xml with version 0 
>   [junit4]   2> 63265 INFO  (parallelCoreAdminExecutor-373-thread-1) [    ] o.a.s.c.c.ZkStateReader path=[/collections/falsepredicate] [configName]=[config] specified config exists in ZooKeeper
>   [junit4]   2> 63265 INFO  (parallelCoreAdminExecutor-373-thread-1) [    ] o.a.s.c.SolrResourceLoader new SolrResourceLoader for directory: '/home/jenkins/workspace/Lucene-Solr-master-Linux/solr/build/solr-solrj/test/J2/temp/solr.common.cloud.TestCollectionStateWatchers_34E75E20242312A2-001/tempDir-001/node4/falsepredicate_shard4_replica1'
>   [junit4]   2> 63265 INFO  (parallelCoreAdminExecutor-373-thread-1) [    ] o.a.s.c.SolrResourceLoader JNDI not configured for solr (NoInitialContextEx)
>   [junit4]   2> 63265 INFO  (parallelCoreAdminExecutor-373-thread-1) [    ] o.a.s.c.SolrResourceLoader solr home defaulted to 'solr/' (could not find system property or JNDI)
>   [junit4]   2> 63266 INFO  (parallelCoreAdminExecutor-373-thread-1) [    ] o.a.s.c.Config loaded config solrconfig.xml with version 0 
>   [junit4]   2> 63266 INFO  (parallelCoreAdminExecutor-369-thread-1) [    ] o.a.s.c.SolrConfig current version of requestparams : -1
>   [junit4]   2> 63267 INFO  (parallelCoreAdminExecutor-375-thread-1) [    ] o.a.s.c.Config loaded config solrconfig.xml with version 0 
>   [junit4]   2> 63268 INFO  (parallelCoreAdminExecutor-369-thread-1) [    ] o.a.s.c.SolrConfig Using Lucene MatchVersion: 7.0.0
>   [junit4]   2> 63274 INFO  (parallelCoreAdminExecutor-369-thread-1) [    ] o.a.s.c.SolrConfig Loaded SolrConfig: solrconfig.xml
>   [junit4]   2> 63276 INFO  (parallelCoreAdminExecutor-373-thread-1) [    ] o.a.s.c.SolrConfig current version of requestparams : -1
>   [junit4]   2> 63277 INFO  (parallelCoreAdminExecutor-371-thread-1) [    ] o.a.s.c.SolrConfig current version of requestparams : -1
>   [junit4]   2> 63280 INFO  (parallelCoreAdminExecutor-371-thread-1) [    ] o.a.s.c.SolrConfig Using Lucene MatchVersion: 7.0.0
>   [junit4]   2> 63281 INFO  (parallelCoreAdminExecutor-369-thread-1) [    ] o.a.s.s.IndexSchema [falsepredicate_shard2_replica1] Schema name=test
>   [junit4]   2> 63282 INFO  (parallelCoreAdminExecutor-375-thread-1) [    ] o.a.s.c.SolrConfig current version of requestparams : -1
>   [junit4]   2> 63284 INFO  (parallelCoreAdminExecutor-373-thread-1) [    ] o.a.s.c.SolrConfig Using Lucene MatchVersion: 7.0.0
>   [junit4]   2> 63285 INFO  (parallelCoreAdminExecutor-375-thread-1) [    ] o.a.s.c.SolrConfig Using Lucene MatchVersion: 7.0.0
>   [junit4]   2> 63300 INFO  (parallelCoreAdminExecutor-375-thread-1) [    ] o.a.s.c.SolrConfig Loaded SolrConfig: solrconfig.xml
>   [junit4]   2> 63301 INFO  (parallelCoreAdminExecutor-371-thread-1) [    ] o.a.s.c.SolrConfig Loaded SolrConfig: solrconfig.xml
>   [junit4]   2> 63303 INFO  (parallelCoreAdminExecutor-373-thread-1) [    ] o.a.s.c.SolrConfig Loaded SolrConfig: solrconfig.xml
>   [junit4]   2> 63310 INFO  (parallelCoreAdminExecutor-375-thread-1) [    ] o.a.s.s.IndexSchema [falsepredicate_shard3_replica1] Schema name=test
>   [junit4]   2> 63310 INFO  (parallelCoreAdminExecutor-371-thread-1) [    ] o.a.s.s.IndexSchema [falsepredicate_shard1_replica1] Schema name=test
>   [junit4]   2> 63310 INFO  (parallelCoreAdminExecutor-373-thread-1) [    ] o.a.s.s.IndexSchema [falsepredicate_shard4_replica1] Schema name=test
>   [junit4]   2> 63432 INFO  (parallelCoreAdminExecutor-371-thread-1) [    ] o.a.s.s.IndexSchema default search field in schema is text
>   [junit4]   2> 63433 INFO  (parallelCoreAdminExecutor-369-thread-1) [    ] o.a.s.s.IndexSchema default search field in schema is text
>   [junit4]   2> 63433 INFO  (parallelCoreAdminExecutor-371-thread-1) [    ] o.a.s.s.IndexSchema unique key field: id
>   [junit4]   2> 63434 INFO  (parallelCoreAdminExecutor-369-thread-1) [    ] o.a.s.s.IndexSchema unique key field: id
>   [junit4]   2> 63434 WARN  (parallelCoreAdminExecutor-371-thread-1) [    ] o.a.s.s.IndexSchema Field lowerfilt1and2 is not multivalued and destination for multiple copyFields (2)
>   [junit4]   2> 63438 WARN  (parallelCoreAdminExecutor-369-thread-1) [    ] o.a.s.s.IndexSchema Field lowerfilt1and2 is not multivalued and destination for multiple copyFields (2)
>   [junit4]   2> 63438 WARN  (parallelCoreAdminExecutor-371-thread-1) [    ] o.a.s.s.IndexSchema Field text is not multivalued and destination for multiple copyFields (3)
>   [junit4]   2> 63438 WARN  (parallelCoreAdminExecutor-369-thread-1) [    ] o.a.s.s.IndexSchema Field text is not multivalued and destination for multiple copyFields (3)
>   [junit4]   2> 63440 INFO  (parallelCoreAdminExecutor-375-thread-1) [    ] o.a.s.s.IndexSchema default search field in schema is text
>   [junit4]   2> 63440 INFO  (parallelCoreAdminExecutor-375-thread-1) [    ] o.a.s.s.IndexSchema unique key field: id
>   [junit4]   2> 63441 WARN  (parallelCoreAdminExecutor-375-thread-1) [    ] o.a.s.s.IndexSchema Field lowerfilt1and2 is not multivalued and destination for multiple copyFields (2)
>   [junit4]   2> 63441 WARN  (parallelCoreAdminExecutor-375-thread-1) [    ] o.a.s.s.IndexSchema Field text is not multivalued and destination for multiple copyFields (3)
>   [junit4]   2> 63442 INFO  (parallelCoreAdminExecutor-369-thread-1) [    ] o.a.s.c.ConfigSetProperties Did not find ConfigSet properties, assuming default properties: Can't find resource 'configsetprops.json' in classpath or '/configs/config', cwd=/home/jenkins/workspace/Lucene-Solr-master-Linux/solr/build/solr-solrj/test/J2
>   [junit4]   2> 63442 INFO  (parallelCoreAdminExecutor-371-thread-1) [    ] o.a.s.c.ConfigSetProperties Did not find ConfigSet properties, assuming default properties: Can't find resource 'configsetprops.json' in classpath or '/configs/config', cwd=/home/jenkins/workspace/Lucene-Solr-master-Linux/solr/build/solr-solrj/test/J2
>   [junit4]   2> 63442 INFO  (parallelCoreAdminExecutor-369-thread-1) [    ] o.a.s.c.CoreContainer Creating SolrCore 'falsepredicate_shard2_replica1' using configuration from collection falsepredicate
>   [junit4]   2> 63442 INFO  (parallelCoreAdminExecutor-371-thread-1) [    ] o.a.s.c.CoreContainer Creating SolrCore 'falsepredicate_shard1_replica1' using configuration from collection falsepredicate
>   [junit4]   2> 63442 INFO  (parallelCoreAdminExecutor-369-thread-1) [    ] o.a.s.c.SolrCore org.apache.solr.core.MockDirectoryFactory
>   [junit4]   2> 63442 INFO  (parallelCoreAdminExecutor-371-thread-1) [    ] o.a.s.c.
> 
> [...truncated too long message...]
> 
> ectoryFactory Closing directory: /home/jenkins/workspace/Lucene-Solr-master-Linux/solr/build/solr-solrj/test/J2/temp/solr.common.cloud.TestCollectionStateWatchers_34E75E20242312A2-001/tempDir-001/node4/./testcollection_shard4_replica1/data
>   [junit4]   2> 147560 INFO  (coreCloseExecutor-472-thread-4) [    ] o.a.s.c.CachingDirectoryFactory Closing directory: /home/jenkins/workspace/Lucene-Solr-master-Linux/solr/build/solr-solrj/test/J2/temp/solr.common.cloud.TestCollectionStateWatchers_34E75E20242312A2-001/tempDir-001/node4/./delayed_shard1_replica1/data/index
>   [junit4]   2> 147560 INFO  (coreCloseExecutor-472-thread-1) [    ] o.a.s.c.CachingDirectoryFactory Closing directory, CoreContainer#isShutdown=true
>   [junit4]   2> 147561 INFO  (coreCloseExecutor-472-thread-1) [    ] o.a.s.c.CachingDirectoryFactory Closing directory: /home/jenkins/workspace/Lucene-Solr-master-Linux/solr/build/solr-solrj/test/J2/temp/solr.common.cloud.TestCollectionStateWatchers_34E75E20242312A2-001/tempDir-001/node4/./falsepredicate_shard4_replica1/data
>   [junit4]   2> 147561 INFO  (zkCallback-200-thread-1) [    ] o.a.s.c.c.ZkStateReader Updating data for [waitforstate] from [4] to [5]
>   [junit4]   2> 147561 INFO  (jetty-launcher-158-thread-6) [    ] o.a.s.c.Overseer Overseer (id=95994505783148552-127.0.0.1:40525_solr-n_0000000000) closing
>   [junit4]   2> 147561 INFO  (OverseerStateUpdate-95994505783148552-127.0.0.1:40525_solr-n_0000000000) [    ] o.a.s.c.Overseer Overseer Loop exiting : 127.0.0.1:40525_solr
>   [junit4]   2> 147561 INFO  (zkCallback-171-thread-2) [    ] o.a.s.c.c.ZkStateReader A live node change: [WatchedEvent state:SyncConnected type:NodeChildrenChanged path:/live_nodes], has occurred - updating... (live nodes size: [3])
>   [junit4]   2> 147561 INFO  (zkCallback-200-thread-1) [    ] o.a.s.c.c.ZkStateReader A live node change: [WatchedEvent state:SyncConnected type:NodeChildrenChanged path:/live_nodes], has occurred - updating... (live nodes size: [3])
>   [junit4]   2> 147561 INFO  (zkCallback-170-thread-1) [    ] o.a.s.c.c.ZkStateReader A live node change: [WatchedEvent state:SyncConnected type:NodeChildrenChanged path:/live_nodes], has occurred - updating... (live nodes size: [3])
>   [junit4]   2> 147561 WARN  (zkCallback-170-thread-1) [    ] o.a.s.c.c.ZkStateReader ZooKeeper watch triggered, but Solr cannot talk to ZK: [KeeperErrorCode = Session expired for /live_nodes]
>   [junit4]   2> 147561 INFO  (zkCallback-171-thread-2) [    ] o.a.s.c.c.ZkStateReader Updated live nodes from ZooKeeper... (3) -> (2)
>   [junit4]   2> 147562 INFO  (zkCallback-200-thread-1) [    ] o.a.s.c.c.ZkStateReader Updated live nodes from ZooKeeper... (3) -> (2)
>   [junit4]   2> 147562 INFO  (jetty-launcher-158-thread-5) [    ] o.e.j.s.h.ContextHandler Stopped o.e.j.s.ServletContextHandler@5e79a700{/solr,null,UNAVAILABLE}
>   [junit4]   2> 147562 INFO  (zkCallback-200-thread-1) [    ] o.a.s.c.c.ZkStateReader A live node change: [WatchedEvent state:SyncConnected type:NodeChildrenChanged path:/live_nodes], has occurred - updating... (live nodes size: [2])
>   [junit4]   2> 147562 INFO  (zkCallback-171-thread-2) [    ] o.a.s.c.c.ZkStateReader A live node change: [WatchedEvent state:SyncConnected type:NodeChildrenChanged path:/live_nodes], has occurred - updating... (live nodes size: [2])
>   [junit4]   2> 147562 WARN  (zkCallback-171-thread-2) [    ] o.a.s.c.c.ZkStateReader ZooKeeper watch triggered, but Solr cannot talk to ZK: [KeeperErrorCode = Session expired for /live_nodes]
>   [junit4]   2> 147562 INFO  (jetty-launcher-158-thread-6) [    ] o.e.j.s.h.ContextHandler Stopped o.e.j.s.ServletContextHandler@1d182483{/solr,null,UNAVAILABLE}
>   [junit4]   2> 149062 WARN  (zkCallback-200-thread-3) [    ] o.a.s.c.LeaderElector 
>   [junit4]   2> org.apache.zookeeper.KeeperException$SessionExpiredException: KeeperErrorCode = Session expired for /overseer_elect/election/95994505783148552-127.0.0.1:40525_solr-n_0000000000
>   [junit4]   2> 	at org.apache.zookeeper.KeeperException.create(KeeperException.java:127)
>   [junit4]   2> 	at org.apache.zookeeper.KeeperException.create(KeeperException.java:51)
>   [junit4]   2> 	at org.apache.zookeeper.ZooKeeper.getData(ZooKeeper.java:1155)
>   [junit4]   2> 	at org.apache.solr.common.cloud.SolrZkClient$7.execute(SolrZkClient.java:348)
>   [junit4]   2> 	at org.apache.solr.common.cloud.SolrZkClient$7.execute(SolrZkClient.java:345)
>   [junit4]   2> 	at org.apache.solr.common.cloud.ZkCmdExecutor.retryOperation(ZkCmdExecutor.java:60)
>   [junit4]   2> 	at org.apache.solr.common.cloud.SolrZkClient.getData(SolrZkClient.java:345)
>   [junit4]   2> 	at org.apache.solr.cloud.LeaderElector.checkIfIamLeader(LeaderElector.java:152)
>   [junit4]   2> 	at org.apache.solr.cloud.LeaderElector.access$200(LeaderElector.java:56)
>   [junit4]   2> 	at org.apache.solr.cloud.LeaderElector$ElectionWatcher.process(LeaderElector.java:348)
>   [junit4]   2> 	at org.apache.solr.common.cloud.SolrZkClient$3.lambda$process$0(SolrZkClient.java:266)
>   [junit4]   2> 	at java.util.concurrent.Executors$RunnableAdapter.call(java.base@9-ea/Executors.java:514)
>   [junit4]   2> 	at java.util.concurrent.FutureTask.run(java.base@9-ea/FutureTask.java:266)
>   [junit4]   2> 	at org.apache.solr.common.util.ExecutorUtil$MDCAwareThreadPoolExecutor.lambda$execute$0(ExecutorUtil.java:229)
>   [junit4]   2> 	at java.util.concurrent.ThreadPoolExecutor.runWorker(java.base@9-ea/ThreadPoolExecutor.java:1158)
>   [junit4]   2> 	at java.util.concurrent.ThreadPoolExecutor$Worker.run(java.base@9-ea/ThreadPoolExecutor.java:632)
>   [junit4]   2> 	at java.lang.Thread.run(java.base@9-ea/Thread.java:843)
>   [junit4]   2> 149062 WARN  (zkCallback-200-thread-1) [    ] o.a.s.c.c.ZkStateReader ZooKeeper watch triggered, but Solr cannot talk to ZK: [KeeperErrorCode = Session expired for /live_nodes]
>   [junit4]   2> 149062 INFO  (jetty-launcher-158-thread-7) [    ] o.e.j.s.h.ContextHandler Stopped o.e.j.s.ServletContextHandler@42bd3200{/solr,null,UNAVAILABLE}
>   [junit4]   2> 149063 INFO  (SUITE-TestCollectionStateWatchers-seed#[34E75E20242312A2]-worker) [    ] o.a.s.c.ZkTestServer connecting to 127.0.0.1:34609 34609
>   [junit4]   2> 149095 INFO  (Thread-237) [    ] o.a.s.c.ZkTestServer connecting to 127.0.0.1:34609 34609
>   [junit4]   2> 149095 WARN  (Thread-237) [    ] o.a.s.c.ZkTestServer Watch limit violations: 
>   [junit4]   2> Maximum concurrent create/delete watches above limit:
>   [junit4]   2> 
>   [junit4]   2> 	7	/solr/aliases.json
>   [junit4]   2> 	7	/solr/clusterprops.json
>   [junit4]   2> 	6	/solr/security.json
>   [junit4]   2> 	6	/solr/configs/config
>   [junit4]   2> 	3	/solr/collections/stateformat1/state.json
>   [junit4]   2> 
>   [junit4]   2> Maximum concurrent data watches above limit:
>   [junit4]   2> 
>   [junit4]   2> 	12	/solr/collections/waitforstate/state.json
>   [junit4]   2> 	8	/solr/collections/falsepredicate/state.json
>   [junit4]   2> 	7	/solr/clusterstate.json
>   [junit4]   2> 	7	/solr/collections/testcollection/state.json
>   [junit4]   2> 	4	/solr/overseer_elect/election/95994505783148551-127.0.0.1:44223_solr-n_0000000001
>   [junit4]   2> 	3	/solr/collections/stateformat1/state.json
>   [junit4]   2> 	2	/solr/collections/currentstate/state.json
>   [junit4]   2> 	2	/solr/collections/delayed/state.json
>   [junit4]   2> 	2	/solr/collections/tobedeleted/state.json
>   [junit4]   2> 
>   [junit4]   2> Maximum concurrent children watches above limit:
>   [junit4]   2> 
>   [junit4]   2> 	7	/solr/collections
>   [junit4]   2> 	5	/solr/live_nodes
>   [junit4]   2> 
>   [junit4]   2> 149095 INFO  (SUITE-TestCollectionStateWatchers-seed#[34E75E20242312A2]-worker) [    ] o.a.s.SolrTestCaseJ4 ###deleteCore
>   [junit4]   2> NOTE: leaving temporary files on disk at: /home/jenkins/workspace/Lucene-Solr-master-Linux/solr/build/solr-solrj/test/J2/temp/solr.common.cloud.TestCollectionStateWatchers_34E75E20242312A2-001
>   [junit4]   2> Jun 01, 2016 5:46:43 AM com.carrotsearch.randomizedtesting.ThreadLeakControl checkThreadLeaks
>   [junit4]   2> WARNING: Will linger awaiting termination of 1 leaked thread(s).
>   [junit4]   2> NOTE: test params are: codec=CheapBastard, sim=RandomSimilarity(queryNorm=true,coord=no): {}, locale=en-PH, timezone=Europe/Simferopol
>   [junit4]   2> NOTE: Linux 4.4.0-21-generic amd64/Oracle Corporation 9-ea (64-bit)/cpus=12,threads=1,free=280313184,total=508887040
>   [junit4]   2> NOTE: All tests run in this JVM: [CloudSolrClientTest, CommonParamsTest, ModifiableSolrParamsTest, SolrExampleXMLTest, JDBCStreamTest, SolrParamTest, TestCoreAdmin, SolrPingTest, GraphTest, ConcatOperationTest, SolrSchemalessExampleTest, TestHash, TestBatchUpdate, TestCollectionStateWatchers]
>   [junit4] Completed [82/83 (1!)] on J2 in 89.28s, 9 tests, 1 failure <<< FAILURES!
> 
> [...truncated 14 lines...]
> BUILD FAILED
> /home/jenkins/workspace/Lucene-Solr-master-Linux/build.xml:740: The following error occurred while executing this line:
> /home/jenkins/workspace/Lucene-Solr-master-Linux/build.xml:684: The following error occurred while executing this line:
> /home/jenkins/workspace/Lucene-Solr-master-Linux/build.xml:59: The following error occurred while executing this line:
> /home/jenkins/workspace/Lucene-Solr-master-Linux/solr/build.xml:246: The following error occurred while executing this line:
> /home/jenkins/workspace/Lucene-Solr-master-Linux/solr/common-build.xml:531: The following error occurred while executing this line:
> /home/jenkins/workspace/Lucene-Solr-master-Linux/lucene/common-build.xml:1427: The following error occurred while executing this line:
> /home/jenkins/workspace/Lucene-Solr-master-Linux/lucene/common-build.xml:984: There were test failures: 83 suites, 640 tests, 1 failure, 2 ignored [seed: 34E75E20242312A2]
> 
> Total time: 57 minutes 29 seconds
> Build step 'Invoke Ant' marked build as failure
> Archiving artifacts
> [WARNINGS] Skipping publisher since build result is FAILURE
> Recording test results
> Email was triggered for: Failure - Any
> Sending email for trigger: Failure - Any
> 
> 
> 
> ---------------------------------------------------------------------
> To unsubscribe, e-mail: dev-unsubscribe@lucene.apache.org
> For additional commands, e-mail: dev-help@lucene.apache.org


Mime
View raw message