lucene-dev mailing list archives

Site index · List index
Message view « Date » · « Thread »
Top « Date » · « Thread »
From Apache Jenkins Server <jenk...@builds.apache.org>
Subject [JENKINS] Lucene-Solr-Tests-master - Build # 1248 - Still Failing
Date Sat, 02 Jul 2016 19:51:23 GMT
Build: https://builds.apache.org/job/Lucene-Solr-Tests-master/1248/

3 tests failed.
FAILED:  org.apache.solr.cloud.overseer.ZkStateReaderTest.testExternalCollectionWatchedNotWatched

Error Message:


Stack Trace:
java.lang.NullPointerException
	at __randomizedtesting.SeedInfo.seed([B368BEFAAE5564C1:B8D34FD6FF0C9268]:0)
	at org.apache.solr.cloud.overseer.ZkStateReaderTest.testExternalCollectionWatchedNotWatched(ZkStateReaderTest.java:167)
	at sun.reflect.NativeMethodAccessorImpl.invoke0(Native Method)
	at sun.reflect.NativeMethodAccessorImpl.invoke(NativeMethodAccessorImpl.java:62)
	at sun.reflect.DelegatingMethodAccessorImpl.invoke(DelegatingMethodAccessorImpl.java:43)
	at java.lang.reflect.Method.invoke(Method.java:498)
	at com.carrotsearch.randomizedtesting.RandomizedRunner.invoke(RandomizedRunner.java:1764)
	at com.carrotsearch.randomizedtesting.RandomizedRunner$8.evaluate(RandomizedRunner.java:871)
	at com.carrotsearch.randomizedtesting.RandomizedRunner$9.evaluate(RandomizedRunner.java:907)
	at com.carrotsearch.randomizedtesting.RandomizedRunner$10.evaluate(RandomizedRunner.java:921)
	at com.carrotsearch.randomizedtesting.rules.SystemPropertiesRestoreRule$1.evaluate(SystemPropertiesRestoreRule.java:57)
	at org.apache.lucene.util.TestRuleSetupTeardownChained$1.evaluate(TestRuleSetupTeardownChained.java:49)
	at org.apache.lucene.util.AbstractBeforeAfterRule$1.evaluate(AbstractBeforeAfterRule.java:45)
	at org.apache.lucene.util.TestRuleThreadAndTestName$1.evaluate(TestRuleThreadAndTestName.java:48)
	at org.apache.lucene.util.TestRuleIgnoreAfterMaxFailures$1.evaluate(TestRuleIgnoreAfterMaxFailures.java:64)
	at org.apache.lucene.util.TestRuleMarkFailure$1.evaluate(TestRuleMarkFailure.java:47)
	at com.carrotsearch.randomizedtesting.rules.StatementAdapter.evaluate(StatementAdapter.java:36)
	at com.carrotsearch.randomizedtesting.ThreadLeakControl$StatementRunner.run(ThreadLeakControl.java:367)
	at com.carrotsearch.randomizedtesting.ThreadLeakControl.forkTimeoutingTask(ThreadLeakControl.java:809)
	at com.carrotsearch.randomizedtesting.ThreadLeakControl$3.evaluate(ThreadLeakControl.java:460)
	at com.carrotsearch.randomizedtesting.RandomizedRunner.runSingleTest(RandomizedRunner.java:880)
	at com.carrotsearch.randomizedtesting.RandomizedRunner$5.evaluate(RandomizedRunner.java:781)
	at com.carrotsearch.randomizedtesting.RandomizedRunner$6.evaluate(RandomizedRunner.java:816)
	at com.carrotsearch.randomizedtesting.RandomizedRunner$7.evaluate(RandomizedRunner.java:827)
	at com.carrotsearch.randomizedtesting.rules.StatementAdapter.evaluate(StatementAdapter.java:36)
	at com.carrotsearch.randomizedtesting.rules.SystemPropertiesRestoreRule$1.evaluate(SystemPropertiesRestoreRule.java:57)
	at org.apache.lucene.util.AbstractBeforeAfterRule$1.evaluate(AbstractBeforeAfterRule.java:45)
	at com.carrotsearch.randomizedtesting.rules.StatementAdapter.evaluate(StatementAdapter.java:36)
	at org.apache.lucene.util.TestRuleStoreClassName$1.evaluate(TestRuleStoreClassName.java:41)
	at com.carrotsearch.randomizedtesting.rules.NoShadowingOrOverridesOnMethodsRule$1.evaluate(NoShadowingOrOverridesOnMethodsRule.java:40)
	at com.carrotsearch.randomizedtesting.rules.NoShadowingOrOverridesOnMethodsRule$1.evaluate(NoShadowingOrOverridesOnMethodsRule.java:40)
	at com.carrotsearch.randomizedtesting.rules.StatementAdapter.evaluate(StatementAdapter.java:36)
	at com.carrotsearch.randomizedtesting.rules.StatementAdapter.evaluate(StatementAdapter.java:36)
	at com.carrotsearch.randomizedtesting.rules.StatementAdapter.evaluate(StatementAdapter.java:36)
	at org.apache.lucene.util.TestRuleAssertionsRequired$1.evaluate(TestRuleAssertionsRequired.java:53)
	at org.apache.lucene.util.TestRuleMarkFailure$1.evaluate(TestRuleMarkFailure.java:47)
	at org.apache.lucene.util.TestRuleIgnoreAfterMaxFailures$1.evaluate(TestRuleIgnoreAfterMaxFailures.java:64)
	at org.apache.lucene.util.TestRuleIgnoreTestSuites$1.evaluate(TestRuleIgnoreTestSuites.java:54)
	at com.carrotsearch.randomizedtesting.rules.StatementAdapter.evaluate(StatementAdapter.java:36)
	at com.carrotsearch.randomizedtesting.ThreadLeakControl$StatementRunner.run(ThreadLeakControl.java:367)
	at java.lang.Thread.run(Thread.java:745)


FAILED:  org.apache.solr.update.HardAutoCommitTest.testCommitWithin

Error Message:
Exception during query

Stack Trace:
java.lang.RuntimeException: Exception during query
	at __randomizedtesting.SeedInfo.seed([B368BEFAAE5564C1:9BAD1822D7B8AD4]:0)
	at org.apache.solr.SolrTestCaseJ4.assertQ(SolrTestCaseJ4.java:780)
	at org.apache.solr.update.HardAutoCommitTest.testCommitWithin(HardAutoCommitTest.java:99)
	at sun.reflect.NativeMethodAccessorImpl.invoke0(Native Method)
	at sun.reflect.NativeMethodAccessorImpl.invoke(NativeMethodAccessorImpl.java:62)
	at sun.reflect.DelegatingMethodAccessorImpl.invoke(DelegatingMethodAccessorImpl.java:43)
	at java.lang.reflect.Method.invoke(Method.java:498)
	at com.carrotsearch.randomizedtesting.RandomizedRunner.invoke(RandomizedRunner.java:1764)
	at com.carrotsearch.randomizedtesting.RandomizedRunner$8.evaluate(RandomizedRunner.java:871)
	at com.carrotsearch.randomizedtesting.RandomizedRunner$9.evaluate(RandomizedRunner.java:907)
	at com.carrotsearch.randomizedtesting.RandomizedRunner$10.evaluate(RandomizedRunner.java:921)
	at com.carrotsearch.randomizedtesting.rules.SystemPropertiesRestoreRule$1.evaluate(SystemPropertiesRestoreRule.java:57)
	at org.apache.lucene.util.TestRuleSetupTeardownChained$1.evaluate(TestRuleSetupTeardownChained.java:49)
	at org.apache.lucene.util.AbstractBeforeAfterRule$1.evaluate(AbstractBeforeAfterRule.java:45)
	at org.apache.lucene.util.TestRuleThreadAndTestName$1.evaluate(TestRuleThreadAndTestName.java:48)
	at org.apache.lucene.util.TestRuleIgnoreAfterMaxFailures$1.evaluate(TestRuleIgnoreAfterMaxFailures.java:64)
	at org.apache.lucene.util.TestRuleMarkFailure$1.evaluate(TestRuleMarkFailure.java:47)
	at com.carrotsearch.randomizedtesting.rules.StatementAdapter.evaluate(StatementAdapter.java:36)
	at com.carrotsearch.randomizedtesting.ThreadLeakControl$StatementRunner.run(ThreadLeakControl.java:367)
	at com.carrotsearch.randomizedtesting.ThreadLeakControl.forkTimeoutingTask(ThreadLeakControl.java:809)
	at com.carrotsearch.randomizedtesting.ThreadLeakControl$3.evaluate(ThreadLeakControl.java:460)
	at com.carrotsearch.randomizedtesting.RandomizedRunner.runSingleTest(RandomizedRunner.java:880)
	at com.carrotsearch.randomizedtesting.RandomizedRunner$5.evaluate(RandomizedRunner.java:781)
	at com.carrotsearch.randomizedtesting.RandomizedRunner$6.evaluate(RandomizedRunner.java:816)
	at com.carrotsearch.randomizedtesting.RandomizedRunner$7.evaluate(RandomizedRunner.java:827)
	at com.carrotsearch.randomizedtesting.rules.StatementAdapter.evaluate(StatementAdapter.java:36)
	at com.carrotsearch.randomizedtesting.rules.SystemPropertiesRestoreRule$1.evaluate(SystemPropertiesRestoreRule.java:57)
	at org.apache.lucene.util.AbstractBeforeAfterRule$1.evaluate(AbstractBeforeAfterRule.java:45)
	at com.carrotsearch.randomizedtesting.rules.StatementAdapter.evaluate(StatementAdapter.java:36)
	at org.apache.lucene.util.TestRuleStoreClassName$1.evaluate(TestRuleStoreClassName.java:41)
	at com.carrotsearch.randomizedtesting.rules.NoShadowingOrOverridesOnMethodsRule$1.evaluate(NoShadowingOrOverridesOnMethodsRule.java:40)
	at com.carrotsearch.randomizedtesting.rules.NoShadowingOrOverridesOnMethodsRule$1.evaluate(NoShadowingOrOverridesOnMethodsRule.java:40)
	at com.carrotsearch.randomizedtesting.rules.StatementAdapter.evaluate(StatementAdapter.java:36)
	at com.carrotsearch.randomizedtesting.rules.StatementAdapter.evaluate(StatementAdapter.java:36)
	at com.carrotsearch.randomizedtesting.rules.StatementAdapter.evaluate(StatementAdapter.java:36)
	at org.apache.lucene.util.TestRuleAssertionsRequired$1.evaluate(TestRuleAssertionsRequired.java:53)
	at org.apache.lucene.util.TestRuleMarkFailure$1.evaluate(TestRuleMarkFailure.java:47)
	at org.apache.lucene.util.TestRuleIgnoreAfterMaxFailures$1.evaluate(TestRuleIgnoreAfterMaxFailures.java:64)
	at org.apache.lucene.util.TestRuleIgnoreTestSuites$1.evaluate(TestRuleIgnoreTestSuites.java:54)
	at com.carrotsearch.randomizedtesting.rules.StatementAdapter.evaluate(StatementAdapter.java:36)
	at com.carrotsearch.randomizedtesting.ThreadLeakControl$StatementRunner.run(ThreadLeakControl.java:367)
	at java.lang.Thread.run(Thread.java:745)
Caused by: java.lang.RuntimeException: REQUEST FAILED: xpath=//result[@numFound=1]
	xml response was: <?xml version="1.0" encoding="UTF-8"?>
<response>
<lst name="responseHeader"><int name="status">0</int><int name="QTime">0</int></lst><result name="response" numFound="0" start="0"></result>
</response>

	request was:q=id:529&qt=standard&start=0&rows=20&version=2.2
	at org.apache.solr.SolrTestCaseJ4.assertQ(SolrTestCaseJ4.java:773)
	... 40 more


FAILED:  org.apache.solr.cloud.overseer.ZkStateReaderTest.testStateFormatUpdateWithExplicitRefresh

Error Message:
Could not find collection : c1

Stack Trace:
org.apache.solr.common.SolrException: Could not find collection : c1
	at __randomizedtesting.SeedInfo.seed([B368BEFAAE5564C1:ACD2CF0D7E35A204]:0)
	at org.apache.solr.common.cloud.ClusterState.getCollection(ClusterState.java:192)
	at org.apache.solr.cloud.overseer.ZkStateReaderTest.testStateFormatUpdate(ZkStateReaderTest.java:129)
	at org.apache.solr.cloud.overseer.ZkStateReaderTest.testStateFormatUpdateWithExplicitRefresh(ZkStateReaderTest.java:43)
	at sun.reflect.NativeMethodAccessorImpl.invoke0(Native Method)
	at sun.reflect.NativeMethodAccessorImpl.invoke(NativeMethodAccessorImpl.java:62)
	at sun.reflect.DelegatingMethodAccessorImpl.invoke(DelegatingMethodAccessorImpl.java:43)
	at java.lang.reflect.Method.invoke(Method.java:498)
	at com.carrotsearch.randomizedtesting.RandomizedRunner.invoke(RandomizedRunner.java:1764)
	at com.carrotsearch.randomizedtesting.RandomizedRunner$8.evaluate(RandomizedRunner.java:871)
	at com.carrotsearch.randomizedtesting.RandomizedRunner$9.evaluate(RandomizedRunner.java:907)
	at com.carrotsearch.randomizedtesting.RandomizedRunner$10.evaluate(RandomizedRunner.java:921)
	at com.carrotsearch.randomizedtesting.rules.SystemPropertiesRestoreRule$1.evaluate(SystemPropertiesRestoreRule.java:57)
	at org.apache.lucene.util.TestRuleSetupTeardownChained$1.evaluate(TestRuleSetupTeardownChained.java:49)
	at org.apache.lucene.util.AbstractBeforeAfterRule$1.evaluate(AbstractBeforeAfterRule.java:45)
	at org.apache.lucene.util.TestRuleThreadAndTestName$1.evaluate(TestRuleThreadAndTestName.java:48)
	at org.apache.lucene.util.TestRuleIgnoreAfterMaxFailures$1.evaluate(TestRuleIgnoreAfterMaxFailures.java:64)
	at org.apache.lucene.util.TestRuleMarkFailure$1.evaluate(TestRuleMarkFailure.java:47)
	at com.carrotsearch.randomizedtesting.rules.StatementAdapter.evaluate(StatementAdapter.java:36)
	at com.carrotsearch.randomizedtesting.ThreadLeakControl$StatementRunner.run(ThreadLeakControl.java:367)
	at com.carrotsearch.randomizedtesting.ThreadLeakControl.forkTimeoutingTask(ThreadLeakControl.java:809)
	at com.carrotsearch.randomizedtesting.ThreadLeakControl$3.evaluate(ThreadLeakControl.java:460)
	at com.carrotsearch.randomizedtesting.RandomizedRunner.runSingleTest(RandomizedRunner.java:880)
	at com.carrotsearch.randomizedtesting.RandomizedRunner$5.evaluate(RandomizedRunner.java:781)
	at com.carrotsearch.randomizedtesting.RandomizedRunner$6.evaluate(RandomizedRunner.java:816)
	at com.carrotsearch.randomizedtesting.RandomizedRunner$7.evaluate(RandomizedRunner.java:827)
	at com.carrotsearch.randomizedtesting.rules.StatementAdapter.evaluate(StatementAdapter.java:36)
	at com.carrotsearch.randomizedtesting.rules.SystemPropertiesRestoreRule$1.evaluate(SystemPropertiesRestoreRule.java:57)
	at org.apache.lucene.util.AbstractBeforeAfterRule$1.evaluate(AbstractBeforeAfterRule.java:45)
	at com.carrotsearch.randomizedtesting.rules.StatementAdapter.evaluate(StatementAdapter.java:36)
	at org.apache.lucene.util.TestRuleStoreClassName$1.evaluate(TestRuleStoreClassName.java:41)
	at com.carrotsearch.randomizedtesting.rules.NoShadowingOrOverridesOnMethodsRule$1.evaluate(NoShadowingOrOverridesOnMethodsRule.java:40)
	at com.carrotsearch.randomizedtesting.rules.NoShadowingOrOverridesOnMethodsRule$1.evaluate(NoShadowingOrOverridesOnMethodsRule.java:40)
	at com.carrotsearch.randomizedtesting.rules.StatementAdapter.evaluate(StatementAdapter.java:36)
	at com.carrotsearch.randomizedtesting.rules.StatementAdapter.evaluate(StatementAdapter.java:36)
	at com.carrotsearch.randomizedtesting.rules.StatementAdapter.evaluate(StatementAdapter.java:36)
	at org.apache.lucene.util.TestRuleAssertionsRequired$1.evaluate(TestRuleAssertionsRequired.java:53)
	at org.apache.lucene.util.TestRuleMarkFailure$1.evaluate(TestRuleMarkFailure.java:47)
	at org.apache.lucene.util.TestRuleIgnoreAfterMaxFailures$1.evaluate(TestRuleIgnoreAfterMaxFailures.java:64)
	at org.apache.lucene.util.TestRuleIgnoreTestSuites$1.evaluate(TestRuleIgnoreTestSuites.java:54)
	at com.carrotsearch.randomizedtesting.rules.StatementAdapter.evaluate(StatementAdapter.java:36)
	at com.carrotsearch.randomizedtesting.ThreadLeakControl$StatementRunner.run(ThreadLeakControl.java:367)
	at java.lang.Thread.run(Thread.java:745)




Build Log:
[...truncated 11551 lines...]
   [junit4] Suite: org.apache.solr.update.HardAutoCommitTest
   [junit4]   2> Creating dataDir: /x1/jenkins/jenkins-slave/workspace/Lucene-Solr-Tests-master/solr/build/solr-core/test/J2/temp/solr.update.HardAutoCommitTest_B368BEFAAE5564C1-001/init-core-data-001
   [junit4]   2> 1083601 INFO  (SUITE-HardAutoCommitTest-seed#[B368BEFAAE5564C1]-worker) [    ] o.a.s.SolrTestCaseJ4 Randomized ssl (false) and clientAuth (true) via: @org.apache.solr.util.RandomizeSSL(reason=, ssl=NaN, value=NaN, clientAuth=NaN)
   [junit4]   2> 1083606 INFO  (SUITE-HardAutoCommitTest-seed#[B368BEFAAE5564C1]-worker) [    ] o.a.s.SolrTestCaseJ4 ####initCore
   [junit4]   2> 1083606 INFO  (SUITE-HardAutoCommitTest-seed#[B368BEFAAE5564C1]-worker) [    ] o.a.s.c.SolrResourceLoader new SolrResourceLoader for directory: '/x1/jenkins/jenkins-slave/workspace/Lucene-Solr-Tests-master/solr/core/src/test-files/solr/collection1'
   [junit4]   2> 1083606 INFO  (SUITE-HardAutoCommitTest-seed#[B368BEFAAE5564C1]-worker) [    ] o.a.s.c.SolrResourceLoader JNDI not configured for solr (NoInitialContextEx)
   [junit4]   2> 1083606 INFO  (SUITE-HardAutoCommitTest-seed#[B368BEFAAE5564C1]-worker) [    ] o.a.s.c.SolrResourceLoader using system property solr.solr.home: /x1/jenkins/jenkins-slave/workspace/Lucene-Solr-Tests-master/solr/core/src/test-files/solr
   [junit4]   2> 1083606 INFO  (SUITE-HardAutoCommitTest-seed#[B368BEFAAE5564C1]-worker) [    ] o.a.s.c.SolrResourceLoader Adding 'file:/x1/jenkins/jenkins-slave/workspace/Lucene-Solr-Tests-master/solr/core/src/test-files/solr/collection1/lib/classes/' to classloader
   [junit4]   2> 1083606 INFO  (SUITE-HardAutoCommitTest-seed#[B368BEFAAE5564C1]-worker) [    ] o.a.s.c.SolrResourceLoader Adding 'file:/x1/jenkins/jenkins-slave/workspace/Lucene-Solr-Tests-master/solr/core/src/test-files/solr/collection1/lib/README' to classloader
   [junit4]   2> 1083633 INFO  (SUITE-HardAutoCommitTest-seed#[B368BEFAAE5564C1]-worker) [    ] o.a.s.c.SolrConfig current version of requestparams : -1
   [junit4]   2> 1083667 WARN  (SUITE-HardAutoCommitTest-seed#[B368BEFAAE5564C1]-worker) [    ] o.a.s.c.Config Beginning with Solr 5.5, <mergePolicy> is deprecated, use <mergePolicyFactory> instead.
   [junit4]   2> 1083669 INFO  (SUITE-HardAutoCommitTest-seed#[B368BEFAAE5564C1]-worker) [    ] o.a.s.c.SolrConfig Using Lucene MatchVersion: 7.0.0
   [junit4]   2> 1083716 INFO  (SUITE-HardAutoCommitTest-seed#[B368BEFAAE5564C1]-worker) [    ] o.a.s.c.SolrConfig Loaded SolrConfig: solrconfig.xml
   [junit4]   2> 1083719 INFO  (SUITE-HardAutoCommitTest-seed#[B368BEFAAE5564C1]-worker) [    ] o.a.s.s.IndexSchema [null] Schema name=test
   [junit4]   2> 1083931 INFO  (SUITE-HardAutoCommitTest-seed#[B368BEFAAE5564C1]-worker) [    ] o.a.s.s.OpenExchangeRatesOrgProvider Initialized with rates=open-exchange-rates.json, refreshInterval=1440.
   [junit4]   2> 1083935 INFO  (SUITE-HardAutoCommitTest-seed#[B368BEFAAE5564C1]-worker) [    ] o.a.s.s.IndexSchema default search field in schema is text
   [junit4]   2> 1083936 INFO  (SUITE-HardAutoCommitTest-seed#[B368BEFAAE5564C1]-worker) [    ] o.a.s.s.IndexSchema unique key field: id
   [junit4]   2> 1083939 INFO  (SUITE-HardAutoCommitTest-seed#[B368BEFAAE5564C1]-worker) [    ] o.a.s.s.FileExchangeRateProvider Reloading exchange rates from file currency.xml
   [junit4]   2> 1083940 INFO  (SUITE-HardAutoCommitTest-seed#[B368BEFAAE5564C1]-worker) [    ] o.a.s.s.FileExchangeRateProvider Reloading exchange rates from file currency.xml
   [junit4]   2> 1083941 INFO  (SUITE-HardAutoCommitTest-seed#[B368BEFAAE5564C1]-worker) [    ] o.a.s.s.OpenExchangeRatesOrgProvider Reloading exchange rates from open-exchange-rates.json
   [junit4]   2> 1083941 INFO  (SUITE-HardAutoCommitTest-seed#[B368BEFAAE5564C1]-worker) [    ] o.a.s.s.OpenExchangeRatesOrgProvider Reloading exchange rates from open-exchange-rates.json
   [junit4]   2> 1083941 INFO  (SUITE-HardAutoCommitTest-seed#[B368BEFAAE5564C1]-worker) [    ] o.a.s.c.SolrResourceLoader JNDI not configured for solr (NoInitialContextEx)
   [junit4]   2> 1083941 INFO  (SUITE-HardAutoCommitTest-seed#[B368BEFAAE5564C1]-worker) [    ] o.a.s.c.SolrResourceLoader using system property solr.solr.home: /x1/jenkins/jenkins-slave/workspace/Lucene-Solr-Tests-master/solr/core/src/test-files/solr
   [junit4]   2> 1083941 INFO  (SUITE-HardAutoCommitTest-seed#[B368BEFAAE5564C1]-worker) [    ] o.a.s.c.SolrResourceLoader new SolrResourceLoader for directory: '/x1/jenkins/jenkins-slave/workspace/Lucene-Solr-Tests-master/solr/core/src/test-files/solr'
   [junit4]   2> 1083941 INFO  (SUITE-HardAutoCommitTest-seed#[B368BEFAAE5564C1]-worker) [    ] o.a.s.c.SolrResourceLoader JNDI not configured for solr (NoInitialContextEx)
   [junit4]   2> 1083941 INFO  (SUITE-HardAutoCommitTest-seed#[B368BEFAAE5564C1]-worker) [    ] o.a.s.c.SolrResourceLoader using system property solr.solr.home: /x1/jenkins/jenkins-slave/workspace/Lucene-Solr-Tests-master/solr/core/src/test-files/solr
   [junit4]   2> 1083941 INFO  (SUITE-HardAutoCommitTest-seed#[B368BEFAAE5564C1]-worker) [    ] o.a.s.c.CoreContainer New CoreContainer 1523862192
   [junit4]   2> 1083941 INFO  (SUITE-HardAutoCommitTest-seed#[B368BEFAAE5564C1]-worker) [    ] o.a.s.c.CoreContainer Loading cores into CoreContainer [instanceDir=/x1/jenkins/jenkins-slave/workspace/Lucene-Solr-Tests-master/solr/core/src/test-files/solr]
   [junit4]   2> 1083942 WARN  (SUITE-HardAutoCommitTest-seed#[B368BEFAAE5564C1]-worker) [    ] o.a.s.c.CoreContainer Couldn't add files from /x1/jenkins/jenkins-slave/workspace/Lucene-Solr-Tests-master/solr/core/src/test-files/solr/lib to classpath: /x1/jenkins/jenkins-slave/workspace/Lucene-Solr-Tests-master/solr/core/src/test-files/solr/lib
   [junit4]   2> 1083942 INFO  (SUITE-HardAutoCommitTest-seed#[B368BEFAAE5564C1]-worker) [    ] o.a.s.h.c.HttpShardHandlerFactory created with socketTimeout : 600000,connTimeout : 60000,maxConnectionsPerHost : 20,maxConnections : 10000,corePoolSize : 0,maximumPoolSize : 2147483647,maxThreadIdleTime : 5,sizeOfQueue : -1,fairnessPolicy : false,
   [junit4]   2> 1083944 INFO  (SUITE-HardAutoCommitTest-seed#[B368BEFAAE5564C1]-worker) [    ] o.a.s.u.UpdateShardHandler Created UpdateShardHandler HTTP client with params: socketTimeout=30000&connTimeout=30000&maxConnections=100000&maxConnectionsPerHost=100000
   [junit4]   2> 1083944 INFO  (SUITE-HardAutoCommitTest-seed#[B368BEFAAE5564C1]-worker) [    ] o.a.s.l.LogWatcher SLF4J impl is org.slf4j.impl.Log4jLoggerFactory
   [junit4]   2> 1083944 INFO  (SUITE-HardAutoCommitTest-seed#[B368BEFAAE5564C1]-worker) [    ] o.a.s.l.LogWatcher Registering Log Listener [Log4j (org.slf4j.impl.Log4jLoggerFactory)]
   [junit4]   2> 1083945 INFO  (SUITE-HardAutoCommitTest-seed#[B368BEFAAE5564C1]-worker) [    ] o.a.s.c.CoreContainer Security conf doesn't exist. Skipping setup for authorization module.
   [junit4]   2> 1083945 INFO  (SUITE-HardAutoCommitTest-seed#[B368BEFAAE5564C1]-worker) [    ] o.a.s.c.CoreContainer No authentication plugin used.
   [junit4]   2> 1083945 INFO  (SUITE-HardAutoCommitTest-seed#[B368BEFAAE5564C1]-worker) [    ] o.a.s.c.CoreDescriptor Created CoreDescriptor: {name=collection1, config=solrconfig.xml, transient=false, schema=schema.xml, loadOnStartup=true, configSetProperties=configsetprops.json, collection=collection1, dataDir=/x1/jenkins/jenkins-slave/workspace/Lucene-Solr-Tests-master/solr/build/solr-core/test/J2/temp/solr.update.HardAutoCommitTest_B368BEFAAE5564C1-001/init-core-data-001, shard=shard1}
   [junit4]   2> 1083946 INFO  (coreLoadExecutor-6656-thread-1) [    ] o.a.s.c.SolrResourceLoader new SolrResourceLoader for directory: '/x1/jenkins/jenkins-slave/workspace/Lucene-Solr-Tests-master/solr/core/src/test-files/solr/collection1'
   [junit4]   2> 1083951 INFO  (coreLoadExecutor-6656-thread-1) [    ] o.a.s.c.SolrResourceLoader JNDI not configured for solr (NoInitialContextEx)
   [junit4]   2> 1083951 INFO  (coreLoadExecutor-6656-thread-1) [    ] o.a.s.c.SolrResourceLoader using system property solr.solr.home: /x1/jenkins/jenkins-slave/workspace/Lucene-Solr-Tests-master/solr/core/src/test-files/solr
   [junit4]   2> 1083952 INFO  (coreLoadExecutor-6656-thread-1) [    ] o.a.s.c.SolrResourceLoader Adding 'file:/x1/jenkins/jenkins-slave/workspace/Lucene-Solr-Tests-master/solr/core/src/test-files/solr/collection1/lib/classes/' to classloader
   [junit4]   2> 1083952 INFO  (coreLoadExecutor-6656-thread-1) [    ] o.a.s.c.SolrResourceLoader Adding 'file:/x1/jenkins/jenkins-slave/workspace/Lucene-Solr-Tests-master/solr/core/src/test-files/solr/collection1/lib/README' to classloader
   [junit4]   2> 1083965 INFO  (coreLoadExecutor-6656-thread-1) [    ] o.a.s.c.SolrConfig current version of requestparams : -1
   [junit4]   2> 1083999 WARN  (coreLoadExecutor-6656-thread-1) [    ] o.a.s.c.Config Beginning with Solr 5.5, <mergePolicy> is deprecated, use <mergePolicyFactory> instead.
   [junit4]   2> 1084001 INFO  (coreLoadExecutor-6656-thread-1) [    ] o.a.s.c.SolrConfig Using Lucene MatchVersion: 7.0.0
   [junit4]   2> 1084028 INFO  (coreLoadExecutor-6656-thread-1) [    ] o.a.s.c.SolrConfig Loaded SolrConfig: solrconfig.xml
   [junit4]   2> 1084031 INFO  (coreLoadExecutor-6656-thread-1) [    ] o.a.s.s.IndexSchema [collection1] Schema name=test
   [junit4]   2> 1084098 INFO  (coreLoadExecutor-6656-thread-1) [    ] o.a.s.s.OpenExchangeRatesOrgProvider Initialized with rates=open-exchange-rates.json, refreshInterval=1440.
   [junit4]   2> 1084102 INFO  (coreLoadExecutor-6656-thread-1) [    ] o.a.s.s.IndexSchema default search field in schema is text
   [junit4]   2> 1084103 INFO  (coreLoadExecutor-6656-thread-1) [    ] o.a.s.s.IndexSchema unique key field: id
   [junit4]   2> 1084111 INFO  (coreLoadExecutor-6656-thread-1) [    ] o.a.s.s.FileExchangeRateProvider Reloading exchange rates from file currency.xml
   [junit4]   2> 1084112 INFO  (coreLoadExecutor-6656-thread-1) [    ] o.a.s.s.FileExchangeRateProvider Reloading exchange rates from file currency.xml
   [junit4]   2> 1084113 INFO  (coreLoadExecutor-6656-thread-1) [    ] o.a.s.s.OpenExchangeRatesOrgProvider Reloading exchange rates from open-exchange-rates.json
   [junit4]   2> 1084113 INFO  (coreLoadExecutor-6656-thread-1) [    ] o.a.s.s.OpenExchangeRatesOrgProvider Reloading exchange rates from open-exchange-rates.json
   [junit4]   2> 1084114 INFO  (coreLoadExecutor-6656-thread-1) [    ] o.a.s.c.ConfigSetProperties Did not find ConfigSet properties, assuming default properties: Can't find resource 'configsetprops.json' in classpath or '/x1/jenkins/jenkins-slave/workspace/Lucene-Solr-Tests-master/solr/core/src/test-files/solr/collection1'
   [junit4]   2> 1084115 INFO  (coreLoadExecutor-6656-thread-1) [    ] o.a.s.c.CoreContainer Creating SolrCore 'collection1' using configuration from instancedir /x1/jenkins/jenkins-slave/workspace/Lucene-Solr-Tests-master/solr/core/src/test-files/solr/collection1
   [junit4]   2> 1084115 INFO  (coreLoadExecutor-6656-thread-1) [    x:collection1] o.a.s.c.SolrCore org.apache.solr.core.MockDirectoryFactory
   [junit4]   2> 1084115 INFO  (coreLoadExecutor-6656-thread-1) [    x:collection1] o.a.s.c.SolrCore [[collection1] ] Opening new SolrCore at [/x1/jenkins/jenkins-slave/workspace/Lucene-Solr-Tests-master/solr/core/src/test-files/solr/collection1], dataDir=[/x1/jenkins/jenkins-slave/workspace/Lucene-Solr-Tests-master/solr/build/solr-core/test/J2/temp/solr.update.HardAutoCommitTest_B368BEFAAE5564C1-001/init-core-data-001/]
   [junit4]   2> 1084115 INFO  (coreLoadExecutor-6656-thread-1) [    x:collection1] o.a.s.c.JmxMonitoredMap JMX monitoring is enabled. Adding Solr mbeans to JMX Server: com.sun.jmx.mbeanserver.JmxMBeanServer@28dd329d
   [junit4]   2> 1084115 INFO  (coreLoadExecutor-6656-thread-1) [    x:collection1] o.a.s.c.CachingDirectoryFactory return new directory for /x1/jenkins/jenkins-slave/workspace/Lucene-Solr-Tests-master/solr/build/solr-core/test/J2/temp/solr.update.HardAutoCommitTest_B368BEFAAE5564C1-001/init-core-data-001
   [junit4]   2> 1084115 INFO  (coreLoadExecutor-6656-thread-1) [    x:collection1] o.a.s.c.SolrCore New index directory detected: old=null new=/x1/jenkins/jenkins-slave/workspace/Lucene-Solr-Tests-master/solr/build/solr-core/test/J2/temp/solr.update.HardAutoCommitTest_B368BEFAAE5564C1-001/init-core-data-001/index/
   [junit4]   2> 1084115 WARN  (coreLoadExecutor-6656-thread-1) [    x:collection1] o.a.s.c.SolrCore [collection1] Solr index directory '/x1/jenkins/jenkins-slave/workspace/Lucene-Solr-Tests-master/solr/build/solr-core/test/J2/temp/solr.update.HardAutoCommitTest_B368BEFAAE5564C1-001/init-core-data-001/index' doesn't exist. Creating new index...
   [junit4]   2> 1084116 INFO  (coreLoadExecutor-6656-thread-1) [    x:collection1] o.a.s.c.CachingDirectoryFactory return new directory for /x1/jenkins/jenkins-slave/workspace/Lucene-Solr-Tests-master/solr/build/solr-core/test/J2/temp/solr.update.HardAutoCommitTest_B368BEFAAE5564C1-001/init-core-data-001/index
   [junit4]   2> 1084116 INFO  (coreLoadExecutor-6656-thread-1) [    x:collection1] o.a.s.u.RandomMergePolicy RandomMergePolicy wrapping class org.apache.lucene.index.AlcoholicMergePolicy: [AlcoholicMergePolicy: minMergeSize=0, mergeFactor=10, maxMergeSize=1173236342, maxMergeSizeForForcedMerge=9223372036854775807, calibrateSizeByDeletes=true, maxMergeDocs=2147483647, maxCFSSegmentSizeMB=8.796093022207999E12, noCFSRatio=0.1]
   [junit4]   2> 1084116 INFO  (coreLoadExecutor-6656-thread-1) [    x:collection1] o.a.s.c.SolrDeletionPolicy SolrDeletionPolicy.onCommit: commits: num=1
   [junit4]   2> 	commit{dir=MockDirectoryWrapper(RAMDirectory@5808febc lockFactory=org.apache.lucene.store.SingleInstanceLockFactory@eaad4fc),segFN=segments_1,generation=1}
   [junit4]   2> 1084116 INFO  (coreLoadExecutor-6656-thread-1) [    x:collection1] o.a.s.c.SolrDeletionPolicy newest commit generation = 1
   [junit4]   2> 1084118 INFO  (coreLoadExecutor-6656-thread-1) [    x:collection1] o.a.s.u.p.UpdateRequestProcessorChain creating updateRequestProcessorChain "dedupe"
   [junit4]   2> 1084118 INFO  (coreLoadExecutor-6656-thread-1) [    x:collection1] o.a.s.u.p.UpdateRequestProcessorChain inserting DistributedUpdateProcessorFactory into updateRequestProcessorChain "dedupe"
   [junit4]   2> 1084118 INFO  (coreLoadExecutor-6656-thread-1) [    x:collection1] o.a.s.u.p.UpdateRequestProcessorChain creating updateRequestProcessorChain "dedupe-allfields"
   [junit4]   2> 1084118 INFO  (coreLoadExecutor-6656-thread-1) [    x:collection1] o.a.s.u.p.UpdateRequestProcessorChain inserting DistributedUpdateProcessorFactory into updateRequestProcessorChain "dedupe-allfields"
   [junit4]   2> 1084119 INFO  (coreLoadExecutor-6656-thread-1) [    x:collection1] o.a.s.u.p.UpdateRequestProcessorChain creating updateRequestProcessorChain "stored_sig"
   [junit4]   2> 1084119 INFO  (coreLoadExecutor-6656-thread-1) [    x:collection1] o.a.s.u.p.UpdateRequestProcessorChain inserting DistributedUpdateProcessorFactory into updateRequestProcessorChain "stored_sig"
   [junit4]   2> 1084119 INFO  (coreLoadExecutor-6656-thread-1) [    x:collection1] o.a.s.u.p.UpdateRequestProcessorChain creating updateRequestProcessorChain "uniq-fields"
   [junit4]   2> 1084119 INFO  (coreLoadExecutor-6656-thread-1) [    x:collection1] o.a.s.u.p.UpdateRequestProcessorChain inserting DistributedUpdateProcessorFactory into updateRequestProcessorChain "uniq-fields"
   [junit4]   2> 1084119 INFO  (coreLoadExecutor-6656-thread-1) [    x:collection1] o.a.s.u.p.UpdateRequestProcessorChain creating updateRequestProcessorChain "distrib-dup-test-chain-explicit"
   [junit4]   2> 1084119 INFO  (coreLoadExecutor-6656-thread-1) [    x:collection1] o.a.s.u.p.UpdateRequestProcessorChain creating updateRequestProcessorChain "distrib-dup-test-chain-implicit"
   [junit4]   2> 1084119 INFO  (coreLoadExecutor-6656-thread-1) [    x:collection1] o.a.s.u.p.UpdateRequestProcessorChain inserting DistributedUpdateProcessorFactory into updateRequestProcessorChain "distrib-dup-test-chain-implicit"
   [junit4]   2> 1084119 INFO  (coreLoadExecutor-6656-thread-1) [    x:collection1] o.a.s.c.SolrCore no updateRequestProcessorChain defined as default, creating implicit default
   [junit4]   2> 1084120 INFO  (coreLoadExecutor-6656-thread-1) [    x:collection1] o.a.s.h.l.XMLLoader xsltCacheLifetimeSeconds=60
   [junit4]   2> 1084121 INFO  (coreLoadExecutor-6656-thread-1) [    x:collection1] o.a.s.h.l.XMLLoader xsltCacheLifetimeSeconds=60
   [junit4]   2> 1084121 INFO  (coreLoadExecutor-6656-thread-1) [    x:collection1] o.a.s.h.l.XMLLoader xsltCacheLifetimeSeconds=60
   [junit4]   2> 1084122 INFO  (coreLoadExecutor-6656-thread-1) [    x:collection1] o.a.s.h.l.XMLLoader xsltCacheLifetimeSeconds=60
   [junit4]   2> 1084124 INFO  (coreLoadExecutor-6656-thread-1) [    x:collection1] o.a.s.c.PluginBag requestHandler : 'lazy' created with startup=lazy 
   [junit4]   2> 1084124 INFO  (coreLoadExecutor-6656-thread-1) [    x:collection1] o.a.s.c.RequestHandlers Registered paths: /admin/mbeans,standard,spellCheckCompRH,lazy,/update/json/docs,/admin/luke,/export,spellCheckWithWordbreak_Direct,tvrh,/get,/admin/properties,/update/json,mltrh,/admin/threads,/search-facet-def,/update/csv,/sql,/graph,/search-facet-invariants,/admin/segments,spellCheckCompRH1,/mlt,/admin/system,/replication,dismax,defaults,/config,/stream,/schema,/admin/plugins,/admin/logging,spellCheckWithWordbreak,mock,/admin/ping,/update,/admin/file,/terms,spellCheckCompRH_Direct,/debug/dump
   [junit4]   2> 1084125 INFO  (coreLoadExecutor-6656-thread-1) [    x:collection1] o.a.s.c.SolrCore Using default statsCache cache: org.apache.solr.search.stats.LocalStatsCache
   [junit4]   2> 1084125 INFO  (OldIndexDirectoryCleanupThreadForCore-collection1) [    x:collection1] o.a.s.c.SolrCore Looking for old index directories to cleanup for core collection1 in /x1/jenkins/jenkins-slave/workspace/Lucene-Solr-Tests-master/solr/build/solr-core/test/J2/temp/solr.update.HardAutoCommitTest_B368BEFAAE5564C1-001/init-core-data-001/
   [junit4]   2> 1084158 INFO  (coreLoadExecutor-6656-thread-1) [    x:collection1] o.a.s.u.UpdateHandler Using UpdateLog implementation: org.apache.solr.update.UpdateLog
   [junit4]   2> 1084158 INFO  (coreLoadExecutor-6656-thread-1) [    x:collection1] o.a.s.u.UpdateLog Initializing UpdateLog: dataDir= defaultSyncLevel=FLUSH numRecordsToKeep=100 maxNumLogsToKeep=10 numVersionBuckets=65536
   [junit4]   2> 1084159 INFO  (coreLoadExecutor-6656-thread-1) [    x:collection1] o.a.s.u.CommitTracker Hard AutoCommit: disabled
   [junit4]   2> 1084159 INFO  (coreLoadExecutor-6656-thread-1) [    x:collection1] o.a.s.u.CommitTracker Soft AutoCommit: disabled
   [junit4]   2> 1084159 INFO  (coreLoadExecutor-6656-thread-1) [    x:collection1] o.a.s.u.RandomMergePolicy RandomMergePolicy wrapping class org.apache.lucene.index.LogDocMergePolicy: [LogDocMergePolicy: minMergeSize=1000, mergeFactor=28, maxMergeSize=9223372036854775807, maxMergeSizeForForcedMerge=9223372036854775807, calibrateSizeByDeletes=true, maxMergeDocs=2147483647, maxCFSSegmentSizeMB=8.796093022207999E12, noCFSRatio=0.0]
   [junit4]   2> 1084159 INFO  (coreLoadExecutor-6656-thread-1) [    x:collection1] o.a.s.c.SolrDeletionPolicy SolrDeletionPolicy.onInit: commits: num=1
   [junit4]   2> 	commit{dir=MockDirectoryWrapper(RAMDirectory@5808febc lockFactory=org.apache.lucene.store.SingleInstanceLockFactory@eaad4fc),segFN=segments_1,generation=1}
   [junit4]   2> 1084159 INFO  (coreLoadExecutor-6656-thread-1) [    x:collection1] o.a.s.c.SolrDeletionPolicy newest commit generation = 1
   [junit4]   2> 1084161 INFO  (coreLoadExecutor-6656-thread-1) [    x:collection1] o.a.s.s.SolrIndexSearcher Opening [Searcher@6971722a[collection1] main]
   [junit4]   2> 1084161 INFO  (coreLoadExecutor-6656-thread-1) [    x:collection1] o.a.s.r.RestManager Initializing RestManager with initArgs: {storageIO=org.apache.solr.rest.ManagedResourceStorage$InMemoryStorageIO}
   [junit4]   2> 1084161 INFO  (coreLoadExecutor-6656-thread-1) [    x:collection1] o.a.s.r.ManagedResourceStorage Reading _rest_managed.json using InMemoryStorage
   [junit4]   2> 1084161 INFO  (coreLoadExecutor-6656-thread-1) [    x:collection1] o.a.s.r.RestManager Initializing 0 registered ManagedResources
   [junit4]   2> 1084162 INFO  (coreLoadExecutor-6656-thread-1) [    x:collection1] o.a.s.h.c.SpellCheckComponent Initializing spell checkers
   [junit4]   2> 1084169 INFO  (coreLoadExecutor-6656-thread-1) [    x:collection1] o.a.s.s.DirectSolrSpellChecker init: {name=direct,classname=DirectSolrSpellChecker,field=lowerfilt,minQueryLength=3}
   [junit4]   2> 1084237 INFO  (coreLoadExecutor-6656-thread-1) [    x:collection1] o.a.s.h.ReplicationHandler Commits will be reserved for  10000
   [junit4]   2> 1084238 INFO  (searcherExecutor-6657-thread-1-processing-x:collection1) [    x:collection1] o.a.s.h.c.SpellCheckComponent Loading spell index for spellchecker: default
   [junit4]   2> 1084238 INFO  (searcherExecutor-6657-thread-1-processing-x:collection1) [    x:collection1] o.a.s.h.c.SpellCheckComponent Loading spell index for spellchecker: direct
   [junit4]   2> 1084238 INFO  (searcherExecutor-6657-thread-1-processing-x:collection1) [    x:collection1] o.a.s.h.c.SpellCheckComponent Loading spell index for spellchecker: wordbreak
   [junit4]   2> 1084238 INFO  (searcherExecutor-6657-thread-1-processing-x:collection1) [    x:collection1] o.a.s.h.c.SpellCheckComponent Loading spell index for spellchecker: multipleFields
   [junit4]   2> 1084238 INFO  (searcherExecutor-6657-thread-1-processing-x:collection1) [    x:collection1] o.a.s.h.c.SpellCheckComponent Loading spell index for spellchecker: jarowinkler
   [junit4]   2> 1084238 INFO  (searcherExecutor-6657-thread-1-processing-x:collection1) [    x:collection1] o.a.s.h.c.SpellCheckComponent Loading spell index for spellchecker: external
   [junit4]   2> 1084239 INFO  (searcherExecutor-6657-thread-1-processing-x:collection1) [    x:collection1] o.a.s.h.c.SpellCheckComponent Loading spell index for spellchecker: freq
   [junit4]   2> 1084239 INFO  (searcherExecutor-6657-thread-1-processing-x:collection1) [    x:collection1] o.a.s.h.c.SpellCheckComponent Loading spell index for spellchecker: fqcn
   [junit4]   2> 1084239 INFO  (searcherExecutor-6657-thread-1-processing-x:collection1) [    x:collection1] o.a.s.h.c.SpellCheckComponent Loading spell index for spellchecker: perDict
   [junit4]   2> 1084239 INFO  (searcherExecutor-6657-thread-1-processing-x:collection1) [    x:collection1] o.a.s.c.SolrCore [collection1] Registered new searcher Searcher@6971722a[collection1] main{ExitableDirectoryReader(UninvertingDirectoryReader())}
   [junit4]   2> 1084242 INFO  (coreLoadExecutor-6656-thread-1) [    x:collection1] o.a.s.u.UpdateLog Looking up max value of version field to seed version buckets
   [junit4]   2> 1084242 INFO  (coreLoadExecutor-6656-thread-1) [    x:collection1] o.a.s.u.VersionInfo Refreshing highest value of _version_ for 65536 version buckets from index
   [junit4]   2> 1084242 INFO  (coreLoadExecutor-6656-thread-1) [    x:collection1] o.a.s.u.VersionInfo No terms found for _version_, cannot seed version bucket highest value from index
   [junit4]   2> 1084242 INFO  (coreLoadExecutor-6656-thread-1) [    x:collection1] o.a.s.u.UpdateLog Could not find max version in index or recent updates, using new clock 1538772760913772544
   [junit4]   2> 1084244 INFO  (coreLoadExecutor-6656-thread-1) [    x:collection1] o.a.s.u.UpdateLog Took 1.0ms to seed version buckets with highest version 1538772760913772544
   [junit4]   2> 1084244 INFO  (coreLoadExecutor-6656-thread-1) [    x:collection1] o.a.s.c.CoreContainer registering core: collection1
   [junit4]   2> 1084244 INFO  (SUITE-HardAutoCommitTest-seed#[B368BEFAAE5564C1]-worker) [    ] o.a.s.SolrTestCaseJ4 ####initCore end
   [junit4]   2> 1084251 INFO  (TEST-HardAutoCommitTest.testCommitWithin-seed#[B368BEFAAE5564C1]) [    ] o.a.s.SolrTestCaseJ4 ###Starting testCommitWithin
   [junit4]   2> 1084258 INFO  (TEST-HardAutoCommitTest.testCommitWithin-seed#[B368BEFAAE5564C1]) [    ] o.a.s.u.p.LogUpdateProcessorFactory [collection1]  webapp=null path=null params={}{deleteByQuery=*:* (-1538772760923209728)} 0 7
   [junit4]   2> 1084259 INFO  (TEST-HardAutoCommitTest.testCommitWithin-seed#[B368BEFAAE5564C1]) [    ] o.a.s.c.SolrResourceLoader new SolrResourceLoader for directory: '/x1/jenkins/jenkins-slave/workspace/Lucene-Solr-Tests-master/solr/core/src/test-files/solr/collection1'
   [junit4]   2> 1084259 INFO  (TEST-HardAutoCommitTest.testCommitWithin-seed#[B368BEFAAE5564C1]) [    ] o.a.s.c.SolrResourceLoader JNDI not configured for solr (NoInitialContextEx)
   [junit4]   2> 1084259 INFO  (TEST-HardAutoCommitTest.testCommitWithin-seed#[B368BEFAAE5564C1]) [    ] o.a.s.c.SolrResourceLoader using system property solr.solr.home: /x1/jenkins/jenkins-slave/workspace/Lucene-Solr-Tests-master/solr/core/src/test-files/solr
   [junit4]   2> 1084259 INFO  (TEST-HardAutoCommitTest.testCommitWithin-seed#[B368BEFAAE5564C1]) [    ] o.a.s.c.SolrResourceLoader Adding 'file:/x1/jenkins/jenkins-slave/workspace/Lucene-Solr-Tests-master/solr/core/src/test-files/solr/collection1/lib/classes/' to classloader
   [junit4]   2> 1084260 INFO  (TEST-HardAutoCommitTest.testCommitWithin-seed#[B368BEFAAE5564C1]) [    ] o.a.s.c.SolrResourceLoader Adding 'file:/x1/jenkins/jenkins-slave/workspace/Lucene-Solr-Tests-master/solr/core/src/test-files/solr/collection1/lib/README' to classloader
   [junit4]   2> 1084307 INFO  (TEST-HardAutoCommitTest.testCommitWithin-seed#[B368BEFAAE5564C1]) [    ] o.a.s.c.SolrConfig current version of requestparams : -1
   [junit4]   2> 1084404 WARN  (TEST-HardAutoCommitTest.testCommitWithin-seed#[B368BEFAAE5564C1]) [    ] o.a.s.c.Config Beginning with Solr 5.5, <mergePolicy> is deprecated, use <mergePolicyFactory> instead.
   [junit4]   2> 1084407 INFO  (TEST-HardAutoCommitTest.testCommitWithin-seed#[B368BEFAAE5564C1]) [    ] o.a.s.c.SolrConfig Using Lucene MatchVersion: 7.0.0
   [junit4]   2> 1084423 INFO  (TEST-HardAutoCommitTest.testCommitWithin-seed#[B368BEFAAE5564C1]) [    ] o.a.s.c.SolrConfig Loaded SolrConfig: solrconfig.xml
   [junit4]   2> 1084427 INFO  (TEST-HardAutoCommitTest.testCommitWithin-seed#[B368BEFAAE5564C1]) [    ] o.a.s.s.IndexSchema [collection1] Schema name=test
   [junit4]   2> 1084577 INFO  (TEST-HardAutoCommitTest.testCommitWithin-seed#[B368BEFAAE5564C1]) [    ] o.a.s.s.OpenExchangeRatesOrgProvider Initialized with rates=open-exchange-rates.json, refreshInterval=1440.
   [junit4]   2> 1084589 INFO  (TEST-HardAutoCommitTest.testCommitWithin-seed#[B368BEFAAE5564C1]) [    ] o.a.s.s.IndexSchema default search field in schema is text
   [junit4]   2> 1084589 INFO  (TEST-HardAutoCommitTest.testCommitWithin-seed#[B368BEFAAE5564C1]) [    ] o.a.s.s.IndexSchema unique key field: id
   [junit4]   2> 1084592 INFO  (TEST-HardAutoCommitTest.testCommitWithin-seed#[B368BEFAAE5564C1]) [    ] o.a.s.s.FileExchangeRateProvider Reloading exchange rates from file currency.xml
   [junit4]   2> 1084593 INFO  (TEST-HardAutoCommitTest.testCommitWithin-seed#[B368BEFAAE5564C1]) [    ] o.a.s.s.FileExchangeRateProvider Reloading exchange rates from file currency.xml
   [junit4]   2> 1084607 INFO  (TEST-HardAutoCommitTest.testCommitWithin-seed#[B368BEFAAE5564C1]) [    ] o.a.s.s.OpenExchangeRatesOrgProvider Reloading exchange rates from open-exchange-rates.json
   [junit4]   2> 1084607 INFO  (TEST-HardAutoCommitTest.testCommitWithin-seed#[B368BEFAAE5564C1]) [    ] o.a.s.s.OpenExchangeRatesOrgProvider Reloading exchange rates from open-exchange-rates.json
   [junit4]   2> 1084609 INFO  (TEST-HardAutoCommitTest.testCommitWithin-seed#[B368BEFAAE5564C1]) [    ] o.a.s.c.ConfigSetProperties Did not find ConfigSet properties, assuming default properties: Can't find resource 'configsetprops.json' in classpath or '/x1/jenkins/jenkins-slave/workspace/Lucene-Solr-Tests-master/solr/core/src/test-files/solr/collection1'
   [junit4]   2> 1084609 INFO  (TEST-HardAutoCommitTest.testCommitWithin-seed#[B368BEFAAE5564C1]) [    ] o.a.s.c.CoreContainer Reloading SolrCore 'collection1' using configuration from instancedir /x1/jenkins/jenkins-slave/workspace/Lucene-Solr-Tests-master/solr/core/src/test-files/solr/collection1
   [junit4]   2> 1084609 INFO  (TEST-HardAutoCommitTest.testCommitWithin-seed#[B368BEFAAE5564C1]) [    x:collection1] o.a.s.c.SolrCore [[collection1] ] Opening new SolrCore at [/x1/jenkins/jenkins-slave/workspace/Lucene-Solr-Tests-master/solr/core/src/test-files/solr/collection1], dataDir=[/x1/jenkins/jenkins-slave/workspace/Lucene-Solr-Tests-master/solr/build/solr-core/test/J2/temp/solr.update.HardAutoCommitTest_B368BEFAAE5564C1-001/init-core-data-001/]
   [junit4]   2> 1084609 INFO  (TEST-HardAutoCommitTest.testCommitWithin-seed#[B368BEFAAE5564C1]) [    x:collection1] o.a.s.c.JmxMonitoredMap JMX monitoring is enabled. Adding Solr mbeans to JMX Server: com.sun.jmx.mbeanserver.JmxMBeanServer@28dd329d
   [junit4]   2> 1084614 INFO  (TEST-HardAutoCommitTest.testCommitWithin-seed#[B368BEFAAE5564C1]) [    x:collection1] o.a.s.c.SolrCore New index directory detected: old=null new=/x1/jenkins/jenkins-slave/workspace/Lucene-Solr-Tests-master/solr/build/solr-core/test/J2/temp/solr.update.HardAutoCommitTest_B368BEFAAE5564C1-001/init-core-data-001/index/
   [junit4]   2> 1084617 INFO  (TEST-HardAutoCommitTest.testCommitWithin-seed#[B368BEFAAE5564C1]) [    x:collection1] o.a.s.u.p.UpdateRequestProcessorChain creating updateRequestProcessorChain "dedupe"
   [junit4]   2> 1084617 INFO  (TEST-HardAutoCommitTest.testCommitWithin-seed#[B368BEFAAE5564C1]) [    x:collection1] o.a.s.u.p.UpdateRequestProcessorChain inserting DistributedUpdateProcessorFactory into updateRequestProcessorChain "dedupe"
   [junit4]   2> 1084617 INFO  (TEST-HardAutoCommitTest.testCommitWithin-seed#[B368BEFAAE5564C1]) [    x:collection1] o.a.s.u.p.UpdateRequestProcessorChain creating updateRequestProcessorChain "dedupe-allfields"
   [junit4]   2> 1084617 INFO  (TEST-HardAutoCommitTest.testCommitWithin-seed#[B368BEFAAE5564C1]) [    x:collection1] o.a.s.u.p.UpdateRequestProcessorChain inserting DistributedUpdateProcessorFactory into updateRequestProcessorChain "dedupe-allfields"
   [junit4]   2> 1084617 INFO  (TEST-HardAutoCommitTest.testCommitWithin-seed#[B368BEFAAE5564C1]) [    x:collection1] o.a.s.u.p.UpdateRequestProcessorChain creating updateRequestProcessorChain "stored_sig"
   [junit4]   2> 1084617 INFO  (TEST-HardAutoCommitTest.testCommitWithin-seed#[B368BEFAAE5564C1]) [    x:collection1] o.a.s.u.p.UpdateRequestProcessorChain inserting DistributedUpdateProcessorFactory into updateRequestProcessorChain "stored_sig"
   [junit4]   2> 1084617 INFO  (TEST-HardAutoCommitTest.testCommitWithin-seed#[B368BEFAAE5564C1]) [    x:collection1] o.a.s.u.p.UpdateRequestProcessorChain creating updateRequestProcessorChain "uniq-fields"
   [junit4]   2> 1084617 INFO  (TEST-HardAutoCommitTest.testCommitWithin-seed#[B368BEFAAE5564C1]) [    x:collection1] o.a.s.u.p.UpdateRequestProcessorChain inserting DistributedUpdateProcessorFactory into updateRequestProcessorChain "uniq-fields"
   [junit4]   2> 1084617 INFO  (TEST-HardAutoCommitTest.testCommitWithin-seed#[B368BEFAAE5564C1]) [    x:collection1] o.a.s.u.p.UpdateRequestProcessorChain creating updateRequestProcessorChain "distrib-dup-test-chain-explicit"
   [junit4]   2> 1084618 INFO  (TEST-HardAutoCommitTest.testCommitWithin-seed#[B368BEFAAE5564C1]) [    x:collection1] o.a.s.u.p.UpdateRequestProcessorChain creating updateRequestProcessorChain "distrib-dup-test-chain-implicit"
   [junit4]   2> 1084618 INFO  (TEST-HardAutoCommitTest.testCommitWithin-seed#[B368BEFAAE5564C1]) [    x:collection1] o.a.s.u.p.UpdateRequestProcessorChain inserting DistributedUpdateProcessorFactory into updateRequestProcessorChain "distrib-dup-test-chain-implicit"
   [junit4]   2> 1084618 INFO  (TEST-HardAutoCommitTest.testCommitWithin-seed#[B368BEFAAE5564C1]) [    x:collection1] o.a.s.c.SolrCore no updateRequestProcessorChain defined as default, creating implicit default
   [junit4]   2> 1084619 INFO  (TEST-HardAutoCommitTest.testCommitWithin-seed#[B368BEFAAE5564C1]) [    x:collection1] o.a.s.h.l.XMLLoader xsltCacheLifetimeSeconds=60
   [junit4]   2> 1084619 INFO  (TEST-HardAutoCommitTest.testCommitWithin-seed#[B368BEFAAE5564C1]) [    x:collection1] o.a.s.h.l.XMLLoader xsltCacheLifetimeSeconds=60
   [junit4]   2> 1084620 INFO  (TEST-HardAutoCommitTest.testCommitWithin-seed#[B368BEFAAE5564C1]) [    x:collection1] o.a.s.h.l.XMLLoader xsltCacheLifetimeSeconds=60
   [junit4]   2> 1084621 INFO  (TEST-HardAutoCommitTest.testCommitWithin-seed#[B368BEFAAE5564C1]) [    x:collection1] o.a.s.h.l.XMLLoader xsltCacheLifetimeSeconds=60
   [junit4]   2> 1084622 INFO  (OldIndexDirectoryCleanupThreadForCore-collection1) [    x:collection1] o.a.s.c.SolrCore Looking for old index directories to cleanup for core collection1 in /x1/jenkins/jenkins-slave/workspace/Lucene-Solr-Tests-master/solr/build/solr-core/test/J2/temp/solr.update.HardAutoCommitTest_B368BEFAAE5564C1-001/init-core-data-001/
   [junit4]   2> 1084643 INFO  (TEST-HardAutoCommitTest.testCommitWithin-seed#[B368BEFAAE5564C1]) [    x:collection1] o.a.s.c.PluginBag requestHandler : 'lazy' created with startup=lazy 
   [junit4]   2> 1084645 INFO  (TEST-HardAutoCommitTest.testCommitWithin-seed#[B368BEFAAE5564C1]) [    x:collection1] o.a.s.c.RequestHandlers Registered paths: /admin/mbeans,standard,spellCheckCompRH,lazy,/update/json/docs,/admin/luke,/export,spellCheckWithWordbreak_Direct,tvrh,/get,/admin/properties,/update/json,mltrh,/admin/threads,/search-facet-def,/update/csv,/sql,/graph,/search-facet-invariants,/admin/segments,spellCheckCompRH1,/mlt,/admin/system,/replication,dismax,defaults,/config,/stream,/schema,/admin/plugins,/admin/logging,spellCheckWithWordbreak,mock,/admin/ping,/update,/admin/file,/terms,spellCheckCompRH_Direct,/debug/dump
   [junit4]   2> 1084645 INFO  (TEST-HardAutoCommitTest.testCommitWithin-seed#[B368BEFAAE5564C1]) [    x:collection1] o.a.s.c.SolrCore Using default statsCache cache: org.apache.solr.search.stats.LocalStatsCache
   [junit4]   2> 1084658 INFO  (TEST-HardAutoCommitTest.testCommitWithin-seed#[B368BEFAAE5564C1]) [    x:collection1] o.a.s.u.CommitTracker Hard AutoCommit: disabled
   [junit4]   2> 1084658 INFO  (TEST-HardAutoCommitTest.testCommitWithin-seed#[B368BEFAAE5564C1]) [    x:collection1] o.a.s.u.CommitTracker Soft AutoCommit: disabled
   [junit4]   2> 1084658 INFO  (TEST-HardAutoCommitTest.testCommitWithin-seed#[B368BEFAAE5564C1]) [    x:collection1] o.a.s.s.SolrIndexSearcher Opening [Searcher@62013f67[collection1] main]
   [junit4]   2> 1084658 INFO  (TEST-HardAutoCommitTest.testCommitWithin-seed#[B368BEFAAE5564C1]) [    x:collection1] o.a.s.r.RestManager Initializing RestManager with initArgs: {storageIO=org.apache.solr.rest.ManagedResourceStorage$InMemoryStorageIO}
   [junit4]   2> 1084658 INFO  (TEST-HardAutoCommitTest.testCommitWithin-seed#[B368BEFAAE5564C1]) [    x:collection1] o.a.s.r.ManagedResourceStorage Reading _rest_managed.json using InMemoryStorage
   [junit4]   2> 1084659 INFO  (TEST-HardAutoCommitTest.testCommitWithin-seed#[B368BEFAAE5564C1]) [    x:collection1] o.a.s.r.RestManager Initializing 0 registered ManagedResources
   [junit4]   2> 1084659 INFO  (TEST-HardAutoCommitTest.testCommitWithin-seed#[B368BEFAAE5564C1]) [    x:collection1] o.a.s.h.c.SpellCheckComponent Initializing spell checkers
   [junit4]   2> 1084659 INFO  (TEST-HardAutoCommitTest.testCommitWithin-seed#[B368BEFAAE5564C1]) [    x:collection1] o.a.s.s.DirectSolrSpellChecker init: {name=direct,classname=DirectSolrSpellChecker,field=lowerfilt,minQueryLength=3}
   [junit4]   2> 1084661 INFO  (TEST-HardAutoCommitTest.testCommitWithin-seed#[B368BEFAAE5564C1]) [    x:collection1] o.a.s.h.ReplicationHandler Commits will be reserved for  10000
   [junit4]   2> 1084662 INFO  (TEST-HardAutoCommitTest.testCommitWithin-seed#[B368BEFAAE5564C1]) [    x:collection1] o.a.s.u.UpdateLog Looking up max value of version field to seed version buckets
   [junit4]   2> 1084662 INFO  (TEST-HardAutoCommitTest.testCommitWithin-seed#[B368BEFAAE5564C1]) [    x:collection1] o.a.s.u.VersionInfo Refreshing highest value of _version_ for 65536 version buckets from index
   [junit4]   2> 1084663 INFO  (TEST-HardAutoCommitTest.testCommitWithin-seed#[B368BEFAAE5564C1]) [    x:collection1] o.a.s.u.VersionInfo No terms found for _version_, cannot seed version bucket highest value from index
   [junit4]   2> 1084664 INFO  (TEST-HardAutoCommitTest.testCommitWithin-seed#[B368BEFAAE5564C1]) [    x:collection1] o.a.s.u.UpdateLog Took 1.0ms to seed version buckets with highest version 1538772760923209728
   [junit4]   2> 1084664 INFO  (TEST-HardAutoCommitTest.testCommitWithin-seed#[B368BEFAAE5564C1]) [    x:collection1] o.a.s.u.DefaultSolrCoreState Closing old IndexWriter... core=collection1
   [junit4]   2> 1084665 INFO  (TEST-HardAutoCommitTest.testCommitWithin-seed#[B368BEFAAE5564C1]) [    x:collection1] o.a.s.u.RandomMergePolicy RandomMergePolicy wrapping class org.apache.lucene.index.TieredMergePolicy: [TieredMergePolicy: maxMergeAtOnce=12, maxMergeAtOnceExplicit=11, maxMergedSegmentMB=45.70703125, floorSegmentMB=1.9541015625, forceMergeDeletesPctAllowed=14.887233284055908, segmentsPerTier=17.0, maxCFSSegmentSizeMB=8.796093022207999E12, noCFSRatio=0.6094237442572987
   [junit4]   2> 1084669 INFO  (searcherExecutor-6662-thread-1-processing-x:collection1) [    x:collection1] o.a.s.h.c.SpellCheckComponent Loading spell index for spellchecker: default
   [junit4]   2> 1084670 INFO  (searcherExecutor-6662-thread-1-processing-x:collection1) [    x:collection1] o.a.s.h.c.SpellCheckComponent Loading spell index for spellchecker: direct
   [junit4]   2> 1084670 INFO  (searcherExecutor-6662-thread-1-processing-x:collection1) [    x:collection1] o.a.s.h.c.SpellCheckComponent Loading spell index for spellchecker: wordbreak
   [junit4]   2> 1084670 INFO  (searcherExecutor-6662-thread-1-processing-x:collection1) [    x:collection1] o.a.s.h.c.SpellCheckComponent Loading spell index for spellchecker: multipleFields
   [junit4]   2> 1084670 INFO  (searcherExecutor-6662-thread-1-processing-x:collection1) [    x:collection1] o.a.s.h.c.SpellCheckComponent Loading spell index for spellchecker: jarowinkler
   [junit4]   2> 1084670 INFO  (searcherExecutor-6662-thread-1-processing-x:collection1) [    x:collection1] o.a.s.h.c.SpellCheckComponent Loading spell index for spellchecker: external
   [junit4]   2> 1084670 INFO  (searcherExecutor-6662-thread-1-processing-x:collection1) [    x:collection1] o.a.s.h.c.SpellCheckComponent Loading spell index for spellchecker: freq
   [junit4]   2> 1084670 INFO  (searcherExecutor-6662-thread-1-processing-x:collection1) [    x:collection1] o.a.s.h.c.SpellCheckComponent Loading spell index for spellchecker: fqcn
   [junit4]   2> 1084670 INFO  (searcherExecutor-6662-thread-1-processing-x:collection1) [    x:collection1] o.a.s.h.c.SpellCheckComponent Loading spell index for spellchecker: perDict
   [junit4]   2> 1084671 INFO  (TEST-HardAutoCommitTest.testCommitWithin-seed#[B368BEFAAE5564C1]) [    x:collection1] o.a.s.c.SolrDeletionPolicy SolrDeletionPolicy.onInit: commits: num=1
   [junit4]   2> 	commit{dir=MockDirectoryWrapper(RAMDirectory@5808febc lockFactory=org.apache.lucene.store.SingleInstanceLockFactory@eaad4fc),segFN=segments_1,generation=1}
   [junit4]   2> 1084672 INFO  (TEST-HardAutoCommitTest.testCommitWithin-seed#[B368BEFAAE5564C1]) [    x:collection1] o.a.s.c.SolrDeletionPolicy newest commit generation = 1
   [junit4]   2> 1084672 INFO  (TEST-HardAutoCommitTest.testCommitWithin-seed#[B368BEFAAE5564C1]) [    x:collection1] o.a.s.u.DefaultSolrCoreState New IndexWriter is ready to be used.
   [junit4]   2> 1084673 INFO  (searcherExecutor-6662-thread-1-processing-x:collection1) [    x:collection1] o.a.s.c.SolrCore [collection1] Registered new searcher Searcher@62013f67[collection1] main{ExitableDirectoryReader(UninvertingDirectoryReader())}
   [junit4]   2> 1084673 INFO  (TEST-HardAutoCommitTest.testCommitWithin-seed#[B368BEFAAE5564C1]) [    x:collection1] o.a.s.s.SolrIndexSearcher Opening [Searcher@e633b23[collection1] main]
   [junit4]   2> 1084673 INFO  (TEST-HardAutoCommitTest.testCommitWithin-seed#[B368BEFAAE5564C1]) [    x:collection1] o.a.s.c.CoreContainer replacing core: collection1
   [junit4]   2> 1084673 INFO  (TEST-HardAutoCommitTest.testCommitWithin-seed#[B368BEFAAE5564C1]) [    x:collection1] o.a.s.c.SolrCore [collection1]  CLOSING SolrCore org.apache.solr.core.SolrCore@e21e2a2
   [junit4]   2> 1084673 INFO  (TEST-HardAutoCommitTest.testCommitWithin-seed#[B368BEFAAE5564C1]) [    x:collection1] o.a.s.u.DirectUpdateHandler2 closing DirectUpdateHandler2{commits=0,autocommits=0,soft autocommits=0,optimizes=0,rollbacks=0,expungeDeletes=0,docsPending=0,adds=0,deletesById=0,deletesByQuery=1,errors=0,cumulative_adds=0,cumulative_deletesById=0,cumulative_deletesByQuery=1,cumulative_errors=0,transaction_logs_total_size=0,transaction_logs_total_number=0}
   [junit4]   2> 1084673 INFO  (TEST-HardAutoCommitTest.testCommitWithin-seed#[B368BEFAAE5564C1]) [    x:collection1] o.a.s.c.SolrCore [collection1] Closing main searcher on request.
   [junit4]   2> 1084682 INFO  (searcherExecutor-6662-thread-1-processing-x:collection1) [    x:collection1] o.a.s.c.SolrCore [collection1] Registered new searcher Searcher@e633b23[collection1] main{ExitableDirectoryReader(UninvertingDirectoryReader())}
   [junit4]   2> 1084696 INFO  (TEST-HardAutoCommitTest.testCommitWithin-seed#[B368BEFAAE5564C1]) [    x:collection1] o.a.s.u.p.LogUpdateProcessorFactory [collection1] {add=[529 (1538772761382486016)]} 0 16
   [junit4]   2> 1084696 INFO  (TEST-HardAutoCommitTest.testCommitWithin-seed#[B368BEFAAE5564C1]) [    x:collection1] o.a.s.c.S.Request [collection1]  webapp=null path=null params={q=id:529&qt=standard&start=0&rows=20&version=2.2} hits=0 status=0 QTime=0
   [junit4]   2> 1084697 INFO  (TEST-HardAutoCommitTest.testCommitWithin-seed#[B368BEFAAE5564C1]) [    x:collection1] o.a.s.u.p.LogUpdateProcessorFactory [collection1] {add=[530 (1538772761390874624)]} 0 18
   [junit4]   2> 1084698 INFO  (TEST-HardAutoCommitTest.testCommitWithin-seed#[B368BEFAAE5564C1]) [    x:collection1] o.a.s.c.S.Request [collection1]  webapp=null path=null params={q=id:530&qt=standard&start=0&rows=20&version=2.2} hits=0 status=0 QTime=0
   [junit4]   2> 1084698 INFO  (TEST-HardAutoCommitTest.testCommitWithin-seed#[B368BEFAAE5564C1]) [    x:collection1] o.a.s.u.p.LogUpdateProcessorFactory [collection1] {delete=[529 (-1538772761391923200)]} 0 18
   [junit4]   2> 1084698 INFO  (TEST-HardAutoCommitTest.testCommitWithin-seed#[B368BEFAAE5564C1]) [    x:collection1] o.a.s.c.S.Request [collection1]  webapp=null path=null params={q=id:529&qt=standard&start=0&rows=20&version=2.2} hits=0 status=0 QTime=0
   [junit4]   2> 1084698 ERROR (TEST-HardAutoCommitTest.testCommitWithin-seed#[B368BEFAAE5564C1]) [    x:collection1] o.a.s.SolrTestCaseJ4 REQUEST FAILED: xpath=//result[@numFound=1]
   [junit4]   2> 	xml response was: <?xml version="1.0" encoding="UTF-8"?>
   [junit4]   2> <response>
   [junit4]   2> <lst name="responseHeader"><int name="status">0</int><int name="QTime">0</int></lst><result name="response" numFound="0" start="0"></result>
   [junit4]   2> </response>
   [junit4]   2> 
   [junit4]   2> 	request was:q=id:529&qt=standard&start=0&rows=20&version=2.2
   [junit4]   2> 1084699 ERROR (TEST-HardAutoCommitTest.testCommitWithin-seed#[B368BEFAAE5564C1]) [    x:collection1] o.a.s.SolrTestCaseJ4 REQUEST FAILED: q=id:529&qt=standard&start=0&rows=20&version=2.2:java.lang.RuntimeException: REQUEST FAILED: xpath=//result[@numFound=1]
   [junit4]   2> 	xml response was: <?xml version="1.0" encoding="UTF-8"?>
   [junit4]   2> <response>
   [junit4]   2> <lst name="responseHeader"><int name="status">0</int><int name="QTime">0</int></lst><result name="response" numFound="0" start="0"></result>
   [junit4]   2> </response>
   [junit4]   2> 
   [junit4]   2> 	request was:q=id:529&qt=standard&start=0&rows=20&version=2.2
   [junit4]   2> 	at org.apache.solr.SolrTestCaseJ4.assertQ(SolrTestCaseJ4.java:773)
   [junit4]   2> 	at org.apache.solr.update.HardAutoCommitTest.testCommitWithin(HardAutoCommitTest.java:99)
   [junit4]   2> 	at sun.reflect.NativeMethodAccessorImpl.invoke0(Native Method)
   [junit4]   2> 	at sun.reflect.NativeMethodAccessorImpl.invoke(NativeMethodAccessorImpl.java:62)
   [junit4]   2> 	at sun.reflect.DelegatingMethodAccessorImpl.invoke(DelegatingMethodAccessorImpl.java:43)
   [junit4]   2> 	at java.lang.reflect.Method.invoke(Method.java:498)
   [junit4]   2> 	at com.carrotsearch.randomizedtesting.RandomizedRunner.invoke(RandomizedRunner.java:1764)
   [junit4]   2> 	at com.carrotsearch.randomizedtesting.RandomizedRunner$8.evaluate(RandomizedRunner.java:871)
   [junit4]   2> 	at com.carrotsearch.randomizedtesting.RandomizedRunner$9.evaluate(RandomizedRunner.java:907)
   [junit4]   2> 	at com.carrotsearch.randomizedtesting.RandomizedRunner$10.evaluate(RandomizedRunner.java:921)
   [junit4]   2> 	at com.carrotsearch.randomizedtesting.rules.SystemPropertiesRestoreRule$1.evaluate(SystemPropertiesRestoreRule.java:57)
   [junit4]   2> 	at org.apache.lucene.util.TestRuleSetupTeardownChained$1.evaluate(TestRuleSetupTeardownChained.java:49)
   [junit4]   2> 	at org.apache.lucene.util.AbstractBeforeAfterRule$1.evaluate(AbstractBeforeAfterRule.java:45)
   [junit4]   2> 	at org.apache.lucene.util.TestRuleThreadAndTestName$1.evaluate(TestRuleThreadAndTestName.java:48)
   [junit4]   2> 	at org.apache.lucene.util.TestRuleIgnoreAfterMaxFailures$1.evaluate(TestRuleIgnoreAfterMaxFailures.java:64)
   [junit4]   2> 	at org.apache.lucene.util.TestRuleMarkFailure$1.evaluate(TestRuleMarkFailure.java:47)
   [junit4]   2> 	at com.carrotsearch.randomizedtesting.rules.StatementAdapter.evaluate(StatementAdapter.java:36)
   [junit4]   2> 	at com.carrotsearch.randomizedtesting.ThreadLeakControl$StatementRunner.run(ThreadLeakControl.java:367)
   [junit4]   2> 	at com.carrotsearch.randomizedtesting.ThreadLeakControl.forkTimeoutingTask(ThreadLeakControl.java:809)
   [junit4]   2> 	at com.carrotsearch.randomizedtesting.ThreadLeakControl$3.evaluate(ThreadLeakControl.java:460)
   [junit4]   2> 	at com.carrotsearch.randomizedtesting.RandomizedRunner.runSingleTest(RandomizedRunner.java:880)
   [junit4]   2> 	at com.carrotsearch.randomizedtesting.RandomizedRunner$5.evaluate(RandomizedRunner.java:781)
   [junit4]   2> 	at com.carrotsearch.randomizedtesting.RandomizedRunner$6.evaluate(RandomizedRunner.java:816)
   [junit4]   2> 	at com.carrotsearch.randomizedtesting.RandomizedRunner$7.evaluate(RandomizedRunner.java:827)
   [junit4]   2> 	at com.carrotsearch.randomizedtesting.rules.StatementAdapter.evaluate(StatementAdapter.java:36)
   [junit4]   2> 	at com.carrotsearch.randomizedtesting.rules.SystemPropertiesRestoreRule$1.evaluate(SystemPropertiesRestoreRule.java:57)
   [junit4]   2> 	at org.apache.lucene.util.AbstractBeforeAfterRule$1.evaluate(AbstractBeforeAfterRule.java:45)
   [junit4]   2> 	at com.carrotsearch.randomizedtesting.rules.StatementAdapter.evaluate(StatementAdapter.java:36)
   [junit4]   2> 	at org.apache.lucene.util.TestRuleStoreClassName$1.evaluate(TestRuleStoreClassName.java:41)
   [junit4]   2> 	at com.carrotsearch.randomizedtesting.rules.NoShadowingOrOverridesOnMethodsRule$1.evaluate(NoShadowingOrOverridesOnMethodsRule.java:40)
   [junit4]   2> 	at com.carrotsearch.randomizedtesting.rules.NoShadowingOrOverridesOnMethodsRule$1.evaluate(NoShadowingOrOverridesOnMethodsRule.java:40)
   [junit4]   2> 	at com.carrotsearch.randomizedtesting.rules.StatementAdapter.evaluate(StatementAdapter.java:36)
   [junit4]   2> 	at com.carrotsearch.randomizedtesting.rules.StatementAdapter.evaluate(StatementAdapter.java:36)
   [junit4]   2> 	at com.carrotsearch.randomizedtesting.rules.StatementAdapter.evaluate(StatementAdapter.java:36)
   [junit4]   2> 	at org.apache.lucene.util.TestRuleAssertionsRequired$1.evaluate(TestRuleAssertionsRequired.java:53)
   [junit4]   2> 	at org.apache.lucene.util.TestRuleMarkFailure$1.evaluate(TestRuleMarkFailure.java:47)
   [junit4]   2> 	at org.apache.lucene.util.TestRuleIgnoreAfterMaxFailures$1.evaluate(TestRuleIgnoreAfterMaxFailures.java:64)
   [junit4]   2> 	at org.apache.lucene.util.TestRuleIgnoreTestSuites$1.evaluate(TestRuleIgnoreTestSuites.java:54)
   [junit4]   2> 	at com.carrotsearch.randomizedtesting.rules.StatementAdapter.evaluate(StatementAdapter.java:36)
   [junit4]   2> 	at com.carrotsearch.randomizedtesting.ThreadLeakControl$StatementRunner.run(ThreadLeakControl.java:367)
   [junit4]   2> 	at java.lang.Thread.run(Thread.java:745)
   [junit4]   2> 
   [junit4]   2> 1084699 INFO  (TEST-HardAutoCommitTest.testCommitWithin-seed#[B368BEFAAE5564C1]) [    x:collection1] o.a.s.SolrTestCaseJ4 ###Ending testCommitWithin
   [junit4]   2> NOTE: reproduce with: ant test  -Dtestcase=HardAutoCommitTest -Dtests.method=testCommitWithin -Dtests.seed=B368BEFAAE5564C1 -Dtests.multiplier=2 -Dtests.slow=true -Dtests.locale=el-GR -Dtests.timezone=America/Creston -Dtests.asserts=true -Dtests.file.encoding=ISO-8859-1
   [junit4] ERROR   0.46s J2 | HardAutoCommitTest.testCommitWithin <<<
   [junit4]    > Throwable #1: java.lang.RuntimeException: Exception during query
   [junit4]    > 	at __randomizedtesting.SeedInfo.seed([B368BEFAAE5564C1:9BAD1822D7B8AD4]:0)
   [junit4]    > 	at org.apache.solr.SolrTestCaseJ4.assertQ(SolrTestCaseJ4.java:780)
   [junit4]    > 	at org.apache.solr.update.HardAutoCommitTest.testCommitWithin(HardAutoCommitTest.java:99)
   [junit4]    > 	at java.lang.Thread.run(Thread.java:745)
   [junit4]    > Caused by: java.lang.RuntimeException: REQUEST FAILED: xpath=//result[@numFound=1]
   [junit4]    > 	xml response was: <?xml version="1.0" encoding="UTF-8"?>
   [junit4]    > <response>
   [junit4]    > <lst name="responseHeader"><int name="status">0</int><int name="QTime">0</int></lst><result name="response" numFound="0" start="0"></result>
   [junit4]    > </response>
   [junit4]    > 	request was:q=id:529&qt=standard&start=0&rows=20&version=2.2
   [junit4]    > 	at org.apache.solr.SolrTestCaseJ4.assertQ(SolrTestCaseJ4.java:773)
   [junit4]    > 	... 40 more
   [junit4]   2> 1084707 INFO  (SUITE-HardAutoCommitTest-seed#[B368BEFAAE5564C1]-worker) [    x:collection1] o.a.s.SolrTestCaseJ4 ###deleteCore
   [junit4]   2> 1084707 INFO  (SUITE-HardAutoCommitTest-seed#[B368BEFAAE5564C1]-worker) [    x:collection1] o.a.s.c.CoreContainer Shutting down CoreContainer instance=1523862192
   [junit4]   2> 1084718 INFO  (coreCloseExecutor-6666-thread-1-processing-x:collection1) [    x:collection1] o.a.s.c.SolrCore [collection1]  CLOSING SolrCore org.apache.solr.core.SolrCore@2255f3ee
   [junit4]   2> 1084718 INFO  (coreCloseExecutor-6666-thread-1-processing-x:collection1) [    x:collection1] o.a.s.u.DirectUpdateHandler2 closing DirectUpdateHandler2{commits=0,autocommits=0,soft autocommits=0,optimizes=0,rollbacks=0,expungeDeletes=0,docsPending=2,adds=2,deletesById=1,deletesByQuery=0,errors=0,cumulative_adds=2,cumulative_deletesById=1,cumulative_deletesByQuery=0,cumulative_errors=0,transaction_logs_total_size=0,transaction_logs_total_number=0}
   [junit4]   2> 1084718 INFO  (coreCloseExecutor-6666-thread-1-processing-x:collection1) [    x:collection1] o.a.s.u.SolrCoreState Closing SolrCoreState
   [junit4]   2> 1084718 INFO  (coreCloseExecutor-6666-thread-1-processing-x:collection1) [    x:collection1] o.a.s.u.DefaultSolrCoreState SolrCoreState ref count has reached 0 - closing IndexWriter
   [junit4]   2> 1084718 INFO  (coreCloseExecutor-6666-thread-1-processing-x:collection1) [    x:collection1] o.a.s.u.DefaultSolrCoreState closing IndexWriter with IndexWriterCloser
   [junit4]   2> 1084718 INFO  (coreCloseExecutor-6666-thread-1-processing-x:collection1) [    x:collection1] o.a.s.u.DirectUpdateHandler2 Committing on IndexWriter close.
   [junit4]   2> 1084728 INFO  (coreCloseExecutor-6666-thread-1-processing-x:collection1) [    x:collection1] o.a.s.c.SolrDeletionPolicy SolrDeletionPolicy.onCommit: commits: num=2
   [junit4]   2> 	commit{dir=MockDirectoryWrapper(RAMDirectory@5808febc lockFactory=org.apache.lucene.store.SingleInstanceLockFactory@eaad4fc),segFN=segments_1,generation=1}
   [junit4]   2> 	commit{dir=MockDirectoryWrapper(RAMDirectory@5808febc lockFactory=org.apache.lucene.store.SingleInstanceLockFactory@eaad4fc),segFN=segments_2,generation=2}
   [junit4]   2> 1084728 INFO  (coreCloseExecutor-6666-thread-1-processing-x:collection1) [    x:collection1] o.a.s.c.SolrDeletionPolicy newest commit generation = 2
   [junit4]   2> 1084729 INFO  (coreCloseExecutor-6666-thread-1-processing-x:collection1) [    x:collection1] o.a.s.c.SolrCore [collection1] Closing main searcher on request.
   [junit4]   2> 1084738 INFO  (coreCloseExecutor-6666-thread-1-processing-x:collection1) [    x:collection1] o.a.s.c.CachingDirectoryFactory Closing MockDirectoryFactory - 2 directories currently being tracked
   [junit4]   2> 1084738 INFO  (coreCloseExecutor-6666-thread-1-processing-x:collection1) [    x:collection1] o.a.s.c.CachingDirectoryFactory looking to close /x1/jenkins/jenkins-slave/workspace/Lucene-Solr-Tests-master/solr/build/solr-core/test/J2/temp/solr.update.HardAutoCommitTest_B368BEFAAE5564C1-001/init-core-data-001 [CachedDir<<refCount=0;path=/x1/jenkins/jenkins-slave/workspace/Lucene-Solr-Tests-master/solr/build/solr-core/test/J2/temp/solr.update.HardAutoCommitTest_B368BEFAAE5564C1-001/init-core-data-001;done=false>>]
   [junit4]   2> 1084738 INFO  (coreCloseExecutor-6666-thread-1-processing-x:collection1) [    x:collection1] o.a.s.c.CachingDirectoryFactory Closing directory, CoreContainer#isShutdown=true
   [junit4]   2> 1084738 INFO  (coreCloseExecutor-6666-thread-1-processing-x:collection1) [    x:collection1] o.a.s.c.CachingDirectoryFactory Closing directory: /x1/jenkins/jenkins-slave/workspace/Lucene-Solr-Tests-master/solr/build/solr-core/test/J2/temp/solr.update.HardAutoCommitTest_B368BEFAAE5564C1-001/init-core-data-001
   [junit4]   2> 1084739 INFO  (coreCloseExecutor-6666-thread-1-processing-x:collection1) [    x:collection1] o.a.s.c.CachingDirectoryFactory looking to close /x1/jenkins/jenkins-slave/workspace/Lucene-Solr-Tests-master/solr/build/solr-core/test/J2/temp/solr.update.HardAutoCommitTest_B368BEFAAE5564C1-001/init-core-data-001/index [CachedDir<<refCount=0;path=/x1/jenkins/jenkins-slave/workspace/Lucene-Solr-Tests-master/solr/build/solr-core/test/J2/temp/solr.update.HardAutoCommitTest_B368BEFAAE5564C1-001/init-core-data-001/index;done=false>>]
   [junit4]   2> 1084739 INFO  (coreCloseExecutor-6666-thread-1-processing-x:collection1) [    x:collection1] o.a.s.c.CachingDirectoryFactory Closing directory, CoreContainer#isShutdown=true
   [junit4]   2> 1084739 INFO  (coreCloseExecutor-6666-thread-1-processing-x:collection1) [    x:collection1] o.a.s.c.CachingDirectoryFactory Closing directory: /x1/jenkins/jenkins-slave/workspace/Lucene-Solr-Tests-master/solr/build/solr-core/test/J2/temp/solr.update.HardAutoCommitTest_B368BEFAAE5564C1-001/init-core-data-001/index
   [junit4]   2> NOTE: leaving temporary files on disk at: /x1/jenkins/jenkins-slave/workspace/Lucene-Solr-Tests-master/solr/build/solr-core/test/J2/temp/solr.update.HardAutoCommitTest_B368BEFAAE5564C1-001
   [junit4]   2> NOTE: test params are: codec=Asserting(Lucene62): {range_facet_l_dv=BlockTreeOrds(blocksize=128), _version_=PostingsFormat(name=Direct), field_t=PostingsFormat(name=Asserting), multiDefault=Lucene50(blocksize=128), subject=Lucene50(blocksize=128), intDefault=PostingsFormat(name=Direct), id=BlockTreeOrds(blocksize=128), range_facet_i_dv=PostingsFormat(name=Direct), text=PostingsFormat(name=Asserting), range_facet_l=PostingsFormat(name=Direct), timestamp=PostingsFormat(name=Direct)}, docValues:{range_facet_l_dv=DocValuesFormat(name=Lucene54), range_facet_i_dv=DocValuesFormat(name=Asserting), timestamp=DocValuesFormat(name=Asserting)}, maxPointsInLeafNode=835, maxMBSortInHeap=7.869742328137542, sim=ClassicSimilarity, locale=el-GR, timezone=America/Creston
   [junit4]   2> NOTE: Linux 3.13.0-85-generic amd64/Oracle Corporation 1.8.0_74 (64-bit)/cpus=4,threads=1,free=208429672,total=534249472
   [junit4]   2> NOTE: All tests run in this JVM: [ClusterStateTest, DirectSolrConnectionTest, TestNoOpRegenerator, TestSolrCLIRunExample, HdfsUnloadDistributedZkTest, ShowFileRequestHandlerTest, TestShardHandlerFactory, BlockJoinFacetSimpleTest, EnumFieldTest, TestFieldCacheSort, TestPivotHelperCode, TestTolerantSearch, TestConfigSetImmutable, TestRandomCollapseQParserPlugin, TestNonDefinedSimilarityFactory, ConjunctionSolrSpellCheckerTest, TestStressReorder, SharedFSAutoReplicaFailoverUtilsTest, TestCollationFieldDocValues, QueryResultKeyTest, SuggesterTest, ScriptEngineTest, TestSolrFieldCacheMBean, TestDistribDocBasedVersion, TestMiniSolrCloudCluster, SparseHLLTest, TestReload, TestSchemaVersionResource, MigrateRouteKeyTest, TestRecovery, HighlighterConfigTest, TestIndexingPerformance, TestInitParams, TestStressLiveNodes, AnalysisErrorHandlingTest, TestFuzzyAnalyzedSuggestions, CircularListTest, TestExactStatsCache, TestMinMaxOnMultiValuedField, TestRecoveryHdfs, CdcrRequestHandlerTest, TestScoreJoinQPScore, FullSolrCloudDistribCmdsTest, SimpleFacetsTest, BadIndexSchemaTest, TestWriterPerf, TestJmxIntegration, HdfsChaosMonkeySafeLeaderTest, HighlighterMaxOffsetTest, TestDistributedMissingSort, LeaderFailoverAfterPartitionTest, TestRebalanceLeaders, VersionInfoTest, TestUtils, DeleteInactiveReplicaTest, TestSearchPerf, DistributedVersionInfoTest, BigEndianAscendingWordSerializerTest, RegexBoostProcessorTest, TestTrieFacet, QueryParsingTest, SliceStateTest, TestNumericTerms64, TestRequestStatusCollectionAPI, CollectionStateFormat2Test, HdfsSyncSliceTest, BlockCacheTest, TestFieldCacheWithThreads, PrimitiveFieldTypeTest, IgnoreCommitOptimizeUpdateProcessorFactoryTest, CollectionsAPISolrJTest, TestCSVResponseWriter, RestartWhileUpdatingTest, TestComplexPhraseQParserPlugin, TestSweetSpotSimilarityFactory, LukeRequestHandlerTest, SuggesterWFSTTest, TestClusterStateMutator, TestDefaultStatsCache, BadComponentTest, ConnectionManagerTest, LeaderElectionTest, TestReversedWildcardFilterFactory, TestSchemaManager, DistribDocExpirationUpdateProcessorTest, TestSolrDeletionPolicy1, TestConfigReload, TestCloudManagedSchema, BaseCdcrDistributedZkTest, TestFastWriter, TestFilteredDocIdSet, TestCollationField, PKIAuthenticationIntegrationTest, TestSolrJ, TestExtendedDismaxParser, TestSubQueryTransformerCrossCore, ClassificationUpdateProcessorFactoryTest, TestSort, SampleTest, TestXIncludeConfig, TestIndexSearcher, LeaderElectionIntegrationTest, RecoveryZkTest, TestHashPartitioner, TestRealTimeGet, HardAutoCommitTest]
   [junit4] Completed [306/618 (1!)] on J2 in 1.16s, 1 test, 1 error <<< FAILURES!

[...truncated 594 lines...]
   [junit4] Suite: org.apache.solr.cloud.overseer.ZkStateReaderTest
   [junit4]   2> Creating dataDir: /x1/jenkins/jenkins-slave/workspace/Lucene-Solr-Tests-master/solr/build/solr-core/test/J2/temp/solr.cloud.overseer.ZkStateReaderTest_B368BEFAAE5564C1-001/init-core-data-001
   [junit4]   2> 1665549 INFO  (SUITE-ZkStateReaderTest-seed#[B368BEFAAE5564C1]-worker) [    ] o.a.s.SolrTestCaseJ4 Randomized ssl (false) and clientAuth (false) via: @org.apache.solr.util.RandomizeSSL(reason=, ssl=NaN, value=NaN, clientAuth=NaN)
   [junit4]   2> 1665551 INFO  (TEST-ZkStateReaderTest.testStateFormatUpdateWithTimeDelayLazy-seed#[B368BEFAAE5564C1]) [    ] o.a.s.SolrTestCaseJ4 ###Starting testStateFormatUpdateWithTimeDelayLazy
   [junit4]   2> 1665551 INFO  (TEST-ZkStateReaderTest.testStateFormatUpdateWithTimeDelayLazy-seed#[B368BEFAAE5564C1]) [    ] o.a.s.c.ZkTestServer STARTING ZK TEST SERVER
   [junit4]   2> 1665551 INFO  (Thread-6775) [    ] o.a.s.c.ZkTestServer client port:0.0.0.0/0.0.0.0:0
   [junit4]   2> 1665551 INFO  (Thread-6775) [    ] o.a.s.c.ZkTestServer Starting server
   [junit4]   2> 1665651 INFO  (TEST-ZkStateReaderTest.testStateFormatUpdateWithTimeDelayLazy-seed#[B368BEFAAE5564C1]) [    ] o.a.s.c.ZkTestServer start zk server on port:48924
   [junit4]   2> 1665651 INFO  (TEST-ZkStateReaderTest.testStateFormatUpdateWithTimeDelayLazy-seed#[B368BEFAAE5564C1]) [    ] o.a.s.c.c.SolrZkClient Using default ZkCredentialsProvider
   [junit4]   2> 1665652 INFO  (TEST-ZkStateReaderTest.testStateFormatUpdateWithTimeDelayLazy-seed#[B368BEFAAE5564C1]) [    ] o.a.s.c.c.ConnectionManager Waiting for client to connect to ZooKeeper
   [junit4]   2> 1665654 INFO  (zkCallback-18300-thread-1) [    ] o.a.s.c.c.ConnectionManager Watcher org.apache.solr.common.cloud.ConnectionManager@1470d6f6 name:ZooKeeperConnection Watcher:127.0.0.1:48924 got event WatchedEvent state:SyncConnected type:None path:null path:null type:None
   [junit4]   2> 1665654 INFO  (TEST-ZkStateReaderTest.testStateFormatUpdateWithTimeDelayLazy-seed#[B368BEFAAE5564C1]) [    ] o.a.s.c.c.ConnectionManager Client is connected to ZooKeeper
   [junit4]   2> 1665655 INFO  (TEST-ZkStateReaderTest.testStateFormatUpdateWithTimeDelayLazy-seed#[B368BEFAAE5564C1]) [    ] o.a.s.c.c.SolrZkClient Using default ZkACLProvider
   [junit4]   2> 1665656 INFO  (TEST-ZkStateReaderTest.testStateFormatUpdateWithTimeDelayLazy-seed#[B368BEFAAE5564C1]) [    ] o.a.s.c.c.SolrZkClient Using default ZkCredentialsProvider
   [junit4]   2> 1665656 INFO  (TEST-ZkStateReaderTest.testStateFormatUpdateWithTimeDelayLazy-seed#[B368BEFAAE5564C1]) [    ] o.a.s.c.c.ConnectionManager Waiting for client to connect to ZooKeeper
   [junit4]   2> 1665657 INFO  (zkCallback-18301-thread-1) [    ] o.a.s.c.c.ConnectionManager Watcher org.apache.solr.common.cloud.ConnectionManager@2c384b1a name:ZooKeeperConnection Watcher:127.0.0.1:48924 got event WatchedEvent state:SyncConnected type:None path:null path:null type:None
   [junit4]   2> 1665657 INFO  (TEST-ZkStateReaderTest.testStateFormatUpdateWithTimeDelayLazy-seed#[B368BEFAAE5564C1]) [    ] o.a.s.c.c.ConnectionManager Client is connected to ZooKeeper
   [junit4]   2> 1665657 INFO  (TEST-ZkStateReaderTest.testStateFormatUpdateWithTimeDelayLazy-seed#[B368BEFAAE5564C1]) [    ] o.a.s.c.c.SolrZkClient Using default ZkACLProvider
   [junit4]   2> 1665658 INFO  (TEST-ZkStateReaderTest.testStateFormatUpdateWithTimeDelayLazy-seed#[B368BEFAAE5564C1]) [    ] o.a.s.c.c.SolrZkClient makePath: /solr
   [junit4]   2> 1665663 INFO  (TEST-ZkStateReaderTest.testStateFormatUpdateWithTimeDelayLazy-seed#[B368BEFAAE5564C1]) [    ] o.a.s.c.c.SolrZkClient Using default ZkCredentialsProvider
   [junit4]   2> 1665663 INFO  (TEST-ZkStateReaderTest.testStateFormatUpdateWithTimeDelayLazy-seed#[B368BEFAAE5564C1]) [    ] o.a.s.c.c.ConnectionManager Waiting for client to connect to ZooKeeper
   [junit4]   2> 1665664 INFO  (zkCallback-18302-thread-1) [    ] o.a.s.c.c.ConnectionManager Watcher org.apache.solr.common.cloud.ConnectionManager@1f98a756 name:ZooKeeperConnection Watcher:127.0.0.1:48924/solr got event WatchedEvent state:SyncConnected type:None path:null path:null type:None
   [junit4]   2> 1665664 INFO  (TEST-ZkStateReaderTest.testStateFormatUpdateWithTimeDelayLazy-seed#[B368BEFAAE5564C1]) [    ] o.a.s.c.c.ConnectionManager Client is connected to ZooKeeper
   [junit4]   2> 1665664 INFO  (TEST-ZkStateReaderTest.testStateFormatUpdateWithTimeDelayLazy-seed#[B368BEFAAE5564C1]) [    ] o.a.s.c.c.SolrZkClient Using default ZkACLProvider
   [junit4]   2> 1665664 INFO  (TEST-ZkStateReaderTest.testStateFormatUpdateWithTimeDelayLazy-seed#[B368BEFAAE5564C1]) [    ] o.a.s.c.c.SolrZkClient makePath: /live_nodes
   [junit4]   2> 1665665 INFO  (TEST-ZkStateReaderTest.testStateFormatUpdateWithTimeDelayLazy-seed#[B368BEFAAE5564C1]) [    ] o.a.s.c.c.SolrZkClient makePath: /collections
   [junit4]   2> 1665665 INFO  (TEST-ZkStateReaderTest.testStateFormatUpdateWithTimeDelayLazy-seed#[B368BEFAAE5564C1]) [    ] o.a.s.c.c.SolrZkClient makePath: /aliases.json
   [junit4]   2> 1665666 INFO  (TEST-ZkStateReaderTest.testStateFormatUpdateWithTimeDelayLazy-seed#[B368BEFAAE5564C1]) [    ] o.a.s.c.c.SolrZkClient makePath: /clusterstate.json
   [junit4]   2> 1665666 INFO  (TEST-ZkStateReaderTest.testStateFormatUpdateWithTimeDelayLazy-seed#[B368BEFAAE5564C1]) [    ] o.a.s.c.c.SolrZkClient makePath: /security.json
   [junit4]   2> 1665667 INFO  (TEST-ZkStateReaderTest.testStateFormatUpdateWithTimeDelayLazy-seed#[B368BEFAAE5564C1]) [    ] o.a.s.c.c.ZkStateReader Updating cluster state from ZooKeeper... 
   [junit4]   2> 1665667 INFO  (TEST-ZkStateReaderTest.testStateFormatUpdateWithTimeDelayLazy-seed#[B368BEFAAE5564C1]) [    ] o.a.s.c.c.ZkStateReader Loaded empty cluster properties
   [junit4]   2> 1665667 INFO  (TEST-ZkStateReaderTest.testStateFormatUpdateWithTimeDelayLazy-seed#[B368BEFAAE5564C1]) [    ] o.a.s.c.c.ZkStateReader Updated live nodes from ZooKeeper... (0) -> (0)
   [junit4]   2> 1665668 INFO  (TEST-ZkStateReaderTest.testStateFormatUpdateWithTimeDelayLazy-seed#[B368BEFAAE5564C1]) [    ] o.a.s.c.c.SolrZkClient makePath: /collections/c1
   [junit4]   2> 1665668 INFO  (zkCallback-18302-thread-1) [    ] o.a.s.c.c.ZkStateReader A collections change: [WatchedEvent state:SyncConnected type:NodeChildrenChanged path:/collections], has occurred - updating...
   [junit4]   2> 1665669 INFO  (zkCallback-18302-thread-1) [    ] o.a.s.c.c.ZkStateReader A cluster state change: [WatchedEvent state:SyncConnected type:NodeDataChanged path:/clusterstate.json], has occurred - updating... (live nodes size: [0])
   [junit4]   2> 1665670 INFO  (TEST-ZkStateReaderTest.testStateFormatUpdateWithTimeDelayLazy-seed#[B368BEFAAE5564C1]) [    ] o.a.s.c.c.ZkStateReader Deleting data for [c1]
   [junit4]   2> 1665670 INFO  (TEST-ZkStateReaderTest.testStateFormatUpdateWithTimeDelayLazy-seed#[B368BEFAAE5564C1]) [    ] o.a.s.c.o.ZkStateWriter going to create_collection /collections/c1/state.json
   [junit4]   2> 1665671 INFO  (zkCallback-18302-thread-1) [    ] o.a.s.c.c.ZkStateReader Uninteresting collection c1
   [junit4]   2> 1665671 INFO  (zkCallback-18302-thread-1) [    ] o.a.s.c.c.ZkStateReader A cluster state change: [WatchedEvent state:SyncConnected type:NodeDataChanged path:/clusterstate.json], has occurred - updating... (live nodes size: [0])
   [junit4]   2> 1665672 INFO  (TEST-ZkStateReaderTest.testStateFormatUpdateWithTimeDelayLazy-seed#[B368BEFAAE5564C1]) [    ] o.a.s.c.c.ZkStateReader Add data for [c1] ver [0]
   [junit4]   2> 1665673 INFO  (TEST-ZkStateReaderTest.testStateFormatUpdateWithTimeDelayLazy-seed#[B368BEFAAE5564C1]) [    ] o.a.s.c.ZkTestServer connecting to 127.0.0.1:48924 48924
   [junit4]   2> 1665889 INFO  (Thread-6775) [    ] o.a.s.c.ZkTestServer connecting to 127.0.0.1:48924 48924
   [junit4]   2> 1665890 INFO  (TEST-ZkStateReaderTest.testStateFormatUpdateWithTimeDelayLazy-seed#[B368BEFAAE5564C1]) [    ] o.a.s.SolrTestCaseJ4 ###Ending testStateFormatUpdateWithTimeDelayLazy
   [junit4]   2> 1665893 INFO  (TEST-ZkStateReaderTest.testWatchedCollectionCreation-seed#[B368BEFAAE5564C1]) [    ] o.a.s.SolrTestCaseJ4 ###Starting testWatchedCollectionCreation
   [junit4]   2> 1665893 INFO  (TEST-ZkStateReaderTest.testWatchedCollectionCreation-seed#[B368BEFAAE5564C1]) [    ] o.a.s.c.ZkTestServer STARTING ZK TEST SERVER
   [junit4]   2> 1665894 INFO  (Thread-6776) [    ] o.a.s.c.ZkTestServer client port:0.0.0.0/0.0.0.0:0
   [junit4]   2> 1665894 INFO  (Thread-6776) [    ] o.a.s.c.ZkTestServer Starting server
   [junit4]   2> 1665994 INFO  (TEST-ZkStateReaderTest.testWatchedCollectionCreation-seed#[B368BEFAAE5564C1]) [    ] o.a.s.c.ZkTestServer start zk server on port:41431
   [junit4]   2> 1665994 INFO  (TEST-ZkStateReaderTest.testWatchedCollectionCreation-seed#[B368BEFAAE5564C1]) [    ] o.a.s.c.c.SolrZkClient Using default ZkCredentialsProvider
   [junit4]   2> 1665994 INFO  (TEST-ZkStateReaderTest.testWatchedCollectionCreation-seed#[B368BEFAAE5564C1]) [    ] o.a.s.c.c.ConnectionManager Waiting for client to connect to ZooKeeper
   [junit4]   2> 1665996 INFO  (zkCallback-18304-thread-1) [    ] o.a.s.c.c.ConnectionManager Watcher org.apache.solr.common.cloud.ConnectionManager@440b4a45 name:ZooKeeperConnection Watcher:127.0.0.1:41431 got event WatchedEvent state:SyncConnected type:None path:null path:null type:None
   [junit4]   2> 1665996 INFO  (TEST-ZkStateReaderTest.testWatchedCollectionCreation-seed#[B368BEFAAE5564C1]) [    ] o.a.s.c.c.ConnectionManager Client is connected to ZooKeeper
   [junit4]   2> 1665996 INFO  (TEST-ZkStateReaderTest.testWatchedCollectionCreation-seed#[B368BEFAAE5564C1]) [    ] o.a.s.c.c.SolrZkClient Using default ZkACLProvider
   [junit4]   2> 1665997 INFO  (TEST-ZkStateReaderTest.testWatchedCollectionCreation-seed#[B368BEFAAE5564C1]) [    ] o.a.s.c.c.SolrZkClient Using default ZkCredentialsProvider
   [junit4]   2> 1665997 INFO  (TEST-ZkStateReaderTest.testWatchedCollectionCreation-seed#[B368BEFAAE5564C1]) [    ] o.a.s.c.c.ConnectionManager Waiting for client to connect to ZooKeeper
   [junit4]   2> 1665997 INFO  (zkCallback-18305-thread-1) [    ] o.a.s.c.c.ConnectionManager Watcher org.apache.solr.common.cloud.ConnectionManager@19e8923b name:ZooKeeperConnection Watcher:127.0.0.1:41431 got event WatchedEvent state:SyncConnected type:None path:null path:null type:None
   [junit4]   2> 1665997 INFO  (TEST-ZkStateReaderTest.testWatchedCollectionCreation-seed#[B368BEFAAE5564C1]) [    ] o.a.s.c.c.ConnectionManager Client is connected to ZooKeeper
   [junit4]   2> 1665998 INFO  (TEST-ZkStateReaderTest.testWatchedCollectionCreation-seed#[B368BEFAAE5564C1]) [    ] o.a.s.c.c.SolrZkClient Using default ZkACLProvider
   [junit4]   2> 1665998 INFO  (TEST-ZkStateReaderTest.testWatchedCollectionCreation-seed#[B368BEFAAE5564C1]) [    ] o.a.s.c.c.SolrZkClient makePath: /solr
   [junit4]   2> 1665999 INFO  (TEST-ZkStateReaderTest.testWatchedCollectionCreation-seed#[B368BEFAAE5564C1]) [    ] o.a.s.c.c.SolrZkClient Using default ZkCredentialsProvider
   [junit4]   2> 1666000 INFO  (TEST-ZkStateReaderTest.testWatchedCollectionCreation-seed#[B368BEFAAE5564C1]) [    ] o.a.s.c.c.ConnectionManager Waiting for client to connect to ZooKeeper
   [junit4]   2> 1666000 INFO  (zkCallback-18306-thread-1) [    ] o.a.s.c.c.ConnectionManager Watcher org.apache.solr.common.cloud.ConnectionManager@3e63ba9b name:ZooKeeperConnection Watcher:127.0.0.1:41431/solr got event WatchedEvent state:SyncConnected type:None path:null path:null type:None
   [junit4]   2> 1666000 INFO  (TEST-ZkStateReaderTest.testWatchedCollectionCreation-seed#[B368BEFAAE5564C1]) [    ] o.a.s.c.c.ConnectionManager Client is connected to ZooKeeper
   [junit4]   2> 1666000 INFO  (TEST-ZkStateReaderTest.testWatchedCollectionCreation-seed#[B368BEFAAE5564C1]) [    ] o.a.s.c.c.SolrZkClient Using default ZkACLProvider
   [junit4]   2> 1666001 INFO  (TEST-ZkStateReaderTest.testWatchedCollectionCreation-seed#[B368BEFAAE5564C1]) [    ] o.a.s.c.c.SolrZkClient makePath: /live_nodes
   [junit4]   2> 1666001 INFO  (TEST-ZkStateReaderTest.testWatchedCollectionCreation-seed#[B368BEFAAE5564C1]) [    ] o.a.s.c.c.SolrZkClient makePath: /collections
   [junit4]   2> 1666002 INFO  (TEST-ZkStateReaderTest.testWatchedCollectionCreation-seed#[B368BEFAAE5564C1]) [    ] o.a.s.c.c.SolrZkClient makePath: /aliases.json
   [junit4]   2> 1666002 INFO  (TEST-ZkStateReaderTest.testWatchedCollectionCreation-seed#[B368BEFAAE5564C1]) [    ] o.a.s.c.c.SolrZkClient makePath: /clusterstate.json
   [junit4]   2> 1666003 INFO  (TEST-ZkStateReaderTest.testWatchedCollectionCreation-seed#[B368BEFAAE5564C1]) [    ] o.a.s.c.c.SolrZkClient makePath: /security.json
   [junit4]   2> 1666003 INFO  (TEST-ZkStateReaderTest.testWatchedCollectionCreation-seed#[B368BEFAAE5564C1]) [    ] o.a.s.c.c.ZkStateReader Updating cluster state from ZooKeeper... 
   [junit4]   2> 1666004 INFO  (TEST-ZkStateReaderTest.testWatchedCollectionCreation-seed#[B368BEFAAE5564C1]) [    ] o.a.s.c.c.ZkStateReader Loaded empty cluster properties
   [junit4]   2> 1666004 INFO  (TEST-ZkStateReaderTest.testWatchedCollectionCreation-seed#[B368BEFAAE5564C1]) [    ] o.a.s.c.c.ZkStateReader Updated live nodes from ZooKeeper... (0) -> (0)
   [junit4]   2> 1666005 INFO  (TEST-ZkStateReaderTest.testWatchedCollectionCreation-seed#[B368BEFAAE5564C1]) [    ] o.a.s.c.c.ZkStateReader Deleting data for [c1]
   [junit4]   2> 1666005 INFO  (TEST-ZkStateReaderTest.testWatchedCollectionCreation-seed#[B368BEFAAE5564C1]) [    ] o.a.s.c.c.SolrZkClient makePath: /collections/c1
   [junit4]   2> 1666006 INFO  (zkCallback-18306-thread-1) [    ] o.a.s.c.c.ZkStateReader A collections change: [WatchedEvent state:SyncConnected type:NodeChildrenChanged path:/collections], has occurred - updating...
   [junit4]   2> 1666006 INFO  (TEST-ZkStateReaderTest.testWatchedCollectionCreation-seed#[B368BEFAAE5564C1]) [    ] o.a.s.c.o.ZkStateWriter going to create_collection /collections/c1/state.json
   [junit4]   2> 1666007 INFO  (zkCallback-18306-thread-1) [    ] o.a.s.c.c.ZkStateReader A cluster state change: [WatchedEvent state:SyncConnected type:NodeCreated path:/collections/c1/state.json] for collection [c1] has occurred - updating... (live nodes size: [0])
   [junit4]   2> 1666007 INFO  (zkCallback-18306-thread-1) [    ] o.a.s.c.c.ZkStateReader Add data for [c1] ver [0]
   [junit4]   2> 1666008 INFO  (TEST-ZkStateReaderTest.testWatchedCollectionCreation-seed#[B368BEFAAE5564C1]) [    ] o.a.s.c.ZkTestServer connecting to 127.0.0.1:41431 41431
   [junit4]   2> 1666114 INFO  (Thread-6776) [    ] o.a.s.c.ZkTestServer connecting to 127.0.0.1:41431 41431
   [junit4]   2> 1666114 INFO  (TEST-ZkStateReaderTest.testWatchedCollectionCreation-seed#[B368BEFAAE5564C1]) [    ] o.a.s.SolrTestCaseJ4 ###Ending testWatchedCollectionCreation
   [junit4]   2> 1666117 INFO  (TEST-ZkStateReaderTest.testStateFormatUpdateWithExplicitRefreshLazy-seed#[B368BEFAAE5564C1]) [    ] o.a.s.SolrTestCaseJ4 ###Starting testStateFormatUpdateWithExplicitRefreshLazy
   [junit4]   2> 1666117 INFO  (TEST-ZkStateReaderTest.testStateFormatUpdateWithExplicitRefreshLazy-seed#[B368BEFAAE5564C1]) [    ] o.a.s.c.ZkTestServer STARTING ZK TEST SERVER
   [junit4]   2> 1666118 INFO  (Thread-6777) [    ] o.a.s.c.ZkTestServer client port:0.0.0.0/0.0.0.0:0
   [junit4]   2> 1666118 INFO  (Thread-6777) [    ] o.a.s.c.ZkTestServer Starting server
   [junit4]   2> 1666218 INFO  (TEST-ZkStateReaderTest.testStateFormatUpdateWithExplicitRefreshLazy-seed#[B368BEFAAE5564C1]) [    ] o.a.s.c.ZkTestServer start zk server on port:53198
   [junit4]   2> 1666218 INFO  (TEST-ZkStateReaderTest.testStateFormatUpdateWithExplicitRefreshLazy-seed#[B368BEFAAE5564C1]) [    ] o.a.s.c.c.SolrZkClient Using default ZkCredentialsProvider
   [junit4]   2> 1666219 INFO  (TEST-ZkStateReaderTest.testStateFormatUpdateWithExplicitRefreshLazy-seed#[B368BEFAAE5564C1]) [    ] o.a.s.c.c.ConnectionManager Waiting for client to connect to ZooKeeper
   [junit4]   2> 1666222 INFO  (zkCallback-18308-thread-1) [    ] o.a.s.c.c.ConnectionManager Watcher org.apache.solr.common.cloud.ConnectionManager@77970980 name:ZooKeeperConnection Watcher:127.0.0.1:53198 got event WatchedEvent state:SyncConnected type:None path:null path:null type:None
   [junit4]   2> 1666222 INFO  (TEST-ZkStateReaderTest.testStateFormatUpdateWithExplicitRefreshLazy-seed#[B368BEFAAE5564C1]) [    ] o.a.s.c.c.ConnectionManager Client is connected to ZooKeeper
   [junit4]   2> 1666222 INFO  (TEST-ZkStateReaderTest.testStateFormatUpdateWithExplicitRefreshLazy-seed#[B368BEFAAE5564C1]) [    ] o.a.s.c.c.SolrZkClient Using default ZkACLProvider
   [junit4]   2> 1666223 INFO  (TEST-ZkStateReaderTest.testStateFormatUpdateWithExplicitRefreshLazy-seed#[B368BEFAAE5564C1]) [    ] o.a.s.c.c.SolrZkClient Using default ZkCredentialsProvider
   [junit4]   2> 1666223 INFO  (TEST-ZkStateReaderTest.testStateFormatUpdateWithExplicitRefreshLazy-seed#[B368BEFAAE5564C1]) [    ] o.a.s.c.c.ConnectionManager Waiting for client to connect to ZooKeeper
   [junit4]   2> 1666223 INFO  (zkCallback-18309-thread-1) [    ] o.a.s.c.c.ConnectionManager Watcher org.apache.solr.common.cloud.ConnectionManager@79cccf50 name:ZooKeeperConnection Watcher:127.0.0.1:53198 got event WatchedEvent state:SyncConnected type:None path:null path:null type:None
   [junit4]   2> 1666224 INFO  (TEST-ZkStateReaderTest.testStateFormatUpdateWithExplicitRefreshLazy-seed#[B368BEFAAE5564C1]) [    ] o.a.s.c.c.ConnectionManager Client is connected to ZooKeeper
   [junit4]   2> 1666224 INFO  (TEST-ZkStateReaderTest.testStateFormatUpdateWithExplicitRefreshLazy-seed#[B368BEFAAE5564C

[...truncated too long message...]

667193 INFO  (TEST-ZkStateReaderTest.testStateFormatUpdateWithExplicitRefresh-seed#[B368BEFAAE5564C1]) [    ] o.a.s.c.c.SolrZkClient makePath: /collections/c1
   [junit4]   2> 1667193 INFO  (zkCallback-18322-thread-1) [    ] o.a.s.c.c.ZkStateReader A collections change: [WatchedEvent state:SyncConnected type:NodeChildrenChanged path:/collections], has occurred - updating...
   [junit4]   2> 1667194 INFO  (zkCallback-18322-thread-2) [    ] o.a.s.c.c.ZkStateReader A cluster state change: [WatchedEvent state:SyncConnected type:NodeDataChanged path:/clusterstate.json], has occurred - updating... (live nodes size: [0])
   [junit4]   2> 1667194 INFO  (TEST-ZkStateReaderTest.testStateFormatUpdateWithExplicitRefresh-seed#[B368BEFAAE5564C1]) [    ] o.a.s.c.o.ZkStateWriter going to create_collection /collections/c1/state.json
   [junit4]   2> 1667195 INFO  (zkCallback-18322-thread-2) [    ] o.a.s.c.c.ZkStateReader A cluster state change: [WatchedEvent state:SyncConnected type:NodeCreated path:/collections/c1/state.json] for collection [c1] has occurred - updating... (live nodes size: [0])
   [junit4]   2> 1667195 INFO  (zkCallback-18322-thread-1) [    ] o.a.s.c.c.ZkStateReader A cluster state change: [WatchedEvent state:SyncConnected type:NodeDataChanged path:/clusterstate.json], has occurred - updating... (live nodes size: [0])
   [junit4]   2> 1668698 WARN  (zkCallback-18322-thread-1) [    ] o.a.s.c.c.ZkStateReader ZooKeeper watch triggered, but Solr cannot talk to ZK: [KeeperErrorCode = Session expired for /clusterstate.json]
   [junit4]   2> 1668698 WARN  (zkCallback-18322-thread-2) [    ] o.a.s.c.c.ZkStateReader ZooKeeper watch triggered, but Solr cannot talk to ZK: [KeeperErrorCode = Session expired for /collections/c1/state.json]
   [junit4]   2> 1668699 INFO  (TEST-ZkStateReaderTest.testStateFormatUpdateWithExplicitRefresh-seed#[B368BEFAAE5564C1]) [    ] o.a.s.c.ZkTestServer connecting to 127.0.0.1:44268 44268
   [junit4]   2> 1668821 INFO  (Thread-6780) [    ] o.a.s.c.ZkTestServer connecting to 127.0.0.1:44268 44268
   [junit4]   2> 1668822 INFO  (TEST-ZkStateReaderTest.testStateFormatUpdateWithExplicitRefresh-seed#[B368BEFAAE5564C1]) [    ] o.a.s.SolrTestCaseJ4 ###Ending testStateFormatUpdateWithExplicitRefresh
   [junit4]   2> NOTE: reproduce with: ant test  -Dtestcase=ZkStateReaderTest -Dtests.method=testStateFormatUpdateWithExplicitRefresh -Dtests.seed=B368BEFAAE5564C1 -Dtests.multiplier=2 -Dtests.slow=true -Dtests.locale=it-IT -Dtests.timezone=America/Matamoros -Dtests.asserts=true -Dtests.file.encoding=ISO-8859-1
   [junit4] ERROR   1.75s J2 | ZkStateReaderTest.testStateFormatUpdateWithExplicitRefresh <<<
   [junit4]    > Throwable #1: org.apache.solr.common.SolrException: Could not find collection : c1
   [junit4]    > 	at __randomizedtesting.SeedInfo.seed([B368BEFAAE5564C1:ACD2CF0D7E35A204]:0)
   [junit4]    > 	at org.apache.solr.common.cloud.ClusterState.getCollection(ClusterState.java:192)
   [junit4]    > 	at org.apache.solr.cloud.overseer.ZkStateReaderTest.testStateFormatUpdate(ZkStateReaderTest.java:129)
   [junit4]    > 	at org.apache.solr.cloud.overseer.ZkStateReaderTest.testStateFormatUpdateWithExplicitRefresh(ZkStateReaderTest.java:43)
   [junit4]    > 	at java.lang.Thread.run(Thread.java:745)
   [junit4]   2> 1668823 INFO  (SUITE-ZkStateReaderTest-seed#[B368BEFAAE5564C1]-worker) [    ] o.a.s.SolrTestCaseJ4 ###deleteCore
   [junit4]   2> NOTE: leaving temporary files on disk at: /x1/jenkins/jenkins-slave/workspace/Lucene-Solr-Tests-master/solr/build/solr-core/test/J2/temp/solr.cloud.overseer.ZkStateReaderTest_B368BEFAAE5564C1-001
   [junit4]   2> Jul 02, 2016 7:44:05 PM com.carrotsearch.randomizedtesting.ThreadLeakControl checkThreadLeaks
   [junit4]   2> WARNING: Will linger awaiting termination of 1 leaked thread(s).
   [junit4]   2> NOTE: test params are: codec=CheapBastard, sim=ClassicSimilarity, locale=it-IT, timezone=America/Matamoros
   [junit4]   2> NOTE: Linux 3.13.0-85-generic amd64/Oracle Corporation 1.8.0_74 (64-bit)/cpus=4,threads=1,free=236922680,total=525336576
   [junit4]   2> NOTE: All tests run in this JVM: [ClusterStateTest, DirectSolrConnectionTest, TestNoOpRegenerator, TestSolrCLIRunExample, HdfsUnloadDistributedZkTest, ShowFileRequestHandlerTest, TestShardHandlerFactory, BlockJoinFacetSimpleTest, EnumFieldTest, TestFieldCacheSort, TestPivotHelperCode, TestTolerantSearch, TestConfigSetImmutable, TestRandomCollapseQParserPlugin, TestNonDefinedSimilarityFactory, ConjunctionSolrSpellCheckerTest, TestStressReorder, SharedFSAutoReplicaFailoverUtilsTest, TestCollationFieldDocValues, QueryResultKeyTest, SuggesterTest, ScriptEngineTest, TestSolrFieldCacheMBean, TestDistribDocBasedVersion, TestMiniSolrCloudCluster, SparseHLLTest, TestReload, TestSchemaVersionResource, MigrateRouteKeyTest, TestRecovery, HighlighterConfigTest, TestIndexingPerformance, TestInitParams, TestStressLiveNodes, AnalysisErrorHandlingTest, TestFuzzyAnalyzedSuggestions, CircularListTest, TestExactStatsCache, TestMinMaxOnMultiValuedField, TestRecoveryHdfs, CdcrRequestHandlerTest, TestScoreJoinQPScore, FullSolrCloudDistribCmdsTest, SimpleFacetsTest, BadIndexSchemaTest, TestWriterPerf, TestJmxIntegration, HdfsChaosMonkeySafeLeaderTest, HighlighterMaxOffsetTest, TestDistributedMissingSort, LeaderFailoverAfterPartitionTest, TestRebalanceLeaders, VersionInfoTest, TestUtils, DeleteInactiveReplicaTest, TestSearchPerf, DistributedVersionInfoTest, BigEndianAscendingWordSerializerTest, RegexBoostProcessorTest, TestTrieFacet, QueryParsingTest, SliceStateTest, TestNumericTerms64, TestRequestStatusCollectionAPI, CollectionStateFormat2Test, HdfsSyncSliceTest, BlockCacheTest, TestFieldCacheWithThreads, PrimitiveFieldTypeTest, IgnoreCommitOptimizeUpdateProcessorFactoryTest, CollectionsAPISolrJTest, TestCSVResponseWriter, RestartWhileUpdatingTest, TestComplexPhraseQParserPlugin, TestSweetSpotSimilarityFactory, LukeRequestHandlerTest, SuggesterWFSTTest, TestClusterStateMutator, TestDefaultStatsCache, BadComponentTest, ConnectionManagerTest, LeaderElectionTest, TestReversedWildcardFilterFactory, TestSchemaManager, DistribDocExpirationUpdateProcessorTest, TestSolrDeletionPolicy1, TestConfigReload, TestCloudManagedSchema, BaseCdcrDistributedZkTest, TestFastWriter, TestFilteredDocIdSet, TestCollationField, PKIAuthenticationIntegrationTest, TestSolrJ, TestExtendedDismaxParser, TestSubQueryTransformerCrossCore, ClassificationUpdateProcessorFactoryTest, TestSort, SampleTest, TestXIncludeConfig, TestIndexSearcher, LeaderElectionIntegrationTest, RecoveryZkTest, TestHashPartitioner, TestRealTimeGet, HardAutoCommitTest, DistributedTermsComponentTest, StatsComponentTest, HighlighterTest, CurrencyFieldOpenExchangeTest, DistributedQueryElevationComponentTest, CurrencyFieldXmlFileTest, SolrIndexSplitterTest, SimplePostToolTest, TestCoreDiscovery, TestFoldingMultitermQuery, SuggesterTSTTest, TestStressLucene, TestTrie, SpatialFilterTest, NoCacheHeaderTest, SolrCoreCheckLockOnStartupTest, TestPseudoReturnFields, TestUpdate, FieldMutatingUpdateProcessorTest, TestAtomicUpdateErrorCases, QueryEqualityTest, DirectUpdateHandlerOptimizeTest, DefaultValueUpdateProcessorTest, StatelessScriptUpdateProcessorFactoryTest, SortByFunctionTest, TestRemoteStreaming, DocValuesMultiTest, XsltUpdateRequestHandlerTest, IndexBasedSpellCheckerTest, DocumentAnalysisRequestHandlerTest, RequestHandlersTest, DocumentBuilderTest, MoreLikeThisHandlerTest, TestSolrQueryParser, UpdateRequestProcessorFactoryTest, JsonLoaderTest, TestPHPSerializedResponseWriter, CSVRequestHandlerTest, SearchHandlerTest, UpdateParamsTest, SolrIndexConfigTest, TestMergePolicyConfig, TestSolrDeletionPolicy2, MultiTermTest, MinimalSchemaTest, TestElisionMultitermQuery, TestPostingsSolrHighlighter, NotRequiredUniqueKeyTest, TestLuceneMatchVersion, TestPhraseSuggestions, SpellPossibilityIteratorTest, TestCharFilters, SynonymTokenizerTest, EchoParamsTest, TestPerFieldSimilarity, TestLMDirichletSimilarityFactory, TestLMJelinekMercerSimilarityFactory, TestJmxMonitoredMap, PluginInfoTest, DateMathParserTest, SpellingQueryConverterTest, ZkNodePropsTest, SystemInfoHandlerTest, CursorPagingTest, TestEmbeddedSolrServerConstructors, TestJettySolrRunner, AssignTest, CdcrReplicationDistributedZkTest, CleanupOldIndexTest, DeleteStatusTest, DistribCursorPagingTest, ForceLeaderTest, RecoveryAfterSoftCommitTest, RollingRestartTest, SolrCloudExampleTest, TestCloudPivotFacet, TestMiniSolrCloudClusterBase, TestRandomRequestDistribution, TestRequestForwarding, TestSSLRandomization, TestSizeLimitedDistributedMap, TestTolerantUpdateProcessorRandomCloud, ZkStateReaderTest]
   [junit4] Completed [492/618 (2!)] on J2 in 4.04s, 6 tests, 2 errors <<< FAILURES!

[...truncated 389 lines...]
BUILD FAILED
/x1/jenkins/jenkins-slave/workspace/Lucene-Solr-Tests-master/build.xml:740: The following error occurred while executing this line:
/x1/jenkins/jenkins-slave/workspace/Lucene-Solr-Tests-master/build.xml:684: The following error occurred while executing this line:
/x1/jenkins/jenkins-slave/workspace/Lucene-Solr-Tests-master/build.xml:59: The following error occurred while executing this line:
/x1/jenkins/jenkins-slave/workspace/Lucene-Solr-Tests-master/solr/build.xml:233: The following error occurred while executing this line:
/x1/jenkins/jenkins-slave/workspace/Lucene-Solr-Tests-master/solr/common-build.xml:530: The following error occurred while executing this line:
/x1/jenkins/jenkins-slave/workspace/Lucene-Solr-Tests-master/lucene/common-build.xml:1427: The following error occurred while executing this line:
/x1/jenkins/jenkins-slave/workspace/Lucene-Solr-Tests-master/lucene/common-build.xml:984: There were test failures: 618 suites (10 ignored), 2590 tests, 3 errors, 87 ignored (72 assumptions) [seed: B368BEFAAE5564C1]

Total time: 61 minutes 38 seconds
Build step 'Invoke Ant' marked build as failure
Archiving artifacts
Recording test results
Email was triggered for: Failure - Any
Sending email for trigger: Failure - Any




Mime
View raw message