lucene-dev mailing list archives

Site index · List index
Message view « Date » · « Thread »
Top « Date » · « Thread »
From Policeman Jenkins Server <jenk...@thetaphi.de>
Subject [JENKINS] Lucene-Solr-master-Linux (32bit/jdk1.8.0_92) - Build # 17116 - Still Failing!
Date Fri, 01 Jul 2016 17:24:23 GMT
Build: http://jenkins.thetaphi.de/job/Lucene-Solr-master-Linux/17116/
Java: 32bit/jdk1.8.0_92 -server -XX:+UseSerialGC

1 tests failed.
FAILED:  junit.framework.TestSuite.org.apache.solr.handler.TestSolrConfigHandlerCloud

Error Message:
1 thread leaked from SUITE scope at org.apache.solr.handler.TestSolrConfigHandlerCloud:     1) Thread[id=7392, name=Thread-2188, state=TIMED_WAITING, group=TGRP-TestSolrConfigHandlerCloud]         at java.lang.Thread.sleep(Native Method)         at org.apache.solr.cloud.ZkSolrResourceLoader.openResource(ZkSolrResourceLoader.java:101)         at org.apache.solr.core.SolrResourceLoader.openSchema(SolrResourceLoader.java:333)         at org.apache.solr.schema.IndexSchemaFactory.create(IndexSchemaFactory.java:48)         at org.apache.solr.schema.IndexSchemaFactory.buildIndexSchema(IndexSchemaFactory.java:75)         at org.apache.solr.core.ConfigSetService.createIndexSchema(ConfigSetService.java:107)         at org.apache.solr.core.ConfigSetService.getConfig(ConfigSetService.java:78)         at org.apache.solr.core.CoreContainer.reload(CoreContainer.java:944)         at org.apache.solr.core.SolrCore.lambda$getConfListener$6(SolrCore.java:2509)         at org.apache.solr.core.SolrCore$$Lambda$56/1763531.run(Unknown Source)         at org.apache.solr.cloud.ZkController$4.run(ZkController.java:2427)

Stack Trace:
com.carrotsearch.randomizedtesting.ThreadLeakError: 1 thread leaked from SUITE scope at org.apache.solr.handler.TestSolrConfigHandlerCloud: 
   1) Thread[id=7392, name=Thread-2188, state=TIMED_WAITING, group=TGRP-TestSolrConfigHandlerCloud]
        at java.lang.Thread.sleep(Native Method)
        at org.apache.solr.cloud.ZkSolrResourceLoader.openResource(ZkSolrResourceLoader.java:101)
        at org.apache.solr.core.SolrResourceLoader.openSchema(SolrResourceLoader.java:333)
        at org.apache.solr.schema.IndexSchemaFactory.create(IndexSchemaFactory.java:48)
        at org.apache.solr.schema.IndexSchemaFactory.buildIndexSchema(IndexSchemaFactory.java:75)
        at org.apache.solr.core.ConfigSetService.createIndexSchema(ConfigSetService.java:107)
        at org.apache.solr.core.ConfigSetService.getConfig(ConfigSetService.java:78)
        at org.apache.solr.core.CoreContainer.reload(CoreContainer.java:944)
        at org.apache.solr.core.SolrCore.lambda$getConfListener$6(SolrCore.java:2509)
        at org.apache.solr.core.SolrCore$$Lambda$56/1763531.run(Unknown Source)
        at org.apache.solr.cloud.ZkController$4.run(ZkController.java:2427)
	at __randomizedtesting.SeedInfo.seed([56AE902C5C813D28]:0)




Build Log:
[...truncated 11475 lines...]
   [junit4] Suite: org.apache.solr.handler.TestSolrConfigHandlerCloud
   [junit4]   2> Creating dataDir: /home/jenkins/workspace/Lucene-Solr-master-Linux/solr/build/solr-core/test/J1/temp/solr.handler.TestSolrConfigHandlerCloud_56AE902C5C813D28-001/init-core-data-001
   [junit4]   2> 904698 INFO  (SUITE-TestSolrConfigHandlerCloud-seed#[56AE902C5C813D28]-worker) [    ] o.a.s.SolrTestCaseJ4 Randomized ssl (true) and clientAuth (true) via: @org.apache.solr.util.RandomizeSSL(reason=, ssl=NaN, value=NaN, clientAuth=NaN)
   [junit4]   2> 904699 INFO  (SUITE-TestSolrConfigHandlerCloud-seed#[56AE902C5C813D28]-worker) [    ] o.a.s.BaseDistributedSearchTestCase Setting hostContext system property: /
   [junit4]   2> 904700 INFO  (TEST-TestSolrConfigHandlerCloud.test-seed#[56AE902C5C813D28]) [    ] o.a.s.c.ZkTestServer STARTING ZK TEST SERVER
   [junit4]   2> 904700 INFO  (Thread-2100) [    ] o.a.s.c.ZkTestServer client port:0.0.0.0/0.0.0.0:0
   [junit4]   2> 904700 INFO  (Thread-2100) [    ] o.a.s.c.ZkTestServer Starting server
   [junit4]   2> 904800 INFO  (TEST-TestSolrConfigHandlerCloud.test-seed#[56AE902C5C813D28]) [    ] o.a.s.c.ZkTestServer start zk server on port:35196
   [junit4]   2> 904800 INFO  (TEST-TestSolrConfigHandlerCloud.test-seed#[56AE902C5C813D28]) [    ] o.a.s.c.c.SolrZkClient Using default ZkCredentialsProvider
   [junit4]   2> 904801 INFO  (TEST-TestSolrConfigHandlerCloud.test-seed#[56AE902C5C813D28]) [    ] o.a.s.c.c.ConnectionManager Waiting for client to connect to ZooKeeper
   [junit4]   2> 904801 INFO  (zkCallback-946-thread-1) [    ] o.a.s.c.c.ConnectionManager Watcher org.apache.solr.common.cloud.ConnectionManager@15f38e8 name:ZooKeeperConnection Watcher:127.0.0.1:35196 got event WatchedEvent state:SyncConnected type:None path:null path:null type:None
   [junit4]   2> 904801 INFO  (TEST-TestSolrConfigHandlerCloud.test-seed#[56AE902C5C813D28]) [    ] o.a.s.c.c.ConnectionManager Client is connected to ZooKeeper
   [junit4]   2> 904802 INFO  (TEST-TestSolrConfigHandlerCloud.test-seed#[56AE902C5C813D28]) [    ] o.a.s.c.c.SolrZkClient Using default ZkACLProvider
   [junit4]   2> 904802 INFO  (TEST-TestSolrConfigHandlerCloud.test-seed#[56AE902C5C813D28]) [    ] o.a.s.c.c.SolrZkClient makePath: /solr
   [junit4]   2> 904803 INFO  (TEST-TestSolrConfigHandlerCloud.test-seed#[56AE902C5C813D28]) [    ] o.a.s.c.c.SolrZkClient Using default ZkCredentialsProvider
   [junit4]   2> 904803 INFO  (TEST-TestSolrConfigHandlerCloud.test-seed#[56AE902C5C813D28]) [    ] o.a.s.c.c.ConnectionManager Waiting for client to connect to ZooKeeper
   [junit4]   2> 904803 INFO  (zkCallback-947-thread-1) [    ] o.a.s.c.c.ConnectionManager Watcher org.apache.solr.common.cloud.ConnectionManager@1bb5ed9 name:ZooKeeperConnection Watcher:127.0.0.1:35196/solr got event WatchedEvent state:SyncConnected type:None path:null path:null type:None
   [junit4]   2> 904804 INFO  (TEST-TestSolrConfigHandlerCloud.test-seed#[56AE902C5C813D28]) [    ] o.a.s.c.c.ConnectionManager Client is connected to ZooKeeper
   [junit4]   2> 904804 INFO  (TEST-TestSolrConfigHandlerCloud.test-seed#[56AE902C5C813D28]) [    ] o.a.s.c.c.SolrZkClient Using default ZkACLProvider
   [junit4]   2> 904804 INFO  (TEST-TestSolrConfigHandlerCloud.test-seed#[56AE902C5C813D28]) [    ] o.a.s.c.c.SolrZkClient makePath: /collections/collection1
   [junit4]   2> 904804 INFO  (TEST-TestSolrConfigHandlerCloud.test-seed#[56AE902C5C813D28]) [    ] o.a.s.c.c.SolrZkClient makePath: /collections/collection1/shards
   [junit4]   2> 904805 INFO  (TEST-TestSolrConfigHandlerCloud.test-seed#[56AE902C5C813D28]) [    ] o.a.s.c.c.SolrZkClient makePath: /collections/control_collection
   [junit4]   2> 904805 INFO  (TEST-TestSolrConfigHandlerCloud.test-seed#[56AE902C5C813D28]) [    ] o.a.s.c.c.SolrZkClient makePath: /collections/control_collection/shards
   [junit4]   2> 904805 INFO  (TEST-TestSolrConfigHandlerCloud.test-seed#[56AE902C5C813D28]) [    ] o.a.s.c.AbstractZkTestCase put /home/jenkins/workspace/Lucene-Solr-master-Linux/solr/core/src/test-files/solr/collection1/conf/solrconfig-tlog.xml to /configs/conf1/solrconfig.xml
   [junit4]   2> 904805 INFO  (TEST-TestSolrConfigHandlerCloud.test-seed#[56AE902C5C813D28]) [    ] o.a.s.c.c.SolrZkClient makePath: /configs/conf1/solrconfig.xml
   [junit4]   2> 904806 INFO  (TEST-TestSolrConfigHandlerCloud.test-seed#[56AE902C5C813D28]) [    ] o.a.s.c.AbstractZkTestCase put /home/jenkins/workspace/Lucene-Solr-master-Linux/solr/core/src/test-files/solr/collection1/conf/schema.xml to /configs/conf1/schema.xml
   [junit4]   2> 904806 INFO  (TEST-TestSolrConfigHandlerCloud.test-seed#[56AE902C5C813D28]) [    ] o.a.s.c.c.SolrZkClient makePath: /configs/conf1/schema.xml
   [junit4]   2> 904807 INFO  (TEST-TestSolrConfigHandlerCloud.test-seed#[56AE902C5C813D28]) [    ] o.a.s.c.AbstractZkTestCase put /home/jenkins/workspace/Lucene-Solr-master-Linux/solr/core/src/test-files/solr/collection1/conf/solrconfig.snippet.randomindexconfig.xml to /configs/conf1/solrconfig.snippet.randomindexconfig.xml
   [junit4]   2> 904807 INFO  (TEST-TestSolrConfigHandlerCloud.test-seed#[56AE902C5C813D28]) [    ] o.a.s.c.c.SolrZkClient makePath: /configs/conf1/solrconfig.snippet.randomindexconfig.xml
   [junit4]   2> 904808 INFO  (TEST-TestSolrConfigHandlerCloud.test-seed#[56AE902C5C813D28]) [    ] o.a.s.c.AbstractZkTestCase put /home/jenkins/workspace/Lucene-Solr-master-Linux/solr/core/src/test-files/solr/collection1/conf/stopwords.txt to /configs/conf1/stopwords.txt
   [junit4]   2> 904808 INFO  (TEST-TestSolrConfigHandlerCloud.test-seed#[56AE902C5C813D28]) [    ] o.a.s.c.c.SolrZkClient makePath: /configs/conf1/stopwords.txt
   [junit4]   2> 904808 INFO  (TEST-TestSolrConfigHandlerCloud.test-seed#[56AE902C5C813D28]) [    ] o.a.s.c.AbstractZkTestCase put /home/jenkins/workspace/Lucene-Solr-master-Linux/solr/core/src/test-files/solr/collection1/conf/protwords.txt to /configs/conf1/protwords.txt
   [junit4]   2> 904808 INFO  (TEST-TestSolrConfigHandlerCloud.test-seed#[56AE902C5C813D28]) [    ] o.a.s.c.c.SolrZkClient makePath: /configs/conf1/protwords.txt
   [junit4]   2> 904808 INFO  (TEST-TestSolrConfigHandlerCloud.test-seed#[56AE902C5C813D28]) [    ] o.a.s.c.AbstractZkTestCase put /home/jenkins/workspace/Lucene-Solr-master-Linux/solr/core/src/test-files/solr/collection1/conf/currency.xml to /configs/conf1/currency.xml
   [junit4]   2> 904809 INFO  (TEST-TestSolrConfigHandlerCloud.test-seed#[56AE902C5C813D28]) [    ] o.a.s.c.c.SolrZkClient makePath: /configs/conf1/currency.xml
   [junit4]   2> 904809 INFO  (TEST-TestSolrConfigHandlerCloud.test-seed#[56AE902C5C813D28]) [    ] o.a.s.c.AbstractZkTestCase put /home/jenkins/workspace/Lucene-Solr-master-Linux/solr/core/src/test-files/solr/collection1/conf/enumsConfig.xml to /configs/conf1/enumsConfig.xml
   [junit4]   2> 904809 INFO  (TEST-TestSolrConfigHandlerCloud.test-seed#[56AE902C5C813D28]) [    ] o.a.s.c.c.SolrZkClient makePath: /configs/conf1/enumsConfig.xml
   [junit4]   2> 904809 INFO  (TEST-TestSolrConfigHandlerCloud.test-seed#[56AE902C5C813D28]) [    ] o.a.s.c.AbstractZkTestCase put /home/jenkins/workspace/Lucene-Solr-master-Linux/solr/core/src/test-files/solr/collection1/conf/open-exchange-rates.json to /configs/conf1/open-exchange-rates.json
   [junit4]   2> 904809 INFO  (TEST-TestSolrConfigHandlerCloud.test-seed#[56AE902C5C813D28]) [    ] o.a.s.c.c.SolrZkClient makePath: /configs/conf1/open-exchange-rates.json
   [junit4]   2> 904810 INFO  (TEST-TestSolrConfigHandlerCloud.test-seed#[56AE902C5C813D28]) [    ] o.a.s.c.AbstractZkTestCase put /home/jenkins/workspace/Lucene-Solr-master-Linux/solr/core/src/test-files/solr/collection1/conf/mapping-ISOLatin1Accent.txt to /configs/conf1/mapping-ISOLatin1Accent.txt
   [junit4]   2> 904810 INFO  (TEST-TestSolrConfigHandlerCloud.test-seed#[56AE902C5C813D28]) [    ] o.a.s.c.c.SolrZkClient makePath: /configs/conf1/mapping-ISOLatin1Accent.txt
   [junit4]   2> 904810 INFO  (TEST-TestSolrConfigHandlerCloud.test-seed#[56AE902C5C813D28]) [    ] o.a.s.c.AbstractZkTestCase put /home/jenkins/workspace/Lucene-Solr-master-Linux/solr/core/src/test-files/solr/collection1/conf/old_synonyms.txt to /configs/conf1/old_synonyms.txt
   [junit4]   2> 904811 INFO  (TEST-TestSolrConfigHandlerCloud.test-seed#[56AE902C5C813D28]) [    ] o.a.s.c.c.SolrZkClient makePath: /configs/conf1/old_synonyms.txt
   [junit4]   2> 904811 INFO  (TEST-TestSolrConfigHandlerCloud.test-seed#[56AE902C5C813D28]) [    ] o.a.s.c.AbstractZkTestCase put /home/jenkins/workspace/Lucene-Solr-master-Linux/solr/core/src/test-files/solr/collection1/conf/synonyms.txt to /configs/conf1/synonyms.txt
   [junit4]   2> 904811 INFO  (TEST-TestSolrConfigHandlerCloud.test-seed#[56AE902C5C813D28]) [    ] o.a.s.c.c.SolrZkClient makePath: /configs/conf1/synonyms.txt
   [junit4]   2> 904812 INFO  (TEST-TestSolrConfigHandlerCloud.test-seed#[56AE902C5C813D28]) [    ] o.a.s.c.c.SolrZkClient Using default ZkCredentialsProvider
   [junit4]   2> 904812 INFO  (TEST-TestSolrConfigHandlerCloud.test-seed#[56AE902C5C813D28]) [    ] o.a.s.c.c.ConnectionManager Waiting for client to connect to ZooKeeper
   [junit4]   2> 904812 INFO  (zkCallback-949-thread-1) [    ] o.a.s.c.c.ConnectionManager Watcher org.apache.solr.common.cloud.ConnectionManager@8b8809 name:ZooKeeperConnection Watcher:127.0.0.1:35196/solr got event WatchedEvent state:SyncConnected type:None path:null path:null type:None
   [junit4]   2> 904812 INFO  (TEST-TestSolrConfigHandlerCloud.test-seed#[56AE902C5C813D28]) [    ] o.a.s.c.c.ConnectionManager Client is connected to ZooKeeper
   [junit4]   2> 904812 INFO  (TEST-TestSolrConfigHandlerCloud.test-seed#[56AE902C5C813D28]) [    ] o.a.s.c.c.SolrZkClient Using default ZkACLProvider
   [junit4]   2> 904868 INFO  (TEST-TestSolrConfigHandlerCloud.test-seed#[56AE902C5C813D28]) [    ] o.a.s.SolrTestCaseJ4 Writing core.properties file to /home/jenkins/workspace/Lucene-Solr-master-Linux/solr/build/solr-core/test/J1/temp/solr.handler.TestSolrConfigHandlerCloud_56AE902C5C813D28-001/control-001/cores/collection1
   [junit4]   2> 904870 INFO  (TEST-TestSolrConfigHandlerCloud.test-seed#[56AE902C5C813D28]) [    ] o.e.j.s.Server jetty-9.3.8.v20160314
   [junit4]   2> 904870 INFO  (TEST-TestSolrConfigHandlerCloud.test-seed#[56AE902C5C813D28]) [    ] o.e.j.s.h.ContextHandler Started o.e.j.s.ServletContextHandler@1aaf1bc{/,null,AVAILABLE}
   [junit4]   2> 904873 INFO  (TEST-TestSolrConfigHandlerCloud.test-seed#[56AE902C5C813D28]) [    ] o.e.j.s.ServerConnector Started ServerConnector@621c0e{SSL,[ssl, http/1.1]}{127.0.0.1:39406}
   [junit4]   2> 904873 INFO  (TEST-TestSolrConfigHandlerCloud.test-seed#[56AE902C5C813D28]) [    ] o.e.j.s.Server Started @906839ms
   [junit4]   2> 904873 INFO  (TEST-TestSolrConfigHandlerCloud.test-seed#[56AE902C5C813D28]) [    ] o.a.s.c.s.e.JettySolrRunner Jetty properties: {solr.data.dir=/home/jenkins/workspace/Lucene-Solr-master-Linux/solr/build/solr-core/test/J1/temp/solr.handler.TestSolrConfigHandlerCloud_56AE902C5C813D28-001/tempDir-001/control/data, hostContext=/, hostPort=39406, coreRootDirectory=/home/jenkins/workspace/Lucene-Solr-master-Linux/solr/build/solr-core/test/J1/../../../../../../../../../home/jenkins/workspace/Lucene-Solr-master-Linux/solr/build/solr-core/test/J1/temp/solr.handler.TestSolrConfigHandlerCloud_56AE902C5C813D28-001/control-001/cores}
   [junit4]   2> 904873 INFO  (TEST-TestSolrConfigHandlerCloud.test-seed#[56AE902C5C813D28]) [    ] o.a.s.s.SolrDispatchFilter SolrDispatchFilter.init(): sun.misc.Launcher$AppClassLoader@1d16e93
   [junit4]   2> 904873 INFO  (TEST-TestSolrConfigHandlerCloud.test-seed#[56AE902C5C813D28]) [    ] o.a.s.c.SolrResourceLoader new SolrResourceLoader for directory: '/home/jenkins/workspace/Lucene-Solr-master-Linux/solr/build/solr-core/test/J1/temp/solr.handler.TestSolrConfigHandlerCloud_56AE902C5C813D28-001/control-001'
   [junit4]   2> 904873 INFO  (TEST-TestSolrConfigHandlerCloud.test-seed#[56AE902C5C813D28]) [    ] o.a.s.c.SolrResourceLoader JNDI not configured for solr (NoInitialContextEx)
   [junit4]   2> 904873 INFO  (TEST-TestSolrConfigHandlerCloud.test-seed#[56AE902C5C813D28]) [    ] o.a.s.c.SolrResourceLoader solr home defaulted to 'solr/' (could not find system property or JNDI)
   [junit4]   2> 904873 INFO  (TEST-TestSolrConfigHandlerCloud.test-seed#[56AE902C5C813D28]) [    ] o.a.s.c.c.SolrZkClient Using default ZkCredentialsProvider
   [junit4]   2> 904874 INFO  (TEST-TestSolrConfigHandlerCloud.test-seed#[56AE902C5C813D28]) [    ] o.a.s.c.c.ConnectionManager Waiting for client to connect to ZooKeeper
   [junit4]   2> 904874 INFO  (zkCallback-950-thread-1) [    ] o.a.s.c.c.ConnectionManager Watcher org.apache.solr.common.cloud.ConnectionManager@49e60d name:ZooKeeperConnection Watcher:127.0.0.1:35196/solr got event WatchedEvent state:SyncConnected type:None path:null path:null type:None
   [junit4]   2> 904874 INFO  (TEST-TestSolrConfigHandlerCloud.test-seed#[56AE902C5C813D28]) [    ] o.a.s.c.c.ConnectionManager Client is connected to ZooKeeper
   [junit4]   2> 904875 INFO  (TEST-TestSolrConfigHandlerCloud.test-seed#[56AE902C5C813D28]) [    ] o.a.s.c.c.SolrZkClient Using default ZkACLProvider
   [junit4]   2> 904875 INFO  (TEST-TestSolrConfigHandlerCloud.test-seed#[56AE902C5C813D28]) [    ] o.a.s.s.SolrDispatchFilter Loading solr.xml from SolrHome (not found in ZooKeeper)
   [junit4]   2> 904875 INFO  (TEST-TestSolrConfigHandlerCloud.test-seed#[56AE902C5C813D28]) [    ] o.a.s.c.SolrXmlConfig Loading container configuration from /home/jenkins/workspace/Lucene-Solr-master-Linux/solr/build/solr-core/test/J1/temp/solr.handler.TestSolrConfigHandlerCloud_56AE902C5C813D28-001/control-001/solr.xml
   [junit4]   2> 904878 INFO  (TEST-TestSolrConfigHandlerCloud.test-seed#[56AE902C5C813D28]) [    ] o.a.s.c.CorePropertiesLocator Config-defined core root directory: /home/jenkins/workspace/Lucene-Solr-master-Linux/solr/build/solr-core/test/J1/../../../../../../../../../home/jenkins/workspace/Lucene-Solr-master-Linux/solr/build/solr-core/test/J1/temp/solr.handler.TestSolrConfigHandlerCloud_56AE902C5C813D28-001/control-001/cores
   [junit4]   2> 904878 INFO  (TEST-TestSolrConfigHandlerCloud.test-seed#[56AE902C5C813D28]) [    ] o.a.s.c.CoreContainer New CoreContainer 21673340
   [junit4]   2> 904878 INFO  (TEST-TestSolrConfigHandlerCloud.test-seed#[56AE902C5C813D28]) [    ] o.a.s.c.CoreContainer Loading cores into CoreContainer [instanceDir=/home/jenkins/workspace/Lucene-Solr-master-Linux/solr/build/solr-core/test/J1/temp/solr.handler.TestSolrConfigHandlerCloud_56AE902C5C813D28-001/control-001]
   [junit4]   2> 904878 WARN  (TEST-TestSolrConfigHandlerCloud.test-seed#[56AE902C5C813D28]) [    ] o.a.s.c.CoreContainer Couldn't add files from /home/jenkins/workspace/Lucene-Solr-master-Linux/solr/build/solr-core/test/J1/temp/solr.handler.TestSolrConfigHandlerCloud_56AE902C5C813D28-001/control-001/lib to classpath: /home/jenkins/workspace/Lucene-Solr-master-Linux/solr/build/solr-core/test/J1/temp/solr.handler.TestSolrConfigHandlerCloud_56AE902C5C813D28-001/control-001/lib
   [junit4]   2> 904879 INFO  (TEST-TestSolrConfigHandlerCloud.test-seed#[56AE902C5C813D28]) [    ] o.a.s.h.c.HttpShardHandlerFactory created with socketTimeout : 90000,urlScheme : ,connTimeout : 15000,maxConnectionsPerHost : 20,maxConnections : 10000,corePoolSize : 0,maximumPoolSize : 2147483647,maxThreadIdleTime : 5,sizeOfQueue : -1,fairnessPolicy : false,
   [junit4]   2> 904880 INFO  (TEST-TestSolrConfigHandlerCloud.test-seed#[56AE902C5C813D28]) [    ] o.a.s.u.UpdateShardHandler Created UpdateShardHandler HTTP client with params: socketTimeout=340000&connTimeout=45000&maxConnections=100000&maxConnectionsPerHost=100000
   [junit4]   2> 904880 INFO  (TEST-TestSolrConfigHandlerCloud.test-seed#[56AE902C5C813D28]) [    ] o.a.s.l.LogWatcher SLF4J impl is org.slf4j.impl.Log4jLoggerFactory
   [junit4]   2> 904880 INFO  (TEST-TestSolrConfigHandlerCloud.test-seed#[56AE902C5C813D28]) [    ] o.a.s.l.LogWatcher Registering Log Listener [Log4j (org.slf4j.impl.Log4jLoggerFactory)]
   [junit4]   2> 904880 INFO  (TEST-TestSolrConfigHandlerCloud.test-seed#[56AE902C5C813D28]) [    ] o.a.s.c.ZkContainer Zookeeper client=127.0.0.1:35196/solr
   [junit4]   2> 904880 INFO  (TEST-TestSolrConfigHandlerCloud.test-seed#[56AE902C5C813D28]) [    ] o.a.s.c.ZkController zkHost includes chroot
   [junit4]   2> 904880 INFO  (TEST-TestSolrConfigHandlerCloud.test-seed#[56AE902C5C813D28]) [    ] o.a.s.c.c.SolrZkClient Using default ZkCredentialsProvider
   [junit4]   2> 904881 INFO  (TEST-TestSolrConfigHandlerCloud.test-seed#[56AE902C5C813D28]) [    ] o.a.s.c.c.ConnectionManager Waiting for client to connect to ZooKeeper
   [junit4]   2> 904881 INFO  (zkCallback-953-thread-1) [    ] o.a.s.c.c.ConnectionManager Watcher org.apache.solr.common.cloud.ConnectionManager@8ffded name:ZooKeeperConnection Watcher:127.0.0.1:35196 got event WatchedEvent state:SyncConnected type:None path:null path:null type:None
   [junit4]   2> 904881 INFO  (TEST-TestSolrConfigHandlerCloud.test-seed#[56AE902C5C813D28]) [    ] o.a.s.c.c.ConnectionManager Client is connected to ZooKeeper
   [junit4]   2> 904882 INFO  (TEST-TestSolrConfigHandlerCloud.test-seed#[56AE902C5C813D28]) [    ] o.a.s.c.c.SolrZkClient Using default ZkACLProvider
   [junit4]   2> 904882 INFO  (TEST-TestSolrConfigHandlerCloud.test-seed#[56AE902C5C813D28]) [n:127.0.0.1:39406_    ] o.a.s.c.ZkController Added new OnReconnect listener org.apache.solr.cloud.ZkController$$Lambda$34/6369406@1ad63a0
   [junit4]   2> 904882 INFO  (TEST-TestSolrConfigHandlerCloud.test-seed#[56AE902C5C813D28]) [n:127.0.0.1:39406_    ] o.a.s.c.c.ConnectionManager Waiting for client to connect to ZooKeeper
   [junit4]   2> 904883 INFO  (zkCallback-954-thread-1-processing-n:127.0.0.1:39406_) [n:127.0.0.1:39406_    ] o.a.s.c.c.ConnectionManager Watcher org.apache.solr.common.cloud.ConnectionManager@405c78 name:ZooKeeperConnection Watcher:127.0.0.1:35196/solr got event WatchedEvent state:SyncConnected type:None path:null path:null type:None
   [junit4]   2> 904883 INFO  (TEST-TestSolrConfigHandlerCloud.test-seed#[56AE902C5C813D28]) [n:127.0.0.1:39406_    ] o.a.s.c.c.ConnectionManager Client is connected to ZooKeeper
   [junit4]   2> 904883 INFO  (TEST-TestSolrConfigHandlerCloud.test-seed#[56AE902C5C813D28]) [n:127.0.0.1:39406_    ] o.a.s.c.c.SolrZkClient makePath: /overseer/queue
   [junit4]   2> 904884 INFO  (TEST-TestSolrConfigHandlerCloud.test-seed#[56AE902C5C813D28]) [n:127.0.0.1:39406_    ] o.a.s.c.c.SolrZkClient makePath: /overseer/collection-queue-work
   [junit4]   2> 904885 INFO  (TEST-TestSolrConfigHandlerCloud.test-seed#[56AE902C5C813D28]) [n:127.0.0.1:39406_    ] o.a.s.c.c.SolrZkClient makePath: /overseer/collection-map-running
   [junit4]   2> 904887 INFO  (TEST-TestSolrConfigHandlerCloud.test-seed#[56AE902C5C813D28]) [n:127.0.0.1:39406_    ] o.a.s.c.c.SolrZkClient makePath: /overseer/collection-map-completed
   [junit4]   2> 904887 INFO  (TEST-TestSolrConfigHandlerCloud.test-seed#[56AE902C5C813D28]) [n:127.0.0.1:39406_    ] o.a.s.c.c.SolrZkClient makePath: /overseer/collection-map-failure
   [junit4]   2> 904888 INFO  (TEST-TestSolrConfigHandlerCloud.test-seed#[56AE902C5C813D28]) [n:127.0.0.1:39406_    ] o.a.s.c.c.SolrZkClient makePath: /live_nodes
   [junit4]   2> 904888 INFO  (TEST-TestSolrConfigHandlerCloud.test-seed#[56AE902C5C813D28]) [n:127.0.0.1:39406_    ] o.a.s.c.c.SolrZkClient makePath: /aliases.json
   [junit4]   2> 904888 INFO  (TEST-TestSolrConfigHandlerCloud.test-seed#[56AE902C5C813D28]) [n:127.0.0.1:39406_    ] o.a.s.c.c.SolrZkClient makePath: /clusterstate.json
   [junit4]   2> 904889 INFO  (TEST-TestSolrConfigHandlerCloud.test-seed#[56AE902C5C813D28]) [n:127.0.0.1:39406_    ] o.a.s.c.c.SolrZkClient makePath: /security.json
   [junit4]   2> 904889 INFO  (TEST-TestSolrConfigHandlerCloud.test-seed#[56AE902C5C813D28]) [n:127.0.0.1:39406_    ] o.a.s.c.c.ZkStateReader Updating cluster state from ZooKeeper... 
   [junit4]   2> 904889 INFO  (TEST-TestSolrConfigHandlerCloud.test-seed#[56AE902C5C813D28]) [n:127.0.0.1:39406_    ] o.a.s.c.c.ZkStateReader Loaded cluster properties: {urlScheme=https}
   [junit4]   2> 904889 INFO  (TEST-TestSolrConfigHandlerCloud.test-seed#[56AE902C5C813D28]) [n:127.0.0.1:39406_    ] o.a.s.c.c.ZkStateReader Updated live nodes from ZooKeeper... (0) -> (0)
   [junit4]   2> 904890 INFO  (TEST-TestSolrConfigHandlerCloud.test-seed#[56AE902C5C813D28]) [n:127.0.0.1:39406_    ] o.a.s.c.c.SolrZkClient makePath: /overseer_elect
   [junit4]   2> 904890 INFO  (TEST-TestSolrConfigHandlerCloud.test-seed#[56AE902C5C813D28]) [n:127.0.0.1:39406_    ] o.a.s.c.c.SolrZkClient makePath: /overseer_elect/election
   [junit4]   2> 904890 INFO  (TEST-TestSolrConfigHandlerCloud.test-seed#[56AE902C5C813D28]) [n:127.0.0.1:39406_    ] o.a.s.c.Overseer Overseer (id=null) closing
   [junit4]   2> 904891 INFO  (TEST-TestSolrConfigHandlerCloud.test-seed#[56AE902C5C813D28]) [n:127.0.0.1:39406_    ] o.a.s.c.LeaderElector Joined leadership election with path: /overseer_elect/election/96167072542162949-127.0.0.1:39406_-n_0000000000
   [junit4]   2> 904891 INFO  (TEST-TestSolrConfigHandlerCloud.test-seed#[56AE902C5C813D28]) [n:127.0.0.1:39406_    ] o.a.s.c.OverseerElectionContext I am going to be the leader 127.0.0.1:39406_
   [junit4]   2> 904891 INFO  (TEST-TestSolrConfigHandlerCloud.test-seed#[56AE902C5C813D28]) [n:127.0.0.1:39406_    ] o.a.s.c.c.SolrZkClient makePath: /overseer_elect/leader
   [junit4]   2> 904891 INFO  (TEST-TestSolrConfigHandlerCloud.test-seed#[56AE902C5C813D28]) [n:127.0.0.1:39406_    ] o.a.s.c.Overseer Overseer (id=96167072542162949-127.0.0.1:39406_-n_0000000000) starting
   [junit4]   2> 904891 INFO  (TEST-TestSolrConfigHandlerCloud.test-seed#[56AE902C5C813D28]) [n:127.0.0.1:39406_    ] o.a.s.c.c.SolrZkClient makePath: /overseer/queue-work
   [junit4]   2> 904893 INFO  (TEST-TestSolrConfigHandlerCloud.test-seed#[56AE902C5C813D28]) [n:127.0.0.1:39406_    ] o.a.s.c.OverseerAutoReplicaFailoverThread Starting OverseerAutoReplicaFailoverThread autoReplicaFailoverWorkLoopDelay=10000 autoReplicaFailoverWaitAfterExpiration=30000 autoReplicaFailoverBadNodeExpiration=60000
   [junit4]   2> 904893 INFO  (OverseerCollectionConfigSetProcessor-96167072542162949-127.0.0.1:39406_-n_0000000000) [n:127.0.0.1:39406_    ] o.a.s.c.OverseerTaskProcessor Process current queue of overseer operations
   [junit4]   2> 904893 INFO  (OverseerStateUpdate-96167072542162949-127.0.0.1:39406_-n_0000000000) [n:127.0.0.1:39406_    ] o.a.s.c.Overseer Starting to work on the main queue
   [junit4]   2> 904893 INFO  (TEST-TestSolrConfigHandlerCloud.test-seed#[56AE902C5C813D28]) [n:127.0.0.1:39406_    ] o.a.s.c.ZkController Register node as live in ZooKeeper:/live_nodes/127.0.0.1:39406_
   [junit4]   2> 904893 INFO  (TEST-TestSolrConfigHandlerCloud.test-seed#[56AE902C5C813D28]) [n:127.0.0.1:39406_    ] o.a.s.c.c.SolrZkClient makePath: /live_nodes/127.0.0.1:39406_
   [junit4]   2> 904894 INFO  (OverseerStateUpdate-96167072542162949-127.0.0.1:39406_-n_0000000000) [n:127.0.0.1:39406_    ] o.a.s.c.c.ZkStateReader Updated live nodes from ZooKeeper... (0) -> (0)
   [junit4]   2> 904894 INFO  (zkCallback-954-thread-1-processing-n:127.0.0.1:39406_) [n:127.0.0.1:39406_    ] o.a.s.c.c.ZkStateReader A live node change: [WatchedEvent state:SyncConnected type:NodeChildrenChanged path:/live_nodes], has occurred - updating... (live nodes size: [0])
   [junit4]   2> 904894 INFO  (zkCallback-954-thread-1-processing-n:127.0.0.1:39406_) [n:127.0.0.1:39406_    ] o.a.s.c.c.ZkStateReader Updated live nodes from ZooKeeper... (0) -> (1)
   [junit4]   2> 904908 INFO  (TEST-TestSolrConfigHandlerCloud.test-seed#[56AE902C5C813D28]) [n:127.0.0.1:39406_    ] o.a.s.c.CoreContainer Security conf doesn't exist. Skipping setup for authorization module.
   [junit4]   2> 904908 INFO  (TEST-TestSolrConfigHandlerCloud.test-seed#[56AE902C5C813D28]) [n:127.0.0.1:39406_    ] o.a.s.c.CoreContainer No authentication plugin used.
   [junit4]   2> 904909 INFO  (TEST-TestSolrConfigHandlerCloud.test-seed#[56AE902C5C813D28]) [n:127.0.0.1:39406_    ] o.a.s.c.CorePropertiesLocator Looking for core definitions underneath /home/jenkins/workspace/Lucene-Solr-master-Linux/solr/build/solr-core/test/J1/../../../../../../../../../home/jenkins/workspace/Lucene-Solr-master-Linux/solr/build/solr-core/test/J1/temp/solr.handler.TestSolrConfigHandlerCloud_56AE902C5C813D28-001/control-001/cores
   [junit4]   2> 904909 INFO  (TEST-TestSolrConfigHandlerCloud.test-seed#[56AE902C5C813D28]) [n:127.0.0.1:39406_    ] o.a.s.c.CoreDescriptor Created CoreDescriptor: {name=collection1, config=solrconfig.xml, transient=false, schema=schema.xml, loadOnStartup=true, configSetProperties=configsetprops.json, collection=control_collection, coreNodeName=, dataDir=data/, shard=}
   [junit4]   2> 904909 INFO  (TEST-TestSolrConfigHandlerCloud.test-seed#[56AE902C5C813D28]) [n:127.0.0.1:39406_    ] o.a.s.c.CorePropertiesLocator Found core collection1 in /home/jenkins/workspace/Lucene-Solr-master-Linux/solr/build/solr-core/test/J1/../../../../../../../../../home/jenkins/workspace/Lucene-Solr-master-Linux/solr/build/solr-core/test/J1/temp/solr.handler.TestSolrConfigHandlerCloud_56AE902C5C813D28-001/control-001/cores/collection1
   [junit4]   2> 904909 INFO  (TEST-TestSolrConfigHandlerCloud.test-seed#[56AE902C5C813D28]) [n:127.0.0.1:39406_    ] o.a.s.c.CorePropertiesLocator Found 1 core definitions
   [junit4]   2> 904911 INFO  (coreLoadExecutor-2907-thread-1-processing-n:127.0.0.1:39406_) [n:127.0.0.1:39406_ c:control_collection   x:collection1] o.a.s.c.ZkController publishing state=down
   [junit4]   2> 904911 INFO  (coreLoadExecutor-2907-thread-1-processing-n:127.0.0.1:39406_) [n:127.0.0.1:39406_ c:control_collection   x:collection1] o.a.s.c.ZkController numShards not found on descriptor - reading it from system property
   [junit4]   2> 904911 INFO  (TEST-TestSolrConfigHandlerCloud.test-seed#[56AE902C5C813D28]) [n:127.0.0.1:39406_    ] o.a.s.s.SolrDispatchFilter user.dir=/home/jenkins/workspace/Lucene-Solr-master-Linux/solr/build/solr-core/test/J1
   [junit4]   2> 904911 INFO  (TEST-TestSolrConfigHandlerCloud.test-seed#[56AE902C5C813D28]) [n:127.0.0.1:39406_    ] o.a.s.s.SolrDispatchFilter SolrDispatchFilter.init() done
   [junit4]   2> 904911 INFO  (coreLoadExecutor-2907-thread-1-processing-n:127.0.0.1:39406_) [n:127.0.0.1:39406_ c:control_collection   x:collection1] o.a.s.c.ZkController Collection control_collection not visible yet, but flagging it so a watch is registered when it becomes visible
   [junit4]   2> 904911 INFO  (OverseerStateUpdate-96167072542162949-127.0.0.1:39406_-n_0000000000) [n:127.0.0.1:39406_    ] o.a.s.c.Overseer processMessage: queueSize: 1, message = {
   [junit4]   2>   "core":"collection1",
   [junit4]   2>   "roles":null,
   [junit4]   2>   "base_url":"https://127.0.0.1:39406",
   [junit4]   2>   "node_name":"127.0.0.1:39406_",
   [junit4]   2>   "numShards":"1",
   [junit4]   2>   "state":"down",
   [junit4]   2>   "shard":null,
   [junit4]   2>   "collection":"control_collection",
   [junit4]   2>   "operation":"state"} current state version: 0
   [junit4]   2> 904911 INFO  (OverseerStateUpdate-96167072542162949-127.0.0.1:39406_-n_0000000000) [n:127.0.0.1:39406_    ] o.a.s.c.o.ReplicaMutator Update state numShards=1 message={
   [junit4]   2>   "core":"collection1",
   [junit4]   2>   "roles":null,
   [junit4]   2>   "base_url":"https://127.0.0.1:39406",
   [junit4]   2>   "node_name":"127.0.0.1:39406_",
   [junit4]   2>   "numShards":"1",
   [junit4]   2>   "state":"down",
   [junit4]   2>   "shard":null,
   [junit4]   2>   "collection":"control_collection",
   [junit4]   2>   "operation":"state"}
   [junit4]   2> 904911 INFO  (coreLoadExecutor-2907-thread-1-processing-n:127.0.0.1:39406_) [n:127.0.0.1:39406_ c:control_collection   x:collection1] o.a.s.c.c.ZkStateReader Deleting data for [control_collection]
   [junit4]   2> 904911 INFO  (OverseerStateUpdate-96167072542162949-127.0.0.1:39406_-n_0000000000) [n:127.0.0.1:39406_    ] o.a.s.c.o.ClusterStateMutator building a new cName: control_collection
   [junit4]   2> 904912 INFO  (OverseerStateUpdate-96167072542162949-127.0.0.1:39406_-n_0000000000) [n:127.0.0.1:39406_    ] o.a.s.c.o.ReplicaMutator Assigning new node to shard shard=shard1
   [junit4]   2> 904912 INFO  (coreLoadExecutor-2907-thread-1-processing-n:127.0.0.1:39406_) [n:127.0.0.1:39406_ c:control_collection   x:collection1] o.a.s.c.ZkController look for our core node name
   [junit4]   2> 904912 INFO  (zkCallback-954-thread-1-processing-n:127.0.0.1:39406_) [n:127.0.0.1:39406_    ] o.a.s.c.c.ZkStateReader A cluster state change: [WatchedEvent state:SyncConnected type:NodeDataChanged path:/clusterstate.json], has occurred - updating... (live nodes size: [1])
   [junit4]   2> 905912 INFO  (coreLoadExecutor-2907-thread-1-processing-n:127.0.0.1:39406_) [n:127.0.0.1:39406_ c:control_collection   x:collection1] o.a.s.c.ZkController waiting to find shard id in clusterstate for collection1
   [junit4]   2> 905912 INFO  (coreLoadExecutor-2907-thread-1-processing-n:127.0.0.1:39406_) [n:127.0.0.1:39406_ c:control_collection   x:collection1] o.a.s.c.ZkController Check for collection zkNode:control_collection
   [junit4]   2> 905912 INFO  (coreLoadExecutor-2907-thread-1-processing-n:127.0.0.1:39406_) [n:127.0.0.1:39406_ c:control_collection   x:collection1] o.a.s.c.ZkController Collection zkNode exists
   [junit4]   2> 905912 INFO  (coreLoadExecutor-2907-thread-1-processing-n:127.0.0.1:39406_) [n:127.0.0.1:39406_ c:control_collection   x:collection1] o.a.s.c.c.ZkStateReader Load collection config from: [/collections/control_collection]
   [junit4]   2> 905913 INFO  (coreLoadExecutor-2907-thread-1-processing-n:127.0.0.1:39406_) [n:127.0.0.1:39406_ c:control_collection   x:collection1] o.a.s.c.c.ZkStateReader path=[/collections/control_collection] [configName]=[conf1] specified config exists in ZooKeeper
   [junit4]   2> 905913 INFO  (coreLoadExecutor-2907-thread-1-processing-n:127.0.0.1:39406_) [n:127.0.0.1:39406_ c:control_collection   x:collection1] o.a.s.c.SolrResourceLoader new SolrResourceLoader for directory: '/home/jenkins/workspace/Lucene-Solr-master-Linux/solr/build/solr-core/test/J1/temp/solr.handler.TestSolrConfigHandlerCloud_56AE902C5C813D28-001/control-001/cores/collection1'
   [junit4]   2> 905913 INFO  (coreLoadExecutor-2907-thread-1-processing-n:127.0.0.1:39406_) [n:127.0.0.1:39406_ c:control_collection   x:collection1] o.a.s.c.SolrResourceLoader JNDI not configured for solr (NoInitialContextEx)
   [junit4]   2> 905913 INFO  (coreLoadExecutor-2907-thread-1-processing-n:127.0.0.1:39406_) [n:127.0.0.1:39406_ c:control_collection   x:collection1] o.a.s.c.SolrResourceLoader solr home defaulted to 'solr/' (could not find system property or JNDI)
   [junit4]   2> 905914 INFO  (coreLoadExecutor-2907-thread-1-processing-n:127.0.0.1:39406_) [n:127.0.0.1:39406_ c:control_collection   x:collection1] o.a.s.c.Config loaded config solrconfig.xml with version 0 
   [junit4]   2> 905917 INFO  (coreLoadExecutor-2907-thread-1-processing-n:127.0.0.1:39406_) [n:127.0.0.1:39406_ c:control_collection   x:collection1] o.a.s.c.SolrConfig current version of requestparams : -1
   [junit4]   2> 905919 INFO  (coreLoadExecutor-2907-thread-1-processing-n:127.0.0.1:39406_) [n:127.0.0.1:39406_ c:control_collection   x:collection1] o.a.s.c.SolrConfig Using Lucene MatchVersion: 7.0.0
   [junit4]   2> 905924 INFO  (coreLoadExecutor-2907-thread-1-processing-n:127.0.0.1:39406_) [n:127.0.0.1:39406_ c:control_collection   x:collection1] o.a.s.c.SolrConfig Loaded SolrConfig: solrconfig.xml
   [junit4]   2> 905928 INFO  (coreLoadExecutor-2907-thread-1-processing-n:127.0.0.1:39406_) [n:127.0.0.1:39406_ c:control_collection   x:collection1] o.a.s.s.IndexSchema [collection1] Schema name=test
   [junit4]   2> 905989 INFO  (coreLoadExecutor-2907-thread-1-processing-n:127.0.0.1:39406_) [n:127.0.0.1:39406_ c:control_collection   x:collection1] o.a.s.s.OpenExchangeRatesOrgProvider Initialized with rates=open-exchange-rates.json, refreshInterval=1440.
   [junit4]   2> 905993 INFO  (coreLoadExecutor-2907-thread-1-processing-n:127.0.0.1:39406_) [n:127.0.0.1:39406_ c:control_collection   x:collection1] o.a.s.s.IndexSchema default search field in schema is text
   [junit4]   2> 905994 INFO  (coreLoadExecutor-2907-thread-1-processing-n:127.0.0.1:39406_) [n:127.0.0.1:39406_ c:control_collection   x:collection1] o.a.s.s.IndexSchema unique key field: id
   [junit4]   2> 905997 INFO  (coreLoadExecutor-2907-thread-1-processing-n:127.0.0.1:39406_) [n:127.0.0.1:39406_ c:control_collection   x:collection1] o.a.s.s.FileExchangeRateProvider Reloading exchange rates from file currency.xml
   [junit4]   2> 905999 INFO  (coreLoadExecutor-2907-thread-1-processing-n:127.0.0.1:39406_) [n:127.0.0.1:39406_ c:control_collection   x:collection1] o.a.s.s.FileExchangeRateProvider Reloading exchange rates from file currency.xml
   [junit4]   2> 906000 INFO  (coreLoadExecutor-2907-thread-1-processing-n:127.0.0.1:39406_) [n:127.0.0.1:39406_ c:control_collection   x:collection1] o.a.s.s.OpenExchangeRatesOrgProvider Reloading exchange rates from open-exchange-rates.json
   [junit4]   2> 906000 INFO  (coreLoadExecutor-2907-thread-1-processing-n:127.0.0.1:39406_) [n:127.0.0.1:39406_ c:control_collection   x:collection1] o.a.s.s.OpenExchangeRatesOrgProvider Reloading exchange rates from open-exchange-rates.json
   [junit4]   2> 906001 INFO  (coreLoadExecutor-2907-thread-1-processing-n:127.0.0.1:39406_) [n:127.0.0.1:39406_ c:control_collection   x:collection1] o.a.s.c.ConfigSetProperties Did not find ConfigSet properties, assuming default properties: Can't find resource 'configsetprops.json' in classpath or '/configs/conf1', cwd=/home/jenkins/workspace/Lucene-Solr-master-Linux/solr/build/solr-core/test/J1
   [junit4]   2> 906001 INFO  (coreLoadExecutor-2907-thread-1-processing-n:127.0.0.1:39406_) [n:127.0.0.1:39406_ c:control_collection   x:collection1] o.a.s.c.CoreContainer Creating SolrCore 'collection1' using configuration from collection control_collection
   [junit4]   2> 906001 INFO  (coreLoadExecutor-2907-thread-1-processing-n:127.0.0.1:39406_) [n:127.0.0.1:39406_ c:control_collection s:shard1 r:core_node1 x:collection1] o.a.s.c.SolrCore org.apache.solr.core.MockDirectoryFactory
   [junit4]   2> 906001 INFO  (coreLoadExecutor-2907-thread-1-processing-n:127.0.0.1:39406_) [n:127.0.0.1:39406_ c:control_collection s:shard1 r:core_node1 x:collection1] o.a.s.c.SolrCore [[collection1] ] Opening new SolrCore at [/home/jenkins/workspace/Lucene-Solr-master-Linux/solr/build/solr-core/test/J1/temp/solr.handler.TestSolrConfigHandlerCloud_56AE902C5C813D28-001/control-001/cores/collection1], dataDir=[/home/jenkins/workspace/Lucene-Solr-master-Linux/solr/build/solr-core/test/J1/../../../../../../../../../home/jenkins/workspace/Lucene-Solr-master-Linux/solr/build/solr-core/test/J1/temp/solr.handler.TestSolrConfigHandlerCloud_56AE902C5C813D28-001/control-001/cores/collection1/data/]
   [junit4]   2> 906001 INFO  (coreLoadExecutor-2907-thread-1-processing-n:127.0.0.1:39406_) [n:127.0.0.1:39406_ c:control_collection s:shard1 r:core_node1 x:collection1] o.a.s.c.JmxMonitoredMap JMX monitoring is enabled. Adding Solr mbeans to JMX Server: com.sun.jmx.mbeanserver.JmxMBeanServer@8bb179
   [junit4]   2> 906001 INFO  (coreLoadExecutor-2907-thread-1-processing-n:127.0.0.1:39406_) [n:127.0.0.1:39406_ c:control_collection s:shard1 r:core_node1 x:collection1] o.a.s.c.CachingDirectoryFactory return new directory for /home/jenkins/workspace/Lucene-Solr-master-Linux/solr/build/solr-core/test/J1/../../../../../../../../../home/jenkins/workspace/Lucene-Solr-master-Linux/solr/build/solr-core/test/J1/temp/solr.handler.TestSolrConfigHandlerCloud_56AE902C5C813D28-001/control-001/cores/collection1/data
   [junit4]   2> 906002 INFO  (coreLoadExecutor-2907-thread-1-processing-n:127.0.0.1:39406_) [n:127.0.0.1:39406_ c:control_collection s:shard1 r:core_node1 x:collection1] o.a.s.c.SolrCore New index directory detected: old=null new=/home/jenkins/workspace/Lucene-Solr-master-Linux/solr/build/solr-core/test/J1/../../../../../../../../../home/jenkins/workspace/Lucene-Solr-master-Linux/solr/build/solr-core/test/J1/temp/solr.handler.TestSolrConfigHandlerCloud_56AE902C5C813D28-001/control-001/cores/collection1/data/index/
   [junit4]   2> 906002 WARN  (coreLoadExecutor-2907-thread-1-processing-n:127.0.0.1:39406_) [n:127.0.0.1:39406_ c:control_collection s:shard1 r:core_node1 x:collection1] o.a.s.c.SolrCore [collection1] Solr index directory '/home/jenkins/workspace/Lucene-Solr-master-Linux/solr/build/solr-core/test/J1/../../../../../../../../../home/jenkins/workspace/Lucene-Solr-master-Linux/solr/build/solr-core/test/J1/temp/solr.handler.TestSolrConfigHandlerCloud_56AE902C5C813D28-001/control-001/cores/collection1/data/index' doesn't exist. Creating new index...
   [junit4]   2> 906002 INFO  (coreLoadExecutor-2907-thread-1-processing-n:127.0.0.1:39406_) [n:127.0.0.1:39406_ c:control_collection s:shard1 r:core_node1 x:collection1] o.a.s.c.CachingDirectoryFactory return new directory for /home/jenkins/workspace/Lucene-Solr-master-Linux/solr/build/solr-core/test/J1/../../../../../../../../../home/jenkins/workspace/Lucene-Solr-master-Linux/solr/build/solr-core/test/J1/temp/solr.handler.TestSolrConfigHandlerCloud_56AE902C5C813D28-001/control-001/cores/collection1/data/index
   [junit4]   2> 906003 INFO  (coreLoadExecutor-2907-thread-1-processing-n:127.0.0.1:39406_) [n:127.0.0.1:39406_ c:control_collection s:shard1 r:core_node1 x:collection1] o.a.s.u.RandomMergePolicy RandomMergePolicy wrapping class org.apache.lucene.index.LogDocMergePolicy: [LogDocMergePolicy: minMergeSize=1000, mergeFactor=27, maxMergeSize=9223372036854775807, maxMergeSizeForForcedMerge=9223372036854775807, calibrateSizeByDeletes=true, maxMergeDocs=2147483647, maxCFSSegmentSizeMB=8.796093022207999E12, noCFSRatio=0.289865618377885]
   [junit4]   2> 906003 INFO  (coreLoadExecutor-2907-thread-1-processing-n:127.0.0.1:39406_) [n:127.0.0.1:39406_ c:control_collection s:shard1 r:core_node1 x:collection1] o.a.s.c.SolrDeletionPolicy SolrDeletionPolicy.onCommit: commits: num=1
   [junit4]   2> 	commit{dir=MockDirectoryWrapper(RAMDirectory@188a80c lockFactory=org.apache.lucene.store.SingleInstanceLockFactory@359069),segFN=segments_1,generation=1}
   [junit4]   2> 906003 INFO  (coreLoadExecutor-2907-thread-1-processing-n:127.0.0.1:39406_) [n:127.0.0.1:39406_ c:control_collection s:shard1 r:core_node1 x:collection1] o.a.s.c.SolrDeletionPolicy newest commit generation = 1
   [junit4]   2> 906003 INFO  (OldIndexDirectoryCleanupThreadForCore-collection1) [n:127.0.0.1:39406_ c:control_collection s:shard1 r:core_node1 x:collection1] o.a.s.c.SolrCore Looking for old index directories to cleanup for core collection1 in /home/jenkins/workspace/Lucene-Solr-master-Linux/solr/build/solr-core/test/J1/../../../../../../../../../home/jenkins/workspace/Lucene-Solr-master-Linux/solr/build/solr-core/test/J1/temp/solr.handler.TestSolrConfigHandlerCloud_56AE902C5C813D28-001/control-001/cores/collection1/data/
   [junit4]   2> 906003 WARN  (OldIndexDirectoryCleanupThreadForCore-collection1) [n:127.0.0.1:39406_ c:control_collection s:shard1 r:core_node1 x:collection1] o.a.s.c.DirectoryFactory /home/jenkins/workspace/Lucene-Solr-master-Linux/solr/build/solr-core/test/J1/../../../../../../../../../home/jenkins/workspace/Lucene-Solr-master-Linux/solr/build/solr-core/test/J1/temp/solr.handler.TestSolrConfigHandlerCloud_56AE902C5C813D28-001/control-001/cores/collection1/data/ does not point to a valid data directory; skipping clean-up of old index directories.
   [junit4]   2> 906005 INFO  (coreLoadExecutor-2907-thread-1-processing-n:127.0.0.1:39406_) [n:127.0.0.1:39406_ c:control_collection s:shard1 r:core_node1 x:collection1] o.a.s.u.p.UpdateRequestProcessorChain creating updateRequestProcessorChain "nodistrib"
   [junit4]   2> 906005 INFO  (coreLoadExecutor-2907-thread-1-processing-n:127.0.0.1:39406_) [n:127.0.0.1:39406_ c:control_collection s:shard1 r:core_node1 x:collection1] o.a.s.u.p.UpdateRequestProcessorChain creating updateRequestProcessorChain "dedupe"
   [junit4]   2> 906005 INFO  (coreLoadExecutor-2907-thread-1-processing-n:127.0.0.1:39406_) [n:127.0.0.1:39406_ c:control_collection s:shard1 r:core_node1 x:collection1] o.a.s.u.p.UpdateRequestProcessorChain inserting DistributedUpdateProcessorFactory into updateRequestProcessorChain "dedupe"
   [junit4]   2> 906005 INFO  (coreLoadExecutor-2907-thread-1-processing-n:127.0.0.1:39406_) [n:127.0.0.1:39406_ c:control_collection s:shard1 r:core_node1 x:collection1] o.a.s.u.p.UpdateRequestProcessorChain creating updateRequestProcessorChain "stored_sig"
   [junit4]   2> 906005 INFO  (coreLoadExecutor-2907-thread-1-processing-n:127.0.0.1:39406_) [n:127.0.0.1:39406_ c:control_collection s:shard1 r:core_node1 x:collection1] o.a.s.u.p.UpdateRequestProcessorChain inserting DistributedUpdateProcessorFactory into updateRequestProcessorChain "stored_sig"
   [junit4]   2> 906005 INFO  (coreLoadExecutor-2907-thread-1-processing-n:127.0.0.1:39406_) [n:127.0.0.1:39406_ c:control_collection s:shard1 r:core_node1 x:collection1] o.a.s.u.p.UpdateRequestProcessorChain creating updateRequestProcessorChain "distrib-dup-test-chain-explicit"
   [junit4]   2> 906005 INFO  (coreLoadExecutor-2907-thread-1-processing-n:127.0.0.1:39406_) [n:127.0.0.1:39406_ c:control_collection s:shard1 r:core_node1 x:collection1] o.a.s.u.p.UpdateRequestProcessorChain creating updateRequestProcessorChain "distrib-dup-test-chain-implicit"
   [junit4]   2> 906005 INFO  (coreLoadExecutor-2907-thread-1-processing-n:127.0.0.1:39406_) [n:127.0.0.1:39406_ c:control_collection s:shard1 r:core_node1 x:collection1] o.a.s.u.p.UpdateRequestProcessorChain inserting DistributedUpdateProcessorFactory into updateRequestProcessorChain "distrib-dup-test-chain-implicit"
   [junit4]   2> 906005 INFO  (coreLoadExecutor-2907-thread-1-processing-n:127.0.0.1:39406_) [n:127.0.0.1:39406_ c:control_collection s:shard1 r:core_node1 x:collection1] o.a.s.c.SolrCore no updateRequestProcessorChain defined as default, creating implicit default
   [junit4]   2> 906005 WARN  (coreLoadExecutor-2907-thread-1-processing-n:127.0.0.1:39406_) [n:127.0.0.1:39406_ c:control_collection s:shard1 r:core_node1 x:collection1] o.a.s.c.RequestHandlers INVALID paramSet a in requestHandler {type = requestHandler,name = /dump,class = DumpRequestHandler,args = {defaults={a=A,b=B}}}
   [junit4]   2> 906007 INFO  (coreLoadExecutor-2907-thread-1-processing-n:127.0.0.1:39406_) [n:127.0.0.1:39406_ c:control_collection s:shard1 r:core_node1 x:collection1] o.a.s.h.l.XMLLoader xsltCacheLifetimeSeconds=60
   [junit4]   2> 906007 INFO  (coreLoadExecutor-2907-thread-1-processing-n:127.0.0.1:39406_) [n:127.0.0.1:39406_ c:control_collection s:shard1 r:core_node1 x:collection1] o.a.s.h.l.XMLLoader xsltCacheLifetimeSeconds=60
   [junit4]   2> 906008 INFO  (coreLoadExecutor-2907-thread-1-processing-n:127.0.0.1:39406_) [n:127.0.0.1:39406_ c:control_collection s:shard1 r:core_node1 x:collection1] o.a.s.h.l.XMLLoader xsltCacheLifetimeSeconds=60
   [junit4]   2> 906008 INFO  (coreLoadExecutor-2907-thread-1-processing-n:127.0.0.1:39406_) [n:127.0.0.1:39406_ c:control_collection s:shard1 r:core_node1 x:collection1] o.a.s.h.l.XMLLoader xsltCacheLifetimeSeconds=60
   [junit4]   2> 906011 INFO  (coreLoadExecutor-2907-thread-1-processing-n:127.0.0.1:39406_) [n:127.0.0.1:39406_ c:control_collection s:shard1 r:core_node1 x:collection1] o.a.s.c.RequestHandlers Registered paths: /admin/mbeans,standard,/update/json/docs,/admin/luke,/export,/get,/admin/properties,/update/json,/admin/threads,/dump,/update/csv,/sql,/graph,/admin/segments,/admin/system,/replication,/config,/stream,/schema,/admin/plugins,/admin/logging,/admin/ping,/update,/admin/file
   [junit4]   2> 906011 INFO  (coreLoadExecutor-2907-thread-1-processing-n:127.0.0.1:39406_) [n:127.0.0.1:39406_ c:control_collection s:shard1 r:core_node1 x:collection1] o.a.s.c.SolrCore Using default statsCache cache: org.apache.solr.search.stats.LocalStatsCache
   [junit4]   2> 906012 INFO  (coreLoadExecutor-2907-thread-1-processing-n:127.0.0.1:39406_) [n:127.0.0.1:39406_ c:control_collection s:shard1 r:core_node1 x:collection1] o.a.s.u.UpdateHandler Using UpdateLog implementation: org.apache.solr.update.UpdateLog
   [junit4]   2> 906012 INFO  (coreLoadExecutor-2907-thread-1-processing-n:127.0.0.1:39406_) [n:127.0.0.1:39406_ c:control_collection s:shard1 r:core_node1 x:collection1] o.a.s.u.UpdateLog Initializing UpdateLog: dataDir= defaultSyncLevel=FLUSH numRecordsToKeep=100 maxNumLogsToKeep=10 numVersionBuckets=65536
   [junit4]   2> 906013 INFO  (coreLoadExecutor-2907-thread-1-processing-n:127.0.0.1:39406_) [n:127.0.0.1:39406_ c:control_collection s:shard1 r:core_node1 x:collection1] o.a.s.u.CommitTracker Hard AutoCommit: disabled
   [junit4]   2> 906013 INFO  (coreLoadExecutor-2907-thread-1-processing-n:127.0.0.1:39406_) [n:127.0.0.1:39406_ c:control_collection s:shard1 r:core_node1 x:collection1] o.a.s.u.CommitTracker Soft AutoCommit: disabled
   [junit4]   2> 906013 INFO  (coreLoadExecutor-2907-thread-1-processing-n:127.0.0.1:39406_) [n:127.0.0.1:39406_ c:control_collection s:shard1 r:core_node1 x:collection1] o.a.s.u.RandomMergePolicy RandomMergePolicy wrapping class org.apache.lucene.index.TieredMergePolicy: [TieredMergePolicy: maxMergeAtOnce=49, maxMergeAtOnceExplicit=23, maxMergedSegmentMB=1.2353515625, floorSegmentMB=1.9072265625, forceMergeDeletesPctAllowed=0.4255320174640098, segmentsPerTier=50.0, maxCFSSegmentSizeMB=8.796093022207999E12, noCFSRatio=0.0
   [junit4]   2> 906013 INFO  (coreLoadExecutor-2907-thread-1-processing-n:127.0.0.1:39406_) [n:127.0.0.1:39406_ c:control_collection s:shard1 r:core_node1 x:collection1] o.a.s.c.SolrDeletionPolicy SolrDeletionPolicy.onInit: commits: num=1
   [junit4]   2> 	commit{dir=MockDirectoryWrapper(RAMDirectory@188a80c lockFactory=org.apache.lucene.store.SingleInstanceLockFactory@359069),segFN=segments_1,generation=1}
   [junit4]   2> 906013 INFO  (coreLoadExecutor-2907-thread-1-processing-n:127.0.0.1:39406_) [n:127.0.0.1:39406_ c:control_collection s:shard1 r:core_node1 x:collection1] o.a.s.c.SolrDeletionPolicy newest commit generation = 1
   [junit4]   2> 906013 INFO  (coreLoadExecutor-2907-thread-1-processing-n:127.0.0.1:39406_) [n:127.0.0.1:39406_ c:control_collection s:shard1 r:core_node1 x:collection1] o.a.s.s.SolrIndexSearcher Opening [Searcher@180f80e[collection1] main]
   [junit4]   2> 906013 INFO  (coreLoadExecutor-2907-thread-1-processing-n:127.0.0.1:39406_) [n:127.0.0.1:39406_ c:control_collection s:shard1 r:core_node1 x:collection1] o.a.s.c.c.ZkStateReader Load collection config from: [/collections/control_collection]
   [junit4]   2> 906015 INFO  (coreLoadExecutor-2907-thread-1-processing-n:127.0.0.1:39406_) [n:127.0.0.1:39406_ c:control_collection s:shard1 r:core_node1 x:collection1] o.a.s.c.c.ZkStateReader path=[/collections/control_collection] [configName]=[conf1] specified config exists in ZooKeeper
   [junit4]   2> 906015 INFO  (coreLoadExecutor-2907-thread-1-processing-n:127.0.0.1:39406_) [n:127.0.0.1:39406_ c:control_collection s:shard1 r:core_node1 x:collection1] o.a.s.r.ManagedResourceStorage Setting up ZooKeeper-based storage for the RestManager with znodeBase: /configs/conf1
   [junit4]   2> 906015 INFO  (coreLoadExecutor-2907-thread-1-processing-n:127.0.0.1:39406_) [n:127.0.0.1:39406_ c:control_collection s:shard1 r:core_node1 x:collection1] o.a.s.r.ManagedResourceStorage Configured ZooKeeperStorageIO with znodeBase: /configs/conf1
   [junit4]   2> 906015 INFO  (coreLoadExecutor-2907-thread-1-processing-n:127.0.0.1:39406_) [n:127.0.0.1:39406_ c:control_collection s:shard1 r:core_node1 x:collection1] o.a.s.r.RestManager Initializing RestManager with initArgs: {}
   [junit4]   2> 906015 INFO  (coreLoadExecutor-2907-thread-1-processing-n:127.0.0.1:39406_) [n:127.0.0.1:39406_ c:control_collection s:shard1 r:core_node1 x:collection1] o.a.s.r.ManagedResourceStorage Reading _rest_managed.json using ZooKeeperStorageIO:path=/configs/conf1
   [junit4]   2> 906015 INFO  (coreLoadExecutor-2907-thread-1-processing-n:127.0.0.1:39406_) [n:127.0.0.1:39406_ c:control_collection s:shard1 r:core_node1 x:collection1] o.a.s.r.ManagedResourceStorage No data found for znode /configs/conf1/_rest_managed.json
   [junit4]   2> 906015 INFO  (coreLoadExecutor-2907-thread-1-processing-n:127.0.0.1:39406_) [n:127.0.0.1:39406_ c:control_collection s:shard1 r:core_node1 x:collection1] o.a.s.r.ManagedResourceStorage Loaded null at path _rest_managed.json using ZooKeeperStorageIO:path=/configs/conf1
   [junit4]   2> 906015 INFO  (coreLoadExecutor-2907-thread-1-processing-n:127.0.0.1:39406_) [n:127.0.0.1:39406_ c:control_collection s:shard1 r:core_node1 x:collection1] o.a.s.r.RestManager Initializing 0 registered ManagedResources
   [junit4]   2> 906015 INFO  (coreLoadExecutor-2907-thread-1-processing-n:127.0.0.1:39406_) [n:127.0.0.1:39406_ c:control_collection s:shard1 r:core_node1 x:collection1] o.a.s.h.ReplicationHandler Commits will be reserved for  10000
   [junit4]   2> 906016 INFO  (searcherExecutor-2908-thread-1-processing-n:127.0.0.1:39406_ x:collection1 s:shard1 c:control_collection r:core_node1) [n:127.0.0.1:39406_ c:control_collection s:shard1 r:core_node1 x:collection1] o.a.s.c.SolrCore [collection1] Registered new searcher Searcher@180f80e[collection1] main{ExitableDirectoryReader(UninvertingDirectoryReader())}
   [junit4]   2> 906016 INFO  (coreLoadExecutor-2907-thread-1-processing-n:127.0.0.1:39406_) [n:127.0.0.1:39406_ c:control_collection s:shard1 r:core_node1 x:collection1] o.a.s.u.UpdateLog Looking up max value of version field to seed version buckets
   [junit4]   2> 906016 INFO  (coreLoadExecutor-2907-thread-1-processing-n:127.0.0.1:39406_) [n:127.0.0.1:39406_ c:control_collection s:shard1 r:core_node1 x:collection1] o.a.s.u.VersionInfo Refreshing highest value of _version_ for 65536 version buckets from index
   [junit4]   2> 906016 INFO  (coreLoadExecutor-2907-thread-1-processing-n:127.0.0.1:39406_) [n:127.0.0.1:39406_ c:control_collection s:shard1 r:core_node1 x:collection1] o.a.s.u.VersionInfo No terms found for _version_, cannot seed version bucket highest value from index
   [junit4]   2> 906016 INFO  (coreLoadExecutor-2907-thread-1-processing-n:127.0.0.1:39406_) [n:127.0.0.1:39406_ c:control_collection s:shard1 r:core_node1 x:collection1] o.a.s.u.UpdateLog Could not find max version in index or recent updates, using new clock 1538673162053484544
   [junit4]   2> 906018 INFO  (coreLoadExecutor-2907-thread-1-processing-n:127.0.0.1:39406_) [n:127.0.0.1:39406_ c:control_collection s:shard1 r:core_node1 x:collection1] o.a.s.u.UpdateLog Took 1.0ms to seed version buckets with highest version 1538673162053484544
   [junit4]   2> 906018 INFO  (coreLoadExecutor-2907-thread-1-processing-n:127.0.0.1:39406_) [n:127.0.0.1:39406_ c:control_collection s:shard1 r:core_node1 x:collection1] o.a.s.c.ZkController watch zkdir /configs/conf1
   [junit4]   2> 906018 INFO  (coreLoadExecutor-2907-thread-1-processing-n:127.0.0.1:39406_) [n:127.0.0.1:39406_ c:control_collection s:shard1 r:core_node1 x:collection1] o.a.s.c.CoreContainer registering core: collection1
   [junit4]   2> 906018 INFO  (coreZkRegister-2901-thread-1-processing-n:127.0.0.1:39406_ x:collection1 s:shard1 c:control_collection r:core_node1) [n:127.0.0.1:39406_ c:control_collection s:shard1 r:core_node1 x:collection1] o.a.s.c.ZkController Register replica - core:collection1 address:https://127.0.0.1:39406 collection:control_collection shard:shard1
   [junit4]   2> 906019 INFO  (coreZkRegister-2901-thread-1-processing-n:127.0.0.1:39406_ x:collection1 s:shard1 c:control_collection r:core_node1) [n:127.0.0.1:39406_ c:control_collection s:shard1 r:core_node1 x:collection1] o.a.s.c.c.SolrZkClient makePath: /collections/control_collection/leader_elect/shard1/election
   [junit4]   2> 906020 INFO  (coreZkRegister-2901-thread-1-processing-n:127.0.0.1:39406_ x:collection1 s:shard1 c:control_collection r:core_node1) [n:127.0.0.1:39406_ c:control_collection s:shard1 r:core_node1 x:collection1] o.a.s.c.LeaderElector Joined leadership election with path: /collections/control_collection/leader_elect/shard1/election/96167072542162949-core_node1-n_0000000000
   [junit4]   2> 906020 INFO  (coreZkRegister-2901-thread-1-processing-n:127.0.0.1:39406_ x:collection1 s:shard1 c:control_collection r:core_node1) [n:127.0.0.1:39406_ c:control_collection s:shard1 r:core_node1 x:collection1] o.a.s.c.ShardLeaderElectionContext Running the leader process for shard=shard1 and weAreReplacement=false and leaderVoteWait=10000
   [junit4]   2> 906021 INFO  (coreZkRegister-2901-thread-1-processing-n:127.0.0.1:39406_ x:collection1 s:shard1 c:control_collection r:core_node1) [n:127.0.0.1:39406_ c:control_collection s:shard1 r:core_node1 x:collection1] o.a.s.c.ShardLeaderElectionContext Enough replicas found to continue.
   [junit4]   2> 906021 INFO  (coreZkRegister-2901-thread-1-processing-n:127.0.0.1:39406_ x:collection1 s:shard1 c:control_collection r:core_node1) [n:127.0.0.1:39406_ c:control_collection s:shard1 r:core_node1 x:collection1] o.a.s.c.ShardLeaderElectionContext I may be the new leader - try and sync
   [junit4]   2> 906021 INFO  (coreZkRegister-2901-thread-1-processing-n:127.0.0.1:39406_ x:collection1 s:shard1 c:control_collection r:core_node1) [n:127.0.0.1:39406_ c:control_collection s:shard1 r:core_node1 x:collection1] o.a.s.c.SyncStrategy Sync replicas to https://127.0.0.1:39406/collection1/
   [junit4]   2> 906021 INFO  (coreZkRegister-2901-thread-1-processing-n:127.0.0.1:39406_ x:collection1 s:shard1 c:control_collection r:core_node1) [n:127.0.0.1:39406_ c:control_collection s:shard1 r:core_node1 x:collection1] o.a.s.c.SyncStrategy Sync Success - now sync replicas to me
   [junit4]   2> 906021 INFO  (OverseerStateUpdate-96167072542162949-127.0.0.1:39406_-n_0000000000) [n:127.0.0.1:39406_    ] o.a.s.c.Overseer processMessage: queueSize: 1, message = {
   [junit4]   2>   "operation":"leader",
   [junit4]   2>   "shard":"shard1",
   [junit4]   2>   "collection":"control_collection"} current state version: 1
   [junit4]   2> 906021 INFO  (coreZkRegister-2901-thread-1-processing-n:127.0.0.1:39406_ x:collection1 s:shard1 c:control_collection r:core_node1) [n:127.0.0.1:39406_ c:control_collection s:shard1 r:core_node1 x:collection1] o.a.s.c.SyncStrategy https://127.0.0.1:39406/collection1/ has no replicas
   [junit4]   2> 906021 INFO  (coreZkRegister-2901-thread-1-processing-n:127.0.0.1:39406_ x:collection1 s:shard1 c:control_collection r:core_node1) [n:127.0.0.1:39406_ c:control_collection s:shard1 r:core_node1 x:collection1] o.a.s.c.c.SolrZkClient makePath: /collections/control_collection/leaders/shard1
   [junit4]   2> 906022 INFO  (coreZkRegister-2901-thread-1-processing-n:127.0.0.1:39406_ x:collection1 s:shard1 c:control_collection r:core_node1) [n:127.0.0.1:39406_ c:control_collection s:shard1 r:core_node1 x:collection1] o.a.s.c.ShardLeaderElectionContextBase Creating leader registration node /collections/control_collection/leaders/shard1/leader after winning as /collections/control_collection/leader_elect/shard1/election/96167072542162949-core_node1-n_0000000000
   [junit4]   2> 906023 INFO  (coreZkRegister-2901-thread-1-processing-n:127.0.0.1:39406_ x:collection1 s:shard1 c:control_collection r:core_node1) [n:127.0.0.1:39406_ c:control_collection s:shard1 r:core_node1 x:collection1] o.a.s.c.ShardLeaderElectionContext I am the new leader: https://127.0.0.1:39406/collection1/ shard1
   [junit4]   2> 906023 INFO  (OverseerStateUpdate-96167072542162949-127.0.0.1:39406_-n_0000000000) [n:127.0.0.1:39406_    ] o.a.s.c.Overseer processMessage: queueSize: 1, message = {
   [junit4]   2>   "operation":"leader",
   [junit4]   2>   "shard":"shard1",
   [junit4]   2>   "collection":"control_collection",
   [junit4]   2>   "base_url":"https://127.0.0.1:39406",
   [junit4]   2>   "core":"collection1",
   [junit4]   2>   "state":"active"} current state version: 1
   [junit4]   2> 906124 INFO  (zkCallback-954-thread-1-processing-n:127.0.0.1:39406_) [n:127.0.0.1:39406_    ] o.a.s.c.c.ZkStateReader A cluster state change: [WatchedEvent state:SyncConnected type:NodeDataChanged path:/clusterstate.json], has occurred - updating... (live nodes size: [1])
   [junit4]   2> 906173 INFO  (coreZkRegister-2901-thread-1-processing-n:127.0.0.1:39406_ x:collection1 s:shard1 c:control_collection r:core_node1) [n:127.0.0.1:39406_ c:control_collection s:shard1 r:core_node1 x:collection1] o.a.s.c.ZkController We are https://127.0.0.1:39406/collection1/ and leader is https://127.0.0.1:39406/collection1/
   [junit4]   2> 906173 INFO  (coreZkRegister-2901-thread-1-processing-n:127.0.0.1:39406_ x:collection1 s:shard1 c:control_collection r:core_node1) [n:127.0.0.1:39406_ c:control_collection s:shard1 r:core_node1 x:collection1] o.a.s.c.ZkController No LogReplay needed for core=collection1 baseURL=https://127.0.0.1:39406
   [junit4]   2> 906173 INFO  (coreZkRegister-2901-thread-1-processing-n:127.0.0.1:39406_ x:collection1 s:shard1 c:control_collection r:core_node1) [n:127.0.0.1:39406_ c:control_collection s:shard1 r:core_node1 x:collection1] o.a.s.c.ZkController I am the leader, no recovery necessary
   [junit4]   2> 906173 INFO  (coreZkRegister-2901-thread-1-processing-n:127.0.0.1:39406_ x:collection1 s:shard1 c:control_collection r:core_node1) [n:127.0.0.1:39406_ c:control_collection s:shard1 r:core_node1 x:collection1] o.a.s.c.ZkController publishing state=active
   [junit4]   2> 906173 INFO  (coreZkRegister-2901-thread-1-processing-n:127.0.0.1:39406_ x:collection1 s:shard1 c:control_collection r:core_node1) [n:127.0.0.1:39406_ c:control_collection s:shard1 r:core_node1 x:collection1] o.a.s.c.ZkController numShards not found on descriptor - reading it from system property
   [junit4]   2> 906174 INFO  (OverseerStateUpdate-96167072542162949-127.0.0.1:39406_-n_0000000000) [n:127.0.0.1:39406_    ] o.a.s.c.Overseer processMessage: queueSize: 1, message = {
   [junit4]   2>   "core":"collection1",
   [junit4]   2>   "core_node_name":"core_node1",
   [junit4]   2>   "roles":null,
   [junit4]   2>   "base_url":"https://127.0.0.1:39406",
   [junit4]   2>   "node_name":"127.0.0.1:39406_",
   [junit4]   2>   "numShards":"1",
   [junit4]   2>   "state":"active",
   [junit4]   2>   "shard":"shard1",
   [junit4]   2>   "collection":"control_collection",
   [junit4]   2>   "operation":"state"} current state version: 2
   [junit4]   2> 906174 INFO  (OverseerStateUpdate-96167072542162949-127.0.0.1:39406_-n_0000000000) [n:127.0.0.1:39406_    ] o.a.s.c.o.ReplicaMutator Update state numShards=1 message={
   [junit4]   2>   "core":"collection1",
   [junit4]   2>   "core_node_name":"core_node1",
   [junit4]   2>   "roles":null,
   [junit4]   2>   "base_url":"https://127.0.0.1:39406",
   [junit4]   2>   "node_name":"127.0.0.1:39406_",
   [junit4]   2>   "numShards":"1",
   [junit4]   2>   "state":"active",
   [junit4]   2>   "shard":"shard1",
   [junit4]   2>   "collection":"control_collection",
   [junit4]   2>   "operation":"state"}
   [junit4]   2> 906275 INFO  (zkCallback-954-thread-2-processing-n:127.0.0.1:39406_) [n:127.0.0.1:39406_    ] o.a.s.c.c.ZkStateReader A cluster state change: [WatchedEvent state:SyncConnected type:NodeDataChanged path:/clusterstate.json], has occurred - updating... (live nodes size: [1])
   [junit4]   2> 906412 INFO  (TEST-TestSolrConfigHandlerCloud.test-seed#[56AE902C5C813D28]) [    ] o.a.s.c.s.i.CloudSolrClient Final constructed zkHost string: 127.0.0.1:35196/solr
   [junit4]   2> 906412 INFO  (TEST-TestSolrConfigHandlerCloud.test-seed#[56AE902C5C813D28]) [    ] o.a.s.c.c.SolrZkClient Using default ZkCredentialsProvider
   [junit4]   2> 906413 INFO  (TEST-TestSolrConfigHandlerCloud.test-seed#[56AE902C5C813D28]) [    ] o.a.s.c.c.ConnectionManager Waiting for client to connect to ZooKeeper
   [junit4]   2> 906413 INFO  (zkCallback-958-thread-1) [    ] o.a.s.c.c.ConnectionManager Watcher org.apache.solr.common.cloud.ConnectionManager@1b8fa46 name:ZooKeeperConnection Watcher:127.0.0.1:35196/solr got event WatchedEvent state:SyncConnected type:None path:null path:null type:None
   [junit4]   2> 906413 INFO  (TEST-TestSolrConfigHandlerCloud.test-seed#[56AE902C5C813D28]) [    ] o.a.s.c.c.ConnectionManager Client is connected to ZooKeeper
   [junit4]   2> 906414 INFO  (TEST-TestSolrConfigHandlerCloud.test-seed#[56AE902C5C813D28]) [    ] o.a.s.c.c.SolrZkClient Using default ZkACLProvider
   [junit4]   2> 906414 INFO  (TEST-TestSolrConfigHandlerCloud.test-seed#[56AE902C5C813D28]) [    ] o.a.s.c.c.ZkStateReader Updating cluster state from ZooKeeper... 
   [junit4]   2> 906414 INFO  (TEST-TestSolrConfigHandlerCloud.test-seed#[56AE902C5C813D28]) [    ] o.a.s.c.c.ZkStateReader Loaded cluster properties: {urlScheme=https}
   [junit4]   2> 906414 INFO  (TEST-TestSolrConfigHandlerCloud.test-seed#[56AE902C5C813D28]) [    ] o.a.s.c.c.ZkStateReader Updated live nodes from ZooKeeper... (0) -> (1)
   [junit4]   2> 906414 INFO  (TEST-TestSolrConfigHandlerCloud.test-seed#[56AE902C5C813D28]) [    ] o.a.s.c.ChaosMonkey monkey: init - expire sessions:false cause connection loss:false
   [junit4]   2> 906466 INFO  (TEST-TestSolrConfigHandlerCloud.test-seed#[56AE902C5C813D28]) [    ] o.a.s.SolrTestCaseJ4 Writing core.properties file to /home/jenkins/workspace/Lucene-Solr-master-Linux/solr/build/solr-core/test/J1/temp/solr.handler.TestSolrConfigHandlerCloud_56AE902C5C813D28-001/shard-1-001/cores/collection1
   [junit4]   2> 906466 INFO  (TEST-TestSolrConfigHandlerCloud.test-seed#[56AE902C5C813D28]) [    ] o.a.s.c.AbstractFullDistribZkTestBase create jetty 1 in directory /home/jenkins/workspace/Lucene-Solr-master-Linux/solr/build/solr-core/test/J1/temp/solr.handler.TestSolrConfigHandlerCloud_56AE902C5C813D28-001/shard-1-001
   [junit4]   2> 906467 INFO  (TEST-TestSolrConfigHandlerCloud.test-seed#[56AE902C5C813D28]) [    ] o.e.j.s.Server jetty-9.3.8.v20160314
   [junit4]   2> 906468 INFO  (TEST-TestSolrConfigHandlerCloud.test-seed#[56AE902C5C813D28]) [    ] o.e.j.s.h.ContextHandler Started o.e.j.s.ServletContextHandler@1517750{/,null,AVAILABLE}
   [junit4]   2> 906469 INFO  (TEST-TestSolrConfigHandlerCloud.test-seed#[56AE902C5C813D28]) [    ] o.e.j.s.ServerConnector Started ServerConnector@166753a{SSL,[ssl, http/1.1]}{127.0.0.1:43864}
   [junit4]   2> 906469 INFO  (TEST-TestSolrConfigHandlerCloud.test-seed#[56AE902C5C813D28]) [    ] o.e.j.s.Server Started @908436ms
   [junit4]   2> 906469 INFO  (TEST-TestSolrConfigHandlerCloud.test-seed#[56AE902C5C813D28]) [    ] o.a.s.c.s.e.JettySolrRunner Jetty properties: {solr.data.dir=/home/jenkins/workspace/Lucene-Solr-master-Linux/solr/build/solr-core/test/J1/temp/solr.handler.TestSolrConfigHandlerCloud_56AE902C5C813D28-001/tempDir-001/jetty1, solrconfig=solrconfig.xml, hostContext=/, hostPort=43864, coreRootDirectory=/home/jenkins/workspace/Lucene-Solr-master-Linux/solr/build/solr-core/test/J1/temp/solr.handler.TestSolrConfigHandlerCloud_56AE902C5C813D28-001/shard-1-001/cores}
   [junit4]   2> 906469 INFO  (TEST-TestSolrConfigHandlerCloud.test-seed#[56AE902C5C813D28]) [    ] o.a.s.s.SolrDispatchFilter SolrDispatchFilter.init(): sun.misc.Launcher$AppClassLoader@1d16e93
   [junit4]   2> 906469 INFO  (TEST-TestSolrConfigHandlerCloud.test-seed#[56AE902C5C813D28]) [    ] o.a.s.c.SolrResourceLoader new SolrResourceLoader for directory: '/home/jenkins/workspace/Lucene-Solr-master-Linux/solr/build/solr-core/test/J1/temp/solr.handler.TestSolrConfigHandlerCloud_56AE902C5C813D28-001/shard-1-001'
   [junit4]   2> 906470 INFO  (TEST-TestSolrConfigHandlerCloud.test-seed#[56AE902C5C813D28]) [    ] o.a.s.c.SolrResourceLoader JNDI not configured for solr (NoInitialContextEx)
   [junit4]   2> 906470 INFO  (TEST-TestSolrConfigHandlerCloud.test-seed#[56AE902C5C813D28]) [    ] o.a.s.c.SolrResourceLoader solr home defaulted to 'solr/' (could not find system property or JNDI)
   [junit4]   2> 906470 INFO  (TEST-TestSolrConfigHandlerCloud.test-seed#[56AE902C5C813D28]) [    ] o.a.s.c.c.SolrZkClient Using default ZkCredentialsProvider
   [junit4]   2> 906470 INFO  (TEST-TestSolrConfigHandlerCloud.test-seed#[56AE902C5C813D28]) [    ] o.a.s.c.c.ConnectionManager Waiting for client to connect to ZooKeeper
   [junit4]   2> 906471 INFO  (zkCallback-959-thread-1) [    ] o.a.s.c.c.ConnectionManager Watcher org.apache.solr.common.cloud.ConnectionManager@1acbeb5 name:ZooKeeperConnection Watcher:127.0.0.1:35196/solr got event WatchedEvent state:SyncConnected type:None path:null path:null type:None
   [junit4]   2> 906471 INFO  (TEST-TestSolrConfigHandlerCloud.test-seed#[56AE902C5C813D28]) [    ] o.a.s.c.c.ConnectionManager Client is connected to ZooKeeper
   [junit4]   2> 906471 INFO  (TEST-TestSolrConfigHandlerCloud.test-seed#[56AE902C5C813D28]) [    ] o.a.s.c.c.SolrZkClient Using default ZkACLProvider
   [junit4]   2> 906471 INFO  (TEST-TestSolrConfigHandlerCloud.test-seed#[56AE902C5C813D28]) [    ] o.a.s.s.SolrDispatchFilter Loading solr.xml from SolrHome (not found in ZooKeeper)
   [junit4]   2> 906471 INFO  (TEST-TestSolrConfigHandlerCloud.test-seed#[56AE902C5C813D28]) [    ] o.a.s.c.SolrXmlConfig Loading container configuration from /home/jenkins/workspace/Lucene-Solr-master-Linux/solr/build/solr-core/test/J1/temp/solr.handler.TestSolrConfigHandlerCloud_56AE902C5C813D28-001/shard-1-001/solr.xml
   [junit4]   2> 906474 INFO  (TEST-TestSolrConfigHandlerCloud.test-seed#[56AE902C5C813D28]) [    ] o.a.s.c.CorePropertiesLocator Config-defined core root directory: /home/jenkins/workspace/Lucene-Solr-master-Linux/solr/build/solr-core/test/J1/temp/solr.handler.TestSolrConfigHandlerCloud_56AE902C5C813D28-001/shard-1-001/cores
   [junit4]   2> 906475 INFO  (TEST-TestSolrConfigHandlerCloud.test-seed#[56AE902C5C813D28]) [    ] o.a.s.c.CoreContainer New CoreContainer 25282317
   [junit4]   2> 906475 INFO  (TEST-TestSolrConfigHandlerCloud.test-seed#[56AE902C5C813D28]) [    ] o.a.s.c.CoreContainer Loading cores into CoreContainer [instanceDir=/home/jenkins/workspace/Lucene-Solr-master-Linux/solr/build/solr-core/test/J1/temp/solr.handler.TestSolrConfigHandlerCloud_56AE902C5C813D28-001/shard-1-001]
   [junit4]   2> 906475 WARN  (TEST-TestSolrConfigHandlerCloud.test-seed#[56AE902C5C813D28]) [    ] o.a.s.c.CoreContainer Couldn't add files from /home/jenkins/workspace/Lucene-Solr-master-Linux/solr/build/solr-core/test/J1/temp/solr.handler.TestSolrConfigHandlerCloud_56AE902C5C813D28-001/shard-1-001/lib to classpath: /home/jenkins/workspace/Lucene-Solr-master-Linux/solr/build/solr-core/test/J1/temp/solr.handler.TestSolrConfigHandlerCloud_56AE902C5C813D28-001/shard-1-001/lib
   [junit4]   2> 906475 INFO  (TEST-TestSolrConfigHandlerCloud.test-seed#[56AE902C5C813D28]) [    ] o.a.s.h.c.HttpShardHandlerFactory created with socketTimeout : 90000,urlScheme : ,connTimeout : 15000,maxConnectionsPerHost : 20,maxConnections : 10000,corePoolSize : 0,maximumPoolSize : 2147483647,maxThreadIdleTime : 5,sizeOfQueue : -1,fairnessPolicy : false,
   [junit4]   2> 906476 INFO  (TEST-TestSolrConfigHandlerCloud.test-seed#[56AE902C5C813D28]) [    ] o.a.s.u.UpdateShardHandler Created UpdateShardHandler HTTP client with params: socketTimeout=340000&connTimeout=45000&maxConnections=100000&maxConnectionsPerHost=100000
   [junit4]   2> 906476 INFO  (TEST-TestSolrConfigHandlerCloud.test-seed#[56AE902C5C813D28]) [    ] o.a.s.l.LogWatcher SLF4J impl is org.slf4j.impl.Log4jLoggerFactory
   [junit4]   2> 906476 INFO  (TEST-TestSolrConfigHandlerCloud.test-seed#[56AE902C5C813D28]) [    ] o.a.s.l.LogWatcher Registering Log Listener [Log4j (org.slf4j.impl.Log4jLoggerFactory)]
   [junit4]   2> 906476 INFO  (TEST-TestSolrConfigHandlerCloud.test-seed#[56AE902C5C813D28]) [    ] o.a.s.c.ZkContainer Zookeeper client=127.0.0.1:35196/solr
   [junit4]   2> 906476 INFO  (TEST-TestSolrConfigHandlerCloud.test-seed#[56AE902C5C813D28]) [    ] o.a.s.c.ZkController zkHost includes chroot
   [junit4]   2> 906477 INFO  (TEST-TestSolrConfigHandlerCloud.test-seed#[56AE902C5C813D28]) [    ] o.a.s.c.c.SolrZkClient Using default ZkCredentialsProvider
   [junit4]   2> 906477 INFO  (TEST-TestSolrConfigHandlerCloud.test-seed#[56AE902C5C813D28]) [    ] o.a.s.c.c.ConnectionManager Waiting for client to connect to ZooKeeper
   [junit4]   2> 906477 INFO  (zkCallback-962-thread-1) [    ] o.a.s.c.c.ConnectionManager Watcher org.apache.solr.common.cloud.ConnectionManager@1da80a7 name:ZooKeeperConnection Watcher:127.0.0.1:35196 got event WatchedEvent state:SyncConnected type:None path:null path:null type:None
   [junit4]   2> 906478 INFO  (TEST-TestSolrConfigHandlerCloud.test-seed#[56AE902C5C813D28]) [    ] o.a.s.c.c.ConnectionManager Client is connected to ZooKeeper
   [junit4]   2> 906478 INFO  (TEST-TestSolrConfigHandlerCloud.test-seed#[56AE902C5C813D28]) [    ] o.a.s.c.c.SolrZkClient Using default ZkACLProvider
   [junit4]   2> 906478 INFO  (TEST-TestSolrConfigHandlerCloud.test-seed#[56AE902C5C813D28]) [n:127.0.0.1:43864_    ] o.a.s.c.ZkController Added new OnReconnect listener org.apache.solr.cloud.ZkController$$Lambda$34/6369406@15144d
   [junit4]   2> 906478 INFO  (TEST-TestSolrConfigHandlerCloud.test-seed#[56AE902C5C813D28]) [n:127.0.0.1:43864_    ] o.a.s.c.c.ConnectionManager Waiting for client to connect to ZooKeeper
   [junit4]   2> 906479 INFO  (zkCallback-963-thread-1-processing-n:127.0.0.1:43864_) [n:127.0.0.1:43864_    ] o.a.s.c.c.ConnectionManager Watcher org.apache.solr.common.cloud.ConnectionManager@e78ad1 name:ZooKeeperConnection Watcher:127.0.0.1:35196/solr got event WatchedEvent state:SyncConnected type:None path:null path:null type:None
   [junit4]   2> 906479 INFO  (TEST-TestSolrConfigHandlerCloud.test-seed#[56AE902C5C813D28]) [n:127.0.0.1:43864_    ] o.a.s.c.c.ConnectionManager Client is connected to ZooKeeper
   [junit4]   2> 906482 INFO  (TEST-TestSolrConfigHandlerCloud.test-seed#[56AE902C5C813D28]) [n:127.0.0.1:43864_    ] o.a.s.c.c.ZkStateReader Updating cluster state from ZooKeeper... 
   [junit4]   2> 906482 INFO  (TEST-TestSolrConfigHandlerCloud.test-seed#[56AE902C5C813D28]) [n:127.0.0.1:43864_    ] o.a.s.c.c.ZkStateReader Loaded cluster properties: {urlScheme=https}
   [junit4]   2> 906483 INFO  (TEST-TestSolrConfigHandlerCloud.test-seed#[56AE902C5C813D28]) [n:127.0.0.1:43864_    ] o.a.s.c.c.ZkStateReader Updated live nodes from ZooKeeper... (0) -> (1)
   [junit4]   2> 906484 INFO  (TEST-TestSolrConfigHandlerCloud.test-seed#[56AE902C5C813D28]) [n:127.0.0.1:43864_    ] o.a.s.c.Overseer Overseer (id=null) closing
   [junit4]   2> 906484 INFO  (TEST-TestSolrConfigHandlerCloud.test-seed#[56AE902C5C813D28]) [n:127.0.0.1:43864_    ] o.a.s.c.LeaderElector Joined leadership election with path: /overseer_elect/election/96167072542162953-127.0.0.1:43864_-n_0000000001
   [junit4]   2> 906484 INFO  (TEST-TestSolrConfigHandlerCloud.test-seed#[56AE902C5C813D28]) [n:127.0.0.1:43864_    ] o.a.s.c.LeaderElector Watching path /overseer_elect/election/96167072542162949-127.0.0.1:39406_-n_0000000000 to know if I could be the leader
   [junit4]   2> 906484 INFO  (TEST-TestSolrConfigHandlerCloud.test-seed#[56AE902C5C813D28]) [n:127.0.0.1:43864_    ] o.a.s.c.ZkController Publish node=127.0.0.1:43864_ as DOWN
   [junit4]   2> 906484 INFO  (TEST-TestSolrConfigHandlerCloud.test-seed#[56AE902C5C813D28]) [n:127.0.0.1:43864_    ] o.a.s.c.ZkController Register node as live in ZooKeeper:/live_nodes/127.0.0.1:43864_
   [junit4]   2> 906484 INFO  (TEST-TestSolrConfigHandlerCloud.test-seed#[56AE902C5C813D28]) [n:127.0.0.1:43864_    ] o.a.s.c.c.SolrZkClient makePath: /live_nodes/127.0.0.1:43864_
   [junit4]   2> 906485 INFO  (OverseerStateUpdate-96167072542162949-127.0.0.1:39406_-n_0000000000) [n:127.0.0.1:39406_    ] o.a.s.c.Overseer processMessage: queueSize: 1, message = {
   [junit4]   2>   "operation":"downnode",
   [junit4]   2>   "node_name":"127.0.0.1:43864_"} current state version: 3
   [junit4]   2> 906485 INFO  (OverseerStateUpdate-96167072542162949-127.0.0.1:39406_-n_0000000000) [n:127.0.0.1:39406_    ] o.a.s.c.o.NodeMutator DownNode state invoked for node: 127.0.0.1:43864_
   [junit4]   2> 906485 INFO  (zkCallback-954-thread-1-processing-n:127.0.0.1:39406_) [n:127.0.0.1:39406_    ] o.a.s.c.c.ZkStateReader A live node change: [WatchedEvent state:SyncConnected type:NodeChildrenChanged path:/live_nodes], has occurred - updating... (live nodes size: [1])
   [junit4]   2> 906485 INFO  (zkCallback-963-thread-1-processing-n:127.0.0.1:43864_) [n:127.0.0.1:43864_    ] o.a.s.c.c.ZkStateReader A live node change: [WatchedEvent state:SyncConnected type:NodeChildrenChanged path:/live_nodes], has occurred - updating... (live nodes size: [1])
   [junit4]   2> 906485 INFO  (zkCallback-958-thread-1) [    ] o.a.s.c.c.ZkStateReader A live node change: [WatchedEvent state:SyncConnected type:NodeChildrenChanged path:/live_nodes], has occurred - updating... (live nodes size: [1])
   [junit4]   2> 906485 INFO  (zkCallback-954-thread-1-processing-n:127.0.0.1:39406_) [n:127.0.0.1:39406_    ] o.a.s.c.c.ZkStateReader Updated live nodes from ZooKeeper... (1) -> (2)
   [junit4]   2> 906485 INFO  (zkCallback-963-thread-1-processing-n:127.0.0.1:43864_) [n:127.0.0.1:43864_    ] o.a.s.c.c.ZkStateReader Updated live nodes from ZooKeeper... (1) -> (2)
   [junit4]   2> 906486 INFO  (zkCallback-958-thread-1) [    ] o.a.s.c.c.ZkStateReader Updated live nodes from ZooKeeper... (1) -> (2)
   [junit4]   2> 906502 INFO  (TEST-TestSolrConfigHandlerCloud.test-seed#[56AE902C5C813D28]) [n:127.0.0.1:43864_    ] o.a.s.c.CoreContainer Security conf doesn't exist. Skipping setup for authorization module.
   [junit4]   2> 906502 INFO  (TEST-TestSolrConfigHandlerCloud.test-seed#[56AE902C5C813D28]) [n:127.0.0.1:43864_    ] o.a.s.c.CoreContainer No authentication plugin used.
   [junit4]   2> 906502 INFO  (TEST-TestSolrConfigHandlerCloud.test-seed#[56AE902C5C813D28]) [n:127.0.0.1:43864_    ] o.a.s.c.CorePropertiesLocator Looking for core definitions underneath /home/jenkins/workspace/Lucene-Solr-master-Linux/solr/build/solr-core/test/J1/temp/solr.handler.TestSolrConfigHandlerCloud_56AE902C5C813D28-001/shard-1-001/cores
   [junit4]   2> 906503 INFO  (TEST-TestSolrConfigHandlerCloud.test-seed#[56AE902C5C813D28]) [n:127.0.0.1:43864_    ] o.a.s.c.CoreDescriptor Created CoreDescriptor: {name=collection1, config=solrconfig.xml, transient=false, schema=schema.xml, loadOnStartup=true, configSetProperties=configsetprops.json, collection=collection1, coreNodeName=, dataDir=data/, shard=}
   [junit4]   2> 906503 INFO  (TEST-TestSolrConfigHandlerCloud.test-seed#[56AE902C5C813D28]) [n:127.0.0.1:43864_    ] o.a.s.c.CorePropertiesLocator Found core collection1 in /home/jenkins/workspace/Lucene-Solr-master-Linux/solr/build/solr-core/test/J1/temp/solr.handler.TestSolrConfigHandlerCloud_56AE902C5C813D28-001/shard-1-001/cores/collection1
   [junit4]   2> 906503 INFO  (TEST-TestSolrConfigHandlerCloud.test-seed#[56AE902C5C813D28]) [n:127.0.0.1:43864_    ] o.a.s.c.CorePropertiesLocator Found 1 core definitions
   [junit4]   2> 906503 INFO  (coreLoadExecutor-2918-thread-1-processing-n:127.0.0.1:43864_) [n:127.0.0.1:43864_ c:collection1   x:collection1] o.a.s.c.ZkController publishing state=down
   [junit4]   2> 906503 INFO  (TEST-TestSolrConfigHandlerCloud.test-seed#[56AE902C5C813D28]) [n:127.0.0.1:43864_    ] o.a.s.s.SolrDispatchFilter user.dir=/home/jenkins/workspace/Lucene-Solr-master-Linux/solr/build/solr-core/test/J1
   [junit4]   2> 906503 INFO  (TEST-TestSolrConfigHandlerCloud.test-seed#[56AE902C5C813D28]) [n:127.0.0.1:43864_    ] o.a.s.s.SolrDispatchFilter SolrDispatchFilter.init() done
   [junit4]   2> 906503 INFO  (coreLoadExecutor-2918-thread-1-processing-n:127.0.0.1:43864_) [n:127.0.0.1:43864_ c:collection1   x:collection1] o.a.s.c.ZkController numShards not found on descriptor - reading it from system property
   [junit4]   2> 906504 INFO  (coreLoadExecutor-2918-thread-1-processing-n:127.0.0.1:43864_) [n:127.0.0.1:43864_ c:collection1   x:collection1] o.a.s.c.ZkController Collection collection1 not visible yet, but flagging it so a watch is registered when it becomes visible
   [junit4]   2> 906504 INFO  (OverseerStateUpdate-96167072542162949-127.0.0.1:39406_-n_0000000000) [n:127.0.0.1:39406_    ] o.a.s.c.Overseer processMessage: queueSize: 1, message = {
   [junit4]   2>   "core":"collection1",
   [junit4]   2>   "roles":null,
   [junit4]   2>   "base_url":"https://127.0.0.1:43864",
   [junit4]   2>   "node_name":"127.0.0.1:43864_",
   [junit4]   2>   "numShards":"2",
   [junit4]   2>   "state":"down",
   [junit4]   2>   "shard":null,
   [junit4]   2>   "collection":"collection1",
   [junit4]   2>   "operation":"state"} current state version: 3
   [junit4]   2> 906504 INFO  (OverseerStateUpdate-96167072542162949-127.0.0.1:39406_-n_0000000000) [n:127.0.0.1:39406_    ] o.a.s.c.o.ReplicaMutator Update state numShards=2 message={
   [junit4]   2>   "core":"collection1",
   [junit4]   2>   "roles":null,
   [junit4]   2>   "base_url":"https://127.0.0.1:43864",
   [junit4]   2>   "node_name":"127.0.0.1:43864_",
   [junit4]   2>   "numShards":"2",
   [junit4]   2>   "state":"down",
   [junit4]   2>   "shard":null,
   [junit4]   2>   "collection":"collection1",
   [junit4]   2>   "operation":"state"}
   [junit4]   2> 906504 INFO  (coreLoadExecutor-2918-thread-1-processing-n:127.0.0.1:43864_) [n:127.0.0.1:43864_ c:collection1   x:collection1] o.a.s.c.c.ZkStateReader Deleting data for [collection1]
   [junit4]   2> 906504 INFO  (OverseerStateUpdate-96167072542162949-127.0.0.1:39406_-n_0000000000) [n:127.0.0.1:39406_    ] o.a.s.c.o.ClusterStateMutator building a new cName: collection1
   [junit4]   2> 906504 INFO  (OverseerStateUpdate-96167072542162949-127.0.0.1:39406_-n_0000000000) [n:127.0.0.1:39406_    ] o.a.s.c.o.ReplicaMutator Assigning new node to shard shard=shard2
   [junit4]   2> 906504 INFO  (coreLoadExecutor-2918-thread-1-processing-n:127.0.0.1:43864_) [n:127.0.0.1:43864_ c:collection1   x:collection1] o.a.s.c.ZkController look for our core node name
   [junit4]   2> 906605 INFO  (zkCallback-954-thread-1-processing-n:127.0.0.1:39406_) [n:127.0.0.1:39406_    ] o.a.s.c.c.ZkStateReader A cluster state change: [WatchedEvent state:SyncConnected type:NodeDataChanged path:/clusterstate.json], has occurred - updating... (live nodes size: [2])
   [junit4]   2> 906605 INFO  (zkCallback-963-thread-1-processing-n:127.0.0.1:43864_) [n:127.0.0.1:43864_    ] o.a.s.c.c.ZkStateReader A cluster state change: [WatchedEvent state:SyncConnected type:NodeDataChanged path:/clusterstate.json], has occurred - updating... (live nodes size: [2])
   [junit4]   2> 906605 INFO  (zkCallback-958-thread-1) [    ] o.a.s.c.c.ZkStateReader A cluster state change: [WatchedEvent state:SyncConnected type:NodeDataChanged path:/clusterstate.json], has occurred - updating... (live nodes size: [2])
   [junit4]   2> 907505 INFO  (coreLoadExecutor-2918-thread-1-processing-n:127.0.0.1:43864_) [n:127.0.0.1:43864_ c:collection1   x:collection1] o.a.s.c.ZkController waiting to find shard id in clusterstate for collection1
   [junit4]   2> 907505 INFO  (coreLoadExecutor-2918-thread-1-processing-n:127.0.0.1:43864_) [n:127.0.0.1:43864_ c:collection1   x:collection1] o.a.s.c.ZkController Check for collection zkNode:collection1
   [junit4]   2> 907505 INFO  (coreLoadExecutor-2918-thread-1-processing-n:127.0.0.1:43864_) [n:127.0.0.1:43864_ c:collection1   x:collection1] o.a.s.c.ZkController Collection zkNode exists
   [junit4]   2> 907505 INFO  (coreLoadExecutor-2918-thread-1-processing-n:127.0.0.1:43864_) [n:127.0.0.1:43864_ c:collection1   x:collection1] o.a.s.c.c.ZkStateReader Load collection config from: [/collections/collection1]
   [junit4]   2> 907505 INFO  (coreLoadExecutor-2918-thread-1-processing-n:127.0.0.1:43864_) [n:127.0.0.1:43864_ c:collection1   x:collection1] o.a.s.c.c.ZkStateReader path=[/collections/collection1] [configName]=[conf1] specified config exists in ZooKeeper
   [junit4]   2> 907505 INFO  (coreLoadExecutor-2918-thread-1-processing-n:127.0.0.1:43864_) [n:127.0.0.1:43864_ c:collection1   x:collection1] o.a.s.c.SolrResourceLoader new SolrResourceLoader for directory: '/home/jenkins/workspace/Lucene-Solr-master-Linux/solr/build/solr-core/test/J1/temp/solr.handler.TestSolrConfigHandlerCloud_56AE902C5C813D28-001/shard-1-001/cores/collection1'
   [junit4]   2> 907505 INFO  (coreLoadExecutor-2918-thread-1-processing-n:127.0.0.1:43864_) [n:127.0.0.1:43864_ c:collection1   x:collection1] o.a.s.c.SolrResourceLoader JNDI not configured for solr (NoInitialContextEx)
   [junit4]   2> 907506 INFO  (coreLoadExecutor-2918-thread-1-processing-n:127.0.0.1:43864_) [n:127.0.0.1:43864_ c:collection1   x:collection1] o.a.s.c.SolrResourceLoader solr home defaulted to 'solr/' (could not find system property or JNDI)
   [junit4]   2> 907507 INFO  (coreLoadExecutor-2918-thread-1-processing-n:127.0.0.1:43864_) [n:127.0.0.1:43864_ c:collection1   x:collection1] o.a.s.c.Config loaded config solrconfig.xml with version 0 
   [junit4]   2> 907509 INFO  (coreLoadExecutor-2918-thread-1-processing-n:127.0.0.1:43864_) [n:127.0.0.1:43864_ c:collection1   x:collection1] o.a.s.c.SolrConfig current version of requestparams : -1
   [junit4]   2> 907512 INFO  (coreLoadExecutor-2918-thread-1-processing-n:127.0.0.1:43864_) [n:127.0.0.1:43864_ c:collection1   x:collection1] o.a.s.c.SolrConfig Using Lucene MatchVersion: 7.0.0
   [junit4]   2> 907517 INFO  (coreLoadExecutor-2918-thread-1-processing-n:127.0.0.1:43864_) [n:127.0.0.1:43864_ c:collection1   x:collection1] o.a.s.c.SolrConfig Loaded SolrConfig: solrconfig.xml
   [junit4]   2> 907520 INFO  (coreLoadExecutor-2918-thread-1-processing-n:127.0.0.1:43864_) [n:127.0.0.1:43864_ c:collection1   x:collection1] o.a.s.s.IndexSchema [collection1] Schema name=test
   [junit4]   2> 907581 INFO  (coreLoadExecutor-2918-thread-1-processing-n:127.0.0.1:43864_) [n:127.0.0.1:43864_ c:collection1   x:collection1] o.a.s.s.OpenExchangeRatesOrgProvider Initialized with rates=open-exchange-rates.json, refreshInterval=1440.
   [junit4]   2> 907584 INFO  (coreLoadExecutor-2918-thread-1-processing-n:127.0.0.1:43864_) [n:127.0.0.1:43864_ c:collection1   x:collection1] o.a.s.s.IndexSchema default search field in schema is text
   [junit4]   2> 907585 INFO  (coreLoadExecutor-2918-thread-1-processing-n:127.0.0.1:43864_) [n:127.0.0.1:43864_ c:collection1   x:collection1] o.a.s.s.IndexSchema unique key field: id
   [junit4]   2> 907589 INFO  (coreLoadExecutor-2918-thread-1-processing-n:127.0.0.1:43864_) [n:127.0.0.1:43864_ c:collection1   x:collection1] o.a.s.s.FileExchangeRateProvider Reloading exchange rates from file currency.xml
   [junit4]   2> 907590 INFO  (coreLoadExecutor-2918-thread-1-processing-n:127.0.0.1:43864_) [n:127.0.0.1:43864_ c:collection1   x:collection1] o.a.s.s.FileExchangeRateProvider Reloading exchange rates from file currency.xml
   [junit4]   2> 907591 INFO  (coreLoadExecutor-2918-thread-1-processing-n:127.0.0.1:43864_) [n:127.0.0.1:43864_ c:collection1   x:collection1] o.a.s.s.OpenExchangeRatesOrgProvider Reloading exchange rates from open-exchange-rates.json
   [junit4]   2> 907591 INFO  (coreLoadExecutor-2918-thread-1-processing-n:127.0.0.1:43864_) [n:127.0.0.1:43864_ c:collection1   x:collection1] o.a.s.s.OpenExchangeRatesOrgProvider Reloading exchange rates from open-exchange-rates.json
   [junit4]   2> 907592 INFO  (coreLoadExecutor-2918-thread-1-processing-n:127.0.0.1:43864_) [n:127.0.0.1:43864_ c:collection1   x:collection1] o.a.s.c.ConfigSetProperties Did not find ConfigSet properties, assuming default properties: Can't find resource 'configsetprops.json' in classpath or '/configs/conf1', cwd=/home/jenkins/workspace/Lucene-Solr-master-Linux/solr/build/solr-core/test/J1
   [junit4]   2> 907592 INFO  (coreLoadExecutor-2918-thread-1-processing-n:127.0.0.1:43864_) [n:127.0.0.1:43864_ c:collection1   x:collection1] o.a.s.c.CoreContainer Creating SolrCore 'collection1' using configuration from collection collection1
   [junit4]   2> 907592 INFO  (coreLoadExecutor-2918-thread-1-processing-n:127.0.0.1:43864_) [n:127.0.0.1:43864_ c:collection1 s:shard2 r:core_node1 x:collection1] o.a.s.c.SolrCore org.apache.solr.core.MockDirectoryFactory
   [junit4]   2> 907592 INFO  (coreLoadExecutor-2918-thread-1-processing-n:127.0.0.1:43864_) [n:127.0.0.1:43864_ c:collection1 s:shard2 r:core_node1 x:collection1] o.a.s.c.SolrCore [[collection1] ] Opening new SolrCore at [/home/jenkins/workspace/Lucene-Solr-master-Linux/solr/build/solr-core/test/J1/temp/solr.handler.TestSolrConfigHandlerCloud_56AE902C5C813D28-001/shard-1-001/cores/collection1], dataDir=[/home/jenkins/workspace/Lucene-Solr-master-Linux/solr/build/solr-core/test/J1/temp/solr.handler.TestSolrConfigHandlerCloud_56AE902C5C813D28-001/shard-1-001/cores/collection1/data/]
   [junit4]   2> 907592 INFO  (coreLoadExecutor-2918-thread-1-processing-n:127.0.0.1:43864_) [n:127.0.0.1:43864_ c:collection1 s:shard2 r:core_node1 x:collection1] o.a.s.c.JmxMonitoredMap JMX monitoring is enabled. Adding Solr mbeans to JMX Server: com.sun.jmx.mbeanserver.JmxMBeanServer@8bb179
   [junit4]   2> 907592 INFO  (coreLoadExecutor-2918-thread-1-processing-n:127.0.0.1:43864_) [n:127.0.0.1:43864_ c:collection1 s:shard2 r:core_node1 x:collection1] o.a.s.c.CachingDirectoryFactory return new directory for /home/jenkins/workspace/Lucene-Solr-master-Linux/solr/build/solr-core/test/J1/temp/solr.handler.TestSolrConfigHandlerCloud_56AE902C5C813D28-001/shard-1-001/cores/collection1/data
   [junit4]   2> 907592 INFO  (coreLoadExecutor-2918-thread-1-processing-n:127.0.0.1:43864_) [n:127.0.0.1:43864_ c:collection1 s:shard2 r:core_node1 x:collection1] o.a.s.c.SolrCore New index directory detected: old=null new=/home/jenkins/workspace/Lucene-Solr-master-Linux/solr/build/solr-core/test/J1/temp/solr.handler.TestSolrConfigHandlerCloud_56AE902C5C813D28-001/shard-1-001/cores/collection1/data/index/
   [junit4]   2> 907592 WARN  (coreLoadExecutor-2918-thread-1-processing-n:127.0.0.1:43864_) [n:127.0.0.1:43864_ c:collection1 s:shard2 r:core_node1 x:collection1] o.a.s.c.SolrCore [collection1] Solr index directory '/home/jenkins/workspace/Lucene-Solr-master-Linux/solr/build/solr-core/test/J1/temp/solr.handler.TestSolrConfigHandlerCloud_56AE902C5C813D28-001/shard-1-001/cores/collection1/data/index' doesn't exist. Creating new index...
   [junit4]   2> 907593 INFO  (coreLoadExecutor-2918-thread-1-processing-n:127.0.0.1:43864_) [n:127.0.0.1:43864_ c:collection1 s:shard2 r:core_node1 x:collection1] o.a.s.c.CachingDirectoryFactory return new directory for /home/jenkins/workspace/Lucene-Solr-master-Linux/solr/build/solr-core/test/J1/temp/solr.handler.TestSolrConfigHandlerCloud_56AE902C5C813D28-001/shard-1-001/cores/collection1/data/index
   [junit4]   2> 907593 INFO  (coreLoadExecutor-2918-thread-1-processing-n:127.0.0.1:43864_) [n:127.0.0.1:43864_ c:collection1 s:shard2 r:core_node1 x:collection1] o.a.s.u.RandomMergePolicy RandomMergePolicy wrapping class org.apache.lucene.index.LogDocMergePolicy: [LogDocMergePolicy: minMergeSize=1000, mergeFactor=27, maxMergeSize=9223372036854775807, maxMergeS

[...truncated too long message...]

TGRP-TestSolrConfigHandlerCloud]
   [junit4]   2> 956573 ERROR (Thread-2188) [n:127.0.0.1:46143_    ] o.a.s.s.IndexSchemaFactory Error loading schema resource schema.xml
   [junit4]   2> java.io.IOException: Could not load resource=schema.xml
   [junit4]   2> 	at org.apache.solr.cloud.ZkSolrResourceLoader.openResource(ZkSolrResourceLoader.java:105)
   [junit4]   2> 	at org.apache.solr.core.SolrResourceLoader.openSchema(SolrResourceLoader.java:333)
   [junit4]   2> 	at org.apache.solr.schema.IndexSchemaFactory.create(IndexSchemaFactory.java:48)
   [junit4]   2> 	at org.apache.solr.schema.IndexSchemaFactory.buildIndexSchema(IndexSchemaFactory.java:75)
   [junit4]   2> 	at org.apache.solr.core.ConfigSetService.createIndexSchema(ConfigSetService.java:107)
   [junit4]   2> 	at org.apache.solr.core.ConfigSetService.getConfig(ConfigSetService.java:78)
   [junit4]   2> 	at org.apache.solr.core.CoreContainer.reload(CoreContainer.java:944)
   [junit4]   2> 	at org.apache.solr.core.SolrCore.lambda$getConfListener$6(SolrCore.java:2509)
   [junit4]   2> 	at org.apache.solr.cloud.ZkController$4.run(ZkController.java:2427)
   [junit4]   2> Caused by: java.lang.InterruptedException: sleep interrupted
   [junit4]   2> 	at java.lang.Thread.sleep(Native Method)
   [junit4]   2> 	at org.apache.solr.cloud.ZkSolrResourceLoader.openResource(ZkSolrResourceLoader.java:101)
   [junit4]   2> 	... 8 more
   [junit4]   2> 956573 WARN  (Thread-2188) [n:127.0.0.1:46143_    ] o.a.s.c.SolrCores Tried to remove core collection1 from pendingCoreOps and it wasn't there. 
   [junit4]   2> 956573 WARN  (Thread-2188) [n:127.0.0.1:46143_    ] o.a.s.c.ZkController listener throws error
   [junit4]   2> org.apache.solr.common.SolrException: Unable to reload core [collection1]
   [junit4]   2> 	at org.apache.solr.core.CoreContainer.reload(CoreContainer.java:952)
   [junit4]   2> 	at org.apache.solr.core.SolrCore.lambda$getConfListener$6(SolrCore.java:2509)
   [junit4]   2> 	at org.apache.solr.cloud.ZkController$4.run(ZkController.java:2427)
   [junit4]   2> Caused by: org.apache.solr.common.SolrException: Could not load conf for core collection1: Error loading schema resource schema.xml
   [junit4]   2> 	at org.apache.solr.core.ConfigSetService.getConfig(ConfigSetService.java:85)
   [junit4]   2> 	at org.apache.solr.core.CoreContainer.reload(CoreContainer.java:944)
   [junit4]   2> 	... 2 more
   [junit4]   2> Caused by: org.apache.solr.common.SolrException: Error loading schema resource schema.xml
   [junit4]   2> 	at org.apache.solr.schema.IndexSchemaFactory.create(IndexSchemaFactory.java:52)
   [junit4]   2> 	at org.apache.solr.schema.IndexSchemaFactory.buildIndexSchema(IndexSchemaFactory.java:75)
   [junit4]   2> 	at org.apache.solr.core.ConfigSetService.createIndexSchema(ConfigSetService.java:107)
   [junit4]   2> 	at org.apache.solr.core.ConfigSetService.getConfig(ConfigSetService.java:78)
   [junit4]   2> 	... 3 more
   [junit4]   2> Caused by: java.io.IOException: Could not load resource=schema.xml
   [junit4]   2> 	at org.apache.solr.cloud.ZkSolrResourceLoader.openResource(ZkSolrResourceLoader.java:105)
   [junit4]   2> 	at org.apache.solr.core.SolrResourceLoader.openSchema(SolrResourceLoader.java:333)
   [junit4]   2> 	at org.apache.solr.schema.IndexSchemaFactory.create(IndexSchemaFactory.java:48)
   [junit4]   2> 	... 6 more
   [junit4]   2> Caused by: java.lang.InterruptedException: sleep interrupted
   [junit4]   2> 	at java.lang.Thread.sleep(Native Method)
   [junit4]   2> 	at org.apache.solr.cloud.ZkSolrResourceLoader.openResource(ZkSolrResourceLoader.java:101)
   [junit4]   2> 	... 8 more
   [junit4]   2> 956573 INFO  (Thread-2188) [n:127.0.0.1:46143_    ] o.a.s.c.SolrCore config update listener called for core collection1
   [junit4]   2> Jul 01, 2016 5:12:06 PM com.carrotsearch.randomizedtesting.ThreadLeakControl tryToInterruptAll
   [junit4]   2> INFO: All leaked threads terminated.
   [junit4]   2> NOTE: test params are: codec=HighCompressionCompressingStoredFields(storedFieldsFormat=CompressingStoredFieldsFormat(compressionMode=HIGH_COMPRESSION, chunkSize=12631, maxDocsPerChunk=6, blockSize=2), termVectorsFormat=CompressingTermVectorsFormat(compressionMode=HIGH_COMPRESSION, chunkSize=12631, blockSize=2)), sim=RandomSimilarity(queryNorm=true,coord=yes): {}, locale=de-DE, timezone=America/Resolute
   [junit4]   2> NOTE: Linux 4.4.0-24-generic i386/Oracle Corporation 1.8.0_92 (32-bit)/cpus=12,threads=1,free=243941200,total=518979584
   [junit4]   2> NOTE: All tests run in this JVM: [TestBinaryResponseWriter, SolrPluginUtilsTest, TestLeaderElectionZkExpiry, DistributedFacetPivotSmallAdvancedTest, DistribCursorPagingTest, NotRequiredUniqueKeyTest, CustomCollectionTest, TestLFUCache, TestQuerySenderNoQuery, HdfsUnloadDistributedZkTest, TestRebalanceLeaders, ChaosMonkeySafeLeaderTest, TestRecoveryHdfs, TestFieldCacheSort, TestNoOpRegenerator, TestSubQueryTransformerCrossCore, TestFieldCache, ClassificationUpdateProcessorFactoryTest, TestSolrXml, TestSimpleQParserPlugin, SuggestComponentTest, TestQueryTypes, BlockJoinFacetSimpleTest, DistributedExpandComponentTest, TestLMJelinekMercerSimilarityFactory, OpenExchangeRatesOrgProviderTest, HighlighterTest, BlobRepositoryCloudTest, TestDocBasedVersionConstraints, DeleteReplicaTest, IgnoreCommitOptimizeUpdateProcessorFactoryTest, SolrIndexConfigTest, TestCursorMarkWithoutUniqueKey, DistributedMLTComponentTest, TestScoreJoinQPScore, TestFastLRUCache, TestDocumentBuilder, AnalyticsMergeStrategyTest, HttpPartitionTest, ConjunctionSolrSpellCheckerTest, TestAddFieldRealTimeGet, TestManagedSynonymFilterFactory, OverseerModifyCollectionTest, AliasIntegrationTest, TestFilteredDocIdSet, TestQuerySenderListener, TestUpdate, CSVRequestHandlerTest, CoreAdminRequestStatusTest, TestSurroundQueryParser, UniqFieldsUpdateProcessorFactoryTest, ChangedSchemaMergeTest, OverseerTaskQueueTest, SchemaVersionSpecificBehaviorTest, TestHashPartitioner, TermsComponentTest, DirectoryFactoryTest, DistributedQueueTest, HdfsDirectoryTest, HdfsBasicDistributedZk2Test, NumericFieldsTest, DocValuesTest, TestCloudPivotFacet, TestSortingResponseWriter, AsyncMigrateRouteKeyTest, TestFieldResource, TestDFRSimilarityFactory, LoggingHandlerTest, TestDistribDocBasedVersion, TestShardHandlerFactory, ConvertedLegacyTest, DistributedIntervalFacetingTest, SoftAutoCommitTest, ShardRoutingCustomTest, ZkControllerTest, SolrCloudExampleTest, TestSchemaManager, ClusterStateUpdateTest, TestDynamicFieldCollectionResource, OpenCloseCoreStressTest, TestInitParams, MoreLikeThisHandlerTest, TestMinMaxOnMultiValuedField, TestManagedResourceStorage, TestSchemaVersionResource, TestRawResponseWriter, TestComplexPhraseQParserPlugin, TestRequestStatusCollectionAPI, LeaderInitiatedRecoveryOnShardRestartTest, TestQueryUtils, TestSolrConfigHandlerCloud]
   [junit4]   2> NOTE: reproduce with: ant test  -Dtestcase=TestSolrConfigHandlerCloud -Dtests.seed=56AE902C5C813D28 -Dtests.multiplier=3 -Dtests.slow=true -Dtests.locale=de-DE -Dtests.timezone=America/Resolute -Dtests.asserts=true -Dtests.file.encoding=UTF-8
   [junit4] ERROR   0.00s J1 | TestSolrConfigHandlerCloud (suite) <<<
   [junit4]    > Throwable #1: com.carrotsearch.randomizedtesting.ThreadLeakError: 1 thread leaked from SUITE scope at org.apache.solr.handler.TestSolrConfigHandlerCloud: 
   [junit4]    >    1) Thread[id=7392, name=Thread-2188, state=TIMED_WAITING, group=TGRP-TestSolrConfigHandlerCloud]
   [junit4]    >         at java.lang.Thread.sleep(Native Method)
   [junit4]    >         at org.apache.solr.cloud.ZkSolrResourceLoader.openResource(ZkSolrResourceLoader.java:101)
   [junit4]    >         at org.apache.solr.core.SolrResourceLoader.openSchema(SolrResourceLoader.java:333)
   [junit4]    >         at org.apache.solr.schema.IndexSchemaFactory.create(IndexSchemaFactory.java:48)
   [junit4]    >         at org.apache.solr.schema.IndexSchemaFactory.buildIndexSchema(IndexSchemaFactory.java:75)
   [junit4]    >         at org.apache.solr.core.ConfigSetService.createIndexSchema(ConfigSetService.java:107)
   [junit4]    >         at org.apache.solr.core.ConfigSetService.getConfig(ConfigSetService.java:78)
   [junit4]    >         at org.apache.solr.core.CoreContainer.reload(CoreContainer.java:944)
   [junit4]    >         at org.apache.solr.core.SolrCore.lambda$getConfListener$6(SolrCore.java:2509)
   [junit4]    >         at org.apache.solr.core.SolrCore$$Lambda$56/1763531.run(Unknown Source)
   [junit4]    >         at org.apache.solr.cloud.ZkController$4.run(ZkController.java:2427)
   [junit4]    > 	at __randomizedtesting.SeedInfo.seed([56AE902C5C813D28]:0)
   [junit4] Completed [295/617 (1!)] on J1 in 51.91s, 1 test, 1 error <<< FAILURES!

[...truncated 1047 lines...]
BUILD FAILED
/home/jenkins/workspace/Lucene-Solr-master-Linux/build.xml:740: The following error occurred while executing this line:
/home/jenkins/workspace/Lucene-Solr-master-Linux/build.xml:684: The following error occurred while executing this line:
/home/jenkins/workspace/Lucene-Solr-master-Linux/build.xml:59: The following error occurred while executing this line:
/home/jenkins/workspace/Lucene-Solr-master-Linux/solr/build.xml:233: The following error occurred while executing this line:
/home/jenkins/workspace/Lucene-Solr-master-Linux/solr/common-build.xml:530: The following error occurred while executing this line:
/home/jenkins/workspace/Lucene-Solr-master-Linux/lucene/common-build.xml:1427: The following error occurred while executing this line:
/home/jenkins/workspace/Lucene-Solr-master-Linux/lucene/common-build.xml:984: There were test failures: 617 suites (10 ignored), 2584 tests, 1 suite-level error, 117 ignored (72 assumptions) [seed: 56AE902C5C813D28]

Total time: 53 minutes 14 seconds
Build step 'Invoke Ant' marked build as failure
Archiving artifacts
[WARNINGS] Skipping publisher since build result is FAILURE
Recording test results
Email was triggered for: Failure - Any
Sending email for trigger: Failure - Any



Mime
View raw message