lucene-dev mailing list archives

Site index · List index
Message view « Date » · « Thread »
Top « Date » · « Thread »
From Apache Jenkins Server <jenk...@builds.apache.org>
Subject [JENKINS] Lucene-Solr-Tests-master - Build # 1257 - Still Failing
Date Tue, 05 Jul 2016 01:55:48 GMT
Build: https://builds.apache.org/job/Lucene-Solr-Tests-master/1257/

1 tests failed.
FAILED:  org.apache.solr.cloud.overseer.ZkStateWriterTest.testExternalModificationToStateFormat2

Error Message:


Stack Trace:
java.lang.AssertionError
	at __randomizedtesting.SeedInfo.seed([B1A8433E5364CD97:C07557EA32CF3117]:0)
	at org.junit.Assert.fail(Assert.java:92)
	at org.junit.Assert.assertTrue(Assert.java:43)
	at org.junit.Assert.assertTrue(Assert.java:54)
	at org.apache.solr.cloud.overseer.ZkStateWriterTest.testExternalModificationToStateFormat2(ZkStateWriterTest.java:322)
	at sun.reflect.NativeMethodAccessorImpl.invoke0(Native Method)
	at sun.reflect.NativeMethodAccessorImpl.invoke(NativeMethodAccessorImpl.java:62)
	at sun.reflect.DelegatingMethodAccessorImpl.invoke(DelegatingMethodAccessorImpl.java:43)
	at java.lang.reflect.Method.invoke(Method.java:498)
	at com.carrotsearch.randomizedtesting.RandomizedRunner.invoke(RandomizedRunner.java:1764)
	at com.carrotsearch.randomizedtesting.RandomizedRunner$8.evaluate(RandomizedRunner.java:871)
	at com.carrotsearch.randomizedtesting.RandomizedRunner$9.evaluate(RandomizedRunner.java:907)
	at com.carrotsearch.randomizedtesting.RandomizedRunner$10.evaluate(RandomizedRunner.java:921)
	at com.carrotsearch.randomizedtesting.rules.SystemPropertiesRestoreRule$1.evaluate(SystemPropertiesRestoreRule.java:57)
	at org.apache.lucene.util.TestRuleSetupTeardownChained$1.evaluate(TestRuleSetupTeardownChained.java:49)
	at org.apache.lucene.util.AbstractBeforeAfterRule$1.evaluate(AbstractBeforeAfterRule.java:45)
	at org.apache.lucene.util.TestRuleThreadAndTestName$1.evaluate(TestRuleThreadAndTestName.java:48)
	at org.apache.lucene.util.TestRuleIgnoreAfterMaxFailures$1.evaluate(TestRuleIgnoreAfterMaxFailures.java:64)
	at org.apache.lucene.util.TestRuleMarkFailure$1.evaluate(TestRuleMarkFailure.java:47)
	at com.carrotsearch.randomizedtesting.rules.StatementAdapter.evaluate(StatementAdapter.java:36)
	at com.carrotsearch.randomizedtesting.ThreadLeakControl$StatementRunner.run(ThreadLeakControl.java:367)
	at com.carrotsearch.randomizedtesting.ThreadLeakControl.forkTimeoutingTask(ThreadLeakControl.java:809)
	at com.carrotsearch.randomizedtesting.ThreadLeakControl$3.evaluate(ThreadLeakControl.java:460)
	at com.carrotsearch.randomizedtesting.RandomizedRunner.runSingleTest(RandomizedRunner.java:880)
	at com.carrotsearch.randomizedtesting.RandomizedRunner$5.evaluate(RandomizedRunner.java:781)
	at com.carrotsearch.randomizedtesting.RandomizedRunner$6.evaluate(RandomizedRunner.java:816)
	at com.carrotsearch.randomizedtesting.RandomizedRunner$7.evaluate(RandomizedRunner.java:827)
	at com.carrotsearch.randomizedtesting.rules.StatementAdapter.evaluate(StatementAdapter.java:36)
	at com.carrotsearch.randomizedtesting.rules.SystemPropertiesRestoreRule$1.evaluate(SystemPropertiesRestoreRule.java:57)
	at org.apache.lucene.util.AbstractBeforeAfterRule$1.evaluate(AbstractBeforeAfterRule.java:45)
	at com.carrotsearch.randomizedtesting.rules.StatementAdapter.evaluate(StatementAdapter.java:36)
	at org.apache.lucene.util.TestRuleStoreClassName$1.evaluate(TestRuleStoreClassName.java:41)
	at com.carrotsearch.randomizedtesting.rules.NoShadowingOrOverridesOnMethodsRule$1.evaluate(NoShadowingOrOverridesOnMethodsRule.java:40)
	at com.carrotsearch.randomizedtesting.rules.NoShadowingOrOverridesOnMethodsRule$1.evaluate(NoShadowingOrOverridesOnMethodsRule.java:40)
	at com.carrotsearch.randomizedtesting.rules.StatementAdapter.evaluate(StatementAdapter.java:36)
	at com.carrotsearch.randomizedtesting.rules.StatementAdapter.evaluate(StatementAdapter.java:36)
	at com.carrotsearch.randomizedtesting.rules.StatementAdapter.evaluate(StatementAdapter.java:36)
	at org.apache.lucene.util.TestRuleAssertionsRequired$1.evaluate(TestRuleAssertionsRequired.java:53)
	at org.apache.lucene.util.TestRuleMarkFailure$1.evaluate(TestRuleMarkFailure.java:47)
	at org.apache.lucene.util.TestRuleIgnoreAfterMaxFailures$1.evaluate(TestRuleIgnoreAfterMaxFailures.java:64)
	at org.apache.lucene.util.TestRuleIgnoreTestSuites$1.evaluate(TestRuleIgnoreTestSuites.java:54)
	at com.carrotsearch.randomizedtesting.rules.StatementAdapter.evaluate(StatementAdapter.java:36)
	at com.carrotsearch.randomizedtesting.ThreadLeakControl$StatementRunner.run(ThreadLeakControl.java:367)
	at java.lang.Thread.run(Thread.java:745)




Build Log:
[...truncated 11409 lines...]
   [junit4] Suite: org.apache.solr.cloud.overseer.ZkStateWriterTest
   [junit4]   2> Creating dataDir: /x1/jenkins/jenkins-slave/workspace/Lucene-Solr-Tests-master/solr/build/solr-core/test/J1/temp/solr.cloud.overseer.ZkStateWriterTest_B1A8433E5364CD97-001/init-core-data-001
   [junit4]   2> 999321 INFO  (SUITE-ZkStateWriterTest-seed#[B1A8433E5364CD97]-worker)
[    ] o.a.s.SolrTestCaseJ4 Randomized ssl (false) and clientAuth (false) via: @org.apache.solr.util.RandomizeSSL(reason=,
ssl=NaN, value=NaN, clientAuth=NaN)
   [junit4]   2> 999322 INFO  (TEST-ZkStateWriterTest.testSingleExternalCollection-seed#[B1A8433E5364CD97])
[    ] o.a.s.SolrTestCaseJ4 ###Starting testSingleExternalCollection
   [junit4]   2> 999322 INFO  (TEST-ZkStateWriterTest.testSingleExternalCollection-seed#[B1A8433E5364CD97])
[    ] o.a.s.c.ZkTestServer STARTING ZK TEST SERVER
   [junit4]   2> 999323 INFO  (Thread-1909) [    ] o.a.s.c.ZkTestServer client port:0.0.0.0/0.0.0.0:0
   [junit4]   2> 999323 INFO  (Thread-1909) [    ] o.a.s.c.ZkTestServer Starting server
   [junit4]   2> 999423 INFO  (TEST-ZkStateWriterTest.testSingleExternalCollection-seed#[B1A8433E5364CD97])
[    ] o.a.s.c.ZkTestServer start zk server on port:46435
   [junit4]   2> 999423 INFO  (TEST-ZkStateWriterTest.testSingleExternalCollection-seed#[B1A8433E5364CD97])
[    ] o.a.s.c.c.SolrZkClient Using default ZkCredentialsProvider
   [junit4]   2> 999423 INFO  (TEST-ZkStateWriterTest.testSingleExternalCollection-seed#[B1A8433E5364CD97])
[    ] o.a.s.c.c.ConnectionManager Waiting for client to connect to ZooKeeper
   [junit4]   2> 999425 INFO  (zkCallback-936-thread-1) [    ] o.a.s.c.c.ConnectionManager
Watcher org.apache.solr.common.cloud.ConnectionManager@70a006fb name:ZooKeeperConnection Watcher:127.0.0.1:46435
got event WatchedEvent state:SyncConnected type:None path:null path:null type:None
   [junit4]   2> 999425 INFO  (TEST-ZkStateWriterTest.testSingleExternalCollection-seed#[B1A8433E5364CD97])
[    ] o.a.s.c.c.ConnectionManager Client is connected to ZooKeeper
   [junit4]   2> 999425 INFO  (TEST-ZkStateWriterTest.testSingleExternalCollection-seed#[B1A8433E5364CD97])
[    ] o.a.s.c.c.SolrZkClient Using default ZkACLProvider
   [junit4]   2> 999426 INFO  (TEST-ZkStateWriterTest.testSingleExternalCollection-seed#[B1A8433E5364CD97])
[    ] o.a.s.c.c.SolrZkClient Using default ZkCredentialsProvider
   [junit4]   2> 999426 INFO  (TEST-ZkStateWriterTest.testSingleExternalCollection-seed#[B1A8433E5364CD97])
[    ] o.a.s.c.c.ConnectionManager Waiting for client to connect to ZooKeeper
   [junit4]   2> 999430 INFO  (zkCallback-937-thread-1) [    ] o.a.s.c.c.ConnectionManager
Watcher org.apache.solr.common.cloud.ConnectionManager@31dfc238 name:ZooKeeperConnection Watcher:127.0.0.1:46435
got event WatchedEvent state:SyncConnected type:None path:null path:null type:None
   [junit4]   2> 999432 INFO  (TEST-ZkStateWriterTest.testSingleExternalCollection-seed#[B1A8433E5364CD97])
[    ] o.a.s.c.c.ConnectionManager Client is connected to ZooKeeper
   [junit4]   2> 999432 INFO  (TEST-ZkStateWriterTest.testSingleExternalCollection-seed#[B1A8433E5364CD97])
[    ] o.a.s.c.c.SolrZkClient Using default ZkACLProvider
   [junit4]   2> 999432 INFO  (TEST-ZkStateWriterTest.testSingleExternalCollection-seed#[B1A8433E5364CD97])
[    ] o.a.s.c.c.SolrZkClient makePath: /solr
   [junit4]   2> 999439 INFO  (TEST-ZkStateWriterTest.testSingleExternalCollection-seed#[B1A8433E5364CD97])
[    ] o.a.s.c.c.SolrZkClient Using default ZkCredentialsProvider
   [junit4]   2> 999440 INFO  (TEST-ZkStateWriterTest.testSingleExternalCollection-seed#[B1A8433E5364CD97])
[    ] o.a.s.c.c.ConnectionManager Waiting for client to connect to ZooKeeper
   [junit4]   2> 999440 INFO  (zkCallback-938-thread-1) [    ] o.a.s.c.c.ConnectionManager
Watcher org.apache.solr.common.cloud.ConnectionManager@1ef8218f name:ZooKeeperConnection Watcher:127.0.0.1:46435/solr
got event WatchedEvent state:SyncConnected type:None path:null path:null type:None
   [junit4]   2> 999440 INFO  (TEST-ZkStateWriterTest.testSingleExternalCollection-seed#[B1A8433E5364CD97])
[    ] o.a.s.c.c.ConnectionManager Client is connected to ZooKeeper
   [junit4]   2> 999440 INFO  (TEST-ZkStateWriterTest.testSingleExternalCollection-seed#[B1A8433E5364CD97])
[    ] o.a.s.c.c.SolrZkClient Using default ZkACLProvider
   [junit4]   2> 999440 INFO  (TEST-ZkStateWriterTest.testSingleExternalCollection-seed#[B1A8433E5364CD97])
[    ] o.a.s.c.c.SolrZkClient makePath: /live_nodes
   [junit4]   2> 999441 INFO  (TEST-ZkStateWriterTest.testSingleExternalCollection-seed#[B1A8433E5364CD97])
[    ] o.a.s.c.c.SolrZkClient makePath: /collections
   [junit4]   2> 999441 INFO  (TEST-ZkStateWriterTest.testSingleExternalCollection-seed#[B1A8433E5364CD97])
[    ] o.a.s.c.c.SolrZkClient makePath: /aliases.json
   [junit4]   2> 999442 INFO  (TEST-ZkStateWriterTest.testSingleExternalCollection-seed#[B1A8433E5364CD97])
[    ] o.a.s.c.c.SolrZkClient makePath: /clusterstate.json
   [junit4]   2> 999442 INFO  (TEST-ZkStateWriterTest.testSingleExternalCollection-seed#[B1A8433E5364CD97])
[    ] o.a.s.c.c.SolrZkClient makePath: /security.json
   [junit4]   2> 999442 INFO  (TEST-ZkStateWriterTest.testSingleExternalCollection-seed#[B1A8433E5364CD97])
[    ] o.a.s.c.c.ZkStateReader Updating cluster state from ZooKeeper... 
   [junit4]   2> 999443 INFO  (TEST-ZkStateWriterTest.testSingleExternalCollection-seed#[B1A8433E5364CD97])
[    ] o.a.s.c.c.ZkStateReader Loaded empty cluster properties
   [junit4]   2> 999443 INFO  (TEST-ZkStateWriterTest.testSingleExternalCollection-seed#[B1A8433E5364CD97])
[    ] o.a.s.c.c.ZkStateReader Updated live nodes from ZooKeeper... (0) -> (0)
   [junit4]   2> 999443 INFO  (TEST-ZkStateWriterTest.testSingleExternalCollection-seed#[B1A8433E5364CD97])
[    ] o.a.s.c.c.SolrZkClient makePath: /collections/c1
   [junit4]   2> 999444 INFO  (zkCallback-938-thread-1) [    ] o.a.s.c.c.ZkStateReader
A collections change: [WatchedEvent state:SyncConnected type:NodeChildrenChanged path:/collections],
has occurred - updating...
   [junit4]   2> 999444 INFO  (TEST-ZkStateWriterTest.testSingleExternalCollection-seed#[B1A8433E5364CD97])
[    ] o.a.s.c.o.ZkStateWriter going to create_collection /collections/c1/state.json
   [junit4]   2> 999446 INFO  (TEST-ZkStateWriterTest.testSingleExternalCollection-seed#[B1A8433E5364CD97])
[    ] o.a.s.c.ZkTestServer connecting to 127.0.0.1:46435 46435
   [junit4]   2> 999569 INFO  (Thread-1909) [    ] o.a.s.c.ZkTestServer connecting to 127.0.0.1:46435
46435
   [junit4]   2> 999570 INFO  (TEST-ZkStateWriterTest.testSingleExternalCollection-seed#[B1A8433E5364CD97])
[    ] o.a.s.SolrTestCaseJ4 ###Ending testSingleExternalCollection
   [junit4]   2> 999572 INFO  (TEST-ZkStateWriterTest.testExternalModificationToStateFormat2-seed#[B1A8433E5364CD97])
[    ] o.a.s.SolrTestCaseJ4 ###Starting testExternalModificationToStateFormat2
   [junit4]   2> 999572 INFO  (TEST-ZkStateWriterTest.testExternalModificationToStateFormat2-seed#[B1A8433E5364CD97])
[    ] o.a.s.c.ZkTestServer STARTING ZK TEST SERVER
   [junit4]   2> 999572 INFO  (Thread-1910) [    ] o.a.s.c.ZkTestServer client port:0.0.0.0/0.0.0.0:0
   [junit4]   2> 999572 INFO  (Thread-1910) [    ] o.a.s.c.ZkTestServer Starting server
   [junit4]   2> 999672 INFO  (TEST-ZkStateWriterTest.testExternalModificationToStateFormat2-seed#[B1A8433E5364CD97])
[    ] o.a.s.c.ZkTestServer start zk server on port:33131
   [junit4]   2> 999672 INFO  (TEST-ZkStateWriterTest.testExternalModificationToStateFormat2-seed#[B1A8433E5364CD97])
[    ] o.a.s.c.c.SolrZkClient Using default ZkCredentialsProvider
   [junit4]   2> 999673 INFO  (TEST-ZkStateWriterTest.testExternalModificationToStateFormat2-seed#[B1A8433E5364CD97])
[    ] o.a.s.c.c.ConnectionManager Waiting for client to connect to ZooKeeper
   [junit4]   2> 999674 INFO  (zkCallback-940-thread-1) [    ] o.a.s.c.c.ConnectionManager
Watcher org.apache.solr.common.cloud.ConnectionManager@3fd04fb4 name:ZooKeeperConnection Watcher:127.0.0.1:33131
got event WatchedEvent state:SyncConnected type:None path:null path:null type:None
   [junit4]   2> 999674 INFO  (TEST-ZkStateWriterTest.testExternalModificationToStateFormat2-seed#[B1A8433E5364CD97])
[    ] o.a.s.c.c.ConnectionManager Client is connected to ZooKeeper
   [junit4]   2> 999674 INFO  (TEST-ZkStateWriterTest.testExternalModificationToStateFormat2-seed#[B1A8433E5364CD97])
[    ] o.a.s.c.c.SolrZkClient Using default ZkACLProvider
   [junit4]   2> 999675 INFO  (TEST-ZkStateWriterTest.testExternalModificationToStateFormat2-seed#[B1A8433E5364CD97])
[    ] o.a.s.c.c.SolrZkClient Using default ZkCredentialsProvider
   [junit4]   2> 999676 INFO  (TEST-ZkStateWriterTest.testExternalModificationToStateFormat2-seed#[B1A8433E5364CD97])
[    ] o.a.s.c.c.ConnectionManager Waiting for client to connect to ZooKeeper
   [junit4]   2> 999676 INFO  (zkCallback-941-thread-1) [    ] o.a.s.c.c.ConnectionManager
Watcher org.apache.solr.common.cloud.ConnectionManager@61cc7bce name:ZooKeeperConnection Watcher:127.0.0.1:33131
got event WatchedEvent state:SyncConnected type:None path:null path:null type:None
   [junit4]   2> 999676 INFO  (TEST-ZkStateWriterTest.testExternalModificationToStateFormat2-seed#[B1A8433E5364CD97])
[    ] o.a.s.c.c.ConnectionManager Client is connected to ZooKeeper
   [junit4]   2> 999676 INFO  (TEST-ZkStateWriterTest.testExternalModificationToStateFormat2-seed#[B1A8433E5364CD97])
[    ] o.a.s.c.c.SolrZkClient Using default ZkACLProvider
   [junit4]   2> 999676 INFO  (TEST-ZkStateWriterTest.testExternalModificationToStateFormat2-seed#[B1A8433E5364CD97])
[    ] o.a.s.c.c.SolrZkClient makePath: /solr
   [junit4]   2> 999682 INFO  (TEST-ZkStateWriterTest.testExternalModificationToStateFormat2-seed#[B1A8433E5364CD97])
[    ] o.a.s.c.c.SolrZkClient Using default ZkCredentialsProvider
   [junit4]   2> 999682 INFO  (TEST-ZkStateWriterTest.testExternalModificationToStateFormat2-seed#[B1A8433E5364CD97])
[    ] o.a.s.c.c.ConnectionManager Waiting for client to connect to ZooKeeper
   [junit4]   2> 999683 INFO  (zkCallback-942-thread-1) [    ] o.a.s.c.c.ConnectionManager
Watcher org.apache.solr.common.cloud.ConnectionManager@6335ec3b name:ZooKeeperConnection Watcher:127.0.0.1:33131/solr
got event WatchedEvent state:SyncConnected type:None path:null path:null type:None
   [junit4]   2> 999686 INFO  (TEST-ZkStateWriterTest.testExternalModificationToStateFormat2-seed#[B1A8433E5364CD97])
[    ] o.a.s.c.c.ConnectionManager Client is connected to ZooKeeper
   [junit4]   2> 999686 INFO  (TEST-ZkStateWriterTest.testExternalModificationToStateFormat2-seed#[B1A8433E5364CD97])
[    ] o.a.s.c.c.SolrZkClient Using default ZkACLProvider
   [junit4]   2> 999686 INFO  (TEST-ZkStateWriterTest.testExternalModificationToStateFormat2-seed#[B1A8433E5364CD97])
[    ] o.a.s.c.c.SolrZkClient makePath: /live_nodes
   [junit4]   2> 999686 INFO  (TEST-ZkStateWriterTest.testExternalModificationToStateFormat2-seed#[B1A8433E5364CD97])
[    ] o.a.s.c.c.SolrZkClient makePath: /collections
   [junit4]   2> 999687 INFO  (TEST-ZkStateWriterTest.testExternalModificationToStateFormat2-seed#[B1A8433E5364CD97])
[    ] o.a.s.c.c.SolrZkClient makePath: /aliases.json
   [junit4]   2> 999687 INFO  (TEST-ZkStateWriterTest.testExternalModificationToStateFormat2-seed#[B1A8433E5364CD97])
[    ] o.a.s.c.c.SolrZkClient makePath: /clusterstate.json
   [junit4]   2> 999687 INFO  (TEST-ZkStateWriterTest.testExternalModificationToStateFormat2-seed#[B1A8433E5364CD97])
[    ] o.a.s.c.c.SolrZkClient makePath: /security.json
   [junit4]   2> 999688 INFO  (TEST-ZkStateWriterTest.testExternalModificationToStateFormat2-seed#[B1A8433E5364CD97])
[    ] o.a.s.c.c.ZkStateReader Updating cluster state from ZooKeeper... 
   [junit4]   2> 999688 INFO  (TEST-ZkStateWriterTest.testExternalModificationToStateFormat2-seed#[B1A8433E5364CD97])
[    ] o.a.s.c.c.ZkStateReader Loaded empty cluster properties
   [junit4]   2> 999688 INFO  (TEST-ZkStateWriterTest.testExternalModificationToStateFormat2-seed#[B1A8433E5364CD97])
[    ] o.a.s.c.c.ZkStateReader Updated live nodes from ZooKeeper... (0) -> (0)
   [junit4]   2> 999689 INFO  (TEST-ZkStateWriterTest.testExternalModificationToStateFormat2-seed#[B1A8433E5364CD97])
[    ] o.a.s.c.c.SolrZkClient makePath: /collections/c1
   [junit4]   2> 999689 INFO  (TEST-ZkStateWriterTest.testExternalModificationToStateFormat2-seed#[B1A8433E5364CD97])
[    ] o.a.s.c.c.SolrZkClient makePath: /collections/c2
   [junit4]   2> 999689 INFO  (TEST-ZkStateWriterTest.testExternalModificationToStateFormat2-seed#[B1A8433E5364CD97])
[    ] o.a.s.c.o.ZkStateWriter going to create_collection /collections/c2/state.json
   [junit4]   2> 999690 INFO  (zkCallback-942-thread-1) [    ] o.a.s.c.c.ZkStateReader
A collections change: [WatchedEvent state:SyncConnected type:NodeChildrenChanged path:/collections],
has occurred - updating...
   [junit4]   2> 999693 INFO  (TEST-ZkStateWriterTest.testExternalModificationToStateFormat2-seed#[B1A8433E5364CD97])
[    ] o.a.s.c.ZkTestServer connecting to 127.0.0.1:33131 33131
   [junit4]   2> 999865 INFO  (Thread-1910) [    ] o.a.s.c.ZkTestServer connecting to 127.0.0.1:33131
33131
   [junit4]   2> 999866 INFO  (TEST-ZkStateWriterTest.testExternalModificationToStateFormat2-seed#[B1A8433E5364CD97])
[    ] o.a.s.SolrTestCaseJ4 ###Ending testExternalModificationToStateFormat2
   [junit4]   2> NOTE: reproduce with: ant test  -Dtestcase=ZkStateWriterTest -Dtests.method=testExternalModificationToStateFormat2
-Dtests.seed=B1A8433E5364CD97 -Dtests.multiplier=2 -Dtests.slow=true -Dtests.locale=fr-CH
-Dtests.timezone=America/Boa_Vista -Dtests.asserts=true -Dtests.file.encoding=UTF-8
   [junit4] FAILURE 0.30s J1 | ZkStateWriterTest.testExternalModificationToStateFormat2 <<<
   [junit4]    > Throwable #1: java.lang.AssertionError
   [junit4]    > 	at __randomizedtesting.SeedInfo.seed([B1A8433E5364CD97:C07557EA32CF3117]:0)
   [junit4]    > 	at org.apache.solr.cloud.overseer.ZkStateWriterTest.testExternalModificationToStateFormat2(ZkStateWriterTest.java:322)
   [junit4]    > 	at java.lang.Thread.run(Thread.java:745)
   [junit4]   2> 999869 INFO  (TEST-ZkStateWriterTest.testExternalModificationToSharedClusterState-seed#[B1A8433E5364CD97])
[    ] o.a.s.SolrTestCaseJ4 ###Starting testExternalModificationToSharedClusterState
   [junit4]   2> 999869 INFO  (TEST-ZkStateWriterTest.testExternalModificationToSharedClusterState-seed#[B1A8433E5364CD97])
[    ] o.a.s.c.ZkTestServer STARTING ZK TEST SERVER
   [junit4]   2> 999870 INFO  (Thread-1911) [    ] o.a.s.c.ZkTestServer client port:0.0.0.0/0.0.0.0:0
   [junit4]   2> 999870 INFO  (Thread-1911) [    ] o.a.s.c.ZkTestServer Starting server
   [junit4]   2> 999970 INFO  (TEST-ZkStateWriterTest.testExternalModificationToSharedClusterState-seed#[B1A8433E5364CD97])
[    ] o.a.s.c.ZkTestServer start zk server on port:39082
   [junit4]   2> 999970 INFO  (TEST-ZkStateWriterTest.testExternalModificationToSharedClusterState-seed#[B1A8433E5364CD97])
[    ] o.a.s.c.c.SolrZkClient Using default ZkCredentialsProvider
   [junit4]   2> 999970 INFO  (TEST-ZkStateWriterTest.testExternalModificationToSharedClusterState-seed#[B1A8433E5364CD97])
[    ] o.a.s.c.c.ConnectionManager Waiting for client to connect to ZooKeeper
   [junit4]   2> 999974 INFO  (zkCallback-944-thread-1) [    ] o.a.s.c.c.ConnectionManager
Watcher org.apache.solr.common.cloud.ConnectionManager@5bd78370 name:ZooKeeperConnection Watcher:127.0.0.1:39082
got event WatchedEvent state:SyncConnected type:None path:null path:null type:None
   [junit4]   2> 999974 INFO  (TEST-ZkStateWriterTest.testExternalModificationToSharedClusterState-seed#[B1A8433E5364CD97])
[    ] o.a.s.c.c.ConnectionManager Client is connected to ZooKeeper
   [junit4]   2> 999974 INFO  (TEST-ZkStateWriterTest.testExternalModificationToSharedClusterState-seed#[B1A8433E5364CD97])
[    ] o.a.s.c.c.SolrZkClient Using default ZkACLProvider
   [junit4]   2> 999975 INFO  (TEST-ZkStateWriterTest.testExternalModificationToSharedClusterState-seed#[B1A8433E5364CD97])
[    ] o.a.s.c.c.SolrZkClient Using default ZkCredentialsProvider
   [junit4]   2> 999975 INFO  (TEST-ZkStateWriterTest.testExternalModificationToSharedClusterState-seed#[B1A8433E5364CD97])
[    ] o.a.s.c.c.ConnectionManager Waiting for client to connect to ZooKeeper
   [junit4]   2> 999976 INFO  (zkCallback-945-thread-1) [    ] o.a.s.c.c.ConnectionManager
Watcher org.apache.solr.common.cloud.ConnectionManager@52b24997 name:ZooKeeperConnection Watcher:127.0.0.1:39082
got event WatchedEvent state:SyncConnected type:None path:null path:null type:None
   [junit4]   2> 999976 INFO  (TEST-ZkStateWriterTest.testExternalModificationToSharedClusterState-seed#[B1A8433E5364CD97])
[    ] o.a.s.c.c.ConnectionManager Client is connected to ZooKeeper
   [junit4]   2> 999976 INFO  (TEST-ZkStateWriterTest.testExternalModificationToSharedClusterState-seed#[B1A8433E5364CD97])
[    ] o.a.s.c.c.SolrZkClient Using default ZkACLProvider
   [junit4]   2> 999976 INFO  (TEST-ZkStateWriterTest.testExternalModificationToSharedClusterState-seed#[B1A8433E5364CD97])
[    ] o.a.s.c.c.SolrZkClient makePath: /solr
   [junit4]   2> 999978 INFO  (TEST-ZkStateWriterTest.testExternalModificationToSharedClusterState-seed#[B1A8433E5364CD97])
[    ] o.a.s.c.c.SolrZkClient Using default ZkCredentialsProvider
   [junit4]   2> 999978 INFO  (TEST-ZkStateWriterTest.testExternalModificationToSharedClusterState-seed#[B1A8433E5364CD97])
[    ] o.a.s.c.c.ConnectionManager Waiting for client to connect to ZooKeeper
   [junit4]   2> 999978 INFO  (zkCallback-946-thread-1) [    ] o.a.s.c.c.ConnectionManager
Watcher org.apache.solr.common.cloud.ConnectionManager@5346196b name:ZooKeeperConnection Watcher:127.0.0.1:39082/solr
got event WatchedEvent state:SyncConnected type:None path:null path:null type:None
   [junit4]   2> 999978 INFO  (TEST-ZkStateWriterTest.testExternalModificationToSharedClusterState-seed#[B1A8433E5364CD97])
[    ] o.a.s.c.c.ConnectionManager Client is connected to ZooKeeper
   [junit4]   2> 999979 INFO  (TEST-ZkStateWriterTest.testExternalModificationToSharedClusterState-seed#[B1A8433E5364CD97])
[    ] o.a.s.c.c.SolrZkClient Using default ZkACLProvider
   [junit4]   2> 999979 INFO  (TEST-ZkStateWriterTest.testExternalModificationToSharedClusterState-seed#[B1A8433E5364CD97])
[    ] o.a.s.c.c.SolrZkClient makePath: /live_nodes
   [junit4]   2> 999979 INFO  (TEST-ZkStateWriterTest.testExternalModificationToSharedClusterState-seed#[B1A8433E5364CD97])
[    ] o.a.s.c.c.SolrZkClient makePath: /collections
   [junit4]   2> 999980 INFO  (TEST-ZkStateWriterTest.testExternalModificationToSharedClusterState-seed#[B1A8433E5364CD97])
[    ] o.a.s.c.c.SolrZkClient makePath: /aliases.json
   [junit4]   2> 999981 INFO  (TEST-ZkStateWriterTest.testExternalModificationToSharedClusterState-seed#[B1A8433E5364CD97])
[    ] o.a.s.c.c.SolrZkClient makePath: /clusterstate.json
   [junit4]   2> 999981 INFO  (TEST-ZkStateWriterTest.testExternalModificationToSharedClusterState-seed#[B1A8433E5364CD97])
[    ] o.a.s.c.c.SolrZkClient makePath: /security.json
   [junit4]   2> 999982 INFO  (TEST-ZkStateWriterTest.testExternalModificationToSharedClusterState-seed#[B1A8433E5364CD97])
[    ] o.a.s.c.c.ZkStateReader Updating cluster state from ZooKeeper... 
   [junit4]   2> 999982 INFO  (TEST-ZkStateWriterTest.testExternalModificationToSharedClusterState-seed#[B1A8433E5364CD97])
[    ] o.a.s.c.c.ZkStateReader Loaded empty cluster properties
   [junit4]   2> 999982 INFO  (TEST-ZkStateWriterTest.testExternalModificationToSharedClusterState-seed#[B1A8433E5364CD97])
[    ] o.a.s.c.c.ZkStateReader Updated live nodes from ZooKeeper... (0) -> (0)
   [junit4]   2> 999983 INFO  (TEST-ZkStateWriterTest.testExternalModificationToSharedClusterState-seed#[B1A8433E5364CD97])
[    ] o.a.s.c.c.SolrZkClient makePath: /collections/c1
   [junit4]   2> 999983 INFO  (zkCallback-946-thread-1) [    ] o.a.s.c.c.ZkStateReader
A collections change: [WatchedEvent state:SyncConnected type:NodeChildrenChanged path:/collections],
has occurred - updating...
   [junit4]   2> 999983 INFO  (TEST-ZkStateWriterTest.testExternalModificationToSharedClusterState-seed#[B1A8433E5364CD97])
[    ] o.a.s.c.c.SolrZkClient makePath: /collections/c2
   [junit4]   2> 999984 INFO  (zkCallback-946-thread-1) [    ] o.a.s.c.c.ZkStateReader
A collections change: [WatchedEvent state:SyncConnected type:NodeChildrenChanged path:/collections],
has occurred - updating...
   [junit4]   2> 999985 INFO  (zkCallback-946-thread-1) [    ] o.a.s.c.c.ZkStateReader
A cluster state change: [WatchedEvent state:SyncConnected type:NodeDataChanged path:/clusterstate.json],
has occurred - updating... (live nodes size: [0])
   [junit4]   2> 999986 INFO  (zkCallback-946-thread-1) [    ] o.a.s.c.c.ZkStateReader
A cluster state change: [WatchedEvent state:SyncConnected type:NodeDataChanged path:/clusterstate.json],
has occurred - updating... (live nodes size: [0])
   [junit4]   2> 999987 INFO  (TEST-ZkStateWriterTest.testExternalModificationToSharedClusterState-seed#[B1A8433E5364CD97])
[    ] o.a.s.c.ZkTestServer connecting to 127.0.0.1:39082 39082
   [junit4]   2> 1000107 INFO  (Thread-1911) [    ] o.a.s.c.ZkTestServer connecting to
127.0.0.1:39082 39082
   [junit4]   2> 1000108 INFO  (TEST-ZkStateWriterTest.testExternalModificationToSharedClusterState-seed#[B1A8433E5364CD97])
[    ] o.a.s.SolrTestCaseJ4 ###Ending testExternalModificationToSharedClusterState
   [junit4]   2> 1000111 INFO  (TEST-ZkStateWriterTest.testZkStateWriterBatching-seed#[B1A8433E5364CD97])
[    ] o.a.s.SolrTestCaseJ4 ###Starting testZkStateWriterBatching
   [junit4]   2> 1000111 INFO  (TEST-ZkStateWriterTest.testZkStateWriterBatching-seed#[B1A8433E5364CD97])
[    ] o.a.s.c.ZkTestServer STARTING ZK TEST SERVER
   [junit4]   2> 1000111 INFO  (Thread-1912) [    ] o.a.s.c.ZkTestServer client port:0.0.0.0/0.0.0.0:0
   [junit4]   2> 1000111 INFO  (Thread-1912) [    ] o.a.s.c.ZkTestServer Starting server
   [junit4]   2> 1000211 INFO  (TEST-ZkStateWriterTest.testZkStateWriterBatching-seed#[B1A8433E5364CD97])
[    ] o.a.s.c.ZkTestServer start zk server on port:40651
   [junit4]   2> 1000211 INFO  (TEST-ZkStateWriterTest.testZkStateWriterBatching-seed#[B1A8433E5364CD97])
[    ] o.a.s.c.c.SolrZkClient Using default ZkCredentialsProvider
   [junit4]   2> 1000212 INFO  (TEST-ZkStateWriterTest.testZkStateWriterBatching-seed#[B1A8433E5364CD97])
[    ] o.a.s.c.c.ConnectionManager Waiting for client to connect to ZooKeeper
   [junit4]   2> 1000214 INFO  (zkCallback-948-thread-1) [    ] o.a.s.c.c.ConnectionManager
Watcher org.apache.solr.common.cloud.ConnectionManager@13ccd0c8 name:ZooKeeperConnection Watcher:127.0.0.1:40651
got event WatchedEvent state:SyncConnected type:None path:null path:null type:None
   [junit4]   2> 1000214 INFO  (TEST-ZkStateWriterTest.testZkStateWriterBatching-seed#[B1A8433E5364CD97])
[    ] o.a.s.c.c.ConnectionManager Client is connected to ZooKeeper
   [junit4]   2> 1000214 INFO  (TEST-ZkStateWriterTest.testZkStateWriterBatching-seed#[B1A8433E5364CD97])
[    ] o.a.s.c.c.SolrZkClient Using default ZkACLProvider
   [junit4]   2> 1000215 INFO  (TEST-ZkStateWriterTest.testZkStateWriterBatching-seed#[B1A8433E5364CD97])
[    ] o.a.s.c.c.SolrZkClient Using default ZkCredentialsProvider
   [junit4]   2> 1000215 INFO  (TEST-ZkStateWriterTest.testZkStateWriterBatching-seed#[B1A8433E5364CD97])
[    ] o.a.s.c.c.ConnectionManager Waiting for client to connect to ZooKeeper
   [junit4]   2> 1000216 INFO  (zkCallback-949-thread-1) [    ] o.a.s.c.c.ConnectionManager
Watcher org.apache.solr.common.cloud.ConnectionManager@586c3a64 name:ZooKeeperConnection Watcher:127.0.0.1:40651
got event WatchedEvent state:SyncConnected type:None path:null path:null type:None
   [junit4]   2> 1000216 INFO  (TEST-ZkStateWriterTest.testZkStateWriterBatching-seed#[B1A8433E5364CD97])
[    ] o.a.s.c.c.ConnectionManager Client is connected to ZooKeeper
   [junit4]   2> 1000216 INFO  (TEST-ZkStateWriterTest.testZkStateWriterBatching-seed#[B1A8433E5364CD97])
[    ] o.a.s.c.c.SolrZkClient Using default ZkACLProvider
   [junit4]   2> 1000216 INFO  (TEST-ZkStateWriterTest.testZkStateWriterBatching-seed#[B1A8433E5364CD97])
[    ] o.a.s.c.c.SolrZkClient makePath: /solr
   [junit4]   2> 1000217 INFO  (TEST-ZkStateWriterTest.testZkStateWriterBatching-seed#[B1A8433E5364CD97])
[    ] o.a.s.c.c.SolrZkClient Using default ZkCredentialsProvider
   [junit4]   2> 1000218 INFO  (TEST-ZkStateWriterTest.testZkStateWriterBatching-seed#[B1A8433E5364CD97])
[    ] o.a.s.c.c.ConnectionManager Waiting for client to connect to ZooKeeper
   [junit4]   2> 1000224 INFO  (zkCallback-950-thread-1) [    ] o.a.s.c.c.ConnectionManager
Watcher org.apache.solr.common.cloud.ConnectionManager@3fd40761 name:ZooKeeperConnection Watcher:127.0.0.1:40651/solr
got event WatchedEvent state:SyncConnected type:None path:null path:null type:None
   [junit4]   2> 1000224 INFO  (TEST-ZkStateWriterTest.testZkStateWriterBatching-seed#[B1A8433E5364CD97])
[    ] o.a.s.c.c.ConnectionManager Client is connected to ZooKeeper
   [junit4]   2> 1000224 INFO  (TEST-ZkStateWriterTest.testZkStateWriterBatching-seed#[B1A8433E5364CD97])
[    ] o.a.s.c.c.SolrZkClient Using default ZkACLProvider
   [junit4]   2> 1000224 INFO  (TEST-ZkStateWriterTest.testZkStateWriterBatching-seed#[B1A8433E5364CD97])
[    ] o.a.s.c.c.SolrZkClient makePath: /live_nodes
   [junit4]   2> 1000225 INFO  (TEST-ZkStateWriterTest.testZkStateWriterBatching-seed#[B1A8433E5364CD97])
[    ] o.a.s.c.c.SolrZkClient makePath: /collections
   [junit4]   2> 1000225 INFO  (TEST-ZkStateWriterTest.testZkStateWriterBatching-seed#[B1A8433E5364CD97])
[    ] o.a.s.c.c.SolrZkClient makePath: /aliases.json
   [junit4]   2> 1000226 INFO  (TEST-ZkStateWriterTest.testZkStateWriterBatching-seed#[B1A8433E5364CD97])
[    ] o.a.s.c.c.SolrZkClient makePath: /clusterstate.json
   [junit4]   2> 1000226 INFO  (TEST-ZkStateWriterTest.testZkStateWriterBatching-seed#[B1A8433E5364CD97])
[    ] o.a.s.c.c.SolrZkClient makePath: /security.json
   [junit4]   2> 1000227 INFO  (TEST-ZkStateWriterTest.testZkStateWriterBatching-seed#[B1A8433E5364CD97])
[    ] o.a.s.c.c.ZkStateReader Updating cluster state from ZooKeeper... 
   [junit4]   2> 1000227 INFO  (TEST-ZkStateWriterTest.testZkStateWriterBatching-seed#[B1A8433E5364CD97])
[    ] o.a.s.c.c.ZkStateReader Loaded empty cluster properties
   [junit4]   2> 1000227 INFO  (TEST-ZkStateWriterTest.testZkStateWriterBatching-seed#[B1A8433E5364CD97])
[    ] o.a.s.c.c.ZkStateReader Updated live nodes from ZooKeeper... (0) -> (0)
   [junit4]   2> 1000228 INFO  (TEST-ZkStateWriterTest.testZkStateWriterBatching-seed#[B1A8433E5364CD97])
[    ] o.a.s.c.c.SolrZkClient makePath: /collections/c1
   [junit4]   2> 1000228 INFO  (zkCallback-950-thread-1) [    ] o.a.s.c.c.ZkStateReader
A collections change: [WatchedEvent state:SyncConnected type:NodeChildrenChanged path:/collections],
has occurred - updating...
   [junit4]   2> 1000228 INFO  (TEST-ZkStateWriterTest.testZkStateWriterBatching-seed#[B1A8433E5364CD97])
[    ] o.a.s.c.c.SolrZkClient makePath: /collections/c2
   [junit4]   2> 1000229 INFO  (zkCallback-950-thread-1) [    ] o.a.s.c.c.ZkStateReader
A collections change: [WatchedEvent state:SyncConnected type:NodeChildrenChanged path:/collections],
has occurred - updating...
   [junit4]   2> 1000230 INFO  (TEST-ZkStateWriterTest.testZkStateWriterBatching-seed#[B1A8433E5364CD97])
[    ] o.a.s.c.o.ZkStateWriter going to create_collection /collections/c1/state.json
   [junit4]   2> 1000235 INFO  (TEST-ZkStateWriterTest.testZkStateWriterBatching-seed#[B1A8433E5364CD97])
[    ] o.a.s.c.ZkTestServer connecting to 127.0.0.1:40651 40651
   [junit4]   2> 1000339 INFO  (Thread-1912) [    ] o.a.s.c.ZkTestServer connecting to
127.0.0.1:40651 40651
   [junit4]   2> 1000340 INFO  (TEST-ZkStateWriterTest.testZkStateWriterBatching-seed#[B1A8433E5364CD97])
[    ] o.a.s.SolrTestCaseJ4 ###Ending testZkStateWriterBatching
   [junit4]   2> 1000342 INFO  (TEST-ZkStateWriterTest.testSingleLegacyCollection-seed#[B1A8433E5364CD97])
[    ] o.a.s.SolrTestCaseJ4 ###Starting testSingleLegacyCollection
   [junit4]   2> 1000342 INFO  (TEST-ZkStateWriterTest.testSingleLegacyCollection-seed#[B1A8433E5364CD97])
[    ] o.a.s.c.ZkTestServer STARTING ZK TEST SERVER
   [junit4]   2> 1000342 INFO  (Thread-1913) [    ] o.a.s.c.ZkTestServer client port:0.0.0.0/0.0.0.0:0
   [junit4]   2> 1000342 INFO  (Thread-1913) [    ] o.a.s.c.ZkTestServer Starting server
   [junit4]   2> 1000442 INFO  (TEST-ZkStateWriterTest.testSingleLegacyCollection-seed#[B1A8433E5364CD97])
[    ] o.a.s.c.ZkTestServer start zk server on port:55460
   [junit4]   2> 1000442 INFO  (TEST-ZkStateWriterTest.testSingleLegacyCollection-seed#[B1A8433E5364CD97])
[    ] o.a.s.c.c.SolrZkClient Using default ZkCredentialsProvider
   [junit4]   2> 1000443 INFO  (TEST-ZkStateWriterTest.testSingleLegacyCollection-seed#[B1A8433E5364CD97])
[    ] o.a.s.c.c.ConnectionManager Waiting for client to connect to ZooKeeper
   [junit4]   2> 1000444 INFO  (zkCallback-952-thread-1) [    ] o.a.s.c.c.ConnectionManager
Watcher org.apache.solr.common.cloud.ConnectionManager@4560cf64 name:ZooKeeperConnection Watcher:127.0.0.1:55460
got event WatchedEvent state:SyncConnected type:None path:null path:null type:None
   [junit4]   2> 1000444 INFO  (TEST-ZkStateWriterTest.testSingleLegacyCollection-seed#[B1A8433E5364CD97])
[    ] o.a.s.c.c.ConnectionManager Client is connected to ZooKeeper
   [junit4]   2> 1000444 INFO  (TEST-ZkStateWriterTest.testSingleLegacyCollection-seed#[B1A8433E5364CD97])
[    ] o.a.s.c.c.SolrZkClient Using default ZkACLProvider
   [junit4]   2> 1000445 INFO  (TEST-ZkStateWriterTest.testSingleLegacyCollection-seed#[B1A8433E5364CD97])
[    ] o.a.s.c.c.SolrZkClient Using default ZkCredentialsProvider
   [junit4]   2> 1000445 INFO  (TEST-ZkStateWriterTest.testSingleLegacyCollection-seed#[B1A8433E5364CD97])
[    ] o.a.s.c.c.ConnectionManager Waiting for client to connect to ZooKeeper
   [junit4]   2> 1000445 INFO  (zkCallback-953-thread-1) [    ] o.a.s.c.c.ConnectionManager
Watcher org.apache.solr.common.cloud.ConnectionManager@419e5ae name:ZooKeeperConnection Watcher:127.0.0.1:55460
got event WatchedEvent state:SyncConnected type:None path:null path:null type:None
   [junit4]   2> 1000445 INFO  (TEST-ZkStateWriterTest.testSingleLegacyCollection-seed#[B1A8433E5364CD97])
[    ] o.a.s.c.c.ConnectionManager Client is connected to ZooKeeper
   [junit4]   2> 1000446 INFO  (TEST-ZkStateWriterTest.testSingleLegacyCollection-seed#[B1A8433E5364CD97])
[    ] o.a.s.c.c.SolrZkClient Using default ZkACLProvider
   [junit4]   2> 1000446 INFO  (TEST-ZkStateWriterTest.testSingleLegacyCollection-seed#[B1A8433E5364CD97])
[    ] o.a.s.c.c.SolrZkClient makePath: /solr
   [junit4]   2> 1000447 INFO  (TEST-ZkStateWriterTest.testSingleLegacyCollection-seed#[B1A8433E5364CD97])
[    ] o.a.s.c.c.SolrZkClient Using default ZkCredentialsProvider
   [junit4]   2> 1000447 INFO  (TEST-ZkStateWriterTest.testSingleLegacyCollection-seed#[B1A8433E5364CD97])
[    ] o.a.s.c.c.ConnectionManager Waiting for client to connect to ZooKeeper
   [junit4]   2> 1000448 INFO  (zkCallback-954-thread-1) [    ] o.a.s.c.c.ConnectionManager
Watcher org.apache.solr.common.cloud.ConnectionManager@5b9684a name:ZooKeeperConnection Watcher:127.0.0.1:55460/solr
got event WatchedEvent state:SyncConnected type:None path:null path:null type:None
   [junit4]   2> 1000448 INFO  (TEST-ZkStateWriterTest.testSingleLegacyCollection-seed#[B1A8433E5364CD97])
[    ] o.a.s.c.c.ConnectionManager Client is connected to ZooKeeper
   [junit4]   2> 1000448 INFO  (TEST-ZkStateWriterTest.testSingleLegacyCollection-seed#[B1A8433E5364CD97])
[    ] o.a.s.c.c.SolrZkClient Using default ZkACLProvider
   [junit4]   2> 1000448 INFO  (TEST-ZkStateWriterTest.testSingleLegacyCollection-seed#[B1A8433E5364CD97])
[    ] o.a.s.c.c.SolrZkClient makePath: /live_nodes
   [junit4]   2> 1000449 INFO  (TEST-ZkStateWriterTest.testSingleLegacyCollection-seed#[B1A8433E5364CD97])
[    ] o.a.s.c.c.SolrZkClient makePath: /collections
   [junit4]   2> 1000450 INFO  (TEST-ZkStateWriterTest.testSingleLegacyCollection-seed#[B1A8433E5364CD97])
[    ] o.a.s.c.c.SolrZkClient makePath: /aliases.json
   [junit4]   2> 1000450 INFO  (TEST-ZkStateWriterTest.testSingleLegacyCollection-seed#[B1A8433E5364CD97])
[    ] o.a.s.c.c.SolrZkClient makePath: /clusterstate.json
   [junit4]   2> 1000451 INFO  (TEST-ZkStateWriterTest.testSingleLegacyCollection-seed#[B1A8433E5364CD97])
[    ] o.a.s.c.c.SolrZkClient makePath: /security.json
   [junit4]   2> 1000451 INFO  (TEST-ZkStateWriterTest.testSingleLegacyCollection-seed#[B1A8433E5364CD97])
[    ] o.a.s.c.c.ZkStateReader Updating cluster state from ZooKeeper... 
   [junit4]   2> 1000451 INFO  (TEST-ZkStateWriterTest.testSingleLegacyCollection-seed#[B1A8433E5364CD97])
[    ] o.a.s.c.c.ZkStateReader Loaded empty cluster properties
   [junit4]   2> 1000452 INFO  (TEST-ZkStateWriterTest.testSingleLegacyCollection-seed#[B1A8433E5364CD97])
[    ] o.a.s.c.c.ZkStateReader Updated live nodes from ZooKeeper... (0) -> (0)
   [junit4]   2> 1000452 INFO  (TEST-ZkStateWriterTest.testSingleLegacyCollection-seed#[B1A8433E5364CD97])
[    ] o.a.s.c.c.SolrZkClient makePath: /collections/c1
   [junit4]   2> 1000453 INFO  (zkCallback-954-thread-1) [    ] o.a.s.c.c.ZkStateReader
A collections change: [WatchedEvent state:SyncConnected type:NodeChildrenChanged path:/collections],
has occurred - updating...
   [junit4]   2> 1000458 INFO  (zkCallback-954-thread-2) [    ] o.a.s.c.c.ZkStateReader
A cluster state change: [WatchedEvent state:SyncConnected type:NodeDataChanged path:/clusterstate.json],
has occurred - updating... (live nodes size: [0])
   [junit4]   2> 1001958 WARN  (zkCallback-954-thread-2) [    ] o.a.s.c.c.ZkStateReader
ZooKeeper watch triggered, but Solr cannot talk to ZK: [KeeperErrorCode = Session expired
for /clusterstate.json]
   [junit4]   2> 1001960 INFO  (TEST-ZkStateWriterTest.testSingleLegacyCollection-seed#[B1A8433E5364CD97])
[    ] o.a.s.c.ZkTestServer connecting to 127.0.0.1:55460 55460
   [junit4]   2> 1002080 INFO  (Thread-1913) [    ] o.a.s.c.ZkTestServer connecting to
127.0.0.1:55460 55460
   [junit4]   2> 1002081 INFO  (TEST-ZkStateWriterTest.testSingleLegacyCollection-seed#[B1A8433E5364CD97])
[    ] o.a.s.SolrTestCaseJ4 ###Ending testSingleLegacyCollection
   [junit4]   2> 1002081 INFO  (SUITE-ZkStateWriterTest-seed#[B1A8433E5364CD97]-worker)
[    ] o.a.s.SolrTestCaseJ4 ###deleteCore
   [junit4]   2> NOTE: leaving temporary files on disk at: /x1/jenkins/jenkins-slave/workspace/Lucene-Solr-Tests-master/solr/build/solr-core/test/J1/temp/solr.cloud.overseer.ZkStateWriterTest_B1A8433E5364CD97-001
   [junit4]   2> NOTE: test params are: codec=CheapBastard, sim=RandomSimilarity(queryNorm=true,coord=no):
{}, locale=fr-CH, timezone=America/Boa_Vista
   [junit4]   2> NOTE: Linux 3.13.0-85-generic amd64/Oracle Corporation 1.8.0_74 (64-bit)/cpus=4,threads=1,free=174207608,total=521142272
   [junit4]   2> NOTE: All tests run in this JVM: [TestReRankQParserPlugin, DirectSolrSpellCheckerTest,
TestGraphMLResponseWriter, HttpPartitionTest, TestHashPartitioner, SolrIndexConfigTest, TestQuerySenderNoQuery,
CollectionsAPIAsyncDistributedZkTest, TestManagedSchemaAPI, TestQueryTypes, TestStressCloudBlindAtomicUpdates,
LeaderInitiatedRecoveryOnShardRestartTest, TestRTimerTree, TestSolrDeletionPolicy2, ClusterStateUpdateTest,
DistributedTermsComponentTest, SuggesterFSTTest, SolrIndexSplitterTest, AtomicUpdatesTest,
TestQueryUtils, DistributedFacetPivotLongTailTest, SolrInfoMBeanTest, AddBlockUpdateTest,
TestDFISimilarityFactory, TestMacros, TestStressUserVersions, TestSubQueryTransformer, AliasIntegrationTest,
DistributedDebugComponentTest, TestBlobHandler, CollectionsAPIDistributedZkTest, UniqFieldsUpdateProcessorFactoryTest,
DistributedSuggestComponentTest, ConvertedLegacyTest, DistributedFacetPivotWhiteBoxTest, ShardRoutingCustomTest,
TestScoreJoinQPNoScore, SmileWriterTest, CollectionReloadTest, UpdateRequestProcessorFactoryTest,
TestSQLHandler, TermVectorComponentTest, TestFieldCacheVsDocValues, TestSortByMinMaxFunction,
TestManagedStopFilterFactory, SSLMigrationTest, WrapperMergePolicyFactoryTest, TestFieldCollectionResource,
BasicAuthIntegrationTest, OverseerTaskQueueTest, BufferStoreTest, TestHighFrequencyDictionaryFactory,
MBeansHandlerTest, MoreLikeThisHandlerTest, HdfsRestartWhileUpdatingTest, OverseerModifyCollectionTest,
BlockJoinFacetRandomTest, TestTrie, TestAuthenticationFramework, TestShortCircuitedRequests,
SpellCheckComponentTest, TestLFUCache, BigEndianAscendingWordDeserializerTest, CustomCollectionTest,
TestRequestForwarding, ZkStateWriterTest]
   [junit4] Completed [270/618 (1!)] on J1 in 2.77s, 5 tests, 1 failure <<< FAILURES!

[...truncated 1112 lines...]
BUILD FAILED
/x1/jenkins/jenkins-slave/workspace/Lucene-Solr-Tests-master/build.xml:740: The following
error occurred while executing this line:
/x1/jenkins/jenkins-slave/workspace/Lucene-Solr-Tests-master/build.xml:684: The following
error occurred while executing this line:
/x1/jenkins/jenkins-slave/workspace/Lucene-Solr-Tests-master/build.xml:59: The following error
occurred while executing this line:
/x1/jenkins/jenkins-slave/workspace/Lucene-Solr-Tests-master/solr/build.xml:233: The following
error occurred while executing this line:
/x1/jenkins/jenkins-slave/workspace/Lucene-Solr-Tests-master/solr/common-build.xml:530: The
following error occurred while executing this line:
/x1/jenkins/jenkins-slave/workspace/Lucene-Solr-Tests-master/lucene/common-build.xml:1427:
The following error occurred while executing this line:
/x1/jenkins/jenkins-slave/workspace/Lucene-Solr-Tests-master/lucene/common-build.xml:984:
There were test failures: 618 suites (10 ignored), 2588 tests, 1 failure, 85 ignored (70 assumptions)
[seed: B1A8433E5364CD97]

Total time: 61 minutes 37 seconds
Build step 'Invoke Ant' marked build as failure
Archiving artifacts
Recording test results
Email was triggered for: Failure - Any
Sending email for trigger: Failure - Any




Mime
View raw message