lucene-dev mailing list archives

Site index · List index
Message view « Date » · « Thread »
Top « Date » · « Thread »
From Policeman Jenkins Server <jenk...@thetaphi.de>
Subject [JENKINS-EA] Lucene-Solr-6.x-Linux (64bit/jdk-9-ea+124) - Build # 1021 - Still Failing!
Date Fri, 01 Jul 2016 18:20:55 GMT
Build: http://jenkins.thetaphi.de/job/Lucene-Solr-6.x-Linux/1021/
Java: 64bit/jdk-9-ea+124 -XX:-UseCompressedOops -XX:+UseSerialGC

2 tests failed.
FAILED:  org.apache.solr.cloud.overseer.ZkStateWriterTest.testExternalModificationToStateFormat2

Error Message:


Stack Trace:
java.lang.AssertionError
	at __randomizedtesting.SeedInfo.seed([919D8DFB4ADF743C:E040992F2B7488BC]:0)
	at org.junit.Assert.fail(Assert.java:92)
	at org.junit.Assert.assertTrue(Assert.java:43)
	at org.junit.Assert.assertTrue(Assert.java:54)
	at org.apache.solr.cloud.overseer.ZkStateWriterTest.testExternalModificationToStateFormat2(ZkStateWriterTest.java:322)
	at jdk.internal.reflect.NativeMethodAccessorImpl.invoke0(java.base@9-ea/Native Method)
	at jdk.internal.reflect.NativeMethodAccessorImpl.invoke(java.base@9-ea/NativeMethodAccessorImpl.java:62)
	at jdk.internal.reflect.DelegatingMethodAccessorImpl.invoke(java.base@9-ea/DelegatingMethodAccessorImpl.java:43)
	at java.lang.reflect.Method.invoke(java.base@9-ea/Method.java:533)
	at com.carrotsearch.randomizedtesting.RandomizedRunner.invoke(RandomizedRunner.java:1764)
	at com.carrotsearch.randomizedtesting.RandomizedRunner$8.evaluate(RandomizedRunner.java:871)
	at com.carrotsearch.randomizedtesting.RandomizedRunner$9.evaluate(RandomizedRunner.java:907)
	at com.carrotsearch.randomizedtesting.RandomizedRunner$10.evaluate(RandomizedRunner.java:921)
	at com.carrotsearch.randomizedtesting.rules.SystemPropertiesRestoreRule$1.evaluate(SystemPropertiesRestoreRule.java:57)
	at org.apache.lucene.util.TestRuleSetupTeardownChained$1.evaluate(TestRuleSetupTeardownChained.java:49)
	at org.apache.lucene.util.AbstractBeforeAfterRule$1.evaluate(AbstractBeforeAfterRule.java:45)
	at org.apache.lucene.util.TestRuleThreadAndTestName$1.evaluate(TestRuleThreadAndTestName.java:48)
	at org.apache.lucene.util.TestRuleIgnoreAfterMaxFailures$1.evaluate(TestRuleIgnoreAfterMaxFailures.java:64)
	at org.apache.lucene.util.TestRuleMarkFailure$1.evaluate(TestRuleMarkFailure.java:47)
	at com.carrotsearch.randomizedtesting.rules.StatementAdapter.evaluate(StatementAdapter.java:36)
	at com.carrotsearch.randomizedtesting.ThreadLeakControl$StatementRunner.run(ThreadLeakControl.java:367)
	at com.carrotsearch.randomizedtesting.ThreadLeakControl.forkTimeoutingTask(ThreadLeakControl.java:809)
	at com.carrotsearch.randomizedtesting.ThreadLeakControl$3.evaluate(ThreadLeakControl.java:460)
	at com.carrotsearch.randomizedtesting.RandomizedRunner.runSingleTest(RandomizedRunner.java:880)
	at com.carrotsearch.randomizedtesting.RandomizedRunner$5.evaluate(RandomizedRunner.java:781)
	at com.carrotsearch.randomizedtesting.RandomizedRunner$6.evaluate(RandomizedRunner.java:816)
	at com.carrotsearch.randomizedtesting.RandomizedRunner$7.evaluate(RandomizedRunner.java:827)
	at com.carrotsearch.randomizedtesting.rules.StatementAdapter.evaluate(StatementAdapter.java:36)
	at com.carrotsearch.randomizedtesting.rules.SystemPropertiesRestoreRule$1.evaluate(SystemPropertiesRestoreRule.java:57)
	at org.apache.lucene.util.AbstractBeforeAfterRule$1.evaluate(AbstractBeforeAfterRule.java:45)
	at com.carrotsearch.randomizedtesting.rules.StatementAdapter.evaluate(StatementAdapter.java:36)
	at org.apache.lucene.util.TestRuleStoreClassName$1.evaluate(TestRuleStoreClassName.java:41)
	at com.carrotsearch.randomizedtesting.rules.NoShadowingOrOverridesOnMethodsRule$1.evaluate(NoShadowingOrOverridesOnMethodsRule.java:40)
	at com.carrotsearch.randomizedtesting.rules.NoShadowingOrOverridesOnMethodsRule$1.evaluate(NoShadowingOrOverridesOnMethodsRule.java:40)
	at com.carrotsearch.randomizedtesting.rules.StatementAdapter.evaluate(StatementAdapter.java:36)
	at com.carrotsearch.randomizedtesting.rules.StatementAdapter.evaluate(StatementAdapter.java:36)
	at com.carrotsearch.randomizedtesting.rules.StatementAdapter.evaluate(StatementAdapter.java:36)
	at org.apache.lucene.util.TestRuleAssertionsRequired$1.evaluate(TestRuleAssertionsRequired.java:53)
	at org.apache.lucene.util.TestRuleMarkFailure$1.evaluate(TestRuleMarkFailure.java:47)
	at org.apache.lucene.util.TestRuleIgnoreAfterMaxFailures$1.evaluate(TestRuleIgnoreAfterMaxFailures.java:64)
	at org.apache.lucene.util.TestRuleIgnoreTestSuites$1.evaluate(TestRuleIgnoreTestSuites.java:54)
	at com.carrotsearch.randomizedtesting.rules.StatementAdapter.evaluate(StatementAdapter.java:36)
	at com.carrotsearch.randomizedtesting.ThreadLeakControl$StatementRunner.run(ThreadLeakControl.java:367)
	at java.lang.Thread.run(java.base@9-ea/Thread.java:843)


FAILED:  org.apache.solr.handler.TestReqParamsAPI.test

Error Message:
Could not get expected value  'CY val modified' for path 'response/params/y/c' full output: {   "responseHeader":{     "status":0,     "QTime":0},   "response":{     "znodeVersion":1,     "params":{       "x":{         "a":"A val",         "b":"B val",         "":{"v":0}},       "y":{         "c":"CY val",         "b":"BY val",         "i":20,         "d":[           "val 1",           "val 2"],         "":{"v":0}}}}},  from server:  https://127.0.0.1:37221/collection1

Stack Trace:
java.lang.AssertionError: Could not get expected value  'CY val modified' for path 'response/params/y/c' full output: {
  "responseHeader":{
    "status":0,
    "QTime":0},
  "response":{
    "znodeVersion":1,
    "params":{
      "x":{
        "a":"A val",
        "b":"B val",
        "":{"v":0}},
      "y":{
        "c":"CY val",
        "b":"BY val",
        "i":20,
        "d":[
          "val 1",
          "val 2"],
        "":{"v":0}}}}},  from server:  https://127.0.0.1:37221/collection1
	at __randomizedtesting.SeedInfo.seed([919D8DFB4ADF743C:19C9B221E42319C4]:0)
	at org.junit.Assert.fail(Assert.java:93)
	at org.junit.Assert.assertTrue(Assert.java:43)
	at org.apache.solr.core.TestSolrConfigHandler.testForResponseElement(TestSolrConfigHandler.java:481)
	at org.apache.solr.handler.TestReqParamsAPI.testReqParams(TestReqParamsAPI.java:194)
	at org.apache.solr.handler.TestReqParamsAPI.test(TestReqParamsAPI.java:61)
	at jdk.internal.reflect.NativeMethodAccessorImpl.invoke0(java.base@9-ea/Native Method)
	at jdk.internal.reflect.NativeMethodAccessorImpl.invoke(java.base@9-ea/NativeMethodAccessorImpl.java:62)
	at jdk.internal.reflect.DelegatingMethodAccessorImpl.invoke(java.base@9-ea/DelegatingMethodAccessorImpl.java:43)
	at java.lang.reflect.Method.invoke(java.base@9-ea/Method.java:533)
	at com.carrotsearch.randomizedtesting.RandomizedRunner.invoke(RandomizedRunner.java:1764)
	at com.carrotsearch.randomizedtesting.RandomizedRunner$8.evaluate(RandomizedRunner.java:871)
	at com.carrotsearch.randomizedtesting.RandomizedRunner$9.evaluate(RandomizedRunner.java:907)
	at com.carrotsearch.randomizedtesting.RandomizedRunner$10.evaluate(RandomizedRunner.java:921)
	at org.apache.solr.BaseDistributedSearchTestCase$ShardsRepeatRule$ShardsFixedStatement.callStatement(BaseDistributedSearchTestCase.java:992)
	at org.apache.solr.BaseDistributedSearchTestCase$ShardsRepeatRule$ShardsStatement.evaluate(BaseDistributedSearchTestCase.java:967)
	at com.carrotsearch.randomizedtesting.rules.SystemPropertiesRestoreRule$1.evaluate(SystemPropertiesRestoreRule.java:57)
	at org.apache.lucene.util.TestRuleSetupTeardownChained$1.evaluate(TestRuleSetupTeardownChained.java:49)
	at org.apache.lucene.util.AbstractBeforeAfterRule$1.evaluate(AbstractBeforeAfterRule.java:45)
	at org.apache.lucene.util.TestRuleThreadAndTestName$1.evaluate(TestRuleThreadAndTestName.java:48)
	at org.apache.lucene.util.TestRuleIgnoreAfterMaxFailures$1.evaluate(TestRuleIgnoreAfterMaxFailures.java:64)
	at org.apache.lucene.util.TestRuleMarkFailure$1.evaluate(TestRuleMarkFailure.java:47)
	at com.carrotsearch.randomizedtesting.rules.StatementAdapter.evaluate(StatementAdapter.java:36)
	at com.carrotsearch.randomizedtesting.ThreadLeakControl$StatementRunner.run(ThreadLeakControl.java:367)
	at com.carrotsearch.randomizedtesting.ThreadLeakControl.forkTimeoutingTask(ThreadLeakControl.java:809)
	at com.carrotsearch.randomizedtesting.ThreadLeakControl$3.evaluate(ThreadLeakControl.java:460)
	at com.carrotsearch.randomizedtesting.RandomizedRunner.runSingleTest(RandomizedRunner.java:880)
	at com.carrotsearch.randomizedtesting.RandomizedRunner$5.evaluate(RandomizedRunner.java:781)
	at com.carrotsearch.randomizedtesting.RandomizedRunner$6.evaluate(RandomizedRunner.java:816)
	at com.carrotsearch.randomizedtesting.RandomizedRunner$7.evaluate(RandomizedRunner.java:827)
	at com.carrotsearch.randomizedtesting.rules.StatementAdapter.evaluate(StatementAdapter.java:36)
	at com.carrotsearch.randomizedtesting.rules.SystemPropertiesRestoreRule$1.evaluate(SystemPropertiesRestoreRule.java:57)
	at org.apache.lucene.util.AbstractBeforeAfterRule$1.evaluate(AbstractBeforeAfterRule.java:45)
	at com.carrotsearch.randomizedtesting.rules.StatementAdapter.evaluate(StatementAdapter.java:36)
	at org.apache.lucene.util.TestRuleStoreClassName$1.evaluate(TestRuleStoreClassName.java:41)
	at com.carrotsearch.randomizedtesting.rules.NoShadowingOrOverridesOnMethodsRule$1.evaluate(NoShadowingOrOverridesOnMethodsRule.java:40)
	at com.carrotsearch.randomizedtesting.rules.NoShadowingOrOverridesOnMethodsRule$1.evaluate(NoShadowingOrOverridesOnMethodsRule.java:40)
	at com.carrotsearch.randomizedtesting.rules.StatementAdapter.evaluate(StatementAdapter.java:36)
	at com.carrotsearch.randomizedtesting.rules.StatementAdapter.evaluate(StatementAdapter.java:36)
	at com.carrotsearch.randomizedtesting.rules.StatementAdapter.evaluate(StatementAdapter.java:36)
	at org.apache.lucene.util.TestRuleAssertionsRequired$1.evaluate(TestRuleAssertionsRequired.java:53)
	at org.apache.lucene.util.TestRuleMarkFailure$1.evaluate(TestRuleMarkFailure.java:47)
	at org.apache.lucene.util.TestRuleIgnoreAfterMaxFailures$1.evaluate(TestRuleIgnoreAfterMaxFailures.java:64)
	at org.apache.lucene.util.TestRuleIgnoreTestSuites$1.evaluate(TestRuleIgnoreTestSuites.java:54)
	at com.carrotsearch.randomizedtesting.rules.StatementAdapter.evaluate(StatementAdapter.java:36)
	at com.carrotsearch.randomizedtesting.ThreadLeakControl$StatementRunner.run(ThreadLeakControl.java:367)
	at java.lang.Thread.run(java.base@9-ea/Thread.java:843)




Build Log:
[...truncated 11110 lines...]
   [junit4] Suite: org.apache.solr.handler.TestReqParamsAPI
   [junit4]   2> Creating dataDir: /home/jenkins/workspace/Lucene-Solr-6.x-Linux/solr/build/solr-core/test/J1/temp/solr.handler.TestReqParamsAPI_919D8DFB4ADF743C-001/init-core-data-001
   [junit4]   2> 532129 INFO  (SUITE-TestReqParamsAPI-seed#[919D8DFB4ADF743C]-worker) [    ] o.a.s.SolrTestCaseJ4 Randomized ssl (true) and clientAuth (true) via: @org.apache.solr.util.RandomizeSSL(reason=, ssl=NaN, value=NaN, clientAuth=NaN)
   [junit4]   2> 532129 INFO  (SUITE-TestReqParamsAPI-seed#[919D8DFB4ADF743C]-worker) [    ] o.a.s.BaseDistributedSearchTestCase Setting hostContext system property: /
   [junit4]   2> 532130 INFO  (TEST-TestReqParamsAPI.test-seed#[919D8DFB4ADF743C]) [    ] o.a.s.c.ZkTestServer STARTING ZK TEST SERVER
   [junit4]   2> 532131 INFO  (Thread-1454) [    ] o.a.s.c.ZkTestServer client port:0.0.0.0/0.0.0.0:0
   [junit4]   2> 532131 INFO  (Thread-1454) [    ] o.a.s.c.ZkTestServer Starting server
   [junit4]   2> 532231 INFO  (TEST-TestReqParamsAPI.test-seed#[919D8DFB4ADF743C]) [    ] o.a.s.c.ZkTestServer start zk server on port:39078
   [junit4]   2> 532231 INFO  (TEST-TestReqParamsAPI.test-seed#[919D8DFB4ADF743C]) [    ] o.a.s.c.c.SolrZkClient Using default ZkCredentialsProvider
   [junit4]   2> 532231 INFO  (TEST-TestReqParamsAPI.test-seed#[919D8DFB4ADF743C]) [    ] o.a.s.c.c.ConnectionManager Waiting for client to connect to ZooKeeper
   [junit4]   2> 532232 INFO  (zkCallback-18524-thread-1) [    ] o.a.s.c.c.ConnectionManager Watcher org.apache.solr.common.cloud.ConnectionManager@6527e978 name:ZooKeeperConnection Watcher:127.0.0.1:39078 got event WatchedEvent state:SyncConnected type:None path:null path:null type:None
   [junit4]   2> 532232 INFO  (TEST-TestReqParamsAPI.test-seed#[919D8DFB4ADF743C]) [    ] o.a.s.c.c.ConnectionManager Client is connected to ZooKeeper
   [junit4]   2> 532232 INFO  (TEST-TestReqParamsAPI.test-seed#[919D8DFB4ADF743C]) [    ] o.a.s.c.c.SolrZkClient Using default ZkACLProvider
   [junit4]   2> 532232 INFO  (TEST-TestReqParamsAPI.test-seed#[919D8DFB4ADF743C]) [    ] o.a.s.c.c.SolrZkClient makePath: /solr
   [junit4]   2> 532234 INFO  (TEST-TestReqParamsAPI.test-seed#[919D8DFB4ADF743C]) [    ] o.a.s.c.c.SolrZkClient Using default ZkCredentialsProvider
   [junit4]   2> 532234 INFO  (TEST-TestReqParamsAPI.test-seed#[919D8DFB4ADF743C]) [    ] o.a.s.c.c.ConnectionManager Waiting for client to connect to ZooKeeper
   [junit4]   2> 532234 INFO  (zkCallback-18525-thread-1) [    ] o.a.s.c.c.ConnectionManager Watcher org.apache.solr.common.cloud.ConnectionManager@375813f5 name:ZooKeeperConnection Watcher:127.0.0.1:39078/solr got event WatchedEvent state:SyncConnected type:None path:null path:null type:None
   [junit4]   2> 532234 INFO  (TEST-TestReqParamsAPI.test-seed#[919D8DFB4ADF743C]) [    ] o.a.s.c.c.ConnectionManager Client is connected to ZooKeeper
   [junit4]   2> 532235 INFO  (TEST-TestReqParamsAPI.test-seed#[919D8DFB4ADF743C]) [    ] o.a.s.c.c.SolrZkClient Using default ZkACLProvider
   [junit4]   2> 532235 INFO  (TEST-TestReqParamsAPI.test-seed#[919D8DFB4ADF743C]) [    ] o.a.s.c.c.SolrZkClient makePath: /collections/collection1
   [junit4]   2> 532236 INFO  (TEST-TestReqParamsAPI.test-seed#[919D8DFB4ADF743C]) [    ] o.a.s.c.c.SolrZkClient makePath: /collections/collection1/shards
   [junit4]   2> 532237 INFO  (TEST-TestReqParamsAPI.test-seed#[919D8DFB4ADF743C]) [    ] o.a.s.c.c.SolrZkClient makePath: /collections/control_collection
   [junit4]   2> 532240 INFO  (TEST-TestReqParamsAPI.test-seed#[919D8DFB4ADF743C]) [    ] o.a.s.c.c.SolrZkClient makePath: /collections/control_collection/shards
   [junit4]   2> 532241 INFO  (TEST-TestReqParamsAPI.test-seed#[919D8DFB4ADF743C]) [    ] o.a.s.c.AbstractZkTestCase put /home/jenkins/workspace/Lucene-Solr-6.x-Linux/solr/core/src/test-files/solr/collection1/conf/solrconfig-tlog.xml to /configs/conf1/solrconfig.xml
   [junit4]   2> 532241 INFO  (TEST-TestReqParamsAPI.test-seed#[919D8DFB4ADF743C]) [    ] o.a.s.c.c.SolrZkClient makePath: /configs/conf1/solrconfig.xml
   [junit4]   2> 532243 INFO  (TEST-TestReqParamsAPI.test-seed#[919D8DFB4ADF743C]) [    ] o.a.s.c.AbstractZkTestCase put /home/jenkins/workspace/Lucene-Solr-6.x-Linux/solr/core/src/test-files/solr/collection1/conf/schema.xml to /configs/conf1/schema.xml
   [junit4]   2> 532243 INFO  (TEST-TestReqParamsAPI.test-seed#[919D8DFB4ADF743C]) [    ] o.a.s.c.c.SolrZkClient makePath: /configs/conf1/schema.xml
   [junit4]   2> 532244 INFO  (TEST-TestReqParamsAPI.test-seed#[919D8DFB4ADF743C]) [    ] o.a.s.c.AbstractZkTestCase put /home/jenkins/workspace/Lucene-Solr-6.x-Linux/solr/core/src/test-files/solr/collection1/conf/solrconfig.snippet.randomindexconfig.xml to /configs/conf1/solrconfig.snippet.randomindexconfig.xml
   [junit4]   2> 532244 INFO  (TEST-TestReqParamsAPI.test-seed#[919D8DFB4ADF743C]) [    ] o.a.s.c.c.SolrZkClient makePath: /configs/conf1/solrconfig.snippet.randomindexconfig.xml
   [junit4]   2> 532245 INFO  (TEST-TestReqParamsAPI.test-seed#[919D8DFB4ADF743C]) [    ] o.a.s.c.AbstractZkTestCase put /home/jenkins/workspace/Lucene-Solr-6.x-Linux/solr/core/src/test-files/solr/collection1/conf/stopwords.txt to /configs/conf1/stopwords.txt
   [junit4]   2> 532245 INFO  (TEST-TestReqParamsAPI.test-seed#[919D8DFB4ADF743C]) [    ] o.a.s.c.c.SolrZkClient makePath: /configs/conf1/stopwords.txt
   [junit4]   2> 532246 INFO  (TEST-TestReqParamsAPI.test-seed#[919D8DFB4ADF743C]) [    ] o.a.s.c.AbstractZkTestCase put /home/jenkins/workspace/Lucene-Solr-6.x-Linux/solr/core/src/test-files/solr/collection1/conf/protwords.txt to /configs/conf1/protwords.txt
   [junit4]   2> 532246 INFO  (TEST-TestReqParamsAPI.test-seed#[919D8DFB4ADF743C]) [    ] o.a.s.c.c.SolrZkClient makePath: /configs/conf1/protwords.txt
   [junit4]   2> 532247 INFO  (TEST-TestReqParamsAPI.test-seed#[919D8DFB4ADF743C]) [    ] o.a.s.c.AbstractZkTestCase put /home/jenkins/workspace/Lucene-Solr-6.x-Linux/solr/core/src/test-files/solr/collection1/conf/currency.xml to /configs/conf1/currency.xml
   [junit4]   2> 532247 INFO  (TEST-TestReqParamsAPI.test-seed#[919D8DFB4ADF743C]) [    ] o.a.s.c.c.SolrZkClient makePath: /configs/conf1/currency.xml
   [junit4]   2> 532248 INFO  (TEST-TestReqParamsAPI.test-seed#[919D8DFB4ADF743C]) [    ] o.a.s.c.AbstractZkTestCase put /home/jenkins/workspace/Lucene-Solr-6.x-Linux/solr/core/src/test-files/solr/collection1/conf/enumsConfig.xml to /configs/conf1/enumsConfig.xml
   [junit4]   2> 532248 INFO  (TEST-TestReqParamsAPI.test-seed#[919D8DFB4ADF743C]) [    ] o.a.s.c.c.SolrZkClient makePath: /configs/conf1/enumsConfig.xml
   [junit4]   2> 532248 INFO  (TEST-TestReqParamsAPI.test-seed#[919D8DFB4ADF743C]) [    ] o.a.s.c.AbstractZkTestCase put /home/jenkins/workspace/Lucene-Solr-6.x-Linux/solr/core/src/test-files/solr/collection1/conf/open-exchange-rates.json to /configs/conf1/open-exchange-rates.json
   [junit4]   2> 532248 INFO  (TEST-TestReqParamsAPI.test-seed#[919D8DFB4ADF743C]) [    ] o.a.s.c.c.SolrZkClient makePath: /configs/conf1/open-exchange-rates.json
   [junit4]   2> 532249 INFO  (TEST-TestReqParamsAPI.test-seed#[919D8DFB4ADF743C]) [    ] o.a.s.c.AbstractZkTestCase put /home/jenkins/workspace/Lucene-Solr-6.x-Linux/solr/core/src/test-files/solr/collection1/conf/mapping-ISOLatin1Accent.txt to /configs/conf1/mapping-ISOLatin1Accent.txt
   [junit4]   2> 532249 INFO  (TEST-TestReqParamsAPI.test-seed#[919D8DFB4ADF743C]) [    ] o.a.s.c.c.SolrZkClient makePath: /configs/conf1/mapping-ISOLatin1Accent.txt
   [junit4]   2> 532249 INFO  (TEST-TestReqParamsAPI.test-seed#[919D8DFB4ADF743C]) [    ] o.a.s.c.AbstractZkTestCase put /home/jenkins/workspace/Lucene-Solr-6.x-Linux/solr/core/src/test-files/solr/collection1/conf/old_synonyms.txt to /configs/conf1/old_synonyms.txt
   [junit4]   2> 532250 INFO  (TEST-TestReqParamsAPI.test-seed#[919D8DFB4ADF743C]) [    ] o.a.s.c.c.SolrZkClient makePath: /configs/conf1/old_synonyms.txt
   [junit4]   2> 532250 INFO  (TEST-TestReqParamsAPI.test-seed#[919D8DFB4ADF743C]) [    ] o.a.s.c.AbstractZkTestCase put /home/jenkins/workspace/Lucene-Solr-6.x-Linux/solr/core/src/test-files/solr/collection1/conf/synonyms.txt to /configs/conf1/synonyms.txt
   [junit4]   2> 532250 INFO  (TEST-TestReqParamsAPI.test-seed#[919D8DFB4ADF743C]) [    ] o.a.s.c.c.SolrZkClient makePath: /configs/conf1/synonyms.txt
   [junit4]   2> 532251 INFO  (TEST-TestReqParamsAPI.test-seed#[919D8DFB4ADF743C]) [    ] o.a.s.c.c.SolrZkClient Using default ZkCredentialsProvider
   [junit4]   2> 532252 INFO  (TEST-TestReqParamsAPI.test-seed#[919D8DFB4ADF743C]) [    ] o.a.s.c.c.ConnectionManager Waiting for client to connect to ZooKeeper
   [junit4]   2> 532252 INFO  (zkCallback-18527-thread-1) [    ] o.a.s.c.c.ConnectionManager Watcher org.apache.solr.common.cloud.ConnectionManager@7d1c52bc name:ZooKeeperConnection Watcher:127.0.0.1:39078/solr got event WatchedEvent state:SyncConnected type:None path:null path:null type:None
   [junit4]   2> 532252 INFO  (TEST-TestReqParamsAPI.test-seed#[919D8DFB4ADF743C]) [    ] o.a.s.c.c.ConnectionManager Client is connected to ZooKeeper
   [junit4]   2> 532252 INFO  (TEST-TestReqParamsAPI.test-seed#[919D8DFB4ADF743C]) [    ] o.a.s.c.c.SolrZkClient Using default ZkACLProvider
   [junit4]   2> 532310 INFO  (TEST-TestReqParamsAPI.test-seed#[919D8DFB4ADF743C]) [    ] o.a.s.SolrTestCaseJ4 Writing core.properties file to /home/jenkins/workspace/Lucene-Solr-6.x-Linux/solr/build/solr-core/test/J1/temp/solr.handler.TestReqParamsAPI_919D8DFB4ADF743C-001/control-001/cores/collection1
   [junit4]   2> 532311 INFO  (TEST-TestReqParamsAPI.test-seed#[919D8DFB4ADF743C]) [    ] o.e.j.s.Server jetty-9.3.8.v20160314
   [junit4]   2> 532312 INFO  (TEST-TestReqParamsAPI.test-seed#[919D8DFB4ADF743C]) [    ] o.e.j.s.h.ContextHandler Started o.e.j.s.ServletContextHandler@18c2c90f{/,null,AVAILABLE}
   [junit4]   2> 532313 INFO  (TEST-TestReqParamsAPI.test-seed#[919D8DFB4ADF743C]) [    ] o.e.j.s.ServerConnector Started ServerConnector@1a00ac53{SSL,[ssl, http/1.1]}{127.0.0.1:45968}
   [junit4]   2> 532313 INFO  (TEST-TestReqParamsAPI.test-seed#[919D8DFB4ADF743C]) [    ] o.e.j.s.Server Started @534831ms
   [junit4]   2> 532313 INFO  (TEST-TestReqParamsAPI.test-seed#[919D8DFB4ADF743C]) [    ] o.a.s.c.s.e.JettySolrRunner Jetty properties: {hostContext=/, solr.data.dir=/home/jenkins/workspace/Lucene-Solr-6.x-Linux/solr/build/solr-core/test/J1/temp/solr.handler.TestReqParamsAPI_919D8DFB4ADF743C-001/tempDir-001/control/data, hostPort=45968, coreRootDirectory=/home/jenkins/workspace/Lucene-Solr-6.x-Linux/solr/build/solr-core/test/J1/temp/solr.handler.TestReqParamsAPI_919D8DFB4ADF743C-001/control-001/cores}
   [junit4]   2> 532314 INFO  (TEST-TestReqParamsAPI.test-seed#[919D8DFB4ADF743C]) [    ] o.a.s.s.SolrDispatchFilter SolrDispatchFilter.init(): jdk.internal.loader.ClassLoaders$AppClassLoader@2cfb4a64
   [junit4]   2> 532314 INFO  (TEST-TestReqParamsAPI.test-seed#[919D8DFB4ADF743C]) [    ] o.a.s.c.SolrResourceLoader new SolrResourceLoader for directory: '/home/jenkins/workspace/Lucene-Solr-6.x-Linux/solr/build/solr-core/test/J1/temp/solr.handler.TestReqParamsAPI_919D8DFB4ADF743C-001/control-001'
   [junit4]   2> 532314 INFO  (TEST-TestReqParamsAPI.test-seed#[919D8DFB4ADF743C]) [    ] o.a.s.c.SolrResourceLoader JNDI not configured for solr (NoInitialContextEx)
   [junit4]   2> 532314 INFO  (TEST-TestReqParamsAPI.test-seed#[919D8DFB4ADF743C]) [    ] o.a.s.c.SolrResourceLoader solr home defaulted to 'solr/' (could not find system property or JNDI)
   [junit4]   2> 532314 INFO  (TEST-TestReqParamsAPI.test-seed#[919D8DFB4ADF743C]) [    ] o.a.s.c.c.SolrZkClient Using default ZkCredentialsProvider
   [junit4]   2> 532315 INFO  (TEST-TestReqParamsAPI.test-seed#[919D8DFB4ADF743C]) [    ] o.a.s.c.c.ConnectionManager Waiting for client to connect to ZooKeeper
   [junit4]   2> 532315 INFO  (zkCallback-18528-thread-1) [    ] o.a.s.c.c.ConnectionManager Watcher org.apache.solr.common.cloud.ConnectionManager@1051c11 name:ZooKeeperConnection Watcher:127.0.0.1:39078/solr got event WatchedEvent state:SyncConnected type:None path:null path:null type:None
   [junit4]   2> 532315 INFO  (TEST-TestReqParamsAPI.test-seed#[919D8DFB4ADF743C]) [    ] o.a.s.c.c.ConnectionManager Client is connected to ZooKeeper
   [junit4]   2> 532315 INFO  (TEST-TestReqParamsAPI.test-seed#[919D8DFB4ADF743C]) [    ] o.a.s.c.c.SolrZkClient Using default ZkACLProvider
   [junit4]   2> 532316 INFO  (TEST-TestReqParamsAPI.test-seed#[919D8DFB4ADF743C]) [    ] o.a.s.s.SolrDispatchFilter Loading solr.xml from SolrHome (not found in ZooKeeper)
   [junit4]   2> 532316 INFO  (TEST-TestReqParamsAPI.test-seed#[919D8DFB4ADF743C]) [    ] o.a.s.c.SolrXmlConfig Loading container configuration from /home/jenkins/workspace/Lucene-Solr-6.x-Linux/solr/build/solr-core/test/J1/temp/solr.handler.TestReqParamsAPI_919D8DFB4ADF743C-001/control-001/solr.xml
   [junit4]   2> 532319 INFO  (TEST-TestReqParamsAPI.test-seed#[919D8DFB4ADF743C]) [    ] o.a.s.c.CorePropertiesLocator Config-defined core root directory: /home/jenkins/workspace/Lucene-Solr-6.x-Linux/solr/build/solr-core/test/J1/temp/solr.handler.TestReqParamsAPI_919D8DFB4ADF743C-001/control-001/cores
   [junit4]   2> 532319 INFO  (TEST-TestReqParamsAPI.test-seed#[919D8DFB4ADF743C]) [    ] o.a.s.c.CoreContainer New CoreContainer 30482124
   [junit4]   2> 532319 INFO  (TEST-TestReqParamsAPI.test-seed#[919D8DFB4ADF743C]) [    ] o.a.s.c.CoreContainer Loading cores into CoreContainer [instanceDir=/home/jenkins/workspace/Lucene-Solr-6.x-Linux/solr/build/solr-core/test/J1/temp/solr.handler.TestReqParamsAPI_919D8DFB4ADF743C-001/control-001]
   [junit4]   2> 532319 WARN  (TEST-TestReqParamsAPI.test-seed#[919D8DFB4ADF743C]) [    ] o.a.s.c.CoreContainer Couldn't add files from /home/jenkins/workspace/Lucene-Solr-6.x-Linux/solr/build/solr-core/test/J1/temp/solr.handler.TestReqParamsAPI_919D8DFB4ADF743C-001/control-001/lib to classpath: /home/jenkins/workspace/Lucene-Solr-6.x-Linux/solr/build/solr-core/test/J1/temp/solr.handler.TestReqParamsAPI_919D8DFB4ADF743C-001/control-001/lib
   [junit4]   2> 532319 INFO  (TEST-TestReqParamsAPI.test-seed#[919D8DFB4ADF743C]) [    ] o.a.s.h.c.HttpShardHandlerFactory created with socketTimeout : 90000,urlScheme : ,connTimeout : 15000,maxConnectionsPerHost : 20,maxConnections : 10000,corePoolSize : 0,maximumPoolSize : 2147483647,maxThreadIdleTime : 5,sizeOfQueue : -1,fairnessPolicy : false,useRetries : false,
   [junit4]   2> 532320 INFO  (TEST-TestReqParamsAPI.test-seed#[919D8DFB4ADF743C]) [    ] o.a.s.u.UpdateShardHandler Creating UpdateShardHandler HTTP client with params: socketTimeout=340000&connTimeout=45000&retry=true
   [junit4]   2> 532320 INFO  (TEST-TestReqParamsAPI.test-seed#[919D8DFB4ADF743C]) [    ] o.a.s.l.LogWatcher SLF4J impl is org.slf4j.impl.Log4jLoggerFactory
   [junit4]   2> 532320 INFO  (TEST-TestReqParamsAPI.test-seed#[919D8DFB4ADF743C]) [    ] o.a.s.l.LogWatcher Registering Log Listener [Log4j (org.slf4j.impl.Log4jLoggerFactory)]
   [junit4]   2> 532320 INFO  (TEST-TestReqParamsAPI.test-seed#[919D8DFB4ADF743C]) [    ] o.a.s.c.ZkContainer Zookeeper client=127.0.0.1:39078/solr
   [junit4]   2> 532320 INFO  (TEST-TestReqParamsAPI.test-seed#[919D8DFB4ADF743C]) [    ] o.a.s.c.ZkController zkHost includes chroot
   [junit4]   2> 532320 INFO  (TEST-TestReqParamsAPI.test-seed#[919D8DFB4ADF743C]) [    ] o.a.s.c.c.SolrZkClient Using default ZkCredentialsProvider
   [junit4]   2> 532321 INFO  (TEST-TestReqParamsAPI.test-seed#[919D8DFB4ADF743C]) [    ] o.a.s.c.c.ConnectionManager Waiting for client to connect to ZooKeeper
   [junit4]   2> 532334 INFO  (zkCallback-18531-thread-1) [    ] o.a.s.c.c.ConnectionManager Watcher org.apache.solr.common.cloud.ConnectionManager@49ff3de7 name:ZooKeeperConnection Watcher:127.0.0.1:39078 got event WatchedEvent state:SyncConnected type:None path:null path:null type:None
   [junit4]   2> 532335 INFO  (TEST-TestReqParamsAPI.test-seed#[919D8DFB4ADF743C]) [    ] o.a.s.c.c.ConnectionManager Client is connected to ZooKeeper
   [junit4]   2> 532335 INFO  (TEST-TestReqParamsAPI.test-seed#[919D8DFB4ADF743C]) [    ] o.a.s.c.c.SolrZkClient Using default ZkACLProvider
   [junit4]   2> 532335 INFO  (TEST-TestReqParamsAPI.test-seed#[919D8DFB4ADF743C]) [    ] o.a.s.c.ZkController Added new OnReconnect listener org.apache.solr.cloud.ZkController$$Lambda$144/891945504@5dd26fad
   [junit4]   2> 532336 INFO  (TEST-TestReqParamsAPI.test-seed#[919D8DFB4ADF743C]) [    ] o.a.s.c.c.ConnectionManager Waiting for client to connect to ZooKeeper
   [junit4]   2> 532336 INFO  (zkCallback-18532-thread-1) [    ] o.a.s.c.c.ConnectionManager Watcher org.apache.solr.common.cloud.ConnectionManager@4f35e8a6 name:ZooKeeperConnection Watcher:127.0.0.1:39078/solr got event WatchedEvent state:SyncConnected type:None path:null path:null type:None
   [junit4]   2> 532336 INFO  (TEST-TestReqParamsAPI.test-seed#[919D8DFB4ADF743C]) [    ] o.a.s.c.c.ConnectionManager Client is connected to ZooKeeper
   [junit4]   2> 532337 INFO  (TEST-TestReqParamsAPI.test-seed#[919D8DFB4ADF743C]) [    ] o.a.s.c.c.SolrZkClient makePath: /overseer/queue
   [junit4]   2> 532337 INFO  (TEST-TestReqParamsAPI.test-seed#[919D8DFB4ADF743C]) [    ] o.a.s.c.c.SolrZkClient makePath: /overseer/collection-queue-work
   [junit4]   2> 532339 INFO  (TEST-TestReqParamsAPI.test-seed#[919D8DFB4ADF743C]) [    ] o.a.s.c.c.SolrZkClient makePath: /overseer/collection-map-running
   [junit4]   2> 532339 INFO  (TEST-TestReqParamsAPI.test-seed#[919D8DFB4ADF743C]) [    ] o.a.s.c.c.SolrZkClient makePath: /overseer/collection-map-completed
   [junit4]   2> 532340 INFO  (TEST-TestReqParamsAPI.test-seed#[919D8DFB4ADF743C]) [    ] o.a.s.c.c.SolrZkClient makePath: /overseer/collection-map-failure
   [junit4]   2> 532340 INFO  (TEST-TestReqParamsAPI.test-seed#[919D8DFB4ADF743C]) [    ] o.a.s.c.c.SolrZkClient makePath: /live_nodes
   [junit4]   2> 532341 INFO  (TEST-TestReqParamsAPI.test-seed#[919D8DFB4ADF743C]) [    ] o.a.s.c.c.SolrZkClient makePath: /aliases.json
   [junit4]   2> 532342 INFO  (TEST-TestReqParamsAPI.test-seed#[919D8DFB4ADF743C]) [    ] o.a.s.c.c.SolrZkClient makePath: /clusterstate.json
   [junit4]   2> 532342 INFO  (TEST-TestReqParamsAPI.test-seed#[919D8DFB4ADF743C]) [    ] o.a.s.c.c.SolrZkClient makePath: /security.json
   [junit4]   2> 532343 INFO  (TEST-TestReqParamsAPI.test-seed#[919D8DFB4ADF743C]) [    ] o.a.s.c.c.ZkStateReader Updating cluster state from ZooKeeper... 
   [junit4]   2> 532343 INFO  (TEST-TestReqParamsAPI.test-seed#[919D8DFB4ADF743C]) [    ] o.a.s.c.c.ZkStateReader Loaded cluster properties: {urlScheme=https}
   [junit4]   2> 532343 INFO  (TEST-TestReqParamsAPI.test-seed#[919D8DFB4ADF743C]) [    ] o.a.s.c.c.ZkStateReader Updated live nodes from ZooKeeper... (0) -> (0)
   [junit4]   2> 532344 INFO  (TEST-TestReqParamsAPI.test-seed#[919D8DFB4ADF743C]) [    ] o.a.s.c.c.SolrZkClient makePath: /overseer_elect
   [junit4]   2> 532345 INFO  (TEST-TestReqParamsAPI.test-seed#[919D8DFB4ADF743C]) [    ] o.a.s.c.c.SolrZkClient makePath: /overseer_elect/election
   [junit4]   2> 532345 INFO  (TEST-TestReqParamsAPI.test-seed#[919D8DFB4ADF743C]) [    ] o.a.s.c.Overseer Overseer (id=null) closing
   [junit4]   2> 532345 INFO  (TEST-TestReqParamsAPI.test-seed#[919D8DFB4ADF743C]) [    ] o.a.s.c.LeaderElector Joined leadership election with path: /overseer_elect/election/96167260341469189-127.0.0.1:45968_-n_0000000000
   [junit4]   2> 532346 INFO  (TEST-TestReqParamsAPI.test-seed#[919D8DFB4ADF743C]) [    ] o.a.s.c.OverseerElectionContext I am going to be the leader 127.0.0.1:45968_
   [junit4]   2> 532346 INFO  (TEST-TestReqParamsAPI.test-seed#[919D8DFB4ADF743C]) [    ] o.a.s.c.c.SolrZkClient makePath: /overseer_elect/leader
   [junit4]   2> 532346 INFO  (TEST-TestReqParamsAPI.test-seed#[919D8DFB4ADF743C]) [    ] o.a.s.c.Overseer Overseer (id=96167260341469189-127.0.0.1:45968_-n_0000000000) starting
   [junit4]   2> 532347 INFO  (TEST-TestReqParamsAPI.test-seed#[919D8DFB4ADF743C]) [    ] o.a.s.c.c.SolrZkClient makePath: /overseer/queue-work
   [junit4]   2> 532349 INFO  (TEST-TestReqParamsAPI.test-seed#[919D8DFB4ADF743C]) [    ] o.a.s.c.OverseerAutoReplicaFailoverThread Starting OverseerAutoReplicaFailoverThread autoReplicaFailoverWorkLoopDelay=10000 autoReplicaFailoverWaitAfterExpiration=30000 autoReplicaFailoverBadNodeExpiration=60000
   [junit4]   2> 532349 INFO  (OverseerCollectionConfigSetProcessor-96167260341469189-127.0.0.1:45968_-n_0000000000) [    ] o.a.s.c.OverseerTaskProcessor Process current queue of overseer operations
   [junit4]   2> 532349 INFO  (OverseerStateUpdate-96167260341469189-127.0.0.1:45968_-n_0000000000) [    ] o.a.s.c.Overseer Starting to work on the main queue
   [junit4]   2> 532353 INFO  (TEST-TestReqParamsAPI.test-seed#[919D8DFB4ADF743C]) [    ] o.a.s.c.ZkController Register node as live in ZooKeeper:/live_nodes/127.0.0.1:45968_
   [junit4]   2> 532353 INFO  (TEST-TestReqParamsAPI.test-seed#[919D8DFB4ADF743C]) [    ] o.a.s.c.c.SolrZkClient makePath: /live_nodes/127.0.0.1:45968_
   [junit4]   2> 532353 INFO  (OverseerStateUpdate-96167260341469189-127.0.0.1:45968_-n_0000000000) [    ] o.a.s.c.c.ZkStateReader Updated live nodes from ZooKeeper... (0) -> (0)
   [junit4]   2> 532353 INFO  (zkCallback-18532-thread-1) [    ] o.a.s.c.c.ZkStateReader A live node change: [WatchedEvent state:SyncConnected type:NodeChildrenChanged path:/live_nodes], has occurred - updating... (live nodes size: [0])
   [junit4]   2> 532354 INFO  (zkCallback-18532-thread-1) [    ] o.a.s.c.c.ZkStateReader Updated live nodes from ZooKeeper... (0) -> (1)
   [junit4]   2> 532359 INFO  (TEST-TestReqParamsAPI.test-seed#[919D8DFB4ADF743C]) [    ] o.a.s.c.CoreContainer Security conf doesn't exist. Skipping setup for authorization module.
   [junit4]   2> 532359 INFO  (TEST-TestReqParamsAPI.test-seed#[919D8DFB4ADF743C]) [    ] o.a.s.c.CoreContainer No authentication plugin used.
   [junit4]   2> 532359 INFO  (TEST-TestReqParamsAPI.test-seed#[919D8DFB4ADF743C]) [    ] o.a.s.c.CorePropertiesLocator Looking for core definitions underneath /home/jenkins/workspace/Lucene-Solr-6.x-Linux/solr/build/solr-core/test/J1/temp/solr.handler.TestReqParamsAPI_919D8DFB4ADF743C-001/control-001/cores
   [junit4]   2> 532360 INFO  (TEST-TestReqParamsAPI.test-seed#[919D8DFB4ADF743C]) [    ] o.a.s.c.CoreDescriptor Created CoreDescriptor: {schema=schema.xml, dataDir=data/, collection=control_collection, loadOnStartup=true, coreNodeName=, transient=false, name=collection1, shard=, config=solrconfig.xml, configSetProperties=configsetprops.json}
   [junit4]   2> 532360 INFO  (TEST-TestReqParamsAPI.test-seed#[919D8DFB4ADF743C]) [    ] o.a.s.c.CorePropertiesLocator Found core collection1 in /home/jenkins/workspace/Lucene-Solr-6.x-Linux/solr/build/solr-core/test/J1/temp/solr.handler.TestReqParamsAPI_919D8DFB4ADF743C-001/control-001/cores/collection1
   [junit4]   2> 532360 INFO  (TEST-TestReqParamsAPI.test-seed#[919D8DFB4ADF743C]) [    ] o.a.s.c.CorePropertiesLocator Found 1 core definitions
   [junit4]   2> 532360 INFO  (TEST-TestReqParamsAPI.test-seed#[919D8DFB4ADF743C]) [    ] o.a.s.s.SolrDispatchFilter user.dir=/home/jenkins/workspace/Lucene-Solr-6.x-Linux/solr/build/solr-core/test/J1
   [junit4]   2> 532361 INFO  (TEST-TestReqParamsAPI.test-seed#[919D8DFB4ADF743C]) [    ] o.a.s.s.SolrDispatchFilter SolrDispatchFilter.init() done
   [junit4]   2> 532363 INFO  (coreLoadExecutor-5051-thread-1) [    ] o.a.s.c.ZkController publishing state=down
   [junit4]   2> 532363 INFO  (coreLoadExecutor-5051-thread-1) [    ] o.a.s.c.ZkController numShards not found on descriptor - reading it from system property
   [junit4]   2> 532364 INFO  (coreLoadExecutor-5051-thread-1) [    ] o.a.s.c.ZkController Collection control_collection not visible yet, but flagging it so a watch is registered when it becomes visible
   [junit4]   2> 532364 INFO  (OverseerStateUpdate-96167260341469189-127.0.0.1:45968_-n_0000000000) [    ] o.a.s.c.Overseer processMessage: queueSize: 1, message = {
   [junit4]   2>   "core":"collection1",
   [junit4]   2>   "roles":null,
   [junit4]   2>   "base_url":"https://127.0.0.1:45968",
   [junit4]   2>   "node_name":"127.0.0.1:45968_",
   [junit4]   2>   "numShards":"1",
   [junit4]   2>   "state":"down",
   [junit4]   2>   "shard":null,
   [junit4]   2>   "collection":"control_collection",
   [junit4]   2>   "operation":"state"} current state version: 0
   [junit4]   2> 532364 INFO  (OverseerStateUpdate-96167260341469189-127.0.0.1:45968_-n_0000000000) [    ] o.a.s.c.o.ReplicaMutator Update state numShards=1 message={
   [junit4]   2>   "core":"collection1",
   [junit4]   2>   "roles":null,
   [junit4]   2>   "base_url":"https://127.0.0.1:45968",
   [junit4]   2>   "node_name":"127.0.0.1:45968_",
   [junit4]   2>   "numShards":"1",
   [junit4]   2>   "state":"down",
   [junit4]   2>   "shard":null,
   [junit4]   2>   "collection":"control_collection",
   [junit4]   2>   "operation":"state"}
   [junit4]   2> 532365 INFO  (coreLoadExecutor-5051-thread-1) [    ] o.a.s.c.c.ZkStateReader Deleting data for [control_collection]
   [junit4]   2> 532365 INFO  (OverseerStateUpdate-96167260341469189-127.0.0.1:45968_-n_0000000000) [    ] o.a.s.c.o.ClusterStateMutator building a new cName: control_collection
   [junit4]   2> 532365 INFO  (coreLoadExecutor-5051-thread-1) [    ] o.a.s.c.ZkController look for our core node name
   [junit4]   2> 532365 INFO  (OverseerStateUpdate-96167260341469189-127.0.0.1:45968_-n_0000000000) [    ] o.a.s.c.o.ReplicaMutator Assigning new node to shard shard=shard1
   [junit4]   2> 532366 INFO  (zkCallback-18532-thread-1) [    ] o.a.s.c.c.ZkStateReader A cluster state change: [WatchedEvent state:SyncConnected type:NodeDataChanged path:/clusterstate.json], has occurred - updating... (live nodes size: [1])
   [junit4]   2> 533365 INFO  (coreLoadExecutor-5051-thread-1) [    ] o.a.s.c.ZkController waiting to find shard id in clusterstate for collection1
   [junit4]   2> 533365 INFO  (coreLoadExecutor-5051-thread-1) [    ] o.a.s.c.ZkController Check for collection zkNode:control_collection
   [junit4]   2> 533366 INFO  (coreLoadExecutor-5051-thread-1) [    ] o.a.s.c.ZkController Collection zkNode exists
   [junit4]   2> 533366 INFO  (coreLoadExecutor-5051-thread-1) [    ] o.a.s.c.c.ZkStateReader Load collection config from: [/collections/control_collection]
   [junit4]   2> 533366 INFO  (coreLoadExecutor-5051-thread-1) [    ] o.a.s.c.c.ZkStateReader path=[/collections/control_collection] [configName]=[conf1] specified config exists in ZooKeeper
   [junit4]   2> 533366 INFO  (coreLoadExecutor-5051-thread-1) [    ] o.a.s.c.SolrResourceLoader new SolrResourceLoader for directory: '/home/jenkins/workspace/Lucene-Solr-6.x-Linux/solr/build/solr-core/test/J1/temp/solr.handler.TestReqParamsAPI_919D8DFB4ADF743C-001/control-001/cores/collection1'
   [junit4]   2> 533366 INFO  (coreLoadExecutor-5051-thread-1) [    ] o.a.s.c.SolrResourceLoader JNDI not configured for solr (NoInitialContextEx)
   [junit4]   2> 533366 INFO  (coreLoadExecutor-5051-thread-1) [    ] o.a.s.c.SolrResourceLoader solr home defaulted to 'solr/' (could not find system property or JNDI)
   [junit4]   2> 533367 INFO  (coreLoadExecutor-5051-thread-1) [    ] o.a.s.c.Config loaded config solrconfig.xml with version 0 
   [junit4]   2> 533372 INFO  (coreLoadExecutor-5051-thread-1) [    ] o.a.s.c.SolrConfig current version of requestparams : -1
   [junit4]   2> 533376 INFO  (coreLoadExecutor-5051-thread-1) [    ] o.a.s.c.SolrConfig Using Lucene MatchVersion: 6.2.0
   [junit4]   2> 533386 INFO  (coreLoadExecutor-5051-thread-1) [    ] o.a.s.c.SolrConfig Loaded SolrConfig: solrconfig.xml
   [junit4]   2> 533391 INFO  (coreLoadExecutor-5051-thread-1) [    ] o.a.s.s.IndexSchema [collection1] Schema name=test
   [junit4]   2> 533493 INFO  (coreLoadExecutor-5051-thread-1) [    ] o.a.s.s.OpenExchangeRatesOrgProvider Initialized with rates=open-exchange-rates.json, refreshInterval=1440.
   [junit4]   2> 533497 INFO  (coreLoadExecutor-5051-thread-1) [    ] o.a.s.s.IndexSchema default search field in schema is text
   [junit4]   2> 533498 INFO  (coreLoadExecutor-5051-thread-1) [    ] o.a.s.s.IndexSchema unique key field: id
   [junit4]   2> 533507 INFO  (coreLoadExecutor-5051-thread-1) [    ] o.a.s.s.FileExchangeRateProvider Reloading exchange rates from file currency.xml
   [junit4]   2> 533509 INFO  (coreLoadExecutor-5051-thread-1) [    ] o.a.s.s.FileExchangeRateProvider Reloading exchange rates from file currency.xml
   [junit4]   2> 533511 INFO  (coreLoadExecutor-5051-thread-1) [    ] o.a.s.s.OpenExchangeRatesOrgProvider Reloading exchange rates from open-exchange-rates.json
   [junit4]   2> 533511 INFO  (coreLoadExecutor-5051-thread-1) [    ] o.a.s.s.OpenExchangeRatesOrgProvider Reloading exchange rates from open-exchange-rates.json
   [junit4]   2> 533513 INFO  (coreLoadExecutor-5051-thread-1) [    ] o.a.s.c.ConfigSetProperties Did not find ConfigSet properties, assuming default properties: Can't find resource 'configsetprops.json' in classpath or '/configs/conf1', cwd=/home/jenkins/workspace/Lucene-Solr-6.x-Linux/solr/build/solr-core/test/J1
   [junit4]   2> 533513 INFO  (coreLoadExecutor-5051-thread-1) [    ] o.a.s.c.CoreContainer Creating SolrCore 'collection1' using configuration from collection control_collection
   [junit4]   2> 533513 INFO  (coreLoadExecutor-5051-thread-1) [    ] o.a.s.c.SolrCore org.apache.solr.core.MockDirectoryFactory
   [junit4]   2> 533514 INFO  (coreLoadExecutor-5051-thread-1) [    ] o.a.s.c.SolrCore [[collection1] ] Opening new SolrCore at [/home/jenkins/workspace/Lucene-Solr-6.x-Linux/solr/build/solr-core/test/J1/temp/solr.handler.TestReqParamsAPI_919D8DFB4ADF743C-001/control-001/cores/collection1], dataDir=[/home/jenkins/workspace/Lucene-Solr-6.x-Linux/solr/build/solr-core/test/J1/temp/solr.handler.TestReqParamsAPI_919D8DFB4ADF743C-001/control-001/cores/collection1/data/]
   [junit4]   2> 533515 INFO  (coreLoadExecutor-5051-thread-1) [    ] o.a.s.c.JmxMonitoredMap JMX monitoring is enabled. Adding Solr mbeans to JMX Server: com.sun.jmx.mbeanserver.JmxMBeanServer@9ba32bf
   [junit4]   2> 533515 INFO  (coreLoadExecutor-5051-thread-1) [    ] o.a.s.c.CachingDirectoryFactory return new directory for /home/jenkins/workspace/Lucene-Solr-6.x-Linux/solr/build/solr-core/test/J1/temp/solr.handler.TestReqParamsAPI_919D8DFB4ADF743C-001/control-001/cores/collection1/data
   [junit4]   2> 533515 INFO  (coreLoadExecutor-5051-thread-1) [    ] o.a.s.c.SolrCore New index directory detected: old=null new=/home/jenkins/workspace/Lucene-Solr-6.x-Linux/solr/build/solr-core/test/J1/temp/solr.handler.TestReqParamsAPI_919D8DFB4ADF743C-001/control-001/cores/collection1/data/index/
   [junit4]   2> 533515 WARN  (coreLoadExecutor-5051-thread-1) [    ] o.a.s.c.SolrCore [collection1] Solr index directory '/home/jenkins/workspace/Lucene-Solr-6.x-Linux/solr/build/solr-core/test/J1/temp/solr.handler.TestReqParamsAPI_919D8DFB4ADF743C-001/control-001/cores/collection1/data/index' doesn't exist. Creating new index...
   [junit4]   2> 533515 INFO  (coreLoadExecutor-5051-thread-1) [    ] o.a.s.c.CachingDirectoryFactory return new directory for /home/jenkins/workspace/Lucene-Solr-6.x-Linux/solr/build/solr-core/test/J1/temp/solr.handler.TestReqParamsAPI_919D8DFB4ADF743C-001/control-001/cores/collection1/data/index
   [junit4]   2> 533516 INFO  (coreLoadExecutor-5051-thread-1) [    ] o.a.s.u.RandomMergePolicy RandomMergePolicy wrapping class org.apache.lucene.index.TieredMergePolicy: [TieredMergePolicy: maxMergeAtOnce=26, maxMergeAtOnceExplicit=24, maxMergedSegmentMB=75.6806640625, floorSegmentMB=1.8583984375, forceMergeDeletesPctAllowed=0.33974399141100453, segmentsPerTier=27.0, maxCFSSegmentSizeMB=8.796093022207999E12, noCFSRatio=0.6638996877102852
   [junit4]   2> 533516 INFO  (coreLoadExecutor-5051-thread-1) [    ] o.a.s.c.SolrDeletionPolicy SolrDeletionPolicy.onCommit: commits: num=1
   [junit4]   2> 	commit{dir=MockDirectoryWrapper(RAMDirectory@3d9c882d lockFactory=org.apache.lucene.store.SingleInstanceLockFactory@1b9dd229),segFN=segments_1,generation=1}
   [junit4]   2> 533516 INFO  (coreLoadExecutor-5051-thread-1) [    ] o.a.s.c.SolrDeletionPolicy newest commit generation = 1
   [junit4]   2> 533516 INFO  (OldIndexDirectoryCleanupThreadForCore-collection1) [    ] o.a.s.c.SolrCore Looking for old index directories to cleanup for core collection1 in /home/jenkins/workspace/Lucene-Solr-6.x-Linux/solr/build/solr-core/test/J1/temp/solr.handler.TestReqParamsAPI_919D8DFB4ADF743C-001/control-001/cores/collection1/data/
   [junit4]   2> 533516 WARN  (OldIndexDirectoryCleanupThreadForCore-collection1) [    ] o.a.s.c.DirectoryFactory /home/jenkins/workspace/Lucene-Solr-6.x-Linux/solr/build/solr-core/test/J1/temp/solr.handler.TestReqParamsAPI_919D8DFB4ADF743C-001/control-001/cores/collection1/data/ does not point to a valid data directory; skipping clean-up of old index directories.
   [junit4]   2> 533519 INFO  (coreLoadExecutor-5051-thread-1) [    ] o.a.s.u.p.UpdateRequestProcessorChain creating updateRequestProcessorChain "nodistrib"
   [junit4]   2> 533519 INFO  (coreLoadExecutor-5051-thread-1) [    ] o.a.s.u.p.UpdateRequestProcessorChain creating updateRequestProcessorChain "dedupe"
   [junit4]   2> 533519 INFO  (coreLoadExecutor-5051-thread-1) [    ] o.a.s.u.p.UpdateRequestProcessorChain inserting DistributedUpdateProcessorFactory into updateRequestProcessorChain "dedupe"
   [junit4]   2> 533519 INFO  (coreLoadExecutor-5051-thread-1) [    ] o.a.s.u.p.UpdateRequestProcessorChain creating updateRequestProcessorChain "stored_sig"
   [junit4]   2> 533519 INFO  (coreLoadExecutor-5051-thread-1) [    ] o.a.s.u.p.UpdateRequestProcessorChain inserting DistributedUpdateProcessorFactory into updateRequestProcessorChain "stored_sig"
   [junit4]   2> 533519 INFO  (coreLoadExecutor-5051-thread-1) [    ] o.a.s.u.p.UpdateRequestProcessorChain creating updateRequestProcessorChain "distrib-dup-test-chain-explicit"
   [junit4]   2> 533520 INFO  (coreLoadExecutor-5051-thread-1) [    ] o.a.s.u.p.UpdateRequestProcessorChain creating updateRequestProcessorChain "distrib-dup-test-chain-implicit"
   [junit4]   2> 533520 INFO  (coreLoadExecutor-5051-thread-1) [    ] o.a.s.u.p.UpdateRequestProcessorChain inserting DistributedUpdateProcessorFactory into updateRequestProcessorChain "distrib-dup-test-chain-implicit"
   [junit4]   2> 533520 INFO  (coreLoadExecutor-5051-thread-1) [    ] o.a.s.c.SolrCore no updateRequestProcessorChain defined as default, creating implicit default
   [junit4]   2> 533520 WARN  (coreLoadExecutor-5051-thread-1) [    ] o.a.s.c.RequestHandlers INVALID paramSet a in requestHandler {type = requestHandler,name = /dump,class = DumpRequestHandler,args = {defaults={a=A,b=B}}}
   [junit4]   2> 533522 INFO  (coreLoadExecutor-5051-thread-1) [    ] o.a.s.h.l.XMLLoader xsltCacheLifetimeSeconds=60
   [junit4]   2> 533523 INFO  (coreLoadExecutor-5051-thread-1) [    ] o.a.s.h.l.XMLLoader xsltCacheLifetimeSeconds=60
   [junit4]   2> 533524 INFO  (coreLoadExecutor-5051-thread-1) [    ] o.a.s.h.l.XMLLoader xsltCacheLifetimeSeconds=60
   [junit4]   2> 533524 INFO  (coreLoadExecutor-5051-thread-1) [    ] o.a.s.h.l.XMLLoader xsltCacheLifetimeSeconds=60
   [junit4]   2> 533528 INFO  (coreLoadExecutor-5051-thread-1) [    ] o.a.s.c.RequestHandlers Registered paths: /admin/mbeans,standard,/update/json/docs,/admin/luke,/export,/get,/admin/properties,/update/json,/admin/threads,/dump,/update/csv,/sql,/graph,/admin/segments,/admin/system,/replication,/config,/stream,/schema,/admin/plugins,/admin/logging,/admin/ping,/update,/admin/file
   [junit4]   2> 533528 INFO  (coreLoadExecutor-5051-thread-1) [    ] o.a.s.c.SolrCore Using default statsCache cache: org.apache.solr.search.stats.LocalStatsCache
   [junit4]   2> 533528 INFO  (coreLoadExecutor-5051-thread-1) [    ] o.a.s.u.UpdateHandler Using UpdateLog implementation: org.apache.solr.update.UpdateLog
   [junit4]   2> 533528 INFO  (coreLoadExecutor-5051-thread-1) [    ] o.a.s.u.UpdateLog Initializing UpdateLog: dataDir= defaultSyncLevel=FLUSH numRecordsToKeep=100 maxNumLogsToKeep=10 numVersionBuckets=65536
   [junit4]   2> 533529 INFO  (coreLoadExecutor-5051-thread-1) [    ] o.a.s.u.CommitTracker Hard AutoCommit: disabled
   [junit4]   2> 533529 INFO  (coreLoadExecutor-5051-thread-1) [    ] o.a.s.u.CommitTracker Soft AutoCommit: disabled
   [junit4]   2> 533529 INFO  (coreLoadExecutor-5051-thread-1) [    ] o.a.s.u.RandomMergePolicy RandomMergePolicy wrapping class org.apache.lucene.index.LogByteSizeMergePolicy: [LogByteSizeMergePolicy: minMergeSize=1677721, mergeFactor=31, maxMergeSize=2147483648, maxMergeSizeForForcedMerge=9223372036854775807, calibrateSizeByDeletes=true, maxMergeDocs=2147483647, maxCFSSegmentSizeMB=8.796093022207999E12, noCFSRatio=0.407553674117794]
   [junit4]   2> 533530 INFO  (coreLoadExecutor-5051-thread-1) [    ] o.a.s.c.SolrDeletionPolicy SolrDeletionPolicy.onInit: commits: num=1
   [junit4]   2> 	commit{dir=MockDirectoryWrapper(RAMDirectory@3d9c882d lockFactory=org.apache.lucene.store.SingleInstanceLockFactory@1b9dd229),segFN=segments_1,generation=1}
   [junit4]   2> 533530 INFO  (coreLoadExecutor-5051-thread-1) [    ] o.a.s.c.SolrDeletionPolicy newest commit generation = 1
   [junit4]   2> 533530 INFO  (coreLoadExecutor-5051-thread-1) [    ] o.a.s.s.SolrIndexSearcher Opening [Searcher@7a5430c5[collection1] main]
   [junit4]   2> 533530 INFO  (coreLoadExecutor-5051-thread-1) [    ] o.a.s.c.c.ZkStateReader Load collection config from: [/collections/control_collection]
   [junit4]   2> 533531 INFO  (coreLoadExecutor-5051-thread-1) [    ] o.a.s.c.c.ZkStateReader path=[/collections/control_collection] [configName]=[conf1] specified config exists in ZooKeeper
   [junit4]   2> 533531 INFO  (coreLoadExecutor-5051-thread-1) [    ] o.a.s.r.ManagedResourceStorage Setting up ZooKeeper-based storage for the RestManager with znodeBase: /configs/conf1
   [junit4]   2> 533531 INFO  (coreLoadExecutor-5051-thread-1) [    ] o.a.s.r.ManagedResourceStorage Configured ZooKeeperStorageIO with znodeBase: /configs/conf1
   [junit4]   2> 533531 INFO  (coreLoadExecutor-5051-thread-1) [    ] o.a.s.r.RestManager Initializing RestManager with initArgs: {}
   [junit4]   2> 533531 INFO  (coreLoadExecutor-5051-thread-1) [    ] o.a.s.r.ManagedResourceStorage Reading _rest_managed.json using ZooKeeperStorageIO:path=/configs/conf1
   [junit4]   2> 533532 INFO  (coreLoadExecutor-5051-thread-1) [    ] o.a.s.r.ManagedResourceStorage No data found for znode /configs/conf1/_rest_managed.json
   [junit4]   2> 533532 INFO  (coreLoadExecutor-5051-thread-1) [    ] o.a.s.r.ManagedResourceStorage Loaded null at path _rest_managed.json using ZooKeeperStorageIO:path=/configs/conf1
   [junit4]   2> 533532 INFO  (coreLoadExecutor-5051-thread-1) [    ] o.a.s.r.RestManager Initializing 0 registered ManagedResources
   [junit4]   2> 533532 INFO  (coreLoadExecutor-5051-thread-1) [    ] o.a.s.h.ReplicationHandler Commits will be reserved for  10000
   [junit4]   2> 533533 INFO  (searcherExecutor-5052-thread-1) [    ] o.a.s.c.SolrCore [collection1] Registered new searcher Searcher@7a5430c5[collection1] main{ExitableDirectoryReader(UninvertingDirectoryReader())}
   [junit4]   2> 533533 INFO  (coreLoadExecutor-5051-thread-1) [    ] o.a.s.u.UpdateLog Looking up max value of version field to seed version buckets
   [junit4]   2> 533533 INFO  (coreLoadExecutor-5051-thread-1) [    ] o.a.s.u.VersionInfo Refreshing highest value of _version_ for 65536 version buckets from index
   [junit4]   2> 533533 INFO  (coreLoadExecutor-5051-thread-1) [    ] o.a.s.u.VersionInfo No terms found for _version_, cannot seed version bucket highest value from index
   [junit4]   2> 533533 INFO  (coreLoadExecutor-5051-thread-1) [    ] o.a.s.u.UpdateLog Could not find max version in index or recent updates, using new clock 1538676166933610496
   [junit4]   2> 533535 INFO  (coreLoadExecutor-5051-thread-1) [    ] o.a.s.u.UpdateLog Took 1.0ms to seed version buckets with highest version 1538676166933610496
   [junit4]   2> 533535 INFO  (coreLoadExecutor-5051-thread-1) [    ] o.a.s.c.ZkController watch zkdir /configs/conf1
   [junit4]   2> 533535 INFO  (coreLoadExecutor-5051-thread-1) [    ] o.a.s.c.CoreContainer registering core: collection1
   [junit4]   2> 533535 INFO  (coreZkRegister-5045-thread-1) [    ] o.a.s.c.ZkController Register replica - core:collection1 address:https://127.0.0.1:45968 collection:control_collection shard:shard1
   [junit4]   2> 533536 INFO  (coreZkRegister-5045-thread-1) [    ] o.a.s.c.c.SolrZkClient makePath: /collections/control_collection/leader_elect/shard1/election
   [junit4]   2> 533539 INFO  (coreZkRegister-5045-thread-1) [    ] o.a.s.c.LeaderElector Joined leadership election with path: /collections/control_collection/leader_elect/shard1/election/96167260341469189-core_node1-n_0000000000
   [junit4]   2> 533539 INFO  (coreZkRegister-5045-thread-1) [    ] o.a.s.c.ShardLeaderElectionContext Running the leader process for shard=shard1 and weAreReplacement=false and leaderVoteWait=10000
   [junit4]   2> 533541 INFO  (coreZkRegister-5045-thread-1) [    ] o.a.s.c.ShardLeaderElectionContext Enough replicas found to continue.
   [junit4]   2> 533541 INFO  (OverseerStateUpdate-96167260341469189-127.0.0.1:45968_-n_0000000000) [    ] o.a.s.c.Overseer processMessage: queueSize: 1, message = {
   [junit4]   2>   "operation":"leader",
   [junit4]   2>   "shard":"shard1",
   [junit4]   2>   "collection":"control_collection"} current state version: 1
   [junit4]   2> 533542 INFO  (coreZkRegister-5045-thread-1) [    ] o.a.s.c.ShardLeaderElectionContext I may be the new leader - try and sync
   [junit4]   2> 533542 INFO  (coreZkRegister-5045-thread-1) [    ] o.a.s.c.SyncStrategy Sync replicas to https://127.0.0.1:45968/collection1/
   [junit4]   2> 533542 INFO  (coreZkRegister-5045-thread-1) [    ] o.a.s.c.SyncStrategy Sync Success - now sync replicas to me
   [junit4]   2> 533542 INFO  (coreZkRegister-5045-thread-1) [    ] o.a.s.c.SyncStrategy https://127.0.0.1:45968/collection1/ has no replicas
   [junit4]   2> 533544 INFO  (coreZkRegister-5045-thread-1) [    ] o.a.s.c.c.SolrZkClient makePath: /collections/control_collection/leaders/shard1
   [junit4]   2> 533545 INFO  (coreZkRegister-5045-thread-1) [    ] o.a.s.c.ShardLeaderElectionContextBase Creating leader registration node /collections/control_collection/leaders/shard1/leader after winning as /collections/control_collection/leader_elect/shard1/election/96167260341469189-core_node1-n_0000000000
   [junit4]   2> 533547 INFO  (coreZkRegister-5045-thread-1) [    ] o.a.s.c.ShardLeaderElectionContext I am the new leader: https://127.0.0.1:45968/collection1/ shard1
   [junit4]   2> 533547 INFO  (OverseerStateUpdate-96167260341469189-127.0.0.1:45968_-n_0000000000) [    ] o.a.s.c.Overseer processMessage: queueSize: 1, message = {
   [junit4]   2>   "operation":"leader",
   [junit4]   2>   "shard":"shard1",
   [junit4]   2>   "collection":"control_collection",
   [junit4]   2>   "base_url":"https://127.0.0.1:45968",
   [junit4]   2>   "core":"collection1",
   [junit4]   2>   "state":"active"} current state version: 1
   [junit4]   2> 533648 INFO  (zkCallback-18532-thread-1) [    ] o.a.s.c.c.ZkStateReader A cluster state change: [WatchedEvent state:SyncConnected type:NodeDataChanged path:/clusterstate.json], has occurred - updating... (live nodes size: [1])
   [junit4]   2> 533698 INFO  (coreZkRegister-5045-thread-1) [    ] o.a.s.c.ZkController We are https://127.0.0.1:45968/collection1/ and leader is https://127.0.0.1:45968/collection1/
   [junit4]   2> 533698 INFO  (coreZkRegister-5045-thread-1) [    ] o.a.s.c.ZkController No LogReplay needed for core=collection1 baseURL=https://127.0.0.1:45968
   [junit4]   2> 533698 INFO  (coreZkRegister-5045-thread-1) [    ] o.a.s.c.ZkController I am the leader, no recovery necessary
   [junit4]   2> 533699 INFO  (coreZkRegister-5045-thread-1) [    ] o.a.s.c.ZkController publishing state=active
   [junit4]   2> 533699 INFO  (coreZkRegister-5045-thread-1) [    ] o.a.s.c.ZkController numShards not found on descriptor - reading it from system property
   [junit4]   2> 533700 INFO  (OverseerStateUpdate-96167260341469189-127.0.0.1:45968_-n_0000000000) [    ] o.a.s.c.Overseer processMessage: queueSize: 1, message = {
   [junit4]   2>   "core":"collection1",
   [junit4]   2>   "core_node_name":"core_node1",
   [junit4]   2>   "roles":null,
   [junit4]   2>   "base_url":"https://127.0.0.1:45968",
   [junit4]   2>   "node_name":"127.0.0.1:45968_",
   [junit4]   2>   "numShards":"1",
   [junit4]   2>   "state":"active",
   [junit4]   2>   "shard":"shard1",
   [junit4]   2>   "collection":"control_collection",
   [junit4]   2>   "operation":"state"} current state version: 2
   [junit4]   2> 533700 INFO  (OverseerStateUpdate-96167260341469189-127.0.0.1:45968_-n_0000000000) [    ] o.a.s.c.o.ReplicaMutator Update state numShards=1 message={
   [junit4]   2>   "core":"collection1",
   [junit4]   2>   "core_node_name":"core_node1",
   [junit4]   2>   "roles":null,
   [junit4]   2>   "base_url":"https://127.0.0.1:45968",
   [junit4]   2>   "node_name":"127.0.0.1:45968_",
   [junit4]   2>   "numShards":"1",
   [junit4]   2>   "state":"active",
   [junit4]   2>   "shard":"shard1",
   [junit4]   2>   "collection":"control_collection",
   [junit4]   2>   "operation":"state"}
   [junit4]   2> 533803 INFO  (zkCallback-18532-thread-2) [    ] o.a.s.c.c.ZkStateReader A cluster state change: [WatchedEvent state:SyncConnected type:NodeDataChanged path:/clusterstate.json], has occurred - updating... (live nodes size: [1])
   [junit4]   2> 533864 INFO  (TEST-TestReqParamsAPI.test-seed#[919D8DFB4ADF743C]) [    ] o.a.s.c.c.SolrZkClient Using default ZkCredentialsProvider
   [junit4]   2> 533865 INFO  (TEST-TestReqParamsAPI.test-seed#[919D8DFB4ADF743C]) [    ] o.a.s.c.c.ConnectionManager Waiting for client to connect to ZooKeeper
   [junit4]   2> 533865 INFO  (zkCallback-18536-thread-1) [    ] o.a.s.c.c.ConnectionManager Watcher org.apache.solr.common.cloud.ConnectionManager@70564891 name:ZooKeeperConnection Watcher:127.0.0.1:39078/solr got event WatchedEvent state:SyncConnected type:None path:null path:null type:None
   [junit4]   2> 533865 INFO  (TEST-TestReqParamsAPI.test-seed#[919D8DFB4ADF743C]) [    ] o.a.s.c.c.ConnectionManager Client is connected to ZooKeeper
   [junit4]   2> 533866 INFO  (TEST-TestReqParamsAPI.test-seed#[919D8DFB4ADF743C]) [    ] o.a.s.c.c.SolrZkClient Using default ZkACLProvider
   [junit4]   2> 533866 INFO  (TEST-TestReqParamsAPI.test-seed#[919D8DFB4ADF743C]) [    ] o.a.s.c.c.ZkStateReader Updating cluster state from ZooKeeper... 
   [junit4]   2> 533866 INFO  (TEST-TestReqParamsAPI.test-seed#[919D8DFB4ADF743C]) [    ] o.a.s.c.c.ZkStateReader Loaded cluster properties: {urlScheme=https}
   [junit4]   2> 533866 INFO  (TEST-TestReqParamsAPI.test-seed#[919D8DFB4ADF743C]) [    ] o.a.s.c.c.ZkStateReader Updated live nodes from ZooKeeper... (0) -> (1)
   [junit4]   2> 533867 INFO  (TEST-TestReqParamsAPI.test-seed#[919D8DFB4ADF743C]) [    ] o.a.s.c.ChaosMonkey monkey: init - expire sessions:false cause connection loss:false
   [junit4]   2> 533867 INFO  (TEST-TestReqParamsAPI.test-seed#[919D8DFB4ADF743C]) [    ] o.a.s.c.AbstractFullDistribZkTestBase Creating collection1 with stateFormat=2
   [junit4]   2> 533867 INFO  (TEST-TestReqParamsAPI.test-seed#[919D8DFB4ADF743C]) [    ] o.a.s.c.c.SolrZkClient Using default ZkCredentialsProvider
   [junit4]   2> 533868 INFO  (TEST-TestReqParamsAPI.test-seed#[919D8DFB4ADF743C]) [    ] o.a.s.c.c.ConnectionManager Waiting for client to connect to ZooKeeper
   [junit4]   2> 533869 INFO  (zkCallback-18537-thread-1) [    ] o.a.s.c.c.ConnectionManager Watcher org.apache.solr.common.cloud.ConnectionManager@7b099e5a name:ZooKeeperConnection Watcher:127.0.0.1:39078/solr got event WatchedEvent state:SyncConnected type:None path:null path:null type:None
   [junit4]   2> 533869 INFO  (TEST-TestReqParamsAPI.test-seed#[919D8DFB4ADF743C]) [    ] o.a.s.c.c.ConnectionManager Client is connected to ZooKeeper
   [junit4]   2> 533869 INFO  (TEST-TestReqParamsAPI.test-seed#[919D8DFB4ADF743C]) [    ] o.a.s.c.c.SolrZkClient Using default ZkACLProvider
   [junit4]   2> 533871 INFO  (OverseerStateUpdate-96167260341469189-127.0.0.1:45968_-n_0000000000) [    ] o.a.s.c.Overseer processMessage: queueSize: 1, message = {
   [junit4]   2>   "operation":"create",
   [junit4]   2>   "name":"collection1",
   [junit4]   2>   "numShards":"2",
   [junit4]   2>   "stateFormat":"2"} current state version: 3
   [junit4]   2> 533871 INFO  (OverseerStateUpdate-96167260341469189-127.0.0.1:45968_-n_0000000000) [    ] o.a.s.c.o.ClusterStateMutator building a new cName: collection1
   [junit4]   2> 533942 INFO  (TEST-TestReqParamsAPI.test-seed#[919D8DFB4ADF743C]) [    ] o.a.s.SolrTestCaseJ4 Writing core.properties file to /home/jenkins/workspace/Lucene-Solr-6.x-Linux/solr/build/solr-core/test/J1/temp/solr.handler.TestReqParamsAPI_919D8DFB4ADF743C-001/shard-1-001/cores/collection1
   [junit4]   2> 533942 INFO  (TEST-TestReqParamsAPI.test-seed#[919D8DFB4ADF743C]) [    ] o.a.s.c.AbstractFullDistribZkTestBase create jetty 1 in directory /home/jenkins/workspace/Lucene-Solr-6.x-Linux/solr/build/solr-core/test/J1/temp/solr.handler.TestReqParamsAPI_919D8DFB4ADF743C-001/shard-1-001
   [junit4]   2> 533943 INFO  (TEST-TestReqParamsAPI.test-seed#[919D8DFB4ADF743C]) [    ] o.e.j.s.Server jetty-9.3.8.v20160314
   [junit4]   2> 533944 INFO  (TEST-TestReqParamsAPI.test-seed#[919D8DFB4ADF743C]) [    ] o.e.j.s.h.ContextHandler Started o.e.j.s.ServletContextHandler@776343be{/,null,AVAILABLE}
   [junit4]   2> 533945 INFO  (TEST-TestReqParamsAPI.test-seed#[919D8DFB4ADF743C]) [    ] o.e.j.s.ServerConnector Started ServerConnector@1295f6c6{SSL,[ssl, http/1.1]}{127.0.0.1:43906}
   [junit4]   2> 533945 INFO  (TEST-TestReqParamsAPI.test-seed#[919D8DFB4ADF743C]) [    ] o.e.j.s.Server Started @536462ms
   [junit4]   2> 533945 INFO  (TEST-TestReqParamsAPI.test-seed#[919D8DFB4ADF743C]) [    ] o.a.s.c.s.e.JettySolrRunner Jetty properties: {hostContext=/, solrconfig=solrconfig.xml, solr.data.dir=/home/jenkins/workspace/Lucene-Solr-6.x-Linux/solr/build/solr-core/test/J1/temp/solr.handler.TestReqParamsAPI_919D8DFB4ADF743C-001/tempDir-001/jetty1, hostPort=43906, coreRootDirectory=/home/jenkins/workspace/Lucene-Solr-6.x-Linux/solr/build/solr-core/test/J1/temp/solr.handler.TestReqParamsAPI_919D8DFB4ADF743C-001/shard-1-001/cores}
   [junit4]   2> 533945 INFO  (TEST-TestReqParamsAPI.test-seed#[919D8DFB4ADF743C]) [    ] o.a.s.s.SolrDispatchFilter SolrDispatchFilter.init(): jdk.internal.loader.ClassLoaders$AppClassLoader@2cfb4a64
   [junit4]   2> 533945 INFO  (TEST-TestReqParamsAPI.test-seed#[919D8DFB4ADF743C]) [    ] o.a.s.c.SolrResourceLoader new SolrResourceLoader for directory: '/home/jenkins/workspace/Lucene-Solr-6.x-Linux/solr/build/solr-core/test/J1/temp/solr.handler.TestReqParamsAPI_919D8DFB4ADF743C-001/shard-1-001'
   [junit4]   2> 533946 INFO  (TEST-TestReqParamsAPI.test-seed#[919D8DFB4ADF743C]) [    ] o.a.s.c.SolrResourceLoader JNDI not configured for solr (NoInitialContextEx)
   [junit4]   2> 533946 INFO  (TEST-TestReqParamsAPI.test-seed#[919D8DFB4ADF743C]) [    ] o.a.s.c.SolrResourceLoader solr home defaulted to 'solr/' (could not find system property or JNDI)
   [junit4]   2> 533946 INFO  (TEST-TestReqParamsAPI.test-seed#[919D8DFB4ADF743C]) [    ] o.a.s.c.c.SolrZkClient Using default ZkCredentialsProvider
   [junit4]   2> 533947 INFO  (TEST-TestReqParamsAPI.test-seed#[919D8DFB4ADF743C]) [    ] o.a.s.c.c.ConnectionManager Waiting for client to connect to ZooKeeper
   [junit4]   2> 533947 INFO  (zkCallback-18538-thread-1) [    ] o.a.s.c.c.ConnectionManager Watcher org.apache.solr.common.cloud.ConnectionManager@7838124d name:ZooKeeperConnection Watcher:127.0.0.1:39078/solr got event WatchedEvent state:SyncConnected type:None path:null path:null type:None
   [junit4]   2> 533948 INFO  (TEST-TestReqParamsAPI.test-seed#[919D8DFB4ADF743C]) [    ] o.a.s.c.c.ConnectionManager Client is connected to ZooKeeper
   [junit4]   2> 533948 INFO  (TEST-TestReqParamsAPI.test-seed#[919D8DFB4ADF743C]) [    ] o.a.s.c.c.SolrZkClient Using default ZkACLProvider
   [junit4]   2> 533948 INFO  (TEST-TestReqParamsAPI.test-seed#[919D8DFB4ADF743C]) [    ] o.a.s.s.SolrDispatchFilter Loading solr.xml from SolrHome (not found in ZooKeeper)
   [junit4]   2> 533948 INFO  (TEST-TestReqParamsAPI.test-seed#[919D8DFB4ADF743C]) [    ] o.a.s.c.SolrXmlConfig Loading container configuration from /home/jenkins/workspace/Lucene-Solr-6.x-Linux/solr/build/solr-core/test/J1/temp/solr.handler.TestReqParamsAPI_919D8DFB4ADF743C-001/shard-1-001/solr.xml
   [junit4]   2> 533953 INFO  (TEST-TestReqParamsAPI.test-seed#[919D8DFB4ADF743C]) [    ] o.a.s.c.CorePropertiesLocator Config-defined core root directory: /home/jenkins/workspace/Lucene-Solr-6.x-Linux/solr/build/solr-core/test/J1/temp/solr.handler.TestReqParamsAPI_919D8DFB4ADF743C-001/shard-1-001/cores
   [junit4]   2> 533953 INFO  (TEST-TestReqParamsAPI.test-seed#[919D8DFB4ADF743C]) [    ] o.a.s.c.CoreContainer New CoreContainer 400311035
   [junit4]   2> 533953 INFO  (TEST-TestReqParamsAPI.test-seed#[919D8DFB4ADF743C]) [    ] o.a.s.c.CoreContainer Loading cores into CoreContainer [instanceDir=/home/jenkins/workspace/Lucene-Solr-6.x-Linux/solr/build/solr-core/test/J1/temp/solr.handler.TestReqParamsAPI_919D8DFB4ADF743C-001/shard-1-001]
   [junit4]   2> 533953 WARN  (TEST-TestReqParamsAPI.test-seed#[919D8DFB4ADF743C]) [    ] o.a.s.c.CoreContainer Couldn't add files from /home/jenkins/workspace/Lucene-Solr-6.x-Linux/solr/build/solr-core/test/J1/temp/solr.handler.TestReqParamsAPI_919D8DFB4ADF743C-001/shard-1-001/lib to classpath: /home/jenkins/workspace/Lucene-Solr-6.x-Linux/solr/build/solr-core/test/J1/temp/solr.handler.TestReqParamsAPI_919D8DFB4ADF743C-001/shard-1-001/lib
   [junit4]   2> 533953 INFO  (TEST-TestReqParamsAPI.test-seed#[919D8DFB4ADF743C]) [    ] o.a.s.h.c.HttpShardHandlerFactory created with socketTimeout : 90000,urlScheme : ,connTimeout : 15000,maxConnectionsPerHost : 20,maxConnections : 10000,corePoolSize : 0,maximumPoolSize : 2147483647,maxThreadIdleTime : 5,sizeOfQueue : -1,fairnessPolicy : false,useRetries : false,
   [junit4]   2> 533954 INFO  (TEST-TestReqParamsAPI.test-seed#[919D8DFB4ADF743C]) [    ] o.a.s.u.UpdateShardHandler Creating UpdateShardHandler HTTP client with params: socketTimeout=340000&connTimeout=45000&retry=true
   [junit4]   2> 533954 INFO  (TEST-TestReqParamsAPI.test-seed#[919D8DFB4ADF743C]) [    ] o.a.s.l.LogWatcher SLF4J impl is org.slf4j.impl.Log4jLoggerFactory
   [junit4]   2> 533954 INFO  (TEST-TestReqParamsAPI.test-seed#[919D8DFB4ADF743C]) [    ] o.a.s.l.LogWatcher Registering Log Listener [Log4j (org.slf4j.impl.Log4jLoggerFactory)]
   [junit4]   2> 533955 INFO  (TEST-TestReqParamsAPI.test-seed#[919D8DFB4ADF743C]) [    ] o.a.s.c.ZkContainer Zookeeper client=127.0.0.1:39078/solr
   [junit4]   2> 533955 INFO  (TEST-TestReqParamsAPI.test-seed#[919D8DFB4ADF743C]) [    ] o.a.s.c.ZkController zkHost includes chroot
   [junit4]   2> 533955 INFO  (TEST-TestReqParamsAPI.test-seed#[919D8DFB4ADF743C]) [    ] o.a.s.c.c.SolrZkClient Using default ZkCredentialsProvider
   [junit4]   2> 533955 INFO  (TEST-TestReqParamsAPI.test-seed#[919D8DFB4ADF743C]) [    ] o.a.s.c.c.ConnectionManager Waiting for client to connect to ZooKeeper
   [junit4]   2> 533956 INFO  (zkCallback-18541-thread-1) [    ] o.a.s.c.c.ConnectionManager Watcher org.apache.solr.common.cloud.ConnectionManager@3dc53cbd name:ZooKeeperConnection Watcher:127.0.0.1:39078 got event WatchedEvent state:SyncConnected type:None path:null path:null type:None
   [junit4]   2> 533956 INFO  (TEST-TestReqParamsAPI.test-seed#[919D8DFB4ADF743C]) [    ] o.a.s.c.c.ConnectionManager Client is connected to ZooKeeper
   [junit4]   2> 533956 INFO  (TEST-TestReqParamsAPI.test-seed#[919D8DFB4ADF743C]) [    ] o.a.s.c.c.SolrZkClient Using default ZkACLProvider
   [junit4]   2> 533957 INFO  (TEST-TestReqParamsAPI.test-seed#[919D8DFB4ADF743C]) [    ] o.a.s.c.ZkController Added new OnReconnect listener org.apache.solr.cloud.ZkController$$Lambda$144/891945504@3401acef
   [junit4]   2> 533957 INFO  (TEST-TestReqParamsAPI.test-seed#[919D8DFB4ADF743C]) [    ] o.a.s.c.c.ConnectionManager Waiting for client to connect to ZooKeeper
   [junit4]   2> 533959 INFO  (zkCallback-18542-thread-1) [    ] o.a.s.c.c.ConnectionManager Watcher org.apache.solr.common.cloud.ConnectionManager@2841b07d name:ZooKeeperConnection Watcher:127.0.0.1:39078/solr got event WatchedEvent state:SyncConnected type:None path:null path:null type:None
   [junit4]   2> 533959 INFO  (TEST-TestReqParamsAPI.test-seed#[919D8DFB4ADF743C]) [    ] o.a.s.c.c.ConnectionManager Client is connected to ZooKeeper
   [junit4]   2> 533962 INFO  (TEST-TestReqParamsAPI.test-seed#[919D8DFB4ADF743C]) [    ] o.a.s.c.c.ZkStateReader Updating cluster state from ZooKeeper... 
   [junit4]   2> 533963 INFO  (TEST-TestReqParamsAPI.test-seed#[919D8DFB4ADF743C]) [    ] o.a.s.c.c.ZkStateReader Loaded cluster properties: {urlScheme=https}
   [junit4]   2> 533963 INFO  (TEST-TestReqParamsAPI.test-seed#[919D8DFB4ADF743C]) [    ] o.a.s.c.c.ZkStateReader Updated live nodes from ZooKeeper... (0) -> (1)
   [junit4]   2> 533964 INFO  (TEST-TestReqParamsAPI.test-seed#[919D8DFB4ADF743C]) [    ] o.a.s.c.Overseer Overseer (id=null) closing
   [junit4]   2> 533964 INFO  (TEST-TestReqParamsAPI.test-seed#[919D8DFB4ADF743C]) [    ] o.a.s.c.LeaderElector Joined leadership election with path: /overseer_elect/election/96167260341469194-127.0.0.1:43906_-n_0000000001
   [junit4]   2> 533965 INFO  (TEST-TestReqParamsAPI.test-seed#[919D8DFB4ADF743C]) [    ] o.a.s.c.LeaderElector Watching path /overseer_elect/election/96167260341469189-127.0.0.1:45968_-n_0000000000 to know if I could be the leader
   [junit4]   2> 533965 INFO  (TEST-TestReqParamsAPI.test-seed#[919D8DFB4ADF743C]) [    ] o.a.s.c.ZkController Publish node=127.0.0.1:43906_ as DOWN
   [junit4]   2> 533966 INFO  (TEST-TestReqParamsAPI.test-seed#[919D8DFB4ADF743C]) [    ] o.a.s.c.ZkController Register node as live in ZooKeeper:/live_nodes/127.0.0.1:43906_
   [junit4]   2> 533966 INFO  (TEST-TestReqParamsAPI.test-seed#[919D8DFB4ADF743C]) [    ] o.a.s.c.c.SolrZkClient makePath: /live_nodes/127.0.0.1:43906_
   [junit4]   2> 533966 INFO  (OverseerStateUpdate-96167260341469189-127.0.0.1:45968_-n_0000000000) [    ] o.a.s.c.Overseer processMessage: queueSize: 1, message = {
   [junit4]   2>   "operation":"downnode",
   [junit4]   2>   "node_name":"127.0.0.1:43906_"} current state version: 3
   [junit4]   2> 533966 INFO  (OverseerStateUpdate-96167260341469189-127.0.0.1:45968_-n_0000000000) [    ] o.a.s.c.o.NodeMutator DownNode state invoked for node: 127.0.0.1:43906_
   [junit4]   2> 533966 INFO  (zkCallback-18536-thread-1) [    ] o.a.s.c.c.ZkStateReader A live node change: [WatchedEvent state:SyncConnected type:NodeChildrenChanged path:/live_nodes], has occurred - updating... (live nodes size: [1])
   [junit4]   2> 533966 INFO  (zkCallback-18532-thread-1) [    ] o.a.s.c.c.ZkStateReader A live node change: [WatchedEvent state:SyncConnected type:NodeChildrenChanged path:/live_nodes], has occurred - updating... (live nodes size: [1])
   [junit4]   2> 533967 INFO  (zkCallback-18532-thread-1) [    ] o.a.s.c.c.ZkStateReader Updated live nodes from ZooKeeper... (1) -> (2)
   [junit4]   2> 533970 INFO  (zkCallback-18536-thread-1) [    ] o.a.s.c.c.ZkStateReader Updated live nodes from ZooKeeper... (1) -> (2)
   [junit4]   2> 533970 INFO  (OverseerStateUpdate-96167260341469189-127.0.0.1:45968_-n_0000000000) [    ] o.a.s.c.o.ZkStateWriter going to create_collection /collections/collection1/state.json
   [junit4]   2> 533970 INFO  (zkCallback-18542-thread-1) [    ] o.a.s.c.c.ZkStateReader A live node change: [WatchedEvent state:SyncConnected type:NodeChildrenChanged path:/live_nodes], has occurred - updating... (live nodes size: [1])
   [junit4]   2> 533972 INFO  (zkCallback-18532-thread-1) [    ] o.a.s.c.c.ZkStateReader A cluster state change: [WatchedEvent state:SyncConnected type:NodeDataChanged path:/clusterstate.json], has occurred - updating... (live nodes size: [2])
   [junit4]   2> 533973 INFO  (zkCallback-18536-thread-1) [    ] o.a.s.c.c.ZkStateReader A cluster state change: [WatchedEvent state:SyncConnected type:NodeDataChanged path:/clusterstate.json], has occurred - updating... (live nodes size: [2])
   [junit4]   2> 533973 INFO  (zkCallback-18542-thread-2) [    ] o.a.s.c.c.ZkStateReader A cluster state change: [WatchedEvent state:SyncConnected type:NodeDataChanged path:/clusterstate.json], has occurred - updating... (live nodes size: [1])
   [junit4]   2> 533983 INFO  (zkCallback-18542-thread-1) [    ] o.a.s.c.c.ZkStateReader Updated live nodes from ZooKeeper... (1) -> (2)
   [junit4]   2> 533995 INFO  (TEST-TestReqParamsAPI.test-seed#[919D8DFB4ADF743C]) [    ] o.a.s.c.CoreContainer Security conf doesn't exist. Skipping setup for authorization module.
   [junit4]   2> 533995 INFO  (TEST-TestReqParamsAPI.test-seed#[919D8DFB4ADF743C]) [    ] o.a.s.c.CoreContainer No authentication plugin used.
   [junit4]   2> 533995 INFO  (TEST-TestReqParamsAPI.test-seed#[919D8DFB4ADF743C]) [    ] o.a.s.c.CorePropertiesLocator Looking for core definitions underneath /home/jenkins/workspace/Lucene-Solr-6.x-Linux/solr/build/solr-core/test/J1/temp/solr.handler.TestReqParamsAPI_919D8DFB4ADF743C-001/shard-1-001/cores
   [junit4]   2> 533996 INFO  (TEST-TestReqParamsAPI.test-seed#[919D8DFB4ADF743C]) [    ] o.a.s.c.CoreDescriptor Created CoreDescriptor: {schema=schema.xml, dataDir=data/, collection=collection1, loadOnStartup=true, coreNodeName=, transient=false, name=collection1, shard=, config=solrconfig.xml, configSetProperties=configsetprops.json}
   [junit4]   2> 533996 INFO  (TEST-TestReqParamsAPI.test-seed#[919D8DFB4ADF743C]) [    ] o.a.s.c.CorePropertiesLocator Found core collection1 in /home/jenkins/workspace/Lucene-Solr-6.x-Linux/solr/build/solr-core/test/J1/temp/solr.handler.TestReqParamsAPI_919D8DFB4ADF743C-001/shard-1-001/cores/collection1
   [junit4]   2> 533996 INFO  (TEST-TestReqParamsAPI.test-seed#[919D8DFB4ADF743C]) [    ] o.a.s.c.CorePropertiesLocator Found 1 core definitions
   [junit4]   2> 533998 INFO  (TEST-TestReqParamsAPI.test-seed#[919D8DFB4ADF743C]) [    ] o.a.s.s.SolrDispatchFilter user.dir=/home/jenkins/workspace/Lucene-Solr-6.x-Linux/solr/build/solr-core/test/J1
   [junit4]   2> 533998 INFO  (TEST-TestReqParamsAPI.test-seed#[919D8DFB4ADF743C]) [    ] o.a.s.s.SolrDispatchFilter SolrDispatchFilter.init() done
   [junit4]   2> 533998 INFO  (coreLoadExecutor-5062-thread-1) [    ] o.a.s.c.ZkController publishing state=down
   [junit4]   2> 533998 INFO  (coreLoadExecutor-5062-thread-1) [    ] o.a.s.c.ZkController numShards not found on descriptor - reading it from system property
   [junit4]   2> 533999 INFO  (coreLoadExecutor-5062-thread-1) [    ] o.a.s.c.ZkController Registering watch for collection collection1
   [junit4]   2> 533999 INFO  (coreLoadExecutor-5062-thread-1) [    ] o.a.s.c.c.ZkStateReader Add data for [collection1] ver [0]
   [junit4]   2> 533999 INFO  (coreLoadExecutor-5062-thread-1) [    ] o.a.s.c.ZkController look for our core node name
   [junit4]   2> 534007 INFO  (OverseerStateUpdate-96167260341469189-127.0.0.1:45968_-n_0000000000) [    ] o.a.s.c.Overseer processMessage: queueSize: 1, message = {
   [junit4]   2>   "core":"collection1",
   [junit4]   2>   "roles":null,
   [junit4]   2>   "base_url":"https://127.0.0.1:43906",
   [junit4]   2>   "node_name":"127.0.0.1:43906_",
   [junit4]   2>   "numShards":"2",
   [junit4]   2>   "state":"down",
   [junit4]   2>   "shard":null,
   [junit4]   2>   "collection":"collection1",
   [junit4]   2>   "operation":"state"} current state version: 4
   [junit4]   2> 534007 INFO  (OverseerStateUpdate-96167260341469189-127.0.0.1:45968_-n_0000000000) [    ] o.a.s.c.o.ReplicaMutator Update state numShards=2 message={
   [junit4]   2>   "core":"collection1",
   [junit4]   2>   "roles":null,
   [junit4]   2>   "base_url":"https://127.0.0.1:43906",
   [junit4]   2>   "node_name":"127.0.0.1:43906_",
   [junit4]   2>   "numShards":"2",
   [junit4]   2>   "state":"down",
   [junit4]   2>   "shard":null,
   [junit4]   2>   "collection":"collection1",
   [junit4]   2>   "operation":"state"}
   [junit4]   2> 534007 INFO  (OverseerStateUpdate-96167260341469189-127.0.0.1:45968_-n_0000000000) [    ] o.a.s.c.o.ReplicaMutator Collection already exists with numShards=2
   [junit4]   2> 534007 INFO  (OverseerStateUpdate-96167260341469189-127.0.0.1:45968_-n_0000000000) [    ] o.a.s.c.o.ReplicaMutator Assigning new node to shard shard=shard2
   [junit4]   2> 534109 INFO  (OverseerStateUpdate-96167260341469189-127.0.0.1:45968_-n_0000000000) [    ] o.a.s.c.o.ZkStateWriter going to update_collection /collections/collection1/state.json version: 2147483647
   [junit4]   2> 534109 WARN  (OverseerStateUpdate-96167260341469189-127.0.0.1:45968_-n_0000000000) [    ] o.a.s.c.Overseer Bad version writing to ZK using compare-and-set, will force refresh cluster state
   [junit4]   2> org.apache.zookeeper.KeeperException$BadVersionException: KeeperErrorCode = BadVersion for /collections/collection1/state.json
   [junit4]   2> 	at org.apache.zookeeper.KeeperException.create(KeeperException.java:115)
   [junit4]   2> 	at org.apache.zookeeper.KeeperException.create(KeeperException.java:51)
   [junit4]   2> 	at org.apache.zookeeper.ZooKeeper.setData(ZooKeeper.java:1270)
   [junit4]   2> 	at org.apache.solr.common.cloud.SolrZkClient$8.execute(SolrZkClient.java:364)
   [junit4]   2> 	at org.apache.solr.common.cloud.SolrZkClient$8.execute(SolrZkClient.java:361)
   [junit4]   2> 	at org.apache.solr.common.cloud.ZkCmdExecutor.retryOperation(ZkCmdExecutor.java:60)
   [junit4]   2> 	at org.apache.solr.common.cloud.SolrZkClient.setData(SolrZkClient.java:361)
   [junit4]   2> 	at org.apache.solr.cloud.overseer.ZkStateWriter.writePendingUpdates(ZkStateWriter.java:230)
   [junit4]   2> 	at org.apache.solr.cloud.Overseer$ClusterStateUpdater.run(Overseer.java:240)
   [junit4]   2> 	at java.lang.Thread.run(java.base@9-ea/Thread.java:843)
   [junit4]   2> 534110 INFO  (OverseerStateUpdate-96167260341469189-127.0.0.1:45968_-n_0000000000) [    ] o.a.s.c.c.ZkStateReader Updated live nodes from ZooKeeper... (2) -> (2)
   [junit4]   2> 534110 INFO  (OverseerStateUpdate-96167260341469189-127.0.0.1:45968_-n_0000000000) [    ] o.a.s.c.Overseer processMessage: workQueueSize: 2, message = {
   [junit4]   2>   "operation":"downnode",
   [junit4]   2>   "node_name":"127.0.0.1:43906_"}
   [junit4]   2> 534110 INFO  (OverseerStateUpdate-96167260341469189-127.0.0.1:45968_-n_0000000000) [    ] o.a.s.c.o.NodeMutator DownNode state invoked for node: 127.0.0.1:43906_
   [junit4]   2> 534111 INFO  (zkCallback-18532-thread-1) [    ] o.a.s.c.c.ZkStateReader A cluster state change: [WatchedEvent state:SyncConnected type:NodeDataChanged path:/clusterstate.json], has occurred - updating... (live nodes size: [2])
   [junit4]   2> 534111 INFO  (zkCallback-18536-thread-1) [    ] o.a.s.c.c.ZkStateReader A cluster state change: [WatchedEvent state:SyncConnected type:NodeDataChanged path:/clusterstate.json], has occurred - updating... (live nodes size: [2])
   [junit4]   2> 534111 INFO  (zkCallback-18542-thread-2) [    ] o.a.s.c.c.ZkStateReader A cluster state change: [WatchedEvent state:SyncConnected type:NodeDataChanged path:/clusterstate.json], has occurred - updating... (live nodes size: [2])
   [junit4]   2> 534111 INFO  (OverseerStateUpdate-96167260341469189-127.0.0.1:45968_-n_0000000000) [    ] o.a.s.c.o.ZkStateWriter going to update_collection /collections/collection1/state.json version: 0
   [junit4]   2> 534111 INFO  (zkCallback-18542-thread-2) [    ] o.a.s.c.c.ZkStateReader A cluster state change: [WatchedEvent state:SyncConnected type:NodeDataChanged path:/collections/collection1/state.json] for collection [collection1] has occurred - updating... (live nodes size: [2])
   [junit4]   2> 534111 INFO  (zkCallback-18542-thread-2) [    ] o.a.s.c.c.ZkStateReader Updating data for [collection1] from [0] to [1]
   [junit4]   2> 534112 INFO  (OverseerStateUpdate-96167260341469189-127.0.0.1:45968_-n_0000000000) [    ] o.a.s.c.Overseer processMessage: workQueueSize: 1, message = {
   [junit4]   2>   "core":"collection1",
   [junit4]   2>   "roles":null,
   [junit4]   2>   "base_url":"https://127.0.0.1:43906",
   [junit4]   2>   "node_name":"127.0.0.1:43906_",
   [junit4]   2>   "numShards":"2",
   [junit4]   2>   "state":"down",
   [junit4]   2>   "shard":null,
   [junit4]   2>   "collection":"collection1",
   [junit4]   2>   "operation":"state"}
   [junit4]   2> 534112 INFO  (OverseerStateUpdate-96167260341469189-127.0.0.1:45968_-n_0000000000) [    ] o.a.s.c.o.ReplicaMutator Update state numShards=2 message={
   [junit4]   2>   "core":"collection1",
   [junit4]   2>   "roles":null,
   [junit4]   2>   "base_url":"https://127.0.0.1:43906",
   [junit4]   2>   "node_name":"127.0.0.1:43906_",
   [junit4]   2>   "numShards":"2",
   [junit4]   2>   "state":"down",
   [junit4]   2>   "shard":null,
   [junit4]   2>   "collection":"collection1",
   [junit4]   2>   "operation":"state"}
   [junit4]   2> 534112 INFO  (OverseerStateUpdate-96167260341469189-127.0.0.1:45968_-n_0000000000) [    ] o.a.s.c.o.ReplicaMutator Collection already exists with numShards=2
   [junit4]   2> 534112 INFO  (OverseerStateUpdate-96167260341469189-127.0.0.1:45968_-n_0000000000) [    ] o.a.s.c.o.ReplicaMutator Assigning new node to shard shard=shard2
   [junit4]   2> 534112 INFO  (OverseerStateUpdate-96167260341469189-127.0.0.1:45968_-n_0000000000) [    ] o.a.s.c.o.ZkStateWriter going to update_collection /collections/collection1/state.json version: 1
   [junit4]   2> 534112 INFO  (zkCallback-18542-thread-2) [    ] o.a.s.c.c.ZkStateReader A cluster state change: [WatchedEvent state:SyncConnected type:NodeDataChanged path:/collections/collection1/state.json] for collection [collection1] has occurred - updating... (live nodes size: [2])
   [junit4]   2> 534112 INFO  (zkCallback-18542-thread-2) [    ] o.a.s.c.c.ZkStateReader Updating data for [collection1] from [1] to [2]
   [junit4]   2> 534999 INFO  (coreLoadExecutor-5062-thread-1) [    ] o.a.s.c.ZkController waiting to find shard id in clusterstate for collection1
   [junit4]   2> 534999 INFO  (coreLoadExecutor-5062-thread-1) [    ] o.a.s.c.ZkController Check for collection zkNode:collection1
   [junit4]   2> 535000 INFO  (coreLoadExecutor-5062-thread-1) [    ] o.a.s.c.ZkController Collection zkNode exists
   [junit4]   2> 535000 INFO  (coreLoadExecutor-5062-thread-1) [    ] o.a.s.c.c.ZkStateReader Load collection config from: [/collections/collection1]
   [junit4]   2> 535000 INFO  (coreLoadExecutor-5062-thread-1) [    ] o.a.s.c.c.ZkStateReader path=[/collections/collection1] [configName]=[conf1] specified config exists in ZooKeeper
   [junit4]   2> 535000 INFO  (coreLoadExecutor-5062-thread-1) [    ] o.a.s.c.SolrResourceLoader new SolrResourceLoader for directory: '/home/jenkins/workspace/Lucene-Solr-6.x-Linux/solr/build/solr-core/test/J1/temp/solr.handler.TestReqParamsAPI_919D8DFB4ADF743C-001/shard-1-001/cores/collection1'
   [junit4]   2> 535000 INFO  (coreLoadExecutor-5062-thread-1) [    ] o.a.s.c.SolrResourceLoader JNDI not configured for solr (NoInitialContextEx)
   [junit4]   2> 535000 INFO  (coreLoadExecutor-5062-thread-1) [    ] o.a.s.c.SolrResourceLoader solr home defaulted to 'solr/' (could not find system property or JNDI)
   [junit4]   2> 535001 INFO  (coreLoadExecutor-5062-thread-1) [    ] o.a.s.c.Config loaded config solrconfig.xml with version 0 
   [junit4]   2> 535004 INFO  (coreLoadExecutor-5062-thread-1) [    ] o.a.s.c.SolrConfig current version of requestparams : -1
   [junit4]   2> 535007 INFO  (coreLoadExecutor-5062-thread-1) [    ] o.a.s.c.SolrConfig Using Lucene MatchVersion: 6.2.0
   [junit4]   2> 535013 INFO  (coreLoadExecutor-5062-thread-1) [    ] o.a.s.c.SolrConfig Loaded SolrConfig: solrconfig.xml
   [junit4]   2> 535017 INFO  (coreLoadExecutor-5062-thread-1) [    ] o.a.s.s.IndexSchema [collection1] Schema name=test
   [junit4]   2> 535083 INFO  (coreLoadExecutor-5062-thread-1) [    ] o.a.s.s.OpenExchangeRatesOrgProvider Initialized with rates=open-exchange-rates.json, refreshInterval=1440.
   [junit4]   2> 535087 INFO  (coreLoadExecutor-5062-thread-1) [    ] o.a.s.s.IndexSchema default search field in schema is text
   [junit4]   2> 535088 INFO  (coreLoadExecutor-5062-thread-1) [    ] o.a.s.s.IndexSchema unique key field: id
   [junit4]   2> 535103 INFO  (coreLoadExecutor-5062-thread-1) [    ] o.a.s.s.FileExchangeRateProvider Reloading exchange rates from file currency.xml
   [junit4]   2> 535105 INFO  (coreLoadExecutor-5062-thread-1) [    ] o.a.s.s.FileExchangeRateProvider Reloading exchange rates from file currency.xml
   [junit4]   2> 535106 INFO  (coreLoadExecutor-5062-thread-1) [    ] o.a.s.s.OpenExchangeRatesOrgProvider Reloading exchange rates from open-exchange-rates.json
   [junit4]   2> 535106 INFO  (coreLoadExecutor-5062-thread-1) [    ] o.a.s.s.OpenExchangeRatesOrgProvider Reloading exchange rates from open-exchange-rates.json
   [junit4]   2> 535106 INFO  (coreLoadExecutor-5062-thread-1) [    ] o.a.s.c.ConfigSetProperties Did not find ConfigSet properties, assuming default properties: Can't find resource 'configsetprops.json' in classpath or '/configs/conf1', cwd=/home/jenkins/workspace/Lucene-Solr-6.x-Linux/solr/build/solr-core/test/J1
   [junit4]   2> 535107 INFO  (coreLoadExecutor-5062-thread-1) [    ] o.a.s.c.CoreContainer Creating SolrCore 'collection1' using configuration from collection collection1
   [junit4]   2> 535107 INFO  (coreLoadExecutor-5062-thread-1) [    ] o.a.s.c.SolrCore org.apache.solr.core.MockDirectoryFactory
   [junit4]   2> 535107 INFO  (coreLoadExecutor-5062-thread-1) [    ] o.a.s.c.SolrCore [[collection1] ] Opening new SolrCore at [/home/jenkins/workspace/Lucene-Solr-6.x-Linux/solr/build/solr-core/test/J1/temp/solr.handler.TestReqParamsAPI_919D8DFB4ADF743C-001/shard-1-001/cores/collection1], dataDir=[/home/jenkins/workspace/Lucene-Solr-6.x-Linux/solr/build/solr-core/test/J1/temp/solr.handler.TestReqParamsAPI_919D8DFB4ADF743C-001/shard-1-001/cores/collection1/data/]
   [junit4]   2> 535107 INFO  (coreLoadExecutor-5062-thread-1) [    ] o.a.s.c.JmxMonitoredMap JMX monitoring is enabled. Adding Solr mbeans to JMX Server: com.sun.jmx.mbeanserver.JmxMBeanServer@9ba32bf
   [junit4]   2> 535107 INFO  (coreLoadExecutor-5062-thread-1) [    ] o.a.s.c.CachingDirectoryFactory return new directory for /home/jenkins/workspace/Lucene-Solr-6.x-Linux/solr/build/solr-core/test/J1/temp/solr.handler.TestReqParamsAPI_919D8DFB4ADF743C-001/shard-1-001/cores/collection1/data
   [junit4]   2> 535107 INFO  (coreLoadExecutor-5062-thread-1) [    ] o.a.s.c.SolrCore New index directory detected: old=null new=/home/jenkins/workspace/Lucene-Solr-6.x-Linux/solr/build/solr-core/test/J1/temp/solr.handler.TestReqParamsAPI_919D8DFB4ADF743C-001/shard-1-001/cores/collection1/data/index/
   [junit4]   2> 535107 WARN  (coreLoadExecutor-5062-thread-1) [    ] o.a.s.c.SolrCore [collection1] Solr index directory '/home/jenkins/workspace/Lucene-Solr-6.x-Linux/solr/build/solr-core/test/J1/temp/solr.handler.TestReqParamsAPI_919D8DFB4ADF743C-001/shard-1-001/cores/collection1/data/index' doesn't exist. Creating new index...
   [junit4]   2> 535108 INFO  (coreLoadExecutor-5062-thread-1) [    ] o.a.s.c.CachingDirectoryFactory return new directory for /home/jenkins/workspace/Lucene-Solr-6.x-Linux/solr/build/solr-core/test/J1/temp/solr.handler.TestReqParamsAPI_919D8DFB4ADF743C-001/shard-1-001/cores/collection1/data/index
   [junit4]   2> 535108 INFO  (coreLoadExecutor-5062-thread-1) [    ] o.a.s.u.RandomMergePolicy RandomMergePolicy wrapping class org.apache.lucene.index.TieredMergePolicy: [TieredMergePolicy: maxMergeAtOnce=26, maxMergeAtOnceExplicit=24, maxMergedSegmentMB=75.6806640625, floorSegmentMB=1.8583984375, forceMergeDeletesPctAllowed=0.33974399141100453, segmentsPerTier=27.0, maxCFSSegmentSizeMB=8.796093022207999E12, noCFSRatio=0.6638996877102852
   [junit4]   2> 535108 INFO  (coreLoadExecutor-5062-thread-1) [    ] o.a.s.c.SolrDeletionPolicy SolrDeletionPolicy.onCommit: commits: num=1
   [junit4]   2> 	commit{dir=MockDirectoryWrapper(RAMDirectory@2d0ae764 lockFactory=org.apache.lucene.store.SingleInstanceLockFactory@4a26dfd3),segFN=segments_1,generation=1}
   [junit4]   2> 535108 INFO  (coreLoadExecutor-5062-thread-1) [    ] o.a.s.c.SolrDeletionPolicy newest commit generation = 1
   [junit4]   2> 535108 INFO  (OldIndexDirectoryCleanupThreadForCore-collection1) [    ] o.a.s.c.SolrCore Looking for old index directories to cleanup for core collection1 in /home/jenkins/workspace/Lucene-Solr-6.x-Linux/solr/build/solr-core/test/J1/temp/solr.handler.TestReqParamsAPI_919D8DFB4ADF743C-001/shard-1-001/cores/collection1/data/
   [junit4]   2> 535108 WARN  (OldIndexDirectoryCleanupThreadForCore-collection1) [    ] o.a.s.c.DirectoryFactory /home/jenkins/workspace/Lucene-Solr-6.x-Linux/solr/build/solr-core/test/J1/temp/solr.handler.TestReqParamsAPI_919D8DFB4ADF743C-001/shard-1-001/cores/collection1/data/ does not point to a valid data directory; skipping clean-up of old index directories.
   [junit4]   2> 535111 INFO  (coreLoadExecutor-5062-thread-1) [    ] o.a.s.u.p.UpdateRequestProcessorChain creating updateRequestProcessorChain "nodistrib"
   [junit4]   2> 535111 INFO  (coreLoadExecutor-5062-thread-1) [    ] o.a.s.u.p.UpdateRequestProcessorChain creating updateRequestProcessorChain "dedupe"
   [junit4]   2> 535111 INFO  (coreLoadExecutor-5062-thread-1) [    ] o.a.s.u.p.UpdateRequestProcessorChain inserting DistributedUpdateProcessorFactory into updateRequestProcessorChain "dedupe"
   [junit4]   2> 535111 INFO  (coreLoadExecutor-5062-thread-1) [    ] o.a.s.u.p.UpdateRequestProcessorChain creating updateRequestProcessorChain "stored_sig"
   [junit4]   2> 535111 INFO  (coreLoadExecutor-5062-thread-1) [    ] o.a.s.u.p.UpdateRequestProcessorChain inserting DistributedUpdateProcessorFactory into updateRequestProcessorChain "stored_sig"
   [junit4]   2> 535111 INFO  (coreLoadExecutor-5062-thread-1) [    ] o.a.s.u.p.UpdateRequestProcessorChain creating updateRequestProcessorChain "distrib-dup-test-chain-explicit"
   [junit4]   2> 535111 INFO  (coreLoadExecutor-5062-thread-1) [    ] o.a.s.u.p.UpdateRequestProcessorChain creating updateRequestProcessorChain "distrib-dup-test-chain-implicit"
   [junit4]   2> 535111 INFO  (coreLoadExecutor-5062-thread-1) [    ] o.a.s.u.p.UpdateRequestProcessorChain inserting DistributedUpdateProcessorFactory into updateRequestProcessorChain "distrib-dup-test-chain-implicit"
   [junit4]   2> 535111 INFO  (coreLoadExecutor-5062-thread-1) [    ] o.a.s.c.SolrCore no updateRequestProcessorChain defined as default, creating implicit default
   [junit4]   2> 535111 WARN  (coreLoadExecutor-5062-thread-1) [    ] o.a.s.c.RequestHandlers INVALID paramSet a in requestHandler {type = requestHandler,name = /dump,class = DumpRequestHandler,args = {defaults={a=A,b=B}}}
   [junit4]   2> 535112 INFO  (coreLoadExecutor-5062-thread-1) [    ] o.a.s.h.l.XMLLoader xsltCacheLifetimeSeconds=60
   [junit4]   2> 535113 INFO  (coreLoadExecutor-5062-thread-1) [    ] o.a.s.h.l.XMLLoader xsltCacheLifetimeSeconds=60
   [junit4]   2> 535113 INFO  (coreLoadExecutor-5062-thread-1) [    ] o.a.s.h.l.XMLLoader xsltCacheLifetimeSeconds=60
   [junit4]   2> 535114 INFO  (coreLoadExecutor-5062-thread-1) [    ] o.a.s.h.l.XMLLoader xsltCacheLifetimeSeconds=60


[...truncated too long message...]

t event WatchedEvent state:SyncConnected type:None path:null path:null type:None
   [junit4]   2> 1614131 INFO  (TEST-ZkStateWriterTest.testExternalModificationToSharedClusterState-seed#[919D8DFB4ADF743C]) [    ] o.a.s.c.c.ConnectionManager Client is connected to ZooKeeper
   [junit4]   2> 1614131 INFO  (TEST-ZkStateWriterTest.testExternalModificationToSharedClusterState-seed#[919D8DFB4ADF743C]) [    ] o.a.s.c.c.SolrZkClient Using default ZkACLProvider
   [junit4]   2> 1614132 INFO  (TEST-ZkStateWriterTest.testExternalModificationToSharedClusterState-seed#[919D8DFB4ADF743C]) [    ] o.a.s.c.c.SolrZkClient makePath: /live_nodes
   [junit4]   2> 1614132 INFO  (TEST-ZkStateWriterTest.testExternalModificationToSharedClusterState-seed#[919D8DFB4ADF743C]) [    ] o.a.s.c.c.SolrZkClient makePath: /collections
   [junit4]   2> 1614133 INFO  (TEST-ZkStateWriterTest.testExternalModificationToSharedClusterState-seed#[919D8DFB4ADF743C]) [    ] o.a.s.c.c.SolrZkClient makePath: /aliases.json
   [junit4]   2> 1614134 INFO  (TEST-ZkStateWriterTest.testExternalModificationToSharedClusterState-seed#[919D8DFB4ADF743C]) [    ] o.a.s.c.c.SolrZkClient makePath: /clusterstate.json
   [junit4]   2> 1614135 INFO  (TEST-ZkStateWriterTest.testExternalModificationToSharedClusterState-seed#[919D8DFB4ADF743C]) [    ] o.a.s.c.c.SolrZkClient makePath: /security.json
   [junit4]   2> 1614135 INFO  (TEST-ZkStateWriterTest.testExternalModificationToSharedClusterState-seed#[919D8DFB4ADF743C]) [    ] o.a.s.c.c.ZkStateReader Updating cluster state from ZooKeeper... 
   [junit4]   2> 1614136 INFO  (TEST-ZkStateWriterTest.testExternalModificationToSharedClusterState-seed#[919D8DFB4ADF743C]) [    ] o.a.s.c.c.ZkStateReader Loaded empty cluster properties
   [junit4]   2> 1614136 INFO  (TEST-ZkStateWriterTest.testExternalModificationToSharedClusterState-seed#[919D8DFB4ADF743C]) [    ] o.a.s.c.c.ZkStateReader Updated live nodes from ZooKeeper... (0) -> (0)
   [junit4]   2> 1614136 INFO  (TEST-ZkStateWriterTest.testExternalModificationToSharedClusterState-seed#[919D8DFB4ADF743C]) [    ] o.a.s.c.c.SolrZkClient makePath: /collections/c1
   [junit4]   2> 1614137 INFO  (TEST-ZkStateWriterTest.testExternalModificationToSharedClusterState-seed#[919D8DFB4ADF743C]) [    ] o.a.s.c.c.SolrZkClient makePath: /collections/c2
   [junit4]   2> 1614137 INFO  (zkCallback-20114-thread-1) [    ] o.a.s.c.c.ZkStateReader A collections change: [WatchedEvent state:SyncConnected type:NodeChildrenChanged path:/collections], has occurred - updating...
   [junit4]   2> 1614140 INFO  (zkCallback-20114-thread-1) [    ] o.a.s.c.c.ZkStateReader A collections change: [WatchedEvent state:SyncConnected type:NodeChildrenChanged path:/collections], has occurred - updating...
   [junit4]   2> 1614140 INFO  (zkCallback-20114-thread-1) [    ] o.a.s.c.c.ZkStateReader A cluster state change: [WatchedEvent state:SyncConnected type:NodeDataChanged path:/clusterstate.json], has occurred - updating... (live nodes size: [0])
   [junit4]   2> 1614142 INFO  (zkCallback-20114-thread-1) [    ] o.a.s.c.c.ZkStateReader A cluster state change: [WatchedEvent state:SyncConnected type:NodeDataChanged path:/clusterstate.json], has occurred - updating... (live nodes size: [0])
   [junit4]   2> 1614143 INFO  (TEST-ZkStateWriterTest.testExternalModificationToSharedClusterState-seed#[919D8DFB4ADF743C]) [    ] o.a.s.c.ZkTestServer connecting to 127.0.0.1:46559 46559
   [junit4]   2> 1614260 INFO  (Thread-3933) [    ] o.a.s.c.ZkTestServer connecting to 127.0.0.1:46559 46559
   [junit4]   2> 1614261 INFO  (TEST-ZkStateWriterTest.testExternalModificationToSharedClusterState-seed#[919D8DFB4ADF743C]) [    ] o.a.s.SolrTestCaseJ4 ###Ending testExternalModificationToSharedClusterState
   [junit4]   2> 1614262 INFO  (SUITE-ZkStateWriterTest-seed#[919D8DFB4ADF743C]-worker) [    ] o.a.s.SolrTestCaseJ4 ###deleteCore
   [junit4]   2> NOTE: leaving temporary files on disk at: /home/jenkins/workspace/Lucene-Solr-6.x-Linux/solr/build/solr-core/test/J1/temp/solr.cloud.overseer.ZkStateWriterTest_919D8DFB4ADF743C-001
   [junit4]   2> Jul 01, 2016 6:17:02 PM com.carrotsearch.randomizedtesting.ThreadLeakControl checkThreadLeaks
   [junit4]   2> WARNING: Will linger awaiting termination of 2 leaked thread(s).
   [junit4]   2> NOTE: test params are: codec=Asserting(Lucene62): {}, docValues:{}, maxPointsInLeafNode=1285, maxMBSortInHeap=7.349896549864176, sim=ClassicSimilarity, locale=asa-TZ, timezone=America/Los_Angeles
   [junit4]   2> NOTE: Linux 4.4.0-24-generic amd64/Oracle Corporation 9-ea (64-bit)/cpus=12,threads=1,free=93838544,total=518148096
   [junit4]   2> NOTE: All tests run in this JVM: [TestStressLiveNodes, TestSurroundQueryParser, TestClusterStateMutator, TestFieldCacheSanityChecker, WordBreakSolrSpellCheckerTest, DistributedTermsComponentTest, BigEndianAscendingWordDeserializerTest, FileUtilsTest, TestHashPartitioner, TestConfigSetsAPIExclusivity, DOMUtilTest, CSVRequestHandlerTest, TestCloudManagedSchema, BlockJoinFacetSimpleTest, ClusterStateUpdateTest, CollectionsAPIDistributedZkTest, TestDynamicFieldCollectionResource, ShardRoutingCustomTest, OutOfBoxZkACLAndCredentialsProvidersTest, HdfsBasicDistributedZk2Test, TestFilteredDocIdSet, TestSolrQueryParserResource, CheckHdfsIndexTest, TestMinMaxOnMultiValuedField, TestCloudBackupRestore, DistributedIntervalFacetingTest, TestBM25SimilarityFactory, HdfsSyncSliceTest, SpatialFilterTest, TestSolrCoreProperties, MultiTermTest, TestBinaryResponseWriter, TestDocumentBuilder, SpellPossibilityIteratorTest, SimplePostToolTest, TestSolrFieldCacheMBean, SolrCmdDistributorTest, TestCollationFieldDocValues, CdcrReplicationHandlerTest, TestCustomDocTransformer, DirectSolrSpellCheckerTest, TestComplexPhraseQParserPlugin, TestSizeLimitedDistributedMap, TestQuerySenderNoQuery, SpellCheckComponentTest, AddBlockUpdateTest, EnumFieldTest, DataDrivenBlockJoinTest, ResponseHeaderTest, TestScoreJoinQPScore, TestMiniSolrCloudCluster, ChangedSchemaMergeTest, SuggestComponentTest, TestSimpleTrackingShardHandler, TestReqParamsAPI, ExplicitHLLTest, TestFieldResource, TestHdfsUpdateLog, OpenCloseCoreStressTest, OpenExchangeRatesOrgProviderTest, TestWordDelimiterFilterFactory, CollectionReloadTest, TestSortingResponseWriter, LoggingHandlerTest, HighlighterTest, FacetPivotSmallTest, CollectionsAPIAsyncDistributedZkTest, FastVectorHighlighterTest, TestTrie, QueryResultKeyTest, BJQParserTest, TestFastLRUCache, TestManagedSynonymFilterFactory, TestQueryUtils, HdfsUnloadDistributedZkTest, TestSolrDeletionPolicy2, SimpleMLTQParserTest, TermsComponentTest, DocValuesTest, TlogReplayBufferedWhileIndexingTest, TestSystemIdResolver, TestManagedResourceStorage, TestDistribDocBasedVersion, BufferStoreTest, TestRecoveryHdfs, IndexBasedSpellCheckerTest, TestDynamicLoading, TestUpdate, AtomicUpdatesTest, TestConfigReload, TestSchemaVersionResource, TestPKIAuthenticationPlugin, AliasIntegrationTest, SuggesterFSTTest, BlobRepositoryCloudTest, DistribCursorPagingTest, TestStressVersions, TestSchemaNameResource, SyncSliceTest, OverseerTest, BasicZkTest, RecoveryZkTest, AutoCommitTest, TestDistributedGrouping, DistributedSpellCheckComponentTest, HardAutoCommitTest, QueryElevationComponentTest, PeerSyncTest, TestSort, TestFunctionQuery, BasicFunctionalityTest, TestBadConfig, TestIndexSearcher, SoftAutoCommitTest, ShowFileRequestHandlerTest, SolrIndexSplitterTest, TestCoreDiscovery, AnalysisAfterCoreReloadTest, SpellCheckCollatorTest, TestStressLucene, SchemaVersionSpecificBehaviorTest, TestPseudoReturnFields, TestAtomicUpdateErrorCases, DirectUpdateHandlerOptimizeTest, StatelessScriptUpdateProcessorFactoryTest, XsltUpdateRequestHandlerTest, CacheHeaderTest, TestWriterPerf, TestQueryTypes, DocumentBuilderTest, TestValueSourceCache, MoreLikeThisHandlerTest, FieldAnalysisRequestHandlerTest, RegexBoostProcessorTest, IndexSchemaTest, ReturnFieldsTest, MBeansHandlerTest, UniqFieldsUpdateProcessorFactoryTest, TestPartialUpdateDeduplication, TestLFUCache, CdcrReplicationDistributedZkTest, CleanupOldIndexTest, ConfigSetsAPITest, ConnectionManagerTest, CreateCollectionCleanupTest, DeleteInactiveReplicaTest, DeleteShardTest, DistributedQueueTest, ForceLeaderTest, LeaderInitiatedRecoveryOnShardRestartTest, MigrateRouteKeyTest, OverseerTaskQueueTest, RemoteQueryErrorTest, SolrXmlInZkTest, TestAuthenticationFramework, TestCollectionAPI, TestRequestForwarding, TestRequestStatusCollectionAPI, HdfsChaosMonkeyNothingIsSafeTest, HdfsChaosMonkeySafeLeaderTest, HdfsNNFailoverTest, HdfsRecoverLeaseTest, HdfsRestartWhileUpdatingTest, HdfsThreadLeakTest, HdfsWriteToMultipleCollectionsTest, StressHdfsTest, ZkStateReaderTest, ZkStateWriterTest]
   [junit4] Completed [504/618 (2!)] on J1 in 1.84s, 5 tests, 1 failure <<< FAILURES!

[...truncated 351 lines...]
BUILD FAILED
/home/jenkins/workspace/Lucene-Solr-6.x-Linux/build.xml:740: The following error occurred while executing this line:
/home/jenkins/workspace/Lucene-Solr-6.x-Linux/build.xml:684: The following error occurred while executing this line:
/home/jenkins/workspace/Lucene-Solr-6.x-Linux/build.xml:59: The following error occurred while executing this line:
/home/jenkins/workspace/Lucene-Solr-6.x-Linux/solr/build.xml:233: The following error occurred while executing this line:
/home/jenkins/workspace/Lucene-Solr-6.x-Linux/solr/common-build.xml:530: The following error occurred while executing this line:
/home/jenkins/workspace/Lucene-Solr-6.x-Linux/lucene/common-build.xml:1427: The following error occurred while executing this line:
/home/jenkins/workspace/Lucene-Solr-6.x-Linux/lucene/common-build.xml:984: There were test failures: 618 suites (10 ignored), 2591 tests, 2 failures, 119 ignored (72 assumptions) [seed: 919D8DFB4ADF743C]

Total time: 56 minutes 0 seconds
Build step 'Invoke Ant' marked build as failure
Archiving artifacts
[WARNINGS] Skipping publisher since build result is FAILURE
Recording test results
Email was triggered for: Failure - Any
Sending email for trigger: Failure - Any



Mime
View raw message