lucene-dev mailing list archives

Site index · List index
Message view « Date » · « Thread »
Top « Date » · « Thread »
From Policeman Jenkins Server <jenk...@thetaphi.de>
Subject [JENKINS] Lucene-Solr-6.x-Linux (32bit/jdk1.8.0_92) - Build # 1019 - Failure!
Date Fri, 01 Jul 2016 12:43:31 GMT
Build: http://jenkins.thetaphi.de/job/Lucene-Solr-6.x-Linux/1019/
Java: 32bit/jdk1.8.0_92 -server -XX:+UseParallelGC

1 tests failed.
FAILED:  junit.framework.TestSuite.org.apache.solr.schema.TestManagedSchemaAPI

Error Message:
ObjectTracker found 4 object(s) that were not released!!! [MDCAwareThreadPoolExecutor, MockDirectoryWrapper, MockDirectoryWrapper, TransactionLog]

Stack Trace:
java.lang.AssertionError: ObjectTracker found 4 object(s) that were not released!!! [MDCAwareThreadPoolExecutor, MockDirectoryWrapper, MockDirectoryWrapper, TransactionLog]
	at __randomizedtesting.SeedInfo.seed([BE2D9CD8CF356EA6]:0)
	at org.junit.Assert.fail(Assert.java:93)
	at org.junit.Assert.assertTrue(Assert.java:43)
	at org.junit.Assert.assertNull(Assert.java:551)
	at org.apache.solr.SolrTestCaseJ4.teardownTestCases(SolrTestCaseJ4.java:257)
	at sun.reflect.GeneratedMethodAccessor25.invoke(Unknown Source)
	at sun.reflect.DelegatingMethodAccessorImpl.invoke(DelegatingMethodAccessorImpl.java:43)
	at java.lang.reflect.Method.invoke(Method.java:498)
	at com.carrotsearch.randomizedtesting.RandomizedRunner.invoke(RandomizedRunner.java:1764)
	at com.carrotsearch.randomizedtesting.RandomizedRunner$7.evaluate(RandomizedRunner.java:834)
	at com.carrotsearch.randomizedtesting.rules.StatementAdapter.evaluate(StatementAdapter.java:36)
	at com.carrotsearch.randomizedtesting.rules.SystemPropertiesRestoreRule$1.evaluate(SystemPropertiesRestoreRule.java:57)
	at org.apache.lucene.util.AbstractBeforeAfterRule$1.evaluate(AbstractBeforeAfterRule.java:45)
	at com.carrotsearch.randomizedtesting.rules.StatementAdapter.evaluate(StatementAdapter.java:36)
	at org.apache.lucene.util.TestRuleStoreClassName$1.evaluate(TestRuleStoreClassName.java:41)
	at com.carrotsearch.randomizedtesting.rules.NoShadowingOrOverridesOnMethodsRule$1.evaluate(NoShadowingOrOverridesOnMethodsRule.java:40)
	at com.carrotsearch.randomizedtesting.rules.NoShadowingOrOverridesOnMethodsRule$1.evaluate(NoShadowingOrOverridesOnMethodsRule.java:40)
	at com.carrotsearch.randomizedtesting.rules.StatementAdapter.evaluate(StatementAdapter.java:36)
	at com.carrotsearch.randomizedtesting.rules.StatementAdapter.evaluate(StatementAdapter.java:36)
	at com.carrotsearch.randomizedtesting.rules.StatementAdapter.evaluate(StatementAdapter.java:36)
	at org.apache.lucene.util.TestRuleAssertionsRequired$1.evaluate(TestRuleAssertionsRequired.java:53)
	at org.apache.lucene.util.TestRuleMarkFailure$1.evaluate(TestRuleMarkFailure.java:47)
	at org.apache.lucene.util.TestRuleIgnoreAfterMaxFailures$1.evaluate(TestRuleIgnoreAfterMaxFailures.java:64)
	at org.apache.lucene.util.TestRuleIgnoreTestSuites$1.evaluate(TestRuleIgnoreTestSuites.java:54)
	at com.carrotsearch.randomizedtesting.rules.StatementAdapter.evaluate(StatementAdapter.java:36)
	at com.carrotsearch.randomizedtesting.ThreadLeakControl$StatementRunner.run(ThreadLeakControl.java:367)
	at java.lang.Thread.run(Thread.java:745)




Build Log:
[...truncated 11072 lines...]
   [junit4] Suite: org.apache.solr.schema.TestManagedSchemaAPI
   [junit4]   2> Creating dataDir: /home/jenkins/workspace/Lucene-Solr-6.x-Linux/solr/build/solr-core/test/J0/temp/solr.schema.TestManagedSchemaAPI_BE2D9CD8CF356EA6-001/init-core-data-001
   [junit4]   2> 311179 INFO  (SUITE-TestManagedSchemaAPI-seed#[BE2D9CD8CF356EA6]-worker) [    ] o.a.s.SolrTestCaseJ4 Randomized ssl (true) and clientAuth (false) via: @org.apache.solr.util.RandomizeSSL(reason=, ssl=NaN, value=NaN, clientAuth=NaN)
   [junit4]   2> 311180 INFO  (SUITE-TestManagedSchemaAPI-seed#[BE2D9CD8CF356EA6]-worker) [    ] o.a.s.c.ZkTestServer STARTING ZK TEST SERVER
   [junit4]   2> 311180 INFO  (Thread-1169) [    ] o.a.s.c.ZkTestServer client port:0.0.0.0/0.0.0.0:0
   [junit4]   2> 311180 INFO  (Thread-1169) [    ] o.a.s.c.ZkTestServer Starting server
   [junit4]   2> 311280 INFO  (SUITE-TestManagedSchemaAPI-seed#[BE2D9CD8CF356EA6]-worker) [    ] o.a.s.c.ZkTestServer start zk server on port:36899
   [junit4]   2> 311280 INFO  (SUITE-TestManagedSchemaAPI-seed#[BE2D9CD8CF356EA6]-worker) [    ] o.a.s.c.c.SolrZkClient Using default ZkCredentialsProvider
   [junit4]   2> 311281 INFO  (SUITE-TestManagedSchemaAPI-seed#[BE2D9CD8CF356EA6]-worker) [    ] o.a.s.c.c.ConnectionManager Waiting for client to connect to ZooKeeper
   [junit4]   2> 311283 INFO  (zkCallback-512-thread-1) [    ] o.a.s.c.c.ConnectionManager Watcher org.apache.solr.common.cloud.ConnectionManager@b9eede name:ZooKeeperConnection Watcher:127.0.0.1:36899 got event WatchedEvent state:SyncConnected type:None path:null path:null type:None
   [junit4]   2> 311283 INFO  (SUITE-TestManagedSchemaAPI-seed#[BE2D9CD8CF356EA6]-worker) [    ] o.a.s.c.c.ConnectionManager Client is connected to ZooKeeper
   [junit4]   2> 311283 INFO  (SUITE-TestManagedSchemaAPI-seed#[BE2D9CD8CF356EA6]-worker) [    ] o.a.s.c.c.SolrZkClient Using default ZkACLProvider
   [junit4]   2> 311284 INFO  (SUITE-TestManagedSchemaAPI-seed#[BE2D9CD8CF356EA6]-worker) [    ] o.a.s.c.c.SolrZkClient makePath: /solr/solr.xml
   [junit4]   2> 311284 INFO  (SUITE-TestManagedSchemaAPI-seed#[BE2D9CD8CF356EA6]-worker) [    ] o.a.s.c.c.SolrZkClient makePath: /solr/clusterprops.json
   [junit4]   2> 311291 INFO  (jetty-launcher-511-thread-2) [    ] o.e.j.s.Server jetty-9.3.8.v20160314
   [junit4]   2> 311291 INFO  (jetty-launcher-511-thread-1) [    ] o.e.j.s.Server jetty-9.3.8.v20160314
   [junit4]   2> 311292 INFO  (jetty-launcher-511-thread-2) [    ] o.e.j.s.h.ContextHandler Started o.e.j.s.ServletContextHandler@1a41d04{/solr,null,AVAILABLE}
   [junit4]   2> 311292 INFO  (jetty-launcher-511-thread-1) [    ] o.e.j.s.h.ContextHandler Started o.e.j.s.ServletContextHandler@7be427{/solr,null,AVAILABLE}
   [junit4]   2> 311295 INFO  (jetty-launcher-511-thread-1) [    ] o.e.j.s.ServerConnector Started ServerConnector@1da6864{SSL,[ssl, http/1.1]}{127.0.0.1:41090}
   [junit4]   2> 311295 INFO  (jetty-launcher-511-thread-2) [    ] o.e.j.s.ServerConnector Started ServerConnector@12ff268{SSL,[ssl, http/1.1]}{127.0.0.1:37334}
   [junit4]   2> 311295 INFO  (jetty-launcher-511-thread-1) [    ] o.e.j.s.Server Started @313184ms
   [junit4]   2> 311295 INFO  (jetty-launcher-511-thread-2) [    ] o.e.j.s.Server Started @313184ms
   [junit4]   2> 311295 INFO  (jetty-launcher-511-thread-1) [    ] o.a.s.c.s.e.JettySolrRunner Jetty properties: {hostContext=/solr, hostPort=41090}
   [junit4]   2> 311295 INFO  (jetty-launcher-511-thread-2) [    ] o.a.s.c.s.e.JettySolrRunner Jetty properties: {hostContext=/solr, hostPort=37334}
   [junit4]   2> 311295 INFO  (jetty-launcher-511-thread-1) [    ] o.a.s.s.SolrDispatchFilter SolrDispatchFilter.init(): sun.misc.Launcher$AppClassLoader@1d16e93
   [junit4]   2> 311295 INFO  (jetty-launcher-511-thread-2) [    ] o.a.s.s.SolrDispatchFilter SolrDispatchFilter.init(): sun.misc.Launcher$AppClassLoader@1d16e93
   [junit4]   2> 311295 INFO  (jetty-launcher-511-thread-1) [    ] o.a.s.c.SolrResourceLoader new SolrResourceLoader for directory: '/home/jenkins/workspace/Lucene-Solr-6.x-Linux/solr/build/solr-core/test/J0/temp/solr.schema.TestManagedSchemaAPI_BE2D9CD8CF356EA6-001/tempDir-001/node1'
   [junit4]   2> 311295 INFO  (jetty-launcher-511-thread-2) [    ] o.a.s.c.SolrResourceLoader new SolrResourceLoader for directory: '/home/jenkins/workspace/Lucene-Solr-6.x-Linux/solr/build/solr-core/test/J0/temp/solr.schema.TestManagedSchemaAPI_BE2D9CD8CF356EA6-001/tempDir-001/node2'
   [junit4]   2> 311296 INFO  (jetty-launcher-511-thread-2) [    ] o.a.s.c.SolrResourceLoader JNDI not configured for solr (NoInitialContextEx)
   [junit4]   2> 311296 INFO  (jetty-launcher-511-thread-1) [    ] o.a.s.c.SolrResourceLoader JNDI not configured for solr (NoInitialContextEx)
   [junit4]   2> 311296 INFO  (jetty-launcher-511-thread-2) [    ] o.a.s.c.SolrResourceLoader solr home defaulted to 'solr/' (could not find system property or JNDI)
   [junit4]   2> 311296 INFO  (jetty-launcher-511-thread-1) [    ] o.a.s.c.SolrResourceLoader solr home defaulted to 'solr/' (could not find system property or JNDI)
   [junit4]   2> 311296 INFO  (jetty-launcher-511-thread-1) [    ] o.a.s.c.c.SolrZkClient Using default ZkCredentialsProvider
   [junit4]   2> 311296 INFO  (jetty-launcher-511-thread-2) [    ] o.a.s.c.c.SolrZkClient Using default ZkCredentialsProvider
   [junit4]   2> 311296 INFO  (jetty-launcher-511-thread-1) [    ] o.a.s.c.c.ConnectionManager Waiting for client to connect to ZooKeeper
   [junit4]   2> 311296 INFO  (jetty-launcher-511-thread-2) [    ] o.a.s.c.c.ConnectionManager Waiting for client to connect to ZooKeeper
   [junit4]   2> 311298 INFO  (zkCallback-513-thread-1) [    ] o.a.s.c.c.ConnectionManager Watcher org.apache.solr.common.cloud.ConnectionManager@1cd4159 name:ZooKeeperConnection Watcher:127.0.0.1:36899/solr got event WatchedEvent state:SyncConnected type:None path:null path:null type:None
   [junit4]   2> 311298 INFO  (jetty-launcher-511-thread-1) [    ] o.a.s.c.c.ConnectionManager Client is connected to ZooKeeper
   [junit4]   2> 311298 INFO  (jetty-launcher-511-thread-1) [    ] o.a.s.c.c.SolrZkClient Using default ZkACLProvider
   [junit4]   2> 311298 INFO  (zkCallback-514-thread-1) [    ] o.a.s.c.c.ConnectionManager Watcher org.apache.solr.common.cloud.ConnectionManager@301626 name:ZooKeeperConnection Watcher:127.0.0.1:36899/solr got event WatchedEvent state:SyncConnected type:None path:null path:null type:None
   [junit4]   2> 311298 INFO  (jetty-launcher-511-thread-2) [    ] o.a.s.c.c.ConnectionManager Client is connected to ZooKeeper
   [junit4]   2> 311299 INFO  (jetty-launcher-511-thread-2) [    ] o.a.s.c.c.SolrZkClient Using default ZkACLProvider
   [junit4]   2> 311299 INFO  (jetty-launcher-511-thread-1) [    ] o.a.s.s.SolrDispatchFilter solr.xml found in ZooKeeper. Loading...
   [junit4]   2> 311299 INFO  (jetty-launcher-511-thread-2) [    ] o.a.s.s.SolrDispatchFilter solr.xml found in ZooKeeper. Loading...
   [junit4]   2> 311304 INFO  (jetty-launcher-511-thread-1) [    ] o.a.s.c.CorePropertiesLocator Config-defined core root directory: /home/jenkins/workspace/Lucene-Solr-6.x-Linux/solr/build/solr-core/test/J0/temp/solr.schema.TestManagedSchemaAPI_BE2D9CD8CF356EA6-001/tempDir-001/node1/.
   [junit4]   2> 311304 INFO  (jetty-launcher-511-thread-1) [    ] o.a.s.c.CoreContainer New CoreContainer 4844392
   [junit4]   2> 311304 INFO  (jetty-launcher-511-thread-1) [    ] o.a.s.c.CoreContainer Loading cores into CoreContainer [instanceDir=/home/jenkins/workspace/Lucene-Solr-6.x-Linux/solr/build/solr-core/test/J0/temp/solr.schema.TestManagedSchemaAPI_BE2D9CD8CF356EA6-001/tempDir-001/node1]
   [junit4]   2> 311304 WARN  (jetty-launcher-511-thread-1) [    ] o.a.s.c.CoreContainer Couldn't add files from /home/jenkins/workspace/Lucene-Solr-6.x-Linux/solr/build/solr-core/test/J0/temp/solr.schema.TestManagedSchemaAPI_BE2D9CD8CF356EA6-001/tempDir-001/node1/lib to classpath: /home/jenkins/workspace/Lucene-Solr-6.x-Linux/solr/build/solr-core/test/J0/temp/solr.schema.TestManagedSchemaAPI_BE2D9CD8CF356EA6-001/tempDir-001/node1/lib
   [junit4]   2> 311304 INFO  (jetty-launcher-511-thread-1) [    ] o.a.s.h.c.HttpShardHandlerFactory created with socketTimeout : 90000,urlScheme : https,connTimeout : 15000,maxConnectionsPerHost : 20,maxConnections : 10000,corePoolSize : 0,maximumPoolSize : 2147483647,maxThreadIdleTime : 5,sizeOfQueue : -1,fairnessPolicy : false,useRetries : false,
   [junit4]   2> 311304 INFO  (jetty-launcher-511-thread-2) [    ] o.a.s.c.CorePropertiesLocator Config-defined core root directory: /home/jenkins/workspace/Lucene-Solr-6.x-Linux/solr/build/solr-core/test/J0/temp/solr.schema.TestManagedSchemaAPI_BE2D9CD8CF356EA6-001/tempDir-001/node2/.
   [junit4]   2> 311304 INFO  (jetty-launcher-511-thread-2) [    ] o.a.s.c.CoreContainer New CoreContainer 16305821
   [junit4]   2> 311305 INFO  (jetty-launcher-511-thread-2) [    ] o.a.s.c.CoreContainer Loading cores into CoreContainer [instanceDir=/home/jenkins/workspace/Lucene-Solr-6.x-Linux/solr/build/solr-core/test/J0/temp/solr.schema.TestManagedSchemaAPI_BE2D9CD8CF356EA6-001/tempDir-001/node2]
   [junit4]   2> 311305 WARN  (jetty-launcher-511-thread-2) [    ] o.a.s.c.CoreContainer Couldn't add files from /home/jenkins/workspace/Lucene-Solr-6.x-Linux/solr/build/solr-core/test/J0/temp/solr.schema.TestManagedSchemaAPI_BE2D9CD8CF356EA6-001/tempDir-001/node2/lib to classpath: /home/jenkins/workspace/Lucene-Solr-6.x-Linux/solr/build/solr-core/test/J0/temp/solr.schema.TestManagedSchemaAPI_BE2D9CD8CF356EA6-001/tempDir-001/node2/lib
   [junit4]   2> 311305 INFO  (jetty-launcher-511-thread-2) [    ] o.a.s.h.c.HttpShardHandlerFactory created with socketTimeout : 90000,urlScheme : https,connTimeout : 15000,maxConnectionsPerHost : 20,maxConnections : 10000,corePoolSize : 0,maximumPoolSize : 2147483647,maxThreadIdleTime : 5,sizeOfQueue : -1,fairnessPolicy : false,useRetries : false,
   [junit4]   2> 311305 INFO  (jetty-launcher-511-thread-1) [    ] o.a.s.u.UpdateShardHandler Creating UpdateShardHandler HTTP client with params: socketTimeout=340000&connTimeout=45000&retry=true
   [junit4]   2> 311305 INFO  (jetty-launcher-511-thread-2) [    ] o.a.s.u.UpdateShardHandler Creating UpdateShardHandler HTTP client with params: socketTimeout=340000&connTimeout=45000&retry=true
   [junit4]   2> 311306 INFO  (jetty-launcher-511-thread-1) [    ] o.a.s.l.LogWatcher SLF4J impl is org.slf4j.impl.Log4jLoggerFactory
   [junit4]   2> 311306 INFO  (jetty-launcher-511-thread-1) [    ] o.a.s.l.LogWatcher Registering Log Listener [Log4j (org.slf4j.impl.Log4jLoggerFactory)]
   [junit4]   2> 311306 INFO  (jetty-launcher-511-thread-1) [    ] o.a.s.c.ZkContainer Zookeeper client=127.0.0.1:36899/solr
   [junit4]   2> 311306 INFO  (jetty-launcher-511-thread-1) [    ] o.a.s.c.ZkController zkHost includes chroot
   [junit4]   2> 311306 INFO  (jetty-launcher-511-thread-2) [    ] o.a.s.l.LogWatcher SLF4J impl is org.slf4j.impl.Log4jLoggerFactory
   [junit4]   2> 311306 INFO  (jetty-launcher-511-thread-1) [    ] o.a.s.c.c.SolrZkClient Using default ZkCredentialsProvider
   [junit4]   2> 311306 INFO  (jetty-launcher-511-thread-2) [    ] o.a.s.l.LogWatcher Registering Log Listener [Log4j (org.slf4j.impl.Log4jLoggerFactory)]
   [junit4]   2> 311306 INFO  (jetty-launcher-511-thread-2) [    ] o.a.s.c.ZkContainer Zookeeper client=127.0.0.1:36899/solr
   [junit4]   2> 311306 INFO  (jetty-launcher-511-thread-2) [    ] o.a.s.c.ZkController zkHost includes chroot
   [junit4]   2> 311306 INFO  (jetty-launcher-511-thread-2) [    ] o.a.s.c.c.SolrZkClient Using default ZkCredentialsProvider
   [junit4]   2> 311306 INFO  (jetty-launcher-511-thread-1) [    ] o.a.s.c.c.ConnectionManager Waiting for client to connect to ZooKeeper
   [junit4]   2> 311306 INFO  (jetty-launcher-511-thread-2) [    ] o.a.s.c.c.ConnectionManager Waiting for client to connect to ZooKeeper
   [junit4]   2> 311307 INFO  (zkCallback-519-thread-1) [    ] o.a.s.c.c.ConnectionManager Watcher org.apache.solr.common.cloud.ConnectionManager@1df8f4a name:ZooKeeperConnection Watcher:127.0.0.1:36899 got event WatchedEvent state:SyncConnected type:None path:null path:null type:None
   [junit4]   2> 311307 INFO  (jetty-launcher-511-thread-1) [    ] o.a.s.c.c.ConnectionManager Client is connected to ZooKeeper
   [junit4]   2> 311307 INFO  (zkCallback-520-thread-1) [    ] o.a.s.c.c.ConnectionManager Watcher org.apache.solr.common.cloud.ConnectionManager@1d2255b name:ZooKeeperConnection Watcher:127.0.0.1:36899 got event WatchedEvent state:SyncConnected type:None path:null path:null type:None
   [junit4]   2> 311307 INFO  (jetty-launcher-511-thread-2) [    ] o.a.s.c.c.ConnectionManager Client is connected to ZooKeeper
   [junit4]   2> 311307 INFO  (jetty-launcher-511-thread-1) [    ] o.a.s.c.c.SolrZkClient Using default ZkACLProvider
   [junit4]   2> 311307 INFO  (jetty-launcher-511-thread-2) [    ] o.a.s.c.c.SolrZkClient Using default ZkACLProvider
   [junit4]   2> 311308 WARN  (NIOServerCxn.Factory:0.0.0.0/0.0.0.0:0) [    ] o.a.z.s.NIOServerCnxn caught end of stream exception
   [junit4]   2> EndOfStreamException: Unable to read additional data from client sessionid 0x155a664a3640003, likely client has closed socket
   [junit4]   2> 	at org.apache.zookeeper.server.NIOServerCnxn.doIO(NIOServerCnxn.java:228)
   [junit4]   2> 	at org.apache.zookeeper.server.NIOServerCnxnFactory.run(NIOServerCnxnFactory.java:208)
   [junit4]   2> 	at java.lang.Thread.run(Thread.java:745)
   [junit4]   2> 311308 INFO  (jetty-launcher-511-thread-1) [n:127.0.0.1:41090_solr    ] o.a.s.c.ZkController Added new OnReconnect listener org.apache.solr.cloud.ZkController$$Lambda$10/2092100@bc694e
   [junit4]   2> 311308 INFO  (jetty-launcher-511-thread-1) [n:127.0.0.1:41090_solr    ] o.a.s.c.c.ConnectionManager Waiting for client to connect to ZooKeeper
   [junit4]   2> 311310 INFO  (jetty-launcher-511-thread-2) [n:127.0.0.1:37334_solr    ] o.a.s.c.ZkController Added new OnReconnect listener org.apache.solr.cloud.ZkController$$Lambda$10/2092100@105e386
   [junit4]   2> 311311 WARN  (NIOServerCxn.Factory:0.0.0.0/0.0.0.0:0) [    ] o.a.z.s.NIOServerCnxn caught end of stream exception
   [junit4]   2> EndOfStreamException: Unable to read additional data from client sessionid 0x155a664a3640004, likely client has closed socket
   [junit4]   2> 	at org.apache.zookeeper.server.NIOServerCnxn.doIO(NIOServerCnxn.java:228)
   [junit4]   2> 	at org.apache.zookeeper.server.NIOServerCnxnFactory.run(NIOServerCnxnFactory.java:208)
   [junit4]   2> 	at java.lang.Thread.run(Thread.java:745)
   [junit4]   2> 311311 INFO  (jetty-launcher-511-thread-2) [n:127.0.0.1:37334_solr    ] o.a.s.c.c.ConnectionManager Waiting for client to connect to ZooKeeper
   [junit4]   2> 311311 INFO  (zkCallback-521-thread-1-processing-n:127.0.0.1:41090_solr) [n:127.0.0.1:41090_solr    ] o.a.s.c.c.ConnectionManager Watcher org.apache.solr.common.cloud.ConnectionManager@b68a37 name:ZooKeeperConnection Watcher:127.0.0.1:36899/solr got event WatchedEvent state:SyncConnected type:None path:null path:null type:None
   [junit4]   2> 311311 INFO  (jetty-launcher-511-thread-1) [n:127.0.0.1:41090_solr    ] o.a.s.c.c.ConnectionManager Client is connected to ZooKeeper
   [junit4]   2> 311311 INFO  (zkCallback-522-thread-1-processing-n:127.0.0.1:37334_solr) [n:127.0.0.1:37334_solr    ] o.a.s.c.c.ConnectionManager Watcher org.apache.solr.common.cloud.ConnectionManager@b1eef4 name:ZooKeeperConnection Watcher:127.0.0.1:36899/solr got event WatchedEvent state:SyncConnected type:None path:null path:null type:None
   [junit4]   2> 311311 INFO  (jetty-launcher-511-thread-2) [n:127.0.0.1:37334_solr    ] o.a.s.c.c.ConnectionManager Client is connected to ZooKeeper
   [junit4]   2> 311313 INFO  (jetty-launcher-511-thread-2) [n:127.0.0.1:37334_solr    ] o.a.s.c.c.SolrZkClient makePath: /overseer/queue
   [junit4]   2> 311313 INFO  (jetty-launcher-511-thread-1) [n:127.0.0.1:41090_solr    ] o.a.s.c.c.SolrZkClient makePath: /overseer/queue
   [junit4]   2> 311315 INFO  (jetty-launcher-511-thread-2) [n:127.0.0.1:37334_solr    ] o.a.s.c.c.SolrZkClient makePath: /overseer/collection-queue-work
   [junit4]   2> 311315 INFO  (jetty-launcher-511-thread-1) [n:127.0.0.1:41090_solr    ] o.a.s.c.c.SolrZkClient makePath: /overseer/collection-queue-work
   [junit4]   2> 311317 INFO  (jetty-launcher-511-thread-2) [n:127.0.0.1:37334_solr    ] o.a.s.c.c.SolrZkClient makePath: /overseer/collection-map-running
   [junit4]   2> 311317 INFO  (jetty-launcher-511-thread-1) [n:127.0.0.1:41090_solr    ] o.a.s.c.c.SolrZkClient makePath: /overseer/collection-map-running
   [junit4]   2> 311318 INFO  (jetty-launcher-511-thread-2) [n:127.0.0.1:37334_solr    ] o.a.s.c.c.SolrZkClient makePath: /overseer/collection-map-completed
   [junit4]   2> 311318 INFO  (jetty-launcher-511-thread-1) [n:127.0.0.1:41090_solr    ] o.a.s.c.c.SolrZkClient makePath: /overseer/collection-map-completed
   [junit4]   2> 311318 INFO  (jetty-launcher-511-thread-2) [n:127.0.0.1:37334_solr    ] o.a.s.c.c.SolrZkClient makePath: /overseer/collection-map-failure
   [junit4]   2> 311319 INFO  (jetty-launcher-511-thread-1) [n:127.0.0.1:41090_solr    ] o.a.s.c.c.SolrZkClient makePath: /overseer/collection-map-failure
   [junit4]   2> 311320 INFO  (jetty-launcher-511-thread-2) [n:127.0.0.1:37334_solr    ] o.a.s.c.c.SolrZkClient makePath: /live_nodes
   [junit4]   2> 311320 INFO  (jetty-launcher-511-thread-1) [n:127.0.0.1:41090_solr    ] o.a.s.c.c.SolrZkClient makePath: /live_nodes
   [junit4]   2> 311321 INFO  (jetty-launcher-511-thread-2) [n:127.0.0.1:37334_solr    ] o.a.s.c.c.SolrZkClient makePath: /collections
   [junit4]   2> 311322 INFO  (jetty-launcher-511-thread-1) [n:127.0.0.1:41090_solr    ] o.a.s.c.c.SolrZkClient makePath: /collections
   [junit4]   2> 311322 INFO  (jetty-launcher-511-thread-2) [n:127.0.0.1:37334_solr    ] o.a.s.c.c.SolrZkClient makePath: /aliases.json
   [junit4]   2> 311322 INFO  (jetty-launcher-511-thread-1) [n:127.0.0.1:41090_solr    ] o.a.s.c.c.SolrZkClient makePath: /aliases.json
   [junit4]   2> 311322 INFO  (jetty-launcher-511-thread-1) [n:127.0.0.1:41090_solr    ] o.a.s.c.c.SolrZkClient makePath: /clusterstate.json
   [junit4]   2> 311323 INFO  (jetty-launcher-511-thread-2) [n:127.0.0.1:37334_solr    ] o.a.s.c.c.SolrZkClient makePath: /clusterstate.json
   [junit4]   2> 311323 INFO  (jetty-launcher-511-thread-2) [n:127.0.0.1:37334_solr    ] o.a.s.c.c.SolrZkClient makePath: /security.json
   [junit4]   2> 311323 INFO  (jetty-launcher-511-thread-1) [n:127.0.0.1:41090_solr    ] o.a.s.c.c.SolrZkClient makePath: /security.json
   [junit4]   2> 311324 INFO  (jetty-launcher-511-thread-1) [n:127.0.0.1:41090_solr    ] o.a.s.c.c.ZkStateReader Updating cluster state from ZooKeeper... 
   [junit4]   2> 311324 INFO  (jetty-launcher-511-thread-2) [n:127.0.0.1:37334_solr    ] o.a.s.c.c.ZkStateReader Updating cluster state from ZooKeeper... 
   [junit4]   2> 311325 INFO  (jetty-launcher-511-thread-1) [n:127.0.0.1:41090_solr    ] o.a.s.c.c.ZkStateReader Loaded cluster properties: {urlScheme=https}
   [junit4]   2> 311325 INFO  (jetty-launcher-511-thread-2) [n:127.0.0.1:37334_solr    ] o.a.s.c.c.ZkStateReader Loaded cluster properties: {urlScheme=https}
   [junit4]   2> 311325 INFO  (jetty-launcher-511-thread-1) [n:127.0.0.1:41090_solr    ] o.a.s.c.c.ZkStateReader Updated live nodes from ZooKeeper... (0) -> (0)
   [junit4]   2> 311325 INFO  (jetty-launcher-511-thread-2) [n:127.0.0.1:37334_solr    ] o.a.s.c.c.ZkStateReader Updated live nodes from ZooKeeper... (0) -> (0)
   [junit4]   2> 311326 INFO  (jetty-launcher-511-thread-2) [n:127.0.0.1:37334_solr    ] o.a.s.c.c.SolrZkClient makePath: /overseer_elect
   [junit4]   2> 311326 INFO  (jetty-launcher-511-thread-1) [n:127.0.0.1:41090_solr    ] o.a.s.c.c.SolrZkClient makePath: /overseer_elect
   [junit4]   2> 311327 INFO  (jetty-launcher-511-thread-1) [n:127.0.0.1:41090_solr    ] o.a.s.c.c.SolrZkClient makePath: /overseer_elect/election
   [junit4]   2> 311327 INFO  (jetty-launcher-511-thread-2) [n:127.0.0.1:37334_solr    ] o.a.s.c.c.SolrZkClient makePath: /overseer_elect/election
   [junit4]   2> 311328 INFO  (jetty-launcher-511-thread-1) [n:127.0.0.1:41090_solr    ] o.a.s.c.Overseer Overseer (id=null) closing
   [junit4]   2> 311328 INFO  (jetty-launcher-511-thread-1) [n:127.0.0.1:41090_solr    ] o.a.s.c.LeaderElector Joined leadership election with path: /overseer_elect/election/96165918226513925-127.0.0.1:41090_solr-n_0000000000
   [junit4]   2> 311328 INFO  (jetty-launcher-511-thread-2) [n:127.0.0.1:37334_solr    ] o.a.s.c.Overseer Overseer (id=null) closing
   [junit4]   2> 311328 INFO  (jetty-launcher-511-thread-1) [n:127.0.0.1:41090_solr    ] o.a.s.c.OverseerElectionContext I am going to be the leader 127.0.0.1:41090_solr
   [junit4]   2> 311328 INFO  (jetty-launcher-511-thread-1) [n:127.0.0.1:41090_solr    ] o.a.s.c.c.SolrZkClient makePath: /overseer_elect/leader
   [junit4]   2> 311329 INFO  (jetty-launcher-511-thread-2) [n:127.0.0.1:37334_solr    ] o.a.s.c.LeaderElector Joined leadership election with path: /overseer_elect/election/96165918226513926-127.0.0.1:37334_solr-n_0000000001
   [junit4]   2> 311329 INFO  (jetty-launcher-511-thread-2) [n:127.0.0.1:37334_solr    ] o.a.s.c.LeaderElector Watching path /overseer_elect/election/96165918226513925-127.0.0.1:41090_solr-n_0000000000 to know if I could be the leader
   [junit4]   2> 311330 INFO  (jetty-launcher-511-thread-2) [n:127.0.0.1:37334_solr    ] o.a.s.c.ZkController Register node as live in ZooKeeper:/live_nodes/127.0.0.1:37334_solr
   [junit4]   2> 311330 INFO  (jetty-launcher-511-thread-2) [n:127.0.0.1:37334_solr    ] o.a.s.c.c.SolrZkClient makePath: /live_nodes/127.0.0.1:37334_solr
   [junit4]   2> 311330 INFO  (jetty-launcher-511-thread-1) [n:127.0.0.1:41090_solr    ] o.a.s.c.Overseer Overseer (id=96165918226513925-127.0.0.1:41090_solr-n_0000000000) starting
   [junit4]   2> 311331 INFO  (zkCallback-522-thread-1-processing-n:127.0.0.1:37334_solr) [n:127.0.0.1:37334_solr    ] o.a.s.c.c.ZkStateReader A live node change: [WatchedEvent state:SyncConnected type:NodeChildrenChanged path:/live_nodes], has occurred - updating... (live nodes size: [0])
   [junit4]   2> 311331 INFO  (zkCallback-521-thread-1-processing-n:127.0.0.1:41090_solr) [n:127.0.0.1:41090_solr    ] o.a.s.c.c.ZkStateReader A live node change: [WatchedEvent state:SyncConnected type:NodeChildrenChanged path:/live_nodes], has occurred - updating... (live nodes size: [0])
   [junit4]   2> 311335 INFO  (zkCallback-521-thread-1-processing-n:127.0.0.1:41090_solr) [n:127.0.0.1:41090_solr    ] o.a.s.c.c.ZkStateReader Updated live nodes from ZooKeeper... (0) -> (1)
   [junit4]   2> 311335 INFO  (zkCallback-522-thread-1-processing-n:127.0.0.1:37334_solr) [n:127.0.0.1:37334_solr    ] o.a.s.c.c.ZkStateReader Updated live nodes from ZooKeeper... (0) -> (1)
   [junit4]   2> 311337 INFO  (jetty-launcher-511-thread-1) [n:127.0.0.1:41090_solr    ] o.a.s.c.c.SolrZkClient makePath: /overseer/queue-work
   [junit4]   2> 311339 INFO  (jetty-launcher-511-thread-1) [n:127.0.0.1:41090_solr    ] o.a.s.c.OverseerAutoReplicaFailoverThread Starting OverseerAutoReplicaFailoverThread autoReplicaFailoverWorkLoopDelay=10000 autoReplicaFailoverWaitAfterExpiration=30000 autoReplicaFailoverBadNodeExpiration=60000
   [junit4]   2> 311340 INFO  (OverseerCollectionConfigSetProcessor-96165918226513925-127.0.0.1:41090_solr-n_0000000000) [n:127.0.0.1:41090_solr    ] o.a.s.c.OverseerTaskProcessor Process current queue of overseer operations
   [junit4]   2> 311341 INFO  (jetty-launcher-511-thread-1) [n:127.0.0.1:41090_solr    ] o.a.s.c.ZkController Publish node=127.0.0.1:41090_solr as DOWN
   [junit4]   2> 311341 INFO  (OverseerStateUpdate-96165918226513925-127.0.0.1:41090_solr-n_0000000000) [n:127.0.0.1:41090_solr    ] o.a.s.c.Overseer Starting to work on the main queue
   [junit4]   2> 311341 INFO  (jetty-launcher-511-thread-1) [n:127.0.0.1:41090_solr    ] o.a.s.c.ZkController Register node as live in ZooKeeper:/live_nodes/127.0.0.1:41090_solr
   [junit4]   2> 311342 INFO  (jetty-launcher-511-thread-1) [n:127.0.0.1:41090_solr    ] o.a.s.c.c.SolrZkClient makePath: /live_nodes/127.0.0.1:41090_solr
   [junit4]   2> 311342 INFO  (OverseerStateUpdate-96165918226513925-127.0.0.1:41090_solr-n_0000000000) [n:127.0.0.1:41090_solr    ] o.a.s.c.c.ZkStateReader Updated live nodes from ZooKeeper... (1) -> (1)
   [junit4]   2> 311342 INFO  (zkCallback-522-thread-1-processing-n:127.0.0.1:37334_solr) [n:127.0.0.1:37334_solr    ] o.a.s.c.c.ZkStateReader A live node change: [WatchedEvent state:SyncConnected type:NodeChildrenChanged path:/live_nodes], has occurred - updating... (live nodes size: [1])
   [junit4]   2> 311343 INFO  (zkCallback-522-thread-1-processing-n:127.0.0.1:37334_solr) [n:127.0.0.1:37334_solr    ] o.a.s.c.c.ZkStateReader Updated live nodes from ZooKeeper... (1) -> (2)
   [junit4]   2> 311343 INFO  (OverseerStateUpdate-96165918226513925-127.0.0.1:41090_solr-n_0000000000) [n:127.0.0.1:41090_solr    ] o.a.s.c.Overseer processMessage: queueSize: 1, message = {
   [junit4]   2>   "operation":"downnode",
   [junit4]   2>   "node_name":"127.0.0.1:41090_solr"} current state version: 0
   [junit4]   2> 311343 INFO  (OverseerStateUpdate-96165918226513925-127.0.0.1:41090_solr-n_0000000000) [n:127.0.0.1:41090_solr    ] o.a.s.c.o.NodeMutator DownNode state invoked for node: 127.0.0.1:41090_solr
   [junit4]   2> 311344 INFO  (zkCallback-521-thread-1-processing-n:127.0.0.1:41090_solr) [n:127.0.0.1:41090_solr    ] o.a.s.c.c.ZkStateReader A live node change: [WatchedEvent state:SyncConnected type:NodeChildrenChanged path:/live_nodes], has occurred - updating... (live nodes size: [1])
   [junit4]   2> 311346 INFO  (zkCallback-521-thread-1-processing-n:127.0.0.1:41090_solr) [n:127.0.0.1:41090_solr    ] o.a.s.c.c.ZkStateReader Updated live nodes from ZooKeeper... (1) -> (2)
   [junit4]   2> 311356 INFO  (jetty-launcher-511-thread-1) [n:127.0.0.1:41090_solr    ] o.a.s.c.CoreContainer Security conf doesn't exist. Skipping setup for authorization module.
   [junit4]   2> 311356 INFO  (jetty-launcher-511-thread-1) [n:127.0.0.1:41090_solr    ] o.a.s.c.CoreContainer No authentication plugin used.
   [junit4]   2> 311358 INFO  (jetty-launcher-511-thread-1) [n:127.0.0.1:41090_solr    ] o.a.s.c.CorePropertiesLocator Looking for core definitions underneath /home/jenkins/workspace/Lucene-Solr-6.x-Linux/solr/build/solr-core/test/J0/temp/solr.schema.TestManagedSchemaAPI_BE2D9CD8CF356EA6-001/tempDir-001/node1/.
   [junit4]   2> 311358 INFO  (jetty-launcher-511-thread-1) [n:127.0.0.1:41090_solr    ] o.a.s.c.CorePropertiesLocator Found 0 core definitions
   [junit4]   2> 311358 INFO  (jetty-launcher-511-thread-1) [n:127.0.0.1:41090_solr    ] o.a.s.s.SolrDispatchFilter user.dir=/home/jenkins/workspace/Lucene-Solr-6.x-Linux/solr/build/solr-core/test/J0
   [junit4]   2> 311358 INFO  (jetty-launcher-511-thread-1) [n:127.0.0.1:41090_solr    ] o.a.s.s.SolrDispatchFilter SolrDispatchFilter.init() done
   [junit4]   2> 311362 INFO  (jetty-launcher-511-thread-2) [n:127.0.0.1:37334_solr    ] o.a.s.c.CoreContainer Security conf doesn't exist. Skipping setup for authorization module.
   [junit4]   2> 311362 INFO  (jetty-launcher-511-thread-2) [n:127.0.0.1:37334_solr    ] o.a.s.c.CoreContainer No authentication plugin used.
   [junit4]   2> 311363 INFO  (jetty-launcher-511-thread-2) [n:127.0.0.1:37334_solr    ] o.a.s.c.CorePropertiesLocator Looking for core definitions underneath /home/jenkins/workspace/Lucene-Solr-6.x-Linux/solr/build/solr-core/test/J0/temp/solr.schema.TestManagedSchemaAPI_BE2D9CD8CF356EA6-001/tempDir-001/node2/.
   [junit4]   2> 311363 INFO  (jetty-launcher-511-thread-2) [n:127.0.0.1:37334_solr    ] o.a.s.c.CorePropertiesLocator Found 0 core definitions
   [junit4]   2> 311363 INFO  (jetty-launcher-511-thread-2) [n:127.0.0.1:37334_solr    ] o.a.s.s.SolrDispatchFilter user.dir=/home/jenkins/workspace/Lucene-Solr-6.x-Linux/solr/build/solr-core/test/J0
   [junit4]   2> 311363 INFO  (jetty-launcher-511-thread-2) [n:127.0.0.1:37334_solr    ] o.a.s.s.SolrDispatchFilter SolrDispatchFilter.init() done
   [junit4]   2> 311363 INFO  (SUITE-TestManagedSchemaAPI-seed#[BE2D9CD8CF356EA6]-worker) [    ] o.a.s.c.c.SolrZkClient Using default ZkCredentialsProvider
   [junit4]   2> 311364 INFO  (SUITE-TestManagedSchemaAPI-seed#[BE2D9CD8CF356EA6]-worker) [    ] o.a.s.c.c.ConnectionManager Waiting for client to connect to ZooKeeper
   [junit4]   2> 311364 INFO  (zkCallback-525-thread-1) [    ] o.a.s.c.c.ConnectionManager Watcher org.apache.solr.common.cloud.ConnectionManager@179a16 name:ZooKeeperConnection Watcher:127.0.0.1:36899 got event WatchedEvent state:SyncConnected type:None path:null path:null type:None
   [junit4]   2> 311365 INFO  (SUITE-TestManagedSchemaAPI-seed#[BE2D9CD8CF356EA6]-worker) [    ] o.a.s.c.c.ConnectionManager Client is connected to ZooKeeper
   [junit4]   2> 311365 INFO  (SUITE-TestManagedSchemaAPI-seed#[BE2D9CD8CF356EA6]-worker) [    ] o.a.s.c.c.SolrZkClient Using default ZkACLProvider
   [junit4]   2> 311366 INFO  (SUITE-TestManagedSchemaAPI-seed#[BE2D9CD8CF356EA6]-worker) [    ] o.a.s.c.s.i.CloudSolrClient Final constructed zkHost string: 127.0.0.1:36899/solr
   [junit4]   2> 311366 INFO  (SUITE-TestManagedSchemaAPI-seed#[BE2D9CD8CF356EA6]-worker) [    ] o.a.s.c.c.SolrZkClient Using default ZkCredentialsProvider
   [junit4]   2> 311367 INFO  (SUITE-TestManagedSchemaAPI-seed#[BE2D9CD8CF356EA6]-worker) [    ] o.a.s.c.c.ConnectionManager Waiting for client to connect to ZooKeeper
   [junit4]   2> 311369 INFO  (zkCallback-528-thread-1) [    ] o.a.s.c.c.ConnectionManager Watcher org.apache.solr.common.cloud.ConnectionManager@19bbc58 name:ZooKeeperConnection Watcher:127.0.0.1:36899/solr got event WatchedEvent state:SyncConnected type:None path:null path:null type:None
   [junit4]   2> 311369 INFO  (SUITE-TestManagedSchemaAPI-seed#[BE2D9CD8CF356EA6]-worker) [    ] o.a.s.c.c.ConnectionManager Client is connected to ZooKeeper
   [junit4]   2> 311370 INFO  (SUITE-TestManagedSchemaAPI-seed#[BE2D9CD8CF356EA6]-worker) [    ] o.a.s.c.c.SolrZkClient Using default ZkACLProvider
   [junit4]   2> 311370 INFO  (SUITE-TestManagedSchemaAPI-seed#[BE2D9CD8CF356EA6]-worker) [    ] o.a.s.c.c.ZkStateReader Updating cluster state from ZooKeeper... 
   [junit4]   2> 311370 INFO  (SUITE-TestManagedSchemaAPI-seed#[BE2D9CD8CF356EA6]-worker) [    ] o.a.s.c.c.ZkStateReader Loaded cluster properties: {urlScheme=https}
   [junit4]   2> 311370 INFO  (SUITE-TestManagedSchemaAPI-seed#[BE2D9CD8CF356EA6]-worker) [    ] o.a.s.c.c.ZkStateReader Updated live nodes from ZooKeeper... (0) -> (2)
   [junit4]   2> 311371 INFO  (SUITE-TestManagedSchemaAPI-seed#[BE2D9CD8CF356EA6]-worker) [    ] o.a.s.c.c.SolrZkClient makePath: /configs/conf1/solrconfig.xml
   [junit4]   2> 311374 INFO  (SUITE-TestManagedSchemaAPI-seed#[BE2D9CD8CF356EA6]-worker) [    ] o.a.s.c.c.SolrZkClient makePath: /configs/conf1/managed-schema
   [junit4]   2> 311387 INFO  (TEST-TestManagedSchemaAPI.test-seed#[BE2D9CD8CF356EA6]) [    ] o.a.s.SolrTestCaseJ4 ###Starting test
   [junit4]   2> 311471 INFO  (qtp8275891-3172) [n:127.0.0.1:41090_solr    ] o.a.s.h.a.CollectionsHandler Invoked Collection Action :create with params replicationFactor=2&collection.configName=conf1&name=testschemaapi&action=CREATE&numShards=1&wt=javabin&version=2 and sendToOCPQueue=true
   [junit4]   2> 311472 INFO  (OverseerCollectionConfigSetProcessor-96165918226513925-127.0.0.1:41090_solr-n_0000000000) [n:127.0.0.1:41090_solr    ] o.a.s.c.OverseerTaskProcessor Overseer Collection Message Handler: Get the message id:/overseer/collection-queue-work/qn-0000000000 message:{
   [junit4]   2>   "name":"testschemaapi",
   [junit4]   2>   "fromApi":"true",
   [junit4]   2>   "replicationFactor":"2",
   [junit4]   2>   "collection.configName":"conf1",
   [junit4]   2>   "numShards":"1",
   [junit4]   2>   "stateFormat":"2",
   [junit4]   2>   "operation":"create"}
   [junit4]   2> 311472 INFO  (OverseerThreadFactory-1710-thread-1-processing-n:127.0.0.1:41090_solr) [n:127.0.0.1:41090_solr    ] o.a.s.c.OverseerCollectionMessageHandler OverseerCollectionMessageHandler.processMessage : create , {
   [junit4]   2>   "name":"testschemaapi",
   [junit4]   2>   "fromApi":"true",
   [junit4]   2>   "replicationFactor":"2",
   [junit4]   2>   "collection.configName":"conf1",
   [junit4]   2>   "numShards":"1",
   [junit4]   2>   "stateFormat":"2",
   [junit4]   2>   "operation":"create"}
   [junit4]   2> 311472 INFO  (OverseerThreadFactory-1710-thread-1-processing-n:127.0.0.1:41090_solr) [n:127.0.0.1:41090_solr    ] o.a.s.c.OverseerCollectionMessageHandler Create collection testschemaapi
   [junit4]   2> 311472 INFO  (OverseerThreadFactory-1710-thread-1-processing-n:127.0.0.1:41090_solr) [n:127.0.0.1:41090_solr    ] o.a.s.c.OverseerCollectionMessageHandler creating collections conf node /collections/testschemaapi 
   [junit4]   2> 311473 INFO  (OverseerThreadFactory-1710-thread-1-processing-n:127.0.0.1:41090_solr) [n:127.0.0.1:41090_solr    ] o.a.s.c.c.SolrZkClient makePath: /collections/testschemaapi
   [junit4]   2> 311473 INFO  (zkCallback-528-thread-1) [    ] o.a.s.c.c.ZkStateReader A collections change: [WatchedEvent state:SyncConnected type:NodeChildrenChanged path:/collections], has occurred - updating...
   [junit4]   2> 311473 INFO  (zkCallback-522-thread-1-processing-n:127.0.0.1:37334_solr) [n:127.0.0.1:37334_solr    ] o.a.s.c.c.ZkStateReader A collections change: [WatchedEvent state:SyncConnected type:NodeChildrenChanged path:/collections], has occurred - updating...
   [junit4]   2> 311473 INFO  (zkCallback-521-thread-1-processing-n:127.0.0.1:41090_solr) [n:127.0.0.1:41090_solr    ] o.a.s.c.c.ZkStateReader A collections change: [WatchedEvent state:SyncConnected type:NodeChildrenChanged path:/collections], has occurred - updating...
   [junit4]   2> 311475 INFO  (OverseerStateUpdate-96165918226513925-127.0.0.1:41090_solr-n_0000000000) [n:127.0.0.1:41090_solr    ] o.a.s.c.Overseer processMessage: queueSize: 1, message = {
   [junit4]   2>   "name":"testschemaapi",
   [junit4]   2>   "fromApi":"true",
   [junit4]   2>   "replicationFactor":"2",
   [junit4]   2>   "collection.configName":"conf1",
   [junit4]   2>   "numShards":"1",
   [junit4]   2>   "stateFormat":"2",
   [junit4]   2>   "operation":"create"} current state version: 0
   [junit4]   2> 311475 INFO  (OverseerStateUpdate-96165918226513925-127.0.0.1:41090_solr-n_0000000000) [n:127.0.0.1:41090_solr    ] o.a.s.c.o.ClusterStateMutator building a new cName: testschemaapi
   [junit4]   2> 311476 INFO  (OverseerStateUpdate-96165918226513925-127.0.0.1:41090_solr-n_0000000000) [n:127.0.0.1:41090_solr    ] o.a.s.c.o.ZkStateWriter going to create_collection /collections/testschemaapi/state.json
   [junit4]   2> 311575 INFO  (OverseerThreadFactory-1710-thread-1-processing-n:127.0.0.1:41090_solr) [n:127.0.0.1:41090_solr    ] o.a.s.c.OverseerCollectionMessageHandler Creating SolrCores for new collection testschemaapi, shardNames [shard1] , replicationFactor : 2
   [junit4]   2> 311575 INFO  (OverseerThreadFactory-1710-thread-1-processing-n:127.0.0.1:41090_solr) [n:127.0.0.1:41090_solr    ] o.a.s.c.OverseerCollectionMessageHandler Creating core testschemaapi_shard1_replica2 as part of shard shard1 of collection testschemaapi on 127.0.0.1:41090_solr
   [junit4]   2> 311576 INFO  (OverseerThreadFactory-1710-thread-1-processing-n:127.0.0.1:41090_solr) [n:127.0.0.1:41090_solr    ] o.a.s.c.OverseerCollectionMessageHandler Creating core testschemaapi_shard1_replica1 as part of shard shard1 of collection testschemaapi on 127.0.0.1:37334_solr
   [junit4]   2> 311583 INFO  (qtp8275891-3184) [n:127.0.0.1:41090_solr    ] o.a.s.h.a.CoreAdminOperation core create command qt=/admin/cores&collection.configName=conf1&name=testschemaapi_shard1_replica2&action=CREATE&numShards=1&collection=testschemaapi&shard=shard1&wt=javabin&version=2
   [junit4]   2> 311584 INFO  (qtp8275891-3184) [n:127.0.0.1:41090_solr    ] o.a.s.c.CoreDescriptor Created CoreDescriptor: {name=testschemaapi_shard1_replica2, collection.configName=conf1, config=solrconfig.xml, transient=false, schema=schema.xml, loadOnStartup=true, configSetProperties=configsetprops.json, collection=testschemaapi, numShards=1, dataDir=data/, shard=shard1}
   [junit4]   2> 311584 INFO  (qtp8275891-3184) [n:127.0.0.1:41090_solr c:testschemaapi s:shard1  x:testschemaapi_shard1_replica2] o.a.s.c.ZkController publishing state=down
   [junit4]   2> 311586 INFO  (qtp8275891-3184) [n:127.0.0.1:41090_solr c:testschemaapi s:shard1  x:testschemaapi_shard1_replica2] o.a.s.c.ZkController Registering watch for collection testschemaapi
   [junit4]   2> 311586 INFO  (OverseerStateUpdate-96165918226513925-127.0.0.1:41090_solr-n_0000000000) [n:127.0.0.1:41090_solr    ] o.a.s.c.Overseer processMessage: queueSize: 1, message = {
   [junit4]   2>   "core":"testschemaapi_shard1_replica2",
   [junit4]   2>   "roles":null,
   [junit4]   2>   "base_url":"https://127.0.0.1:41090/solr",
   [junit4]   2>   "node_name":"127.0.0.1:41090_solr",
   [junit4]   2>   "numShards":"1",
   [junit4]   2>   "state":"down",
   [junit4]   2>   "shard":"shard1",
   [junit4]   2>   "collection":"testschemaapi",
   [junit4]   2>   "operation":"state"} current state version: 0
   [junit4]   2> 311586 INFO  (OverseerStateUpdate-96165918226513925-127.0.0.1:41090_solr-n_0000000000) [n:127.0.0.1:41090_solr    ] o.a.s.c.o.ReplicaMutator Update state numShards=1 message={
   [junit4]   2>   "core":"testschemaapi_shard1_replica2",
   [junit4]   2>   "roles":null,
   [junit4]   2>   "base_url":"https://127.0.0.1:41090/solr",
   [junit4]   2>   "node_name":"127.0.0.1:41090_solr",
   [junit4]   2>   "numShards":"1",
   [junit4]   2>   "state":"down",
   [junit4]   2>   "shard":"shard1",
   [junit4]   2>   "collection":"testschemaapi",
   [junit4]   2>   "operation":"state"}
   [junit4]   2> 311586 INFO  (qtp8275891-3184) [n:127.0.0.1:41090_solr c:testschemaapi s:shard1  x:testschemaapi_shard1_replica2] o.a.s.c.c.ZkStateReader Add data for [testschemaapi] ver [0]
   [junit4]   2> 311587 INFO  (qtp8275891-3184) [n:127.0.0.1:41090_solr c:testschemaapi s:shard1  x:testschemaapi_shard1_replica2] o.a.s.c.ZkController look for our core node name
   [junit4]   2> 311660 INFO  (qtp27141515-3171) [n:127.0.0.1:37334_solr    ] o.a.s.h.a.CoreAdminOperation core create command qt=/admin/cores&collection.configName=conf1&name=testschemaapi_shard1_replica1&action=CREATE&numShards=1&collection=testschemaapi&shard=shard1&wt=javabin&version=2
   [junit4]   2> 311660 INFO  (qtp27141515-3171) [n:127.0.0.1:37334_solr    ] o.a.s.c.CoreDescriptor Created CoreDescriptor: {name=testschemaapi_shard1_replica1, collection.configName=conf1, config=solrconfig.xml, transient=false, schema=schema.xml, loadOnStartup=true, configSetProperties=configsetprops.json, collection=testschemaapi, numShards=1, dataDir=data/, shard=shard1}
   [junit4]   2> 311661 INFO  (qtp27141515-3171) [n:127.0.0.1:37334_solr c:testschemaapi s:shard1  x:testschemaapi_shard1_replica1] o.a.s.c.ZkController publishing state=down
   [junit4]   2> 311661 INFO  (qtp27141515-3171) [n:127.0.0.1:37334_solr c:testschemaapi s:shard1  x:testschemaapi_shard1_replica1] o.a.s.c.ZkController Registering watch for collection testschemaapi
   [junit4]   2> 311662 INFO  (OverseerStateUpdate-96165918226513925-127.0.0.1:41090_solr-n_0000000000) [n:127.0.0.1:41090_solr    ] o.a.s.c.Overseer processMessage: queueSize: 1, message = {
   [junit4]   2>   "core":"testschemaapi_shard1_replica1",
   [junit4]   2>   "roles":null,
   [junit4]   2>   "base_url":"https://127.0.0.1:37334/solr",
   [junit4]   2>   "node_name":"127.0.0.1:37334_solr",
   [junit4]   2>   "numShards":"1",
   [junit4]   2>   "state":"down",
   [junit4]   2>   "shard":"shard1",
   [junit4]   2>   "collection":"testschemaapi",
   [junit4]   2>   "operation":"state"} current state version: 0
   [junit4]   2> 311662 INFO  (qtp27141515-3171) [n:127.0.0.1:37334_solr c:testschemaapi s:shard1  x:testschemaapi_shard1_replica1] o.a.s.c.c.ZkStateReader Add data for [testschemaapi] ver [0]
   [junit4]   2> 311662 INFO  (OverseerStateUpdate-96165918226513925-127.0.0.1:41090_solr-n_0000000000) [n:127.0.0.1:41090_solr    ] o.a.s.c.o.ReplicaMutator Update state numShards=1 message={
   [junit4]   2>   "core":"testschemaapi_shard1_replica1",
   [junit4]   2>   "roles":null,
   [junit4]   2>   "base_url":"https://127.0.0.1:37334/solr",
   [junit4]   2>   "node_name":"127.0.0.1:37334_solr",
   [junit4]   2>   "numShards":"1",
   [junit4]   2>   "state":"down",
   [junit4]   2>   "shard":"shard1",
   [junit4]   2>   "collection":"testschemaapi",
   [junit4]   2>   "operation":"state"}
   [junit4]   2> 311662 INFO  (qtp27141515-3171) [n:127.0.0.1:37334_solr c:testschemaapi s:shard1  x:testschemaapi_shard1_replica1] o.a.s.c.ZkController look for our core node name
   [junit4]   2> 311763 INFO  (OverseerStateUpdate-96165918226513925-127.0.0.1:41090_solr-n_0000000000) [n:127.0.0.1:41090_solr    ] o.a.s.c.o.ZkStateWriter going to update_collection /collections/testschemaapi/state.json version: 0
   [junit4]   2> 311763 INFO  (zkCallback-521-thread-1-processing-n:127.0.0.1:41090_solr) [n:127.0.0.1:41090_solr    ] o.a.s.c.c.ZkStateReader A cluster state change: [WatchedEvent state:SyncConnected type:NodeDataChanged path:/collections/testschemaapi/state.json] for collection [testschemaapi] has occurred - updating... (live nodes size: [2])
   [junit4]   2> 311763 INFO  (zkCallback-522-thread-1-processing-n:127.0.0.1:37334_solr) [n:127.0.0.1:37334_solr    ] o.a.s.c.c.ZkStateReader A cluster state change: [WatchedEvent state:SyncConnected type:NodeDataChanged path:/collections/testschemaapi/state.json] for collection [testschemaapi] has occurred - updating... (live nodes size: [2])
   [junit4]   2> 311763 INFO  (zkCallback-521-thread-1-processing-n:127.0.0.1:41090_solr) [n:127.0.0.1:41090_solr    ] o.a.s.c.c.ZkStateReader Updating data for [testschemaapi] from [0] to [1]
   [junit4]   2> 311764 INFO  (zkCallback-522-thread-1-processing-n:127.0.0.1:37334_solr) [n:127.0.0.1:37334_solr    ] o.a.s.c.c.ZkStateReader Updating data for [testschemaapi] from [0] to [1]
   [junit4]   2> 312587 INFO  (qtp8275891-3184) [n:127.0.0.1:41090_solr c:testschemaapi s:shard1  x:testschemaapi_shard1_replica2] o.a.s.c.ZkController waiting to find shard id in clusterstate for testschemaapi_shard1_replica2
   [junit4]   2> 312587 INFO  (qtp8275891-3184) [n:127.0.0.1:41090_solr c:testschemaapi s:shard1  x:testschemaapi_shard1_replica2] o.a.s.c.ZkController Check for collection zkNode:testschemaapi
   [junit4]   2> 312587 INFO  (qtp8275891-3184) [n:127.0.0.1:41090_solr c:testschemaapi s:shard1  x:testschemaapi_shard1_replica2] o.a.s.c.ZkController Collection zkNode exists
   [junit4]   2> 312587 INFO  (qtp8275891-3184) [n:127.0.0.1:41090_solr c:testschemaapi s:shard1  x:testschemaapi_shard1_replica2] o.a.s.c.c.ZkStateReader Load collection config from: [/collections/testschemaapi]
   [junit4]   2> 312587 INFO  (qtp8275891-3184) [n:127.0.0.1:41090_solr c:testschemaapi s:shard1  x:testschemaapi_shard1_replica2] o.a.s.c.c.ZkStateReader path=[/collections/testschemaapi] [configName]=[conf1] specified config exists in ZooKeeper
   [junit4]   2> 312587 INFO  (qtp8275891-3184) [n:127.0.0.1:41090_solr c:testschemaapi s:shard1  x:testschemaapi_shard1_replica2] o.a.s.c.SolrResourceLoader new SolrResourceLoader for directory: '/home/jenkins/workspace/Lucene-Solr-6.x-Linux/solr/build/solr-core/test/J0/temp/solr.schema.TestManagedSchemaAPI_BE2D9CD8CF356EA6-001/tempDir-001/node1/testschemaapi_shard1_replica2'
   [junit4]   2> 312588 INFO  (qtp8275891-3184) [n:127.0.0.1:41090_solr c:testschemaapi s:shard1  x:testschemaapi_shard1_replica2] o.a.s.c.SolrResourceLoader JNDI not configured for solr (NoInitialContextEx)
   [junit4]   2> 312588 INFO  (qtp8275891-3184) [n:127.0.0.1:41090_solr c:testschemaapi s:shard1  x:testschemaapi_shard1_replica2] o.a.s.c.SolrResourceLoader solr home defaulted to 'solr/' (could not find system property or JNDI)
   [junit4]   2> 312588 INFO  (qtp8275891-3184) [n:127.0.0.1:41090_solr c:testschemaapi s:shard1  x:testschemaapi_shard1_replica2] o.a.s.c.Config loaded config solrconfig.xml with version 0 
   [junit4]   2> 312591 INFO  (qtp8275891-3184) [n:127.0.0.1:41090_solr c:testschemaapi s:shard1  x:testschemaapi_shard1_replica2] o.a.s.c.SolrConfig current version of requestparams : -1
   [junit4]   2> 312592 INFO  (qtp8275891-3184) [n:127.0.0.1:41090_solr c:testschemaapi s:shard1  x:testschemaapi_shard1_replica2] o.a.s.c.SolrConfig Using Lucene MatchVersion: 6.2.0
   [junit4]   2> 312596 INFO  (qtp8275891-3184) [n:127.0.0.1:41090_solr c:testschemaapi s:shard1  x:testschemaapi_shard1_replica2] o.a.s.c.SolrConfig Loaded SolrConfig: solrconfig.xml
   [junit4]   2> 312599 INFO  (qtp8275891-3184) [n:127.0.0.1:41090_solr c:testschemaapi s:shard1  x:testschemaapi_shard1_replica2] o.a.s.s.IndexSchema [testschemaapi_shard1_replica2] Schema name=minimal
   [junit4]   2> 312602 INFO  (qtp8275891-3184) [n:127.0.0.1:41090_solr c:testschemaapi s:shard1  x:testschemaapi_shard1_replica2] o.a.s.s.IndexSchema unique key field: id
   [junit4]   2> 312604 INFO  (qtp8275891-3184) [n:127.0.0.1:41090_solr c:testschemaapi s:shard1  x:testschemaapi_shard1_replica2] o.a.s.c.ConfigSetProperties Did not find ConfigSet properties, assuming default properties: Can't find resource 'configsetprops.json' in classpath or '/configs/conf1', cwd=/home/jenkins/workspace/Lucene-Solr-6.x-Linux/solr/build/solr-core/test/J0
   [junit4]   2> 312604 INFO  (qtp8275891-3184) [n:127.0.0.1:41090_solr c:testschemaapi s:shard1  x:testschemaapi_shard1_replica2] o.a.s.c.CoreContainer Creating SolrCore 'testschemaapi_shard1_replica2' using configuration from collection testschemaapi
   [junit4]   2> 312604 INFO  (qtp8275891-3184) [n:127.0.0.1:41090_solr c:testschemaapi s:shard1 r:core_node1 x:testschemaapi_shard1_replica2] o.a.s.c.SolrCore org.apache.solr.core.MockDirectoryFactory
   [junit4]   2> 312604 INFO  (qtp8275891-3184) [n:127.0.0.1:41090_solr c:testschemaapi s:shard1 r:core_node1 x:testschemaapi_shard1_replica2] o.a.s.c.SolrCore [[testschemaapi_shard1_replica2] ] Opening new SolrCore at [/home/jenkins/workspace/Lucene-Solr-6.x-Linux/solr/build/solr-core/test/J0/temp/solr.schema.TestManagedSchemaAPI_BE2D9CD8CF356EA6-001/tempDir-001/node1/testschemaapi_shard1_replica2], dataDir=[/home/jenkins/workspace/Lucene-Solr-6.x-Linux/solr/build/solr-core/test/J0/temp/solr.schema.TestManagedSchemaAPI_BE2D9CD8CF356EA6-001/tempDir-001/node1/./testschemaapi_shard1_replica2/data/]
   [junit4]   2> 312604 INFO  (qtp8275891-3184) [n:127.0.0.1:41090_solr c:testschemaapi s:shard1 r:core_node1 x:testschemaapi_shard1_replica2] o.a.s.c.SolrCore JMX monitoring not detected for core: testschemaapi_shard1_replica2
   [junit4]   2> 312606 INFO  (qtp8275891-3184) [n:127.0.0.1:41090_solr c:testschemaapi s:shard1 r:core_node1 x:testschemaapi_shard1_replica2] o.a.s.c.CachingDirectoryFactory return new directory for /home/jenkins/workspace/Lucene-Solr-6.x-Linux/solr/build/solr-core/test/J0/temp/solr.schema.TestManagedSchemaAPI_BE2D9CD8CF356EA6-001/tempDir-001/node1/./testschemaapi_shard1_replica2/data
   [junit4]   2> 312606 INFO  (qtp8275891-3184) [n:127.0.0.1:41090_solr c:testschemaapi s:shard1 r:core_node1 x:testschemaapi_shard1_replica2] o.a.s.c.SolrCore New index directory detected: old=null new=/home/jenkins/workspace/Lucene-Solr-6.x-Linux/solr/build/solr-core/test/J0/temp/solr.schema.TestManagedSchemaAPI_BE2D9CD8CF356EA6-001/tempDir-001/node1/./testschemaapi_shard1_replica2/data/index/
   [junit4]   2> 312606 WARN  (qtp8275891-3184) [n:127.0.0.1:41090_solr c:testschemaapi s:shard1 r:core_node1 x:testschemaapi_shard1_replica2] o.a.s.c.SolrCore [testschemaapi_shard1_replica2] Solr index directory '/home/jenkins/workspace/Lucene-Solr-6.x-Linux/solr/build/solr-core/test/J0/temp/solr.schema.TestManagedSchemaAPI_BE2D9CD8CF356EA6-001/tempDir-001/node1/./testschemaapi_shard1_replica2/data/index' doesn't exist. Creating new index...
   [junit4]   2> 312607 INFO  (qtp8275891-3184) [n:127.0.0.1:41090_solr c:testschemaapi s:shard1 r:core_node1 x:testschemaapi_shard1_replica2] o.a.s.c.CachingDirectoryFactory return new directory for /home/jenkins/workspace/Lucene-Solr-6.x-Linux/solr/build/solr-core/test/J0/temp/solr.schema.TestManagedSchemaAPI_BE2D9CD8CF356EA6-001/tempDir-001/node1/./testschemaapi_shard1_replica2/data/index
   [junit4]   2> 312607 INFO  (qtp8275891-3184) [n:127.0.0.1:41090_solr c:testschemaapi s:shard1 r:core_node1 x:testschemaapi_shard1_replica2] o.a.s.c.SolrDeletionPolicy SolrDeletionPolicy.onCommit: commits: num=1
   [junit4]   2> 	commit{dir=MockDirectoryWrapper(RAMDirectory@fce607 lockFactory=org.apache.lucene.store.SingleInstanceLockFactory@ad26e5),segFN=segments_1,generation=1}
   [junit4]   2> 312607 INFO  (qtp8275891-3184) [n:127.0.0.1:41090_solr c:testschemaapi s:shard1 r:core_node1 x:testschemaapi_shard1_replica2] o.a.s.c.SolrDeletionPolicy newest commit generation = 1
   [junit4]   2> 312608 INFO  (OldIndexDirectoryCleanupThreadForCore-testschemaapi_shard1_replica2) [n:127.0.0.1:41090_solr c:testschemaapi s:shard1 r:core_node1 x:testschemaapi_shard1_replica2] o.a.s.c.SolrCore Looking for old index directories to cleanup for core testschemaapi_shard1_replica2 in /home/jenkins/workspace/Lucene-Solr-6.x-Linux/solr/build/solr-core/test/J0/temp/solr.schema.TestManagedSchemaAPI_BE2D9CD8CF356EA6-001/tempDir-001/node1/./testschemaapi_shard1_replica2/data/
   [junit4]   2> 312608 WARN  (OldIndexDirectoryCleanupThreadForCore-testschemaapi_shard1_replica2) [n:127.0.0.1:41090_solr c:testschemaapi s:shard1 r:core_node1 x:testschemaapi_shard1_replica2] o.a.s.c.DirectoryFactory /home/jenkins/workspace/Lucene-Solr-6.x-Linux/solr/build/solr-core/test/J0/temp/solr.schema.TestManagedSchemaAPI_BE2D9CD8CF356EA6-001/tempDir-001/node1/./testschemaapi_shard1_replica2/data/ does not point to a valid data directory; skipping clean-up of old index directories.
   [junit4]   2> 312609 INFO  (qtp8275891-3184) [n:127.0.0.1:41090_solr c:testschemaapi s:shard1 r:core_node1 x:testschemaapi_shard1_replica2] o.a.s.c.SolrCore no updateRequestProcessorChain defined as default, creating implicit default
   [junit4]   2> 312611 INFO  (qtp8275891-3184) [n:127.0.0.1:41090_solr c:testschemaapi s:shard1 r:core_node1 x:testschemaapi_shard1_replica2] o.a.s.h.l.XMLLoader xsltCacheLifetimeSeconds=60
   [junit4]   2> 312611 INFO  (qtp8275891-3184) [n:127.0.0.1:41090_solr c:testschemaapi s:shard1 r:core_node1 x:testschemaapi_shard1_replica2] o.a.s.h.l.XMLLoader xsltCacheLifetimeSeconds=60
   [junit4]   2> 312612 INFO  (qtp8275891-3184) [n:127.0.0.1:41090_solr c:testschemaapi s:shard1 r:core_node1 x:testschemaapi_shard1_replica2] o.a.s.h.l.XMLLoader xsltCacheLifetimeSeconds=60
   [junit4]   2> 312613 INFO  (qtp8275891-3184) [n:127.0.0.1:41090_solr c:testschemaapi s:shard1 r:core_node1 x:testschemaapi_shard1_replica2] o.a.s.h.l.XMLLoader xsltCacheLifetimeSeconds=60
   [junit4]   2> 312614 INFO  (qtp8275891-3184) [n:127.0.0.1:41090_solr c:testschemaapi s:shard1 r:core_node1 x:testschemaapi_shard1_replica2] o.a.s.c.RequestHandlers Registered paths: /admin/mbeans,/update/csv,/sql,/update/json/docs,/admin/luke,/graph,/export,/select,/admin/segments,/get,/admin/system,/replication,/admin/properties,/config,/stream,/schema,/admin/plugins,/admin/logging,/update/json,/admin/ping,/admin/threads,/update,/admin/file
   [junit4]   2> 312614 INFO  (qtp8275891-3184) [n:127.0.0.1:41090_solr c:testschemaapi s:shard1 r:core_node1 x:testschemaapi_shard1_replica2] o.a.s.c.SolrCore Using default statsCache cache: org.apache.solr.search.stats.LocalStatsCache
   [junit4]   2> 312614 INFO  (qtp8275891-3184) [n:127.0.0.1:41090_solr c:testschemaapi s:shard1 r:core_node1 x:testschemaapi_shard1_replica2] o.a.s.u.UpdateHandler Using UpdateLog implementation: org.apache.solr.update.UpdateLog
   [junit4]   2> 312614 INFO  (qtp8275891-3184) [n:127.0.0.1:41090_solr c:testschemaapi s:shard1 r:core_node1 x:testschemaapi_shard1_replica2] o.a.s.u.UpdateLog Initializing UpdateLog: dataDir=null defaultSyncLevel=FLUSH numRecordsToKeep=100 maxNumLogsToKeep=10 numVersionBuckets=65536
   [junit4]   2> 312615 INFO  (qtp8275891-3184) [n:127.0.0.1:41090_solr c:testschemaapi s:shard1 r:core_node1 x:testschemaapi_shard1_replica2] o.a.s.u.CommitTracker Hard AutoCommit: disabled
   [junit4]   2> 312615 INFO  (qtp8275891-3184) [n:127.0.0.1:41090_solr c:testschemaapi s:shard1 r:core_node1 x:testschemaapi_shard1_replica2] o.a.s.u.CommitTracker Soft AutoCommit: disabled
   [junit4]   2> 312616 INFO  (qtp8275891-3184) [n:127.0.0.1:41090_solr c:testschemaapi s:shard1 r:core_node1 x:testschemaapi_shard1_replica2] o.a.s.c.SolrDeletionPolicy SolrDeletionPolicy.onInit: commits: num=1
   [junit4]   2> 	commit{dir=MockDirectoryWrapper(RAMDirectory@fce607 lockFactory=org.apache.lucene.store.SingleInstanceLockFactory@ad26e5),segFN=segments_1,generation=1}
   [junit4]   2> 312616 INFO  (qtp8275891-3184) [n:127.0.0.1:41090_solr c:testschemaapi s:shard1 r:core_node1 x:testschemaapi_shard1_replica2] o.a.s.c.SolrDeletionPolicy newest commit generation = 1
   [junit4]   2> 312616 INFO  (qtp8275891-3184) [n:127.0.0.1:41090_solr c:testschemaapi s:shard1 r:core_node1 x:testschemaapi_shard1_replica2] o.a.s.s.SolrIndexSearcher Opening [Searcher@1440129[testschemaapi_shard1_replica2] main]
   [junit4]   2> 312616 INFO  (qtp8275891-3184) [n:127.0.0.1:41090_solr c:testschemaapi s:shard1 r:core_node1 x:testschemaapi_shard1_replica2] o.a.s.c.c.ZkStateReader Load collection config from: [/collections/testschemaapi]
   [junit4]   2> 312617 INFO  (qtp8275891-3184) [n:127.0.0.1:41090_solr c:testschemaapi s:shard1 r:core_node1 x:testschemaapi_shard1_replica2] o.a.s.c.c.ZkStateReader path=[/collections/testschemaapi] [configName]=[conf1] specified config exists in ZooKeeper
   [junit4]   2> 312618 INFO  (qtp8275891-3184) [n:127.0.0.1:41090_solr c:testschemaapi s:shard1 r:core_node1 x:testschemaapi_shard1_replica2] o.a.s.r.ManagedResourceStorage Setting up ZooKeeper-based storage for the RestManager with znodeBase: /configs/conf1
   [junit4]   2> 312618 INFO  (qtp8275891-3184) [n:127.0.0.1:41090_solr c:testschemaapi s:shard1 r:core_node1 x:testschemaapi_shard1_replica2] o.a.s.r.ManagedResourceStorage Configured ZooKeeperStorageIO with znodeBase: /configs/conf1
   [junit4]   2> 312618 INFO  (qtp8275891-3184) [n:127.0.0.1:41090_solr c:testschemaapi s:shard1 r:core_node1 x:testschemaapi_shard1_replica2] o.a.s.r.RestManager Initializing RestManager with initArgs: {}
   [junit4]   2> 312618 INFO  (qtp8275891-3184) [n:127.0.0.1:41090_solr c:testschemaapi s:shard1 r:core_node1 x:testschemaapi_shard1_replica2] o.a.s.r.ManagedResourceStorage Reading _rest_managed.json using ZooKeeperStorageIO:path=/configs/conf1
   [junit4]   2> 312618 INFO  (qtp8275891-3184) [n:127.0.0.1:41090_solr c:testschemaapi s:shard1 r:core_node1 x:testschemaapi_shard1_replica2] o.a.s.r.ManagedResourceStorage No data found for znode /configs/conf1/_rest_managed.json
   [junit4]   2> 312618 INFO  (qtp8275891-3184) [n:127.0.0.1:41090_solr c:testschemaapi s:shard1 r:core_node1 x:testschemaapi_shard1_replica2] o.a.s.r.ManagedResourceStorage Loaded null at path _rest_managed.json using ZooKeeperStorageIO:path=/configs/conf1
   [junit4]   2> 312618 INFO  (qtp8275891-3184) [n:127.0.0.1:41090_solr c:testschemaapi s:shard1 r:core_node1 x:testschemaapi_shard1_replica2] o.a.s.r.RestManager Initializing 0 registered ManagedResources
   [junit4]   2> 312621 INFO  (qtp8275891-3184) [n:127.0.0.1:41090_solr c:testschemaapi s:shard1 r:core_node1 x:testschemaapi_shard1_replica2] o.a.s.s.ZkIndexSchemaReader Creating ZooKeeper watch for the managed schema at /configs/conf1/managed-schema
   [junit4]   2> 312622 INFO  (qtp8275891-3184) [n:127.0.0.1:41090_solr c:testschemaapi s:shard1 r:core_node1 x:testschemaapi_shard1_replica2] o.a.s.c.ZkController Added new OnReconnect listener ZkIndexSchemaReader: /configs/conf1/managed-schema, uniqueCoreId: testschemaapi_shard1_replica2:1607204431127563
   [junit4]   2> 312622 INFO  (qtp8275891-3184) [n:127.0.0.1:41090_solr c:testschemaapi s:shard1 r:core_node1 x:testschemaapi_shard1_replica2] o.a.s.h.ReplicationHandler Commits will be reserved for  10000
   [junit4]   2> 312622 INFO  (searcherExecutor-1715-thread-1-processing-n:127.0.0.1:41090_solr x:testschemaapi_shard1_replica2 s:shard1 c:testschemaapi r:core_node1) [n:127.0.0.1:41090_solr c:testschemaapi s:shard1 r:core_node1 x:testschemaapi_shard1_replica2] o.a.s.c.SolrCore [testschemaapi_shard1_replica2] Registered new searcher Searcher@1440129[testschemaapi_shard1_replica2] main{ExitableDirectoryReader(UninvertingDirectoryReader())}
   [junit4]   2> 312622 INFO  (qtp8275891-3184) [n:127.0.0.1:41090_solr c:testschemaapi s:shard1 r:core_node1 x:testschemaapi_shard1_replica2] o.a.s.u.UpdateLog Looking up max value of version field to seed version buckets
   [junit4]   2> 312622 INFO  (qtp8275891-3184) [n:127.0.0.1:41090_solr c:testschemaapi s:shard1 r:core_node1 x:testschemaapi_shard1_replica2] o.a.s.u.VersionInfo Refreshing highest value of _version_ for 65536 version buckets from index
   [junit4]   2> 312622 INFO  (qtp8275891-3184) [n:127.0.0.1:41090_solr c:testschemaapi s:shard1 r:core_node1 x:testschemaapi_shard1_replica2] o.a.s.u.VersionInfo No terms found for _version_, cannot seed version bucket highest value from index
   [junit4]   2> 312622 INFO  (qtp8275891-3184) [n:127.0.0.1:41090_solr c:testschemaapi s:shard1 r:core_node1 x:testschemaapi_shard1_replica2] o.a.s.u.UpdateLog Could not find max version in index or recent updates, using new clock 1538654693135220736
   [junit4]   2> 312624 INFO  (qtp8275891-3184) [n:127.0.0.1:41090_solr c:testschemaapi s:shard1 r:core_node1 x:testschemaapi_shard1_replica2] o.a.s.u.UpdateLog Took 2.0ms to seed version buckets with highest version 1538654693135220736
   [junit4]   2> 312624 INFO  (qtp8275891-3184) [n:127.0.0.1:41090_solr c:testschemaapi s:shard1 r:core_node1 x:testschemaapi_shard1_replica2] o.a.s.c.ZkController watch zkdir /configs/conf1
   [junit4]   2> 312625 INFO  (qtp8275891-3184) [n:127.0.0.1:41090_solr c:testschemaapi s:shard1 r:core_node1 x:testschemaapi_shard1_replica2] o.a.s.c.CoreContainer registering core: testschemaapi_shard1_replica2
   [junit4]   2> 312625 INFO  (qtp8275891-3184) [n:127.0.0.1:41090_solr c:testschemaapi s:shard1 r:core_node1 x:testschemaapi_shard1_replica2] o.a.s.c.ZkController Register replica - core:testschemaapi_shard1_replica2 address:https://127.0.0.1:41090/solr collection:testschemaapi shard:shard1
   [junit4]   2> 312625 INFO  (qtp8275891-3184) [n:127.0.0.1:41090_solr c:testschemaapi s:shard1 r:core_node1 x:testschemaapi_shard1_replica2] o.a.s.c.c.SolrZkClient makePath: /collections/testschemaapi/leader_elect/shard1/election
   [junit4]   2> 312627 INFO  (qtp8275891-3184) [n:127.0.0.1:41090_solr c:testschemaapi s:shard1 r:core_node1 x:testschemaapi_shard1_replica2] o.a.s.c.LeaderElector Joined leadership election with path: /collections/testschemaapi/leader_elect/shard1/election/96165918226513925-core_node1-n_0000000000
   [junit4]   2> 312627 INFO  (qtp8275891-3184) [n:127.0.0.1:41090_solr c:testschemaapi s:shard1 r:core_node1 x:testschemaapi_shard1_replica2] o.a.s.c.ShardLeaderElectionContext Running the leader process for shard=shard1 and weAreReplacement=false and leaderVoteWait=10000
   [junit4]   2> 312627 INFO  (qtp8275891-3184) [n:127.0.0.1:41090_solr c:testschemaapi s:shard1 r:core_node1 x:testschemaapi_shard1_replica2] o.a.s.c.ShardLeaderElectionContext Waiting until we see more replicas up for shard shard1: total=2 found=1 timeoutin=9999ms
   [junit4]   2> 312627 INFO  (OverseerStateUpdate-96165918226513925-127.0.0.1:41090_solr-n_0000000000) [n:127.0.0.1:41090_solr    ] o.a.s.c.Overseer processMessage: queueSize: 1, message = {
   [junit4]   2>   "operation":"leader",
   [junit4]   2>   "shard":"shard1",
   [junit4]   2>   "collection":"testschemaapi"} current state version: 0
   [junit4]   2> 312662 INFO  (qtp27141515-3171) [n:127.0.0.1:37334_solr c:testschemaapi s:shard1  x:testschemaapi_shard1_replica1] o.a.s.c.ZkController waiting to find shard id in clusterstate for testschemaapi_shard1_replica1
   [junit4]   2> 312662 INFO  (qtp27141515-3171) [n:127.0.0.1:37334_solr c:testschemaapi s:shard1  x:testschemaapi_shard1_replica1] o.a.s.c.ZkController Check for collection zkNode:testschemaapi
   [junit4]   2> 312662 INFO  (qtp27141515-3171) [n:127.0.0.1:37334_solr c:testschemaapi s:shard1  x:testschemaapi_shard1_replica1] o.a.s.c.ZkController Collection zkNode exists
   [junit4]   2> 312662 INFO  (qtp27141515-3171) [n:127.0.0.1:37334_solr c:testschemaapi s:shard1  x:testschemaapi_shard1_replica1] o.a.s.c.c.ZkStateReader Load collection config from: [/collections/testschemaapi]
   [junit4]   2> 312663 INFO  (qtp27141515-3171) [n:127.0.0.1:37334_solr c:testschemaapi s:shard1  x:testschemaapi_shard1_replica1] o.a.s.c.c.ZkStateReader path=[/collections/testschemaapi] [configName]=[conf1] specified config exists in ZooKeeper
   [junit4]   2> 312663 INFO  (qtp27141515-3171) [n:127.0.0.1:37334_solr c:testschemaapi s:shard1  x:testschemaapi_shard1_replica1] o.a.s.c.SolrResourceLoader new SolrResourceLoader for directory: '/home/jenkins/workspace/Lucene-Solr-6.x-Linux/solr/build/solr-core/test/J0/temp/solr.schema.TestManagedSchemaAPI_BE2D9CD8CF356EA6-001/tempDir-001/node2/testschemaapi_shard1_replica1'
   [junit4]   2> 312663 INFO  (qtp27141515-3171) [n:127.0.0.1:37334_solr c:testschemaapi s:shard1  x:testschemaapi_shard1_replica1] o.a.s.c.SolrResourceLoader JNDI not configured for solr (NoInitialContextEx)
   [junit4]   2> 312663 INFO  (qtp27141515-3171) [n:127.0.0.1:37334_solr c:testschemaapi s:shard1  x:testschemaapi_shard1_replica1] o.a.s.c.SolrResourceLoader solr home defaulted to 'solr/' (could not find system property or JNDI)
   [junit4]   2> 312664 INFO  (qtp27141515-3171) [n:127.0.0.1:37334_solr c:testschemaapi s:shard1  x:testschemaapi_shard1_replica1] o.a.s.c.Config loaded config solrconfig.xml with version 0 
   [junit4]   2> 312666 INFO  (qtp27141515-3171) [n:127.0.0.1:37334_solr c:testschemaapi s:shard1  x:testschemaapi_shard1_replica1] o.a.s.c.SolrConfig current version of requestparams : -1
   [junit4]   2> 312668 INFO  (qtp27141515-3171) [n:127.0.0.1:37334_solr c:testschemaapi s:shard1  x:testschemaapi_shard1_replica1] o.a.s.c.SolrConfig Using Lucene MatchVersion: 6.2.0
   [junit4]   2> 312671 INFO  (qtp27141515-3171) [n:127.0.0.1:37334_solr c:testschemaapi s:shard1  x:testschemaapi_shard1_replica1] o.a.s.c.SolrConfig Loaded SolrConfig: solrconfig.xml
   [junit4]   2> 312675 INFO  (qtp27141515-3171) [n:127.0.0.1:37334_solr c:testschemaapi s:shard1  x:testschemaapi_shard1_replica1] o.a.s.s.IndexSchema [testschemaapi_shard1_replica1] Schema name=minimal
   [junit4]   2> 312676 INFO  (qtp27141515-3171) [n:127.0.0.1:37334_solr c:testschemaapi s:shard1  x:testschemaapi_shard1_replica1] o.a.s.s.IndexSchema unique key field: id
   [junit4]   2> 312678 INFO  (qtp27141515-3171) [n:127.0.0.1:37334_solr c:testschemaapi s:shard1  x:testschemaapi_shard1_replica1] o.a.s.c.ConfigSetProperties Did not find ConfigSet properties, assuming default properties: Can't find resource 'configsetprops.json' in classpath or '/configs/conf1', cwd=/home/jenkins/workspace/Lucene-Solr-6.x-Linux/solr/build/solr-core/test/J0
   [junit4]   2> 312678 INFO  (qtp27141515-3171) [n:127.0.0.1:37334_solr c:testschemaapi s:shard1  x:testschemaapi_shard1_replica1] o.a.s.c.CoreContainer Creating SolrCore 'testschemaapi_shard1_replica1' using configuration from collection testschemaapi
   [junit4]   2> 312678 INFO  (qtp27141515-3171) [n:127.0.0.1:37334_solr c:testschemaapi s:shard1 r:core_node2 x:testschemaapi_shard1_replica1] o.a.s.c.SolrCore org.apache.solr.core.MockDirectoryFactory
   [junit4]   2> 312678 INFO  (qtp27141515-3171) [n:127.0.0.1:37334_solr c:testschemaapi s:shard1 r:core_node2 x:testschemaapi_shard1_replica1] o.a.s.c.SolrCore [[testschemaapi_shard1_replica1] ] Opening new SolrCore at [/home/jenkins/workspace/Lucene-Solr-6.x-Linux/solr/build/solr-core/test/J0/temp/solr.schema.TestManagedSchemaAPI_BE2D9CD8CF356EA6-001/tempDir-001/node2/testschemaapi_shard1_replica1], dataDir=[/home/jenkins/workspace/Lucene-Solr-6.x-Linux/solr/build/solr-core/test/J0/temp/solr.schema.TestManagedSchemaAPI_BE2D9CD8CF356EA6-001/tempDir-001/node2/./testschemaapi_shard1_replica1/data/]
   [junit4]   2> 312678 INFO  (qtp27141515-3171) [n:127.0.0.1:37334_solr c:testschemaapi s:shard1 r:core_node2 x:testschemaapi_shard1_replica1] o.a.s.c.SolrCore JMX monitoring not detected for core: testschemaapi_shard1_replica1
   [junit4]   2> 312679 INFO  (qtp27141515-3171) [n:127.0.0.1:37334_solr c:testschemaapi s:shard1 r:core_node2 x:testschemaapi_shard1_replica1] o.a.s.c.CachingDirectoryFactory return new directory for /home/jenkins/workspace/Lucene-Solr-6.x-Linux/solr/build/solr-core/test/J0/temp/solr.schema.TestManagedSchemaAPI_BE2D9CD8CF356EA6-001/tempDir-001/node2/./testschemaapi_shard1_replica1/data
   [junit4]   2> 312679 INFO  (qtp27141515-3171) [n:127.0.0.1:37334_solr c:testschemaapi s:shard1 r:core_node2 x:testschemaapi_shard1_replica1] o.a.s.c.SolrCore New index directory detected: old=null new=/home/jenkins/workspace/Lucene-Solr-6.x-Linux/solr/build/solr-core/test/J0/temp/solr.schema.TestManagedSchemaAPI_BE2D9CD8CF356EA6-001/tempDir-001/node2/./testschemaapi_shard1_replica1/data/index/
   [junit4]   2> 312679 WARN  (qtp27141515-3171) [n:127.0.0.1:37334_solr c:testschemaapi s:shard1 r:core_node2 x:testschemaapi_shard1_replica1] o.a.s.c.SolrCore [testschemaapi_shard1_replica1] Solr index directory '/home/jenkins/workspace/Lucene-Solr-6.x-Linux/solr/build/solr-core/test/J0/temp/solr.schema.TestManagedSchemaAPI_BE2D9CD8CF356EA6-001/tempDir-001/node2/./testschemaapi_shard1_replica1/data/index' doesn't exist. Creating new index...
   [junit4]   2> 312679 INFO  (qtp27141515-3171) [n:127.0.0.1:37334_solr c:testschemaapi s:shard1 r:core_node2 x:testschemaapi_shard1_replica1] o.a.s.c.CachingDirectoryFactory return new directory for /home/jenkins/workspace/Lucene-Solr-6.x-Linux/solr/build/solr-core/test/J0/temp/solr.schema.TestManagedSchemaAPI_BE2D9CD8CF356EA6-001/tempDir-001/node2/./testschemaapi_shard1_replica1/data/index
   [junit4]   2> 312680 INFO  (qtp27141515-3171) [n:127.0.0.1:37334_solr c:testschemaapi s:shard1 r:core_node2 x:testschemaapi_shard1_replica1] o.a.s.c.SolrDeletionPolicy SolrDeletionPolicy.onCommit: commits: num=1
   [junit4]   2> 	commit{dir=MockDirectoryWrapper(RAMDirectory@1c6415d lockFactory=org.apache.lucene.store.SingleInstanceLockFactory@42f697),segFN=segments_1,generation=1}
   [junit4]   2> 312680 INFO  (qtp27141515-3171) [n:127.0.0.1:37334_solr c:testschemaapi s:shard1 r:core_node2 x:testschemaapi_shard1_replica1] o.a.s.c.SolrDeletionPolicy newest commit generation = 1
   [junit4]   2> 312680 INFO  (OldIndexDirectoryCleanupThreadForCore-testschemaapi_shard1_replica1) [n:127.0.0.1:37334_solr c:testschemaapi s:shard1 r:core_node2 x:testschemaapi_shard1_replica1] o.a.s.c.SolrCore Looking for old index directories to cleanup for core testschemaapi_shard1_replica1 in /home/jenkins/workspace/Lucene-Solr-6.x-Linux/solr/build/solr-core/test/J0/temp/solr.schema.TestManagedSchemaAPI_BE2D9CD8CF356EA6-001/tempDir-001/node2/./testschemaapi_shard1_replica1/data/
   [junit4]   2> 312680 WARN  (OldIndexDirectoryCleanupThreadForCore-testschemaapi_shard1_replica1) [n:127.0.0.1:37334_solr c:testschemaapi s:shard1 r:core_node2 x:testschemaapi_shard1_replica1] o.a.s.c.DirectoryFactory /home/jenkins/workspace/Lucene-Solr-6.x-Linux/solr/build/solr-core/test/J0/temp/solr.schema.TestManagedSchemaAPI_BE2D9CD8CF356EA6-001/tempDir-001/node2/./testschemaapi_shard1_replica1/data/ does not point to a valid data directory; skipping clean-up of old index directories.
   [junit4]   2> 312681 INFO  (qtp27141515-3171) [n:127.0.0.1:37334_solr c:testschemaapi s:shard1 r:core_node2 x:testschemaapi_shard1_replica1] o.a.s.c.SolrCore no updateRequestProcessorChain defined as default, creating implicit default
   [junit4]   2> 312682 INFO  (qtp27141515-3171) [n:127.0.0.1:37334_solr c:testschemaapi s:shard1 r:core_node2 x:testschemaapi_shard1_replica1] o.a.s.h.l.XMLLoader xsltCacheLifetimeSeconds=60
   [junit4]   2> 312682 INFO  (qtp27141515-3171) [n:127.0.0.1:37334_solr c:testschemaapi s:shard1 r:core_node2 x:testschemaapi_shard1_replica1] o.a.s.h.l.XMLLoader xsltCacheLifetimeSeconds=60
   [junit4]   2> 312683 INFO  (qtp27141515-3171) [n:127.0.0.1:37334_solr c:testschemaapi s:shard1 r:core_node2 x:testschemaapi_shard1_replica1] o.a.s.h.l.XMLLoader xsltCacheLifetimeSeconds=60
   [junit4]   2> 312683 INFO  (qtp27141515-3171) [n:127.0.0.1:37334_solr c:testschemaapi s:shard1 r:core_node2 x:testschemaapi_shard1_replica1] o.a.s.h.l.XMLLoader xsltCacheLifetimeSeconds=60
   [junit4]   2> 312684 INFO  (qtp27141515-3171) [n:127.0.0.1:37334_solr c:testschemaapi s:shard1 r:core_node2 x:testschemaapi_shard1_replica1] o.a.s.c.RequestHandlers Registered paths: /admin/mbeans,/update/csv,/sql,/update/json/docs,/admin/luke,/graph,/export,/select,/admin/segments,/get,/admin/system,/replication,/admin/properties,/config,/stream,/schema,/admin/plugins,/admin/logging,/update/json,/admin/ping,/admin/threads,/update,/admin/file
   [junit4]   2> 312684 INFO  (qtp27141515-3171) [n:127.0.0.1:37334_solr c:testschemaapi s:shard1 r:core_node2 x:testschemaapi_shard1_replica1] o.a.s.c.SolrCore Using default statsCache cache: org.apache.solr.search.stats.LocalStatsCache
   [junit4]   2> 312684 INFO  (qtp27141515-3171) [n:127.0.0.1:37334_solr c:testschemaapi s:shard1 r:core_node2 x:testschemaapi_shard1_replica1] o.a.s.u.UpdateHandler Using UpdateLog implementation: org.apache.solr.update.UpdateLog
   [junit4]   2> 312684 INFO  (qtp27141515-3171) [n:127.0.0.1:37334_solr c:testschemaapi s:shard1 r:core_node2 x:testschemaapi_shard1_replica1] o.a.s.u.UpdateLog Initializing UpdateLog: dataDir=null defaultSyncLevel=FLUSH numRecordsToKeep=100 maxNumLogsToKeep=10 numVersionBuckets=65536
   [junit4]   2> 312685 INFO  (qtp27141515-3171) [n:127.0.0.1:37334_solr c:testschemaapi s:shard1 r:core_node2 x:testschemaapi_shard1_replica1] o.a.s.u.CommitTracker Hard AutoCommit: disabled
   [junit4]   2> 312685 INFO  (qtp27141515-3171) [n:127.0.0.1:37334_solr c:testschemaapi s:shard1 r:core_node2 x:testschemaapi_shard1_replica1] o.a.s.u.CommitTracker Soft AutoCommit: disabled
   [junit4]   2> 312685 INFO  (qtp27141515-3171) [n:127.0.0.1:37334_solr c:testschemaapi s:shard1 r:core_node2 x:testschemaapi_shard1_replica1] o.a.s.c.SolrDeletionPolicy SolrDeletionPolicy.onInit: commits: num=1
   [junit4]   2> 	commit{dir=MockDirectoryWrapper(RAMDirectory@1c6415d lockFactory=org.apache.lucene.store.SingleInstanceLockFactory@42f697),segFN=segments_1,generation=1}
   [junit4]   2> 312685 INFO  (qtp27141515-3171) [n:127.0.0.1:37334_solr c:testschemaapi s:shard1 r:core_node2 x:testschemaapi_shard1_replica1] o.a.s.c.SolrDeletionPolicy newest commit generation = 1
   [junit4]   2> 312685 INFO  (qtp27141515-3171) [n:127.0.0.1:37334_solr c:testschemaapi s:shard1 r:core_node2 x:testschemaapi_shard1_replica1] o.a.s.s.SolrIndexSearcher Opening [Searcher@1fd2943[testschemaapi_shard1_replica1] main]
   [junit4]   2> 312686 INFO  (qtp27141515-3171) [n:127.0.0.1:37334_solr c:testschemaapi s:shard1 r:core_node2 x:testschemaapi_shard1_replica1] o.a.s.c.c.ZkStateReader Load collection config from: [/collections/testschemaapi]
   [junit4]   2> 312686 INFO  (qtp27141515-3171) [n:127.0.0.1:37334_solr c:testschemaapi s:shard1 r:core_node2 x:testschemaapi_shard1_replica1] o.a.s.c.c.ZkStateReader path=[/collections/testschemaapi] [configName]=[conf1] specified config exists in ZooKeeper
   [junit4]   2> 312686 INFO  (qtp27141515-3171) [n:127.0.0.1:37334_solr c:testschemaapi s:shard1 r:core_node2 x:testschemaapi_shard1_replica1] o.a.s.r.ManagedResourceStorage Setting up ZooKeeper-based storage for the RestManager with znodeBase: /configs/conf1
   [junit4]   2> 312686 INFO  (qtp27141515-3171) [n:127.0.0.1:37334_solr c:testschemaapi s:shard1 r:core_node2 x:testschemaapi_shard1_replica1] o.a.s.r.ManagedResourceStorage Configured ZooKeeperStorageIO with znodeBase: /configs/conf1
   [junit4]   2> 312686 INFO  (qtp27141515-3171) [n:127.0.0.1:37334_solr c:testschemaapi s:shard1 r:core_node2 x:testschemaapi_shard1_replica1] o.a.s.r.RestManager Initializing RestManager with initArgs: {}
   [junit4]   2> 312686 INFO  (qtp27141515-3171) [n:127.0.0.1:37334_solr c:testschemaapi s:shard1 r:core_node2 x:testschemaapi_shard1_replica1] o.a.s.r.ManagedResourceStorage Reading _rest_managed.json using ZooKeeperStorageIO:path=/configs/conf1
   [junit4]   2> 312690 INFO  (qtp27141515-3171) [n:127.0.0.1:37334_solr c:testschemaapi s:shard1 r:core_node2 x:testschemaapi_shard1_replica1] o.a.s.r.ManagedResourceStorage No data found for znode /configs/conf1/_rest_managed.json
   [junit4]   2> 312690 INFO  (qtp27141515-3171) [n:127.0.0.1:37334_solr c:testschemaapi s:shard1 r:core_node2 x:testschemaapi_shard1_replica1] o.a.s.r.ManagedResourceStorage Loaded null at path _rest_managed.json using ZooKeeperStorageIO:path=/configs/conf1
   [junit4]   2> 312690 INFO  (qtp27141515-3171) [n:127.0.0.1:37334_solr c:testschemaapi s:shard1 r:core_node2 x:testschemaapi_shard1_replica1] o.a.s.r.RestManager Initializing 0 registered ManagedResources
   [junit4]   2> 312690 INFO  (qtp27141515-3171) [n:127.0.0.1:37334_solr c:testschemaapi s:shard1 r:core_node2 x:testschemaapi_shard1_replica1] o.a.s.s.ZkIndexSchemaReader Creating ZooKeeper watch for the managed schema at /configs/conf1/managed-schema
   [junit4]   2> 312690 INFO  (qtp27141515-3171) [n:127.0.0.1:37334_solr c:testschemaapi s:shard1 r:core_node2 x:testschemaapi_shard1_replica1] o.a.s.c.ZkController Added new OnReconnect listener ZkIndexSchemaReader: /configs/conf1/managed-schema, uniqueCoreId: testschemaapi_shard1_replica1:1607204505473421
   [junit4]   2> 312691 INFO  (qtp27141515-3171) [n:127.0.0.1:37334_solr c:testschemaapi s:shard1 r:core_node2 x:testschemaapi_shard1_replica1] o.a.s.h.ReplicationHandler Commits will be reserved for  10000
   [junit4]   2> 312691 INFO  (searcherExecutor-1720-thread-1-processing-n:127.0.0.1:37334_solr x:testschemaapi_shard1_replica1 s:shard1 c:testschemaapi r:core_node2) [n:127.0.0.1:37334_solr c:testschemaapi s:shard1 r:core_node2 x:testschemaapi_shard1_replica1] o.a.s.c.SolrCore [testschemaapi_shard1_replica1] Registered new searcher Searcher@1fd2943[testschemaapi_shard1_replica1] main{ExitableDirectoryReader(UninvertingDirectoryReader())}
   [junit4]   2> 312691 INFO  (qtp27141515-3171) [n:127.0.0.1:37334_solr c:testschemaapi s:shard1 r:core_node2 x:testschemaapi_shard1_replica1] o.a.s.u.UpdateLog Looking up max value of version field to seed version buckets
   [junit4]   2> 312691 INFO  (qtp27141515-3171) [n:127.0.0.1:37334_solr c:testschemaapi s:shard1 r:core_node2 x:testschemaapi_shard1_replica1] o.a.s.u.VersionInfo Refreshing highest value of _version_ for 65536 version buckets from index
   [junit4]   2> 312691 INFO  (qtp27141515-3171) [n:127.0.0.1:37334_solr c:testschemaapi s:shard1 r:core_node2 x:testschemaapi_shard1_replica1] o.a.s.u.VersionInfo No terms found for _version_, cannot seed version bucket highest value from index
   [junit4]   2> 312691 INFO  (qtp27141515-3171) [n:127.0.0.1:37334_solr c:testschemaapi s:shard1 r:core_node2 x:testschemaapi_shard1_replica1] o.a.s.u.UpdateLog Could not find max version in index or recent updates, using new clock 1538654693207572480
   [junit4]   2> 312693 INFO  (qtp27141515-3171) [n:127.0.0.1:37334_solr c:testschemaapi s:shard1 r:core_node2 x:testschemaapi_shard1_replica1] o.a.s.u.UpdateLog Took 1.0ms to seed version buckets with highest version 1538654693207572480
   [junit4]   2> 312693 INFO  (qtp27141515-3171) [n:127.0.0.1:37334_solr c:testschemaapi s:shard1 r:core_node2 x:testschemaapi_shard1_replica1] o.a.s.c.ZkController watch zkdir /configs/conf1
   [junit4]   2> 312694 INFO  (qtp27141515-3171) [n:127.0.0.1:37334_solr c:testschemaapi s:shard1 r:core_node2 x:testschemaapi_shard1_replica1] o.a.s.c.CoreContainer registering core: testschemaapi_shard1_replica1
   [junit4]   2> 312694 INFO  (qtp27141515-3171) [n:127.0.0.1:37334_solr c:testschemaapi s:shard1 r:core_node2 x:testschemaapi_shard1_replica1] o.a.s.c.ZkController Register replica - core:testschemaapi_shard1_replica1 address:https://127.0.0.1:37334/solr collection:testschemaapi shard:shard1
   [junit4]   2> 312694 INFO  (qtp27141515-3171) [n:127.0.0.1:37334_solr c:testschemaapi s:shard1 r:core_node2 x:testschemaapi_shard1_replica1] o.a.s.c.LeaderElector Joined leadership election with path: /collections/testschemaapi/leader_elect/shard1/election/96165918226513926-core_node2-n_0000000001
   [junit4]   2> 312695 INFO  (qtp27141515-3171) [n:127.0.0.1:37334_solr c:testschemaapi s:shard1 r:core_node2 x:testschemaapi_shard1_replica1] o.a.s.c.LeaderElector Watching path /collections/testschemaapi/leader_elect/shard1/election/96165918226513925-core_node1-n_0000000000 to know if I could be the leader
   [junit4]   2> 312729 INFO  (OverseerStateUpdate-96165918226513925-127.0.0.1:41090_solr-n_0000000000) [n:127.0.0.1:41090_solr    ] o.a.s.c.o.ZkStateWriter going to update_collection /collections/testschemaapi/state.json version: 1
   [junit4]   2> 312729 INFO  (zkCallback-521-thread-3-processing-n:127.0.0.1:41090_solr) [n:127.0.0.1:41090_solr    ] o.a.s.c.c.ZkStateReader A cluster state change: [WatchedEvent state:SyncConnected type:NodeDataChanged path:/collections/testschemaapi/state.json] for collection [testschemaapi] has occurred - updating... (live nodes size: [2])
   [junit4]   2> 312729 INFO  (zkCallback-522-thread-1-processing-n:127.0.0.1:37334_solr) [n:127.0.0.1:37334_solr    ] o.a.s.c.c.ZkStateReader A cluster state change: [WatchedEvent state:SyncConnected type:NodeDataChanged path:/collections/testschemaapi/state.json] for collection [testschemaapi] has occurred - updating... (live nodes size: [2])
   [junit4]   2> 312729 INFO  (zkCallback-521-thread-3-processing-n:127.0.0.1:41090_solr) [n:127.0.0.1:41090_solr    ] o.a.s.c.c.ZkStateReader Updating data for [testschemaapi] from [1] to [2]
   [junit4]   2> 312729 INFO  (zkCallback-522-thread-1-processing-n:127.0.0.1:37334_solr) [n:127.0.0.1:37334_solr    ] o.a.s.c.c.ZkStateReader Updating data for [testschemaapi] from [1] to [2]
   [junit4]   2> 313128 INFO  (qtp8275891-3184) [n:127.0.0.1:41090_solr c:testschemaapi s:shard1 r:core_node1 x:testschemaapi_shard1_replica2] o.a.s.c.ShardLeaderElectionContext Enough replicas found to continue.
   [junit4]   2> 313128 INFO  (qtp8275891-3184) [n:127.0.0.1:41090_solr c:testschemaapi s:shard1 r:core_node1 x:testschemaapi_shard1_replica2] o.a.s.c.ShardLeaderElectionContext I may be the new leader - try and sync
   [junit4]   2> 313128 INFO  (qtp8275891-3184) [n:127.0.0.1:41090_solr c:testschemaapi s:shard1 r:core_node1 x:testschemaapi_shard1_replica2] o.a.s.c.SyncStrategy Sync replicas to https://127.0.0.1:41090/solr/testschemaapi_shard1_replica2/
   [junit4]   2> 313128 INFO  (qtp8275891-3184) [n:127.0.0.1:41090_solr c:testschemaapi s:shard1 r:core_node1 x:testschemaapi_shard1_replica2] o.a.s.u.PeerSync PeerSync: core=testschemaapi_shard1_replica2 url=https://127.0.0.1:41090/solr START replicas=[https://127.0.0.1:37334/solr/testschemaapi_shard1_replica1/] nUpdates=100
   [junit4]   2> 313128 INFO  (qtp8275891-3184) [n:127.0.0.1:41090_solr c:testschemaapi s:shard1 r:core_node1 x:testschemaapi_shard1_replica2] o.a.s.u.PeerSync PeerSync: core=testschemaapi_shard1_replica2 url=https://127.0.0.1:41090/solr DONE.  We have no versions.  sync failed.
   [junit4]   2> 313128 INFO  (qtp8275891-3184) [n:127.0.0.1:41090_solr c:testschemaapi s:shard1 r:core_node1 x:testschemaapi_shard1_replica2] o.a.s.c.SyncStrategy Leader's attempt to sync with shard failed, moving to the next candidate
   [junit4]   2> 313128 INFO  (qtp8275891-3184) [n:127.0.0.1:41090_solr c:testschemaapi s:shard1 r:core_node1 x:testschemaapi_shard1_replica2] o.a.s.c.ShardLeaderElectionContext We failed sync, but we have no versions - we can't sync in that case - we were active before, so become leader anyway
   [junit4]   2> 313129 INFO  (qtp8275891-3184) [n:127.0.0.1:41090_solr c:testschemaapi s:shard1 r:core_node1 x:testschemaapi_shard1_replica2] o.a.s.c.c.SolrZkClient makePath: /collections/testschemaapi/leaders/shard1
   [junit4]   2> 313130 INFO  (qtp8275891-3184) [n:127.0.0.1:41090_solr c:testschemaapi s:shard1 r:core_node1 x:testschemaapi_shard1_replica2] o.a.s.c.ShardLeaderElectionContextBase Creating leader registration node /collections/testschemaapi/leaders/shard1/leader after winning as /collections/testschemaapi/leader_elect/shard1/election/96165918226513925-core_node1-n_0000000000
   [junit4]   2> 313132 INFO  (qtp8275891-3184) [n:127.0.0.1:41090_solr c:testschemaapi s:shard1 r:core_node1 x:testschemaapi_shard1_replica2] o.a.s.c.ShardLeaderElectionContext I am the new leader: https://127.0.0.1:41090/solr/testschemaapi_shard1_replica2/ shard1
   [junit4]   2> 313132 INFO  (OverseerStateUpdate-96165918226513925-127.0.0.1:41090_solr-n_0000000000) [n:127.0.0.1:41090_solr    ] o.a.s.c.Overseer processMessage: queueSize: 1, message = {
   [junit4]   2>   "operation":"leader",
   [junit4]   2>   "shard":"shard1",
   [junit4]   2>   "collection":"testschemaapi",
   [junit4]   2>   "base_url":"https://127.0.0.1:41090/solr",
   [junit4]   2>   "core":"testschemaapi_shard1_replica2",
   [junit4]   2>   "state":"active"} current state version: 0
   [junit4]   2> 313134 INFO  (qtp27141515-3183) [n:127.0.0.1:37334_solr c:testschemaapi s:shard1 r:core_node2 x:testschemaapi_shard1_replica1] o.a.s.c.S.Request [testschemaapi_shard1_replica1]  webapp=/solr path=/get params={distrib=false&qt=/get&fingerprint=false&getVersions=100&wt=javabin&version=2} status=0 QTime=1
   [junit4]   2> 313235 INFO  (OverseerStateUpdate-96165918226513925-127.0.0.1:41090_solr-n_0000000000) [n:127.0.0.1:41090_solr    ] o.a.s.c.o.ZkStateWriter going to update_collection /collections/testschemaapi/state.json version: 2
   [junit4]   2> 313235 INFO  (zkCallback-521-thread-2-processing-n:127.0.0.1:41090_solr) [n:127.0.0.1:41090_solr    ] o.a.s.c.c.ZkStateReader A cluster state change: [WatchedEvent state:SyncConnected type:NodeDataChanged path:/collections/testschemaapi/state.json] for collection [testschemaapi] has occurred - updating... (live nodes size: [2])
   [junit4]   2> 313235 INFO  (zkCallback-522-thread-1-processing-n:127.0.0.1:37334_solr) [n:127.0.0.1:37334_solr    ] o.a.s.c.c.ZkStateReader A cluster state change: [WatchedEvent state:SyncConnected type:NodeDataChanged path:/collections/testschemaapi/state.json] for collection [testschemaapi] has occurred - updating... (live nodes size: [2])
   [junit4]   2> 313236 INFO  (zkCallback-522-thread-1-processing-n:127.0.0.1:37334_solr) [n:127.0.0.1:37334_solr    ] o.a.s.c.c.ZkStateReader Updating data for [testschemaapi] from [2] to [3]
   [junit4]   2> 313236 INFO  (zkCallback-521-thread-2-processing-n:127.0.0.1:41090_solr) [n:127.0.0.1:41090_solr    ] o.a.s.c.c.ZkStateReader Updating data for [testschemaapi] from [2] to [3]
   [junit4]   2> 313284 INFO  (qtp8275891-3184) [n:127.0.0.1:41090_solr c:testschemaapi s:shard1 r:core_node1 x:testschemaapi_shard1_replica2] o.a.s.c.ZkController We are https://127.0.0.1:41090/solr/testschemaapi_shard1_replica2/ and leader is https://127.0.0.1:41090/solr/testschemaapi_shard1_replica2/
   [junit4]   2> 313284 INFO  (qtp8275891-3184) [n:127.0.0.1:41090_solr c:testschemaapi s:shard1 r:core_node1 x:testschemaapi_shard1_replica2] o.a.s.c.ZkController No LogReplay needed for core=testschemaapi_shard1_replica2 baseURL=https://127.0.0.1:41090/solr
   [junit4]   2> 313284 INFO  (qtp8275891-3184) [n:127.0.0.1:41090_solr c:testschemaapi s:shard1 r:core_node1 x:testschemaapi_shard1_replica2] o.a.s.c.ZkController I am the leader, no recovery necessary
   [junit4]   2> 313284 INFO  (qtp8275891-3184) [n:127.0.0.1:41090_solr c:testschemaapi s:shard1 r:core_node1 x:testschemaapi_shard1_replica2] o.a.s.c.ZkController publishing state=active
   [junit4]   2> 313285 INFO  (OverseerStateUpdate-96165918226513925-127.0.0.1:41090_solr-n_0000000000) [n:127.0.0.1:41090_solr    ] o.a.s.c.Overseer processMessage: queueSize: 1, message = {
   [junit4]   2>   "core":"testschemaapi_shard1_replica2",
   [junit4]   2>   "core_node_name":"core_node1",
   [junit4]   2>   "roles":null,
   [junit4]   2>   "base_url":"https://127.0.0.1:41090/solr",
   [junit4]   2>   "node_name":"127.0.0.1:41090_solr",
   [junit4]   2>   "numShards":"1",
   [junit4]   2>   "state":"active",
   [junit4]   2>   "shard":"shard1",
   [junit4]   2>   "collection":"testschemaapi",
   [junit4]   2>   "operation":"state"} current state version: 0
   [junit4]   2> 313285 INFO  (OverseerStateUpdate-96165918226513925-127.0.0.1:41090_solr-n_0000000000) [n:127.0.0.1:41090_solr    ] o.a.s.c.o.ReplicaMutator Update state numShards=1 message={
   [junit4]   2>   "core":"testschemaapi_shard1_replica2",
   [junit4]   2>   "core_node_name":"core_node1",
   [junit4]   2>   "roles":null,
   [junit4]   2>   "base_url":"https://127.0.0.1:41090/solr",
   [junit4]   2>   "node_name":"127.0.0.1:41090_solr",
   [junit4]   2>   "numShards":"1",
   [junit4]   2>   "state":"active",
   [junit4]   2>   "shard":"shard1",
   [junit4]   2>   "collection":"testschemaapi",
   [junit4]   2>   "operation":"state"}
   [junit4]   2> 313286 INFO  (qtp8275891-3184) [n:127.0.0.1:41090_solr c:testschemaapi s:shard1 r:core_node1 x:testschemaapi_shard1_replica2] o.a.s.s.HttpSolrCall [admin] webapp=null path=/admin/cores params={qt=/admin/cores&collection.configName=conf1&name=testschemaapi_shard1_replica2&action=CREATE&numShards=1&collection=testschemaapi&shard=shard1&wt=javabin&version=2} status=0 QTime=1702
   [junit4]   2> 313386 INFO  (OverseerStateUpdate-96165918226513925-127.0.0.1:41090_solr-n_0000000000) [n:127.0.0.1:41090_solr    ] o.a.s.c.o.ZkStateWriter going to update_collection /collections/testschemaapi/state.json version: 3
   [junit4]   2> 313387 INFO  (zkCallback-521-thread-3-processing-n:127.0.0.1:41090_solr) [n:127.0.0.1:41090_solr    ] o.a.s.c.c.ZkStateReader A cluster state change: [WatchedEvent state:SyncConnected type:NodeDataChanged path:/collections/testschemaapi/state.json] for collection [testschemaapi] has occurred - updating... (live nodes size: [2])
   [junit4]   2> 313387 INFO  (zkCallback-522-thread-1-processing-n:127.0.0.1:37334_solr) [n:127.0.0.1:37334_solr    ] o.a.s.c.c.ZkStateReader A cluster state change: [WatchedEvent state:SyncConnected type:NodeDataChanged path:/collections/testschemaapi/state.json] for collection [testschemaapi] has occurred

[...truncated too long message...]

5) [n:127.0.0.1:41090_solr c:testschemaapi s:shard1 r:core_node1 x:testschemaapi_shard1_replica2] o.a.s.u.DefaultSolrCoreState closing IndexWriter with IndexWriterCloser
   [junit4]   2> 323054 INFO  (searcherExecutor-1741-thread-1-processing-n:127.0.0.1:41090_solr x:testschemaapi_shard1_replica2 s:shard1 c:testschemaapi r:core_node1) [n:127.0.0.1:41090_solr c:testschemaapi s:shard1 r:core_node1 x:testschemaapi_shard1_replica2] o.a.s.c.SolrCore [testschemaapi_shard1_replica2] Registered new searcher Searcher@2c0314[testschemaapi_shard1_replica2] main{ExitableDirectoryReader(UninvertingDirectoryReader(Uninverting(_0(6.2.0):C2)))}
   [junit4]   2> 323054 INFO  (Thread-1205) [n:127.0.0.1:41090_solr c:testschemaapi s:shard1 r:core_node1 x:testschemaapi_shard1_replica2] o.a.s.u.DirectUpdateHandler2 Committing on IndexWriter close.
   [junit4]   2> 323055 INFO  (Thread-1205) [n:127.0.0.1:41090_solr c:testschemaapi s:shard1 r:core_node1 x:testschemaapi_shard1_replica2] o.a.s.c.SolrDeletionPolicy SolrDeletionPolicy.onCommit: commits: num=2
   [junit4]   2> 	commit{dir=MockDirectoryWrapper(RAMDirectory@fce607 lockFactory=org.apache.lucene.store.SingleInstanceLockFactory@ad26e5),segFN=segments_1,generation=1}
   [junit4]   2> 	commit{dir=MockDirectoryWrapper(RAMDirectory@fce607 lockFactory=org.apache.lucene.store.SingleInstanceLockFactory@ad26e5),segFN=segments_2,generation=2}
   [junit4]   2> 323055 INFO  (Thread-1205) [n:127.0.0.1:41090_solr c:testschemaapi s:shard1 r:core_node1 x:testschemaapi_shard1_replica2] o.a.s.c.SolrDeletionPolicy newest commit generation = 2
   [junit4]   2> 323055 INFO  (Thread-1205) [n:127.0.0.1:41090_solr c:testschemaapi s:shard1 r:core_node1 x:testschemaapi_shard1_replica2] o.a.s.c.SolrCore [testschemaapi_shard1_replica2] Closing main searcher on request.
   [junit4]   2> 323055 INFO  (Thread-1205) [n:127.0.0.1:41090_solr c:testschemaapi s:shard1 r:core_node1 x:testschemaapi_shard1_replica2] o.a.s.c.CachingDirectoryFactory Closing MockDirectoryFactory - 2 directories currently being tracked
   [junit4]   2> 323056 INFO  (Thread-1205) [n:127.0.0.1:41090_solr c:testschemaapi s:shard1 r:core_node1 x:testschemaapi_shard1_replica2] o.a.s.c.CachingDirectoryFactory looking to close /home/jenkins/workspace/Lucene-Solr-6.x-Linux/solr/build/solr-core/test/J0/temp/solr.schema.TestManagedSchemaAPI_BE2D9CD8CF356EA6-001/tempDir-001/node1/./testschemaapi_shard1_replica2/data [CachedDir<<refCount=0;path=/home/jenkins/workspace/Lucene-Solr-6.x-Linux/solr/build/solr-core/test/J0/temp/solr.schema.TestManagedSchemaAPI_BE2D9CD8CF356EA6-001/tempDir-001/node1/./testschemaapi_shard1_replica2/data;done=false>>]
   [junit4]   2> 323056 INFO  (Thread-1205) [n:127.0.0.1:41090_solr c:testschemaapi s:shard1 r:core_node1 x:testschemaapi_shard1_replica2] o.a.s.c.CachingDirectoryFactory Closing directory, CoreContainer#isShutdown=true
   [junit4]   2> 323056 INFO  (Thread-1205) [n:127.0.0.1:41090_solr c:testschemaapi s:shard1 r:core_node1 x:testschemaapi_shard1_replica2] o.a.s.c.CachingDirectoryFactory Closing directory: /home/jenkins/workspace/Lucene-Solr-6.x-Linux/solr/build/solr-core/test/J0/temp/solr.schema.TestManagedSchemaAPI_BE2D9CD8CF356EA6-001/tempDir-001/node1/./testschemaapi_shard1_replica2/data
   [junit4]   2> 323057 INFO  (Thread-1205) [n:127.0.0.1:41090_solr c:testschemaapi s:shard1 r:core_node1 x:testschemaapi_shard1_replica2] o.a.s.c.CachingDirectoryFactory looking to close /home/jenkins/workspace/Lucene-Solr-6.x-Linux/solr/build/solr-core/test/J0/temp/solr.schema.TestManagedSchemaAPI_BE2D9CD8CF356EA6-001/tempDir-001/node1/./testschemaapi_shard1_replica2/data/index [CachedDir<<refCount=0;path=/home/jenkins/workspace/Lucene-Solr-6.x-Linux/solr/build/solr-core/test/J0/temp/solr.schema.TestManagedSchemaAPI_BE2D9CD8CF356EA6-001/tempDir-001/node1/./testschemaapi_shard1_replica2/data/index;done=false>>]
   [junit4]   2> Jul 01, 2016 12:17:53 PM com.carrotsearch.randomizedtesting.ThreadLeakControl checkThreadLeaks
   [junit4]   2> WARNING: Will linger awaiting termination of 2 leaked thread(s).
   [junit4]   2> 323057 INFO  (Thread-1205) [n:127.0.0.1:41090_solr c:testschemaapi s:shard1 r:core_node1 x:testschemaapi_shard1_replica2] o.a.s.c.CachingDirectoryFactory Closing directory, CoreContainer#isShutdown=true
   [junit4]   2> 323057 INFO  (Thread-1205) [n:127.0.0.1:41090_solr c:testschemaapi s:shard1 r:core_node1 x:testschemaapi_shard1_replica2] o.a.s.c.CachingDirectoryFactory Closing directory: /home/jenkins/workspace/Lucene-Solr-6.x-Linux/solr/build/solr-core/test/J0/temp/solr.schema.TestManagedSchemaAPI_BE2D9CD8CF356EA6-001/tempDir-001/node1/./testschemaapi_shard1_replica2/data/index
   [junit4]   2> 323057 WARN  (Thread-1205) [n:127.0.0.1:41090_solr c:testschemaapi s:shard1 r:core_node1 x:testschemaapi_shard1_replica2] o.a.s.c.ZkController listener throws error
   [junit4]   2> org.apache.solr.common.SolrException: Unable to reload core [testschemaapi_shard1_replica2]
   [junit4]   2> 	at org.apache.solr.core.CoreContainer.reload(CoreContainer.java:928)
   [junit4]   2> 	at org.apache.solr.core.SolrCore.lambda$getConfListener$6(SolrCore.java:2509)
   [junit4]   2> 	at org.apache.solr.cloud.ZkController$4.run(ZkController.java:2427)
   [junit4]   2> Caused by: org.apache.solr.common.SolrException: Could not find config name for collection:testschemaapi
   [junit4]   2> 	at org.apache.solr.core.SolrCore.<init>(SolrCore.java:772)
   [junit4]   2> 	at org.apache.solr.core.SolrCore.reload(SolrCore.java:461)
   [junit4]   2> 	at org.apache.solr.core.CoreContainer.reload(CoreContainer.java:922)
   [junit4]   2> 	... 2 more
   [junit4]   2> Caused by: org.apache.solr.common.SolrException: Could not find config name for collection:testschemaapi
   [junit4]   2> 	at org.apache.solr.rest.ManagedResourceStorage.newStorageIO(ManagedResourceStorage.java:101)
   [junit4]   2> 	at org.apache.solr.core.SolrCore.initRestManager(SolrCore.java:2304)
   [junit4]   2> 	at org.apache.solr.core.SolrCore.<init>(SolrCore.java:748)
   [junit4]   2> 	... 4 more
   [junit4]   2> NOTE: test params are: codec=Asserting(Lucene62): {_version_=PostingsFormat(name=Asserting), id=PostingsFormat(name=LuceneFixedGap), myNewField1=PostingsFormat(name=LuceneFixedGap), myNewField=PostingsFormat(name=Asserting)}, docValues:{}, maxPointsInLeafNode=1965, maxMBSortInHeap=5.979023272929648, sim=ClassicSimilarity, locale=th, timezone=Africa/Maseru
   [junit4]   2> NOTE: Linux 4.4.0-24-generic i386/Oracle Corporation 1.8.0_92 (32-bit)/cpus=12,threads=1,free=177124784,total=315883520
   [junit4]   2> NOTE: All tests run in this JVM: [MultiThreadedOCPTest, TestRTGBase, DocumentAnalysisRequestHandlerTest, WrapperMergePolicyFactoryTest, TestDistribIDF, DistributedQueryElevationComponentTest, CurrencyFieldOpenExchangeTest, SuggestComponentContextFilterQueryTest, URLClassifyProcessorTest, TestObjectReleaseTracker, TestCollapseQParserPlugin, FileBasedSpellCheckerTest, SyncSliceTest, TestFieldCollectionResource, TestMacros, CloudMLTQParserTest, TestBadConfig, TestValueSourceCache, JsonLoaderTest, TestSolr4Spatial2, StressHdfsTest, CopyFieldTest, ZkNodePropsTest, TestSha256AuthenticationProvider, TestAtomicUpdateErrorCases, TolerantUpdateProcessorTest, TestInfoStreamLogging, TestSearcherReuse, SolrCoreTest, CdcrReplicationDistributedZkTest, TestLRUStatsCache, TestMergePolicyConfig, DistributedSpellCheckComponentTest, ConcurrentDeleteAndCreateCollectionTest, TestFieldCacheReopen, CdcrUpdateLogTest, StandardRequestHandlerTest, TestConfigSets, OverseerStatusTest, DistribJoinFromCollectionTest, TestShortCircuitedRequests, SystemInfoHandlerTest, TestBulkSchemaAPI, UUIDFieldTest, CdcrVersionReplicationTest, TestConfig, TestFoldingMultitermQuery, TestTestInjection, IndexSchemaTest, TestUninvertingReader, TestManagedStopFilterFactory, TestDocSet, TestRealTimeGet, SimpleCollectionCreateDeleteTest, TestManagedSchemaAPI]
   [junit4]   2> NOTE: reproduce with: ant test  -Dtestcase=TestManagedSchemaAPI -Dtests.seed=BE2D9CD8CF356EA6 -Dtests.multiplier=3 -Dtests.slow=true -Dtests.locale=th -Dtests.timezone=Africa/Maseru -Dtests.asserts=true -Dtests.file.encoding=US-ASCII
   [junit4] ERROR   0.00s J0 | TestManagedSchemaAPI (suite) <<<
   [junit4]    > Throwable #1: java.lang.AssertionError: ObjectTracker found 4 object(s) that were not released!!! [MDCAwareThreadPoolExecutor, MockDirectoryWrapper, MockDirectoryWrapper, TransactionLog]
   [junit4]    > 	at __randomizedtesting.SeedInfo.seed([BE2D9CD8CF356EA6]:0)
   [junit4]    > 	at org.apache.solr.SolrTestCaseJ4.teardownTestCases(SolrTestCaseJ4.java:257)
   [junit4]    > 	at java.lang.Thread.run(Thread.java:745)
   [junit4] Completed [139/618 (1!)] on J0 in 12.14s, 1 test, 1 failure <<< FAILURES!

[...truncated 1520 lines...]
BUILD FAILED
/home/jenkins/workspace/Lucene-Solr-6.x-Linux/build.xml:740: The following error occurred while executing this line:
/home/jenkins/workspace/Lucene-Solr-6.x-Linux/build.xml:684: The following error occurred while executing this line:
/home/jenkins/workspace/Lucene-Solr-6.x-Linux/build.xml:59: The following error occurred while executing this line:
/home/jenkins/workspace/Lucene-Solr-6.x-Linux/solr/build.xml:233: The following error occurred while executing this line:
/home/jenkins/workspace/Lucene-Solr-6.x-Linux/solr/common-build.xml:530: The following error occurred while executing this line:
/home/jenkins/workspace/Lucene-Solr-6.x-Linux/lucene/common-build.xml:1427: The following error occurred while executing this line:
/home/jenkins/workspace/Lucene-Solr-6.x-Linux/lucene/common-build.xml:984: There were test failures: 618 suites (10 ignored), 2591 tests, 1 suite-level error, 116 ignored (71 assumptions) [seed: BE2D9CD8CF356EA6]

Total time: 55 minutes 31 seconds
Build step 'Invoke Ant' marked build as failure
Archiving artifacts
[WARNINGS] Skipping publisher since build result is FAILURE
Recording test results
Email was triggered for: Failure - Any
Sending email for trigger: Failure - Any



Mime
View raw message