lucene-dev mailing list archives

Site index · List index
Message view « Date » · « Thread »
Top « Date » · « Thread »
From Policeman Jenkins Server <jenk...@thetaphi.de>
Subject [JENKINS] Lucene-Solr-6.x-Windows (32bit/jdk1.8.0_92) - Build # 285 - Still Failing!
Date Fri, 01 Jul 2016 02:09:18 GMT
Build: http://jenkins.thetaphi.de/job/Lucene-Solr-6.x-Windows/285/
Java: 32bit/jdk1.8.0_92 -client -XX:+UseSerialGC

2 tests failed.
FAILED:  junit.framework.TestSuite.org.apache.solr.schema.TestManagedSchemaAPI

Error Message:
ObjectTracker found 8 object(s) that were not released!!! [MDCAwareThreadPoolExecutor, MockDirectoryWrapper, MockDirectoryWrapper, TransactionLog, TransactionLog, MDCAwareThreadPoolExecutor, MockDirectoryWrapper, MockDirectoryWrapper]

Stack Trace:
java.lang.AssertionError: ObjectTracker found 8 object(s) that were not released!!! [MDCAwareThreadPoolExecutor, MockDirectoryWrapper, MockDirectoryWrapper, TransactionLog, TransactionLog, MDCAwareThreadPoolExecutor, MockDirectoryWrapper, MockDirectoryWrapper]
	at __randomizedtesting.SeedInfo.seed([FD633F85EC5E265D]:0)
	at org.junit.Assert.fail(Assert.java:93)
	at org.junit.Assert.assertTrue(Assert.java:43)
	at org.junit.Assert.assertNull(Assert.java:551)
	at org.apache.solr.SolrTestCaseJ4.teardownTestCases(SolrTestCaseJ4.java:257)
	at sun.reflect.GeneratedMethodAccessor31.invoke(Unknown Source)
	at sun.reflect.DelegatingMethodAccessorImpl.invoke(DelegatingMethodAccessorImpl.java:43)
	at java.lang.reflect.Method.invoke(Method.java:498)
	at com.carrotsearch.randomizedtesting.RandomizedRunner.invoke(RandomizedRunner.java:1764)
	at com.carrotsearch.randomizedtesting.RandomizedRunner$7.evaluate(RandomizedRunner.java:834)
	at com.carrotsearch.randomizedtesting.rules.StatementAdapter.evaluate(StatementAdapter.java:36)
	at com.carrotsearch.randomizedtesting.rules.SystemPropertiesRestoreRule$1.evaluate(SystemPropertiesRestoreRule.java:57)
	at org.apache.lucene.util.AbstractBeforeAfterRule$1.evaluate(AbstractBeforeAfterRule.java:45)
	at com.carrotsearch.randomizedtesting.rules.StatementAdapter.evaluate(StatementAdapter.java:36)
	at org.apache.lucene.util.TestRuleStoreClassName$1.evaluate(TestRuleStoreClassName.java:41)
	at com.carrotsearch.randomizedtesting.rules.NoShadowingOrOverridesOnMethodsRule$1.evaluate(NoShadowingOrOverridesOnMethodsRule.java:40)
	at com.carrotsearch.randomizedtesting.rules.NoShadowingOrOverridesOnMethodsRule$1.evaluate(NoShadowingOrOverridesOnMethodsRule.java:40)
	at com.carrotsearch.randomizedtesting.rules.StatementAdapter.evaluate(StatementAdapter.java:36)
	at com.carrotsearch.randomizedtesting.rules.StatementAdapter.evaluate(StatementAdapter.java:36)
	at com.carrotsearch.randomizedtesting.rules.StatementAdapter.evaluate(StatementAdapter.java:36)
	at org.apache.lucene.util.TestRuleAssertionsRequired$1.evaluate(TestRuleAssertionsRequired.java:53)
	at org.apache.lucene.util.TestRuleMarkFailure$1.evaluate(TestRuleMarkFailure.java:47)
	at org.apache.lucene.util.TestRuleIgnoreAfterMaxFailures$1.evaluate(TestRuleIgnoreAfterMaxFailures.java:64)
	at org.apache.lucene.util.TestRuleIgnoreTestSuites$1.evaluate(TestRuleIgnoreTestSuites.java:54)
	at com.carrotsearch.randomizedtesting.rules.StatementAdapter.evaluate(StatementAdapter.java:36)
	at com.carrotsearch.randomizedtesting.ThreadLeakControl$StatementRunner.run(ThreadLeakControl.java:367)
	at java.lang.Thread.run(Thread.java:745)


FAILED:  junit.framework.TestSuite.org.apache.solr.schema.TestManagedSchemaAPI

Error Message:
Could not remove the following files (in the order of attempts):    C:\Users\jenkins\workspace\Lucene-Solr-6.x-Windows\solr\build\solr-core\test\J1\temp\solr.schema.TestManagedSchemaAPI_FD633F85EC5E265D-001\tempDir-001\node1\testschemaapi_shard1_replica2\data\tlog\tlog.0000000000000000000: java.nio.file.FileSystemException: C:\Users\jenkins\workspace\Lucene-Solr-6.x-Windows\solr\build\solr-core\test\J1\temp\solr.schema.TestManagedSchemaAPI_FD633F85EC5E265D-001\tempDir-001\node1\testschemaapi_shard1_replica2\data\tlog\tlog.0000000000000000000: The process cannot access the file because it is being used by another process.     C:\Users\jenkins\workspace\Lucene-Solr-6.x-Windows\solr\build\solr-core\test\J1\temp\solr.schema.TestManagedSchemaAPI_FD633F85EC5E265D-001\tempDir-001\node1\testschemaapi_shard1_replica2\data\tlog: java.nio.file.DirectoryNotEmptyException: C:\Users\jenkins\workspace\Lucene-Solr-6.x-Windows\solr\build\solr-core\test\J1\temp\solr.schema.TestManagedSchemaAPI_FD633F85EC5E265D-001\tempDir-001\node1\testschemaapi_shard1_replica2\data\tlog    C:\Users\jenkins\workspace\Lucene-Solr-6.x-Windows\solr\build\solr-core\test\J1\temp\solr.schema.TestManagedSchemaAPI_FD633F85EC5E265D-001\tempDir-001\node1\testschemaapi_shard1_replica2\data: java.nio.file.DirectoryNotEmptyException: C:\Users\jenkins\workspace\Lucene-Solr-6.x-Windows\solr\build\solr-core\test\J1\temp\solr.schema.TestManagedSchemaAPI_FD633F85EC5E265D-001\tempDir-001\node1\testschemaapi_shard1_replica2\data    C:\Users\jenkins\workspace\Lucene-Solr-6.x-Windows\solr\build\solr-core\test\J1\temp\solr.schema.TestManagedSchemaAPI_FD633F85EC5E265D-001\tempDir-001\node1\testschemaapi_shard1_replica2: java.nio.file.DirectoryNotEmptyException: C:\Users\jenkins\workspace\Lucene-Solr-6.x-Windows\solr\build\solr-core\test\J1\temp\solr.schema.TestManagedSchemaAPI_FD633F85EC5E265D-001\tempDir-001\node1\testschemaapi_shard1_replica2    C:\Users\jenkins\workspace\Lucene-Solr-6.x-Windows\solr\build\solr-core\test\J1\temp\solr.schema.TestManagedSchemaAPI_FD633F85EC5E265D-001\tempDir-001\node1: java.nio.file.DirectoryNotEmptyException: C:\Users\jenkins\workspace\Lucene-Solr-6.x-Windows\solr\build\solr-core\test\J1\temp\solr.schema.TestManagedSchemaAPI_FD633F85EC5E265D-001\tempDir-001\node1    C:\Users\jenkins\workspace\Lucene-Solr-6.x-Windows\solr\build\solr-core\test\J1\temp\solr.schema.TestManagedSchemaAPI_FD633F85EC5E265D-001\tempDir-001\node2\testschemaapi_shard1_replica1\data\tlog\tlog.0000000000000000001: java.nio.file.FileSystemException: C:\Users\jenkins\workspace\Lucene-Solr-6.x-Windows\solr\build\solr-core\test\J1\temp\solr.schema.TestManagedSchemaAPI_FD633F85EC5E265D-001\tempDir-001\node2\testschemaapi_shard1_replica1\data\tlog\tlog.0000000000000000001: The process cannot access the file because it is being used by another process.     C:\Users\jenkins\workspace\Lucene-Solr-6.x-Windows\solr\build\solr-core\test\J1\temp\solr.schema.TestManagedSchemaAPI_FD633F85EC5E265D-001\tempDir-001\node2\testschemaapi_shard1_replica1\data\tlog: java.nio.file.DirectoryNotEmptyException: C:\Users\jenkins\workspace\Lucene-Solr-6.x-Windows\solr\build\solr-core\test\J1\temp\solr.schema.TestManagedSchemaAPI_FD633F85EC5E265D-001\tempDir-001\node2\testschemaapi_shard1_replica1\data\tlog    C:\Users\jenkins\workspace\Lucene-Solr-6.x-Windows\solr\build\solr-core\test\J1\temp\solr.schema.TestManagedSchemaAPI_FD633F85EC5E265D-001\tempDir-001\node2\testschemaapi_shard1_replica1\data: java.nio.file.DirectoryNotEmptyException: C:\Users\jenkins\workspace\Lucene-Solr-6.x-Windows\solr\build\solr-core\test\J1\temp\solr.schema.TestManagedSchemaAPI_FD633F85EC5E265D-001\tempDir-001\node2\testschemaapi_shard1_replica1\data    C:\Users\jenkins\workspace\Lucene-Solr-6.x-Windows\solr\build\solr-core\test\J1\temp\solr.schema.TestManagedSchemaAPI_FD633F85EC5E265D-001\tempDir-001\node2\testschemaapi_shard1_replica1: java.nio.file.DirectoryNotEmptyException: C:\Users\jenkins\workspace\Lucene-Solr-6.x-Windows\solr\build\solr-core\test\J1\temp\solr.schema.TestManagedSchemaAPI_FD633F85EC5E265D-001\tempDir-001\node2\testschemaapi_shard1_replica1    C:\Users\jenkins\workspace\Lucene-Solr-6.x-Windows\solr\build\solr-core\test\J1\temp\solr.schema.TestManagedSchemaAPI_FD633F85EC5E265D-001\tempDir-001\node2: java.nio.file.DirectoryNotEmptyException: C:\Users\jenkins\workspace\Lucene-Solr-6.x-Windows\solr\build\solr-core\test\J1\temp\solr.schema.TestManagedSchemaAPI_FD633F85EC5E265D-001\tempDir-001\node2    C:\Users\jenkins\workspace\Lucene-Solr-6.x-Windows\solr\build\solr-core\test\J1\temp\solr.schema.TestManagedSchemaAPI_FD633F85EC5E265D-001\tempDir-001: java.nio.file.DirectoryNotEmptyException: C:\Users\jenkins\workspace\Lucene-Solr-6.x-Windows\solr\build\solr-core\test\J1\temp\solr.schema.TestManagedSchemaAPI_FD633F85EC5E265D-001\tempDir-001    C:\Users\jenkins\workspace\Lucene-Solr-6.x-Windows\solr\build\solr-core\test\J1\temp\solr.schema.TestManagedSchemaAPI_FD633F85EC5E265D-001: java.nio.file.DirectoryNotEmptyException: C:\Users\jenkins\workspace\Lucene-Solr-6.x-Windows\solr\build\solr-core\test\J1\temp\solr.schema.TestManagedSchemaAPI_FD633F85EC5E265D-001 

Stack Trace:
java.io.IOException: Could not remove the following files (in the order of attempts):
   C:\Users\jenkins\workspace\Lucene-Solr-6.x-Windows\solr\build\solr-core\test\J1\temp\solr.schema.TestManagedSchemaAPI_FD633F85EC5E265D-001\tempDir-001\node1\testschemaapi_shard1_replica2\data\tlog\tlog.0000000000000000000: java.nio.file.FileSystemException: C:\Users\jenkins\workspace\Lucene-Solr-6.x-Windows\solr\build\solr-core\test\J1\temp\solr.schema.TestManagedSchemaAPI_FD633F85EC5E265D-001\tempDir-001\node1\testschemaapi_shard1_replica2\data\tlog\tlog.0000000000000000000: The process cannot access the file because it is being used by another process.

   C:\Users\jenkins\workspace\Lucene-Solr-6.x-Windows\solr\build\solr-core\test\J1\temp\solr.schema.TestManagedSchemaAPI_FD633F85EC5E265D-001\tempDir-001\node1\testschemaapi_shard1_replica2\data\tlog: java.nio.file.DirectoryNotEmptyException: C:\Users\jenkins\workspace\Lucene-Solr-6.x-Windows\solr\build\solr-core\test\J1\temp\solr.schema.TestManagedSchemaAPI_FD633F85EC5E265D-001\tempDir-001\node1\testschemaapi_shard1_replica2\data\tlog
   C:\Users\jenkins\workspace\Lucene-Solr-6.x-Windows\solr\build\solr-core\test\J1\temp\solr.schema.TestManagedSchemaAPI_FD633F85EC5E265D-001\tempDir-001\node1\testschemaapi_shard1_replica2\data: java.nio.file.DirectoryNotEmptyException: C:\Users\jenkins\workspace\Lucene-Solr-6.x-Windows\solr\build\solr-core\test\J1\temp\solr.schema.TestManagedSchemaAPI_FD633F85EC5E265D-001\tempDir-001\node1\testschemaapi_shard1_replica2\data
   C:\Users\jenkins\workspace\Lucene-Solr-6.x-Windows\solr\build\solr-core\test\J1\temp\solr.schema.TestManagedSchemaAPI_FD633F85EC5E265D-001\tempDir-001\node1\testschemaapi_shard1_replica2: java.nio.file.DirectoryNotEmptyException: C:\Users\jenkins\workspace\Lucene-Solr-6.x-Windows\solr\build\solr-core\test\J1\temp\solr.schema.TestManagedSchemaAPI_FD633F85EC5E265D-001\tempDir-001\node1\testschemaapi_shard1_replica2
   C:\Users\jenkins\workspace\Lucene-Solr-6.x-Windows\solr\build\solr-core\test\J1\temp\solr.schema.TestManagedSchemaAPI_FD633F85EC5E265D-001\tempDir-001\node1: java.nio.file.DirectoryNotEmptyException: C:\Users\jenkins\workspace\Lucene-Solr-6.x-Windows\solr\build\solr-core\test\J1\temp\solr.schema.TestManagedSchemaAPI_FD633F85EC5E265D-001\tempDir-001\node1
   C:\Users\jenkins\workspace\Lucene-Solr-6.x-Windows\solr\build\solr-core\test\J1\temp\solr.schema.TestManagedSchemaAPI_FD633F85EC5E265D-001\tempDir-001\node2\testschemaapi_shard1_replica1\data\tlog\tlog.0000000000000000001: java.nio.file.FileSystemException: C:\Users\jenkins\workspace\Lucene-Solr-6.x-Windows\solr\build\solr-core\test\J1\temp\solr.schema.TestManagedSchemaAPI_FD633F85EC5E265D-001\tempDir-001\node2\testschemaapi_shard1_replica1\data\tlog\tlog.0000000000000000001: The process cannot access the file because it is being used by another process.

   C:\Users\jenkins\workspace\Lucene-Solr-6.x-Windows\solr\build\solr-core\test\J1\temp\solr.schema.TestManagedSchemaAPI_FD633F85EC5E265D-001\tempDir-001\node2\testschemaapi_shard1_replica1\data\tlog: java.nio.file.DirectoryNotEmptyException: C:\Users\jenkins\workspace\Lucene-Solr-6.x-Windows\solr\build\solr-core\test\J1\temp\solr.schema.TestManagedSchemaAPI_FD633F85EC5E265D-001\tempDir-001\node2\testschemaapi_shard1_replica1\data\tlog
   C:\Users\jenkins\workspace\Lucene-Solr-6.x-Windows\solr\build\solr-core\test\J1\temp\solr.schema.TestManagedSchemaAPI_FD633F85EC5E265D-001\tempDir-001\node2\testschemaapi_shard1_replica1\data: java.nio.file.DirectoryNotEmptyException: C:\Users\jenkins\workspace\Lucene-Solr-6.x-Windows\solr\build\solr-core\test\J1\temp\solr.schema.TestManagedSchemaAPI_FD633F85EC5E265D-001\tempDir-001\node2\testschemaapi_shard1_replica1\data
   C:\Users\jenkins\workspace\Lucene-Solr-6.x-Windows\solr\build\solr-core\test\J1\temp\solr.schema.TestManagedSchemaAPI_FD633F85EC5E265D-001\tempDir-001\node2\testschemaapi_shard1_replica1: java.nio.file.DirectoryNotEmptyException: C:\Users\jenkins\workspace\Lucene-Solr-6.x-Windows\solr\build\solr-core\test\J1\temp\solr.schema.TestManagedSchemaAPI_FD633F85EC5E265D-001\tempDir-001\node2\testschemaapi_shard1_replica1
   C:\Users\jenkins\workspace\Lucene-Solr-6.x-Windows\solr\build\solr-core\test\J1\temp\solr.schema.TestManagedSchemaAPI_FD633F85EC5E265D-001\tempDir-001\node2: java.nio.file.DirectoryNotEmptyException: C:\Users\jenkins\workspace\Lucene-Solr-6.x-Windows\solr\build\solr-core\test\J1\temp\solr.schema.TestManagedSchemaAPI_FD633F85EC5E265D-001\tempDir-001\node2
   C:\Users\jenkins\workspace\Lucene-Solr-6.x-Windows\solr\build\solr-core\test\J1\temp\solr.schema.TestManagedSchemaAPI_FD633F85EC5E265D-001\tempDir-001: java.nio.file.DirectoryNotEmptyException: C:\Users\jenkins\workspace\Lucene-Solr-6.x-Windows\solr\build\solr-core\test\J1\temp\solr.schema.TestManagedSchemaAPI_FD633F85EC5E265D-001\tempDir-001
   C:\Users\jenkins\workspace\Lucene-Solr-6.x-Windows\solr\build\solr-core\test\J1\temp\solr.schema.TestManagedSchemaAPI_FD633F85EC5E265D-001: java.nio.file.DirectoryNotEmptyException: C:\Users\jenkins\workspace\Lucene-Solr-6.x-Windows\solr\build\solr-core\test\J1\temp\solr.schema.TestManagedSchemaAPI_FD633F85EC5E265D-001

	at org.apache.lucene.util.IOUtils.rm(IOUtils.java:323)
	at org.apache.lucene.util.TestRuleTemporaryFilesCleanup.afterAlways(TestRuleTemporaryFilesCleanup.java:216)
	at com.carrotsearch.randomizedtesting.rules.TestRuleAdapter$1.afterAlways(TestRuleAdapter.java:31)
	at com.carrotsearch.randomizedtesting.rules.StatementAdapter.evaluate(StatementAdapter.java:43)
	at com.carrotsearch.randomizedtesting.rules.StatementAdapter.evaluate(StatementAdapter.java:36)
	at org.apache.lucene.util.TestRuleAssertionsRequired$1.evaluate(TestRuleAssertionsRequired.java:53)
	at org.apache.lucene.util.TestRuleMarkFailure$1.evaluate(TestRuleMarkFailure.java:47)
	at org.apache.lucene.util.TestRuleIgnoreAfterMaxFailures$1.evaluate(TestRuleIgnoreAfterMaxFailures.java:64)
	at org.apache.lucene.util.TestRuleIgnoreTestSuites$1.evaluate(TestRuleIgnoreTestSuites.java:54)
	at com.carrotsearch.randomizedtesting.rules.StatementAdapter.evaluate(StatementAdapter.java:36)
	at com.carrotsearch.randomizedtesting.ThreadLeakControl$StatementRunner.run(ThreadLeakControl.java:367)
	at java.lang.Thread.run(Thread.java:745)




Build Log:
[...truncated 12376 lines...]
   [junit4] Suite: org.apache.solr.schema.TestManagedSchemaAPI
   [junit4]   2> Creating dataDir: C:\Users\jenkins\workspace\Lucene-Solr-6.x-Windows\solr\build\solr-core\test\J1\temp\solr.schema.TestManagedSchemaAPI_FD633F85EC5E265D-001\init-core-data-001
   [junit4]   2> 2946226 INFO  (SUITE-TestManagedSchemaAPI-seed#[FD633F85EC5E265D]-worker) [    ] o.a.s.SolrTestCaseJ4 Randomized ssl (false) and clientAuth (false) via: @org.apache.solr.util.RandomizeSSL(reason=, value=NaN, ssl=NaN, clientAuth=NaN)
   [junit4]   2> 2946228 INFO  (SUITE-TestManagedSchemaAPI-seed#[FD633F85EC5E265D]-worker) [    ] o.a.s.c.ZkTestServer STARTING ZK TEST SERVER
   [junit4]   2> 2946228 INFO  (Thread-8058) [    ] o.a.s.c.ZkTestServer client port:0.0.0.0/0.0.0.0:0
   [junit4]   2> 2946228 INFO  (Thread-8058) [    ] o.a.s.c.ZkTestServer Starting server
   [junit4]   2> 2946328 INFO  (SUITE-TestManagedSchemaAPI-seed#[FD633F85EC5E265D]-worker) [    ] o.a.s.c.ZkTestServer start zk server on port:60246
   [junit4]   2> 2946328 INFO  (SUITE-TestManagedSchemaAPI-seed#[FD633F85EC5E265D]-worker) [    ] o.a.s.c.c.SolrZkClient Using default ZkCredentialsProvider
   [junit4]   2> 2946329 INFO  (SUITE-TestManagedSchemaAPI-seed#[FD633F85EC5E265D]-worker) [    ] o.a.s.c.c.ConnectionManager Waiting for client to connect to ZooKeeper
   [junit4]   2> 2946334 INFO  (zkCallback-10697-thread-1) [    ] o.a.s.c.c.ConnectionManager Watcher org.apache.solr.common.cloud.ConnectionManager@61fcc3 name:ZooKeeperConnection Watcher:127.0.0.1:60246 got event WatchedEvent state:SyncConnected type:None path:null path:null type:None
   [junit4]   2> 2946334 INFO  (SUITE-TestManagedSchemaAPI-seed#[FD633F85EC5E265D]-worker) [    ] o.a.s.c.c.ConnectionManager Client is connected to ZooKeeper
   [junit4]   2> 2946335 INFO  (SUITE-TestManagedSchemaAPI-seed#[FD633F85EC5E265D]-worker) [    ] o.a.s.c.c.SolrZkClient Using default ZkACLProvider
   [junit4]   2> 2946335 INFO  (SUITE-TestManagedSchemaAPI-seed#[FD633F85EC5E265D]-worker) [    ] o.a.s.c.c.SolrZkClient makePath: /solr/solr.xml
   [junit4]   2> 2946345 INFO  (jetty-launcher-10696-thread-2) [    ] o.e.j.s.Server jetty-9.3.8.v20160314
   [junit4]   2> 2946345 INFO  (jetty-launcher-10696-thread-1) [    ] o.e.j.s.Server jetty-9.3.8.v20160314
   [junit4]   2> 2946347 INFO  (jetty-launcher-10696-thread-1) [    ] o.e.j.s.h.ContextHandler Started o.e.j.s.ServletContextHandler@1bf760f{/solr,null,AVAILABLE}
   [junit4]   2> 2946347 INFO  (jetty-launcher-10696-thread-2) [    ] o.e.j.s.h.ContextHandler Started o.e.j.s.ServletContextHandler@1ee7cb1{/solr,null,AVAILABLE}
   [junit4]   2> 2946348 INFO  (jetty-launcher-10696-thread-1) [    ] o.e.j.s.ServerConnector Started ServerConnector@f5494b{HTTP/1.1,[http/1.1]}{127.0.0.1:60250}
   [junit4]   2> 2946348 INFO  (jetty-launcher-10696-thread-1) [    ] o.e.j.s.Server Started @2950493ms
   [junit4]   2> 2946348 INFO  (jetty-launcher-10696-thread-1) [    ] o.a.s.c.s.e.JettySolrRunner Jetty properties: {hostContext=/solr, hostPort=60250}
   [junit4]   2> 2946348 INFO  (jetty-launcher-10696-thread-2) [    ] o.e.j.s.ServerConnector Started ServerConnector@19b874{HTTP/1.1,[http/1.1]}{127.0.0.1:60253}
   [junit4]   2> 2946348 INFO  (jetty-launcher-10696-thread-1) [    ] o.a.s.s.SolrDispatchFilter SolrDispatchFilter.init(): sun.misc.Launcher$AppClassLoader@1d16e93
   [junit4]   2> 2946348 INFO  (jetty-launcher-10696-thread-2) [    ] o.e.j.s.Server Started @2950493ms
   [junit4]   2> 2946348 INFO  (jetty-launcher-10696-thread-1) [    ] o.a.s.c.SolrResourceLoader new SolrResourceLoader for directory: 'C:\Users\jenkins\workspace\Lucene-Solr-6.x-Windows\solr\build\solr-core\test\J1\temp\solr.schema.TestManagedSchemaAPI_FD633F85EC5E265D-001\tempDir-001\node1'
   [junit4]   2> 2946348 INFO  (jetty-launcher-10696-thread-2) [    ] o.a.s.c.s.e.JettySolrRunner Jetty properties: {hostContext=/solr, hostPort=60253}
   [junit4]   2> 2946348 INFO  (jetty-launcher-10696-thread-1) [    ] o.a.s.c.SolrResourceLoader JNDI not configured for solr (NoInitialContextEx)
   [junit4]   2> 2946349 INFO  (jetty-launcher-10696-thread-1) [    ] o.a.s.c.SolrResourceLoader solr home defaulted to 'solr/' (could not find system property or JNDI)
   [junit4]   2> 2946349 INFO  (jetty-launcher-10696-thread-2) [    ] o.a.s.s.SolrDispatchFilter SolrDispatchFilter.init(): sun.misc.Launcher$AppClassLoader@1d16e93
   [junit4]   2> 2946349 INFO  (jetty-launcher-10696-thread-2) [    ] o.a.s.c.SolrResourceLoader new SolrResourceLoader for directory: 'C:\Users\jenkins\workspace\Lucene-Solr-6.x-Windows\solr\build\solr-core\test\J1\temp\solr.schema.TestManagedSchemaAPI_FD633F85EC5E265D-001\tempDir-001\node2'
   [junit4]   2> 2946349 INFO  (jetty-launcher-10696-thread-2) [    ] o.a.s.c.SolrResourceLoader JNDI not configured for solr (NoInitialContextEx)
   [junit4]   2> 2946349 INFO  (jetty-launcher-10696-thread-2) [    ] o.a.s.c.SolrResourceLoader solr home defaulted to 'solr/' (could not find system property or JNDI)
   [junit4]   2> 2946349 INFO  (jetty-launcher-10696-thread-1) [    ] o.a.s.c.c.SolrZkClient Using default ZkCredentialsProvider
   [junit4]   2> 2946350 INFO  (jetty-launcher-10696-thread-2) [    ] o.a.s.c.c.SolrZkClient Using default ZkCredentialsProvider
   [junit4]   2> 2946350 INFO  (jetty-launcher-10696-thread-1) [    ] o.a.s.c.c.ConnectionManager Waiting for client to connect to ZooKeeper
   [junit4]   2> 2946350 INFO  (jetty-launcher-10696-thread-2) [    ] o.a.s.c.c.ConnectionManager Waiting for client to connect to ZooKeeper
   [junit4]   2> 2946366 INFO  (zkCallback-10698-thread-1) [    ] o.a.s.c.c.ConnectionManager Watcher org.apache.solr.common.cloud.ConnectionManager@3540f8 name:ZooKeeperConnection Watcher:127.0.0.1:60246/solr got event WatchedEvent state:SyncConnected type:None path:null path:null type:None
   [junit4]   2> 2946366 INFO  (jetty-launcher-10696-thread-1) [    ] o.a.s.c.c.ConnectionManager Client is connected to ZooKeeper
   [junit4]   2> 2946366 INFO  (zkCallback-10699-thread-1) [    ] o.a.s.c.c.ConnectionManager Watcher org.apache.solr.common.cloud.ConnectionManager@1a2e8eb name:ZooKeeperConnection Watcher:127.0.0.1:60246/solr got event WatchedEvent state:SyncConnected type:None path:null path:null type:None
   [junit4]   2> 2946366 INFO  (jetty-launcher-10696-thread-2) [    ] o.a.s.c.c.ConnectionManager Client is connected to ZooKeeper
   [junit4]   2> 2946366 INFO  (jetty-launcher-10696-thread-1) [    ] o.a.s.c.c.SolrZkClient Using default ZkACLProvider
   [junit4]   2> 2946367 INFO  (jetty-launcher-10696-thread-2) [    ] o.a.s.c.c.SolrZkClient Using default ZkACLProvider
   [junit4]   2> 2946368 INFO  (jetty-launcher-10696-thread-1) [    ] o.a.s.s.SolrDispatchFilter solr.xml found in ZooKeeper. Loading...
   [junit4]   2> 2946368 INFO  (jetty-launcher-10696-thread-2) [    ] o.a.s.s.SolrDispatchFilter solr.xml found in ZooKeeper. Loading...
   [junit4]   2> 2946386 WARN  (NIOServerCxn.Factory:0.0.0.0/0.0.0.0:0) [    ] o.a.z.s.NIOServerCnxn caught end of stream exception
   [junit4]   2> EndOfStreamException: Unable to read additional data from client sessionid 0x155a42de40b0001, likely client has closed socket
   [junit4]   2> 	at org.apache.zookeeper.server.NIOServerCnxn.doIO(NIOServerCnxn.java:228)
   [junit4]   2> 	at org.apache.zookeeper.server.NIOServerCnxnFactory.run(NIOServerCnxnFactory.java:208)
   [junit4]   2> 	at java.lang.Thread.run(Thread.java:745)
   [junit4]   2> 2946387 INFO  (jetty-launcher-10696-thread-1) [    ] o.a.s.c.CorePropertiesLocator Config-defined core root directory: C:\Users\jenkins\workspace\Lucene-Solr-6.x-Windows\solr\build\solr-core\test\J1\temp\solr.schema.TestManagedSchemaAPI_FD633F85EC5E265D-001\tempDir-001\node1\.
   [junit4]   2> 2946387 INFO  (jetty-launcher-10696-thread-1) [    ] o.a.s.c.CoreContainer New CoreContainer 17963528
   [junit4]   2> 2946387 INFO  (jetty-launcher-10696-thread-1) [    ] o.a.s.c.CoreContainer Loading cores into CoreContainer [instanceDir=C:\Users\jenkins\workspace\Lucene-Solr-6.x-Windows\solr\build\solr-core\test\J1\temp\solr.schema.TestManagedSchemaAPI_FD633F85EC5E265D-001\tempDir-001\node1]
   [junit4]   2> 2946387 WARN  (jetty-launcher-10696-thread-1) [    ] o.a.s.c.CoreContainer Couldn't add files from C:\Users\jenkins\workspace\Lucene-Solr-6.x-Windows\solr\build\solr-core\test\J1\temp\solr.schema.TestManagedSchemaAPI_FD633F85EC5E265D-001\tempDir-001\node1\lib to classpath: C:\Users\jenkins\workspace\Lucene-Solr-6.x-Windows\solr\build\solr-core\test\J1\temp\solr.schema.TestManagedSchemaAPI_FD633F85EC5E265D-001\tempDir-001\node1\lib
   [junit4]   2> 2946389 INFO  (jetty-launcher-10696-thread-1) [    ] o.a.s.h.c.HttpShardHandlerFactory created with socketTimeout : 90000,urlScheme : ,connTimeout : 15000,maxConnectionsPerHost : 20,maxConnections : 10000,corePoolSize : 0,maximumPoolSize : 2147483647,maxThreadIdleTime : 5,sizeOfQueue : -1,fairnessPolicy : false,useRetries : false,
   [junit4]   2> 2946392 INFO  (jetty-launcher-10696-thread-2) [    ] o.a.s.c.CorePropertiesLocator Config-defined core root directory: C:\Users\jenkins\workspace\Lucene-Solr-6.x-Windows\solr\build\solr-core\test\J1\temp\solr.schema.TestManagedSchemaAPI_FD633F85EC5E265D-001\tempDir-001\node2\.
   [junit4]   2> 2946392 INFO  (jetty-launcher-10696-thread-2) [    ] o.a.s.c.CoreContainer New CoreContainer 3996466
   [junit4]   2> 2946392 INFO  (jetty-launcher-10696-thread-2) [    ] o.a.s.c.CoreContainer Loading cores into CoreContainer [instanceDir=C:\Users\jenkins\workspace\Lucene-Solr-6.x-Windows\solr\build\solr-core\test\J1\temp\solr.schema.TestManagedSchemaAPI_FD633F85EC5E265D-001\tempDir-001\node2]
   [junit4]   2> 2946392 WARN  (jetty-launcher-10696-thread-2) [    ] o.a.s.c.CoreContainer Couldn't add files from C:\Users\jenkins\workspace\Lucene-Solr-6.x-Windows\solr\build\solr-core\test\J1\temp\solr.schema.TestManagedSchemaAPI_FD633F85EC5E265D-001\tempDir-001\node2\lib to classpath: C:\Users\jenkins\workspace\Lucene-Solr-6.x-Windows\solr\build\solr-core\test\J1\temp\solr.schema.TestManagedSchemaAPI_FD633F85EC5E265D-001\tempDir-001\node2\lib
   [junit4]   2> 2946393 INFO  (jetty-launcher-10696-thread-1) [    ] o.a.s.u.UpdateShardHandler Creating UpdateShardHandler HTTP client with params: socketTimeout=340000&connTimeout=45000&retry=true
   [junit4]   2> 2946393 INFO  (jetty-launcher-10696-thread-2) [    ] o.a.s.h.c.HttpShardHandlerFactory created with socketTimeout : 90000,urlScheme : ,connTimeout : 15000,maxConnectionsPerHost : 20,maxConnections : 10000,corePoolSize : 0,maximumPoolSize : 2147483647,maxThreadIdleTime : 5,sizeOfQueue : -1,fairnessPolicy : false,useRetries : false,
   [junit4]   2> 2946393 INFO  (jetty-launcher-10696-thread-1) [    ] o.a.s.l.LogWatcher SLF4J impl is org.slf4j.impl.Log4jLoggerFactory
   [junit4]   2> 2946394 INFO  (jetty-launcher-10696-thread-1) [    ] o.a.s.l.LogWatcher Registering Log Listener [Log4j (org.slf4j.impl.Log4jLoggerFactory)]
   [junit4]   2> 2946394 INFO  (jetty-launcher-10696-thread-1) [    ] o.a.s.c.ZkContainer Zookeeper client=127.0.0.1:60246/solr
   [junit4]   2> 2946394 INFO  (jetty-launcher-10696-thread-1) [    ] o.a.s.c.ZkController zkHost includes chroot
   [junit4]   2> 2946394 INFO  (jetty-launcher-10696-thread-2) [    ] o.a.s.u.UpdateShardHandler Creating UpdateShardHandler HTTP client with params: socketTimeout=340000&connTimeout=45000&retry=true
   [junit4]   2> 2946394 INFO  (jetty-launcher-10696-thread-1) [    ] o.a.s.c.c.SolrZkClient Using default ZkCredentialsProvider
   [junit4]   2> 2946395 INFO  (jetty-launcher-10696-thread-2) [    ] o.a.s.l.LogWatcher SLF4J impl is org.slf4j.impl.Log4jLoggerFactory
   [junit4]   2> 2946395 INFO  (jetty-launcher-10696-thread-2) [    ] o.a.s.l.LogWatcher Registering Log Listener [Log4j (org.slf4j.impl.Log4jLoggerFactory)]
   [junit4]   2> 2946395 INFO  (jetty-launcher-10696-thread-2) [    ] o.a.s.c.ZkContainer Zookeeper client=127.0.0.1:60246/solr
   [junit4]   2> 2946395 INFO  (jetty-launcher-10696-thread-2) [    ] o.a.s.c.ZkController zkHost includes chroot
   [junit4]   2> 2946395 INFO  (jetty-launcher-10696-thread-2) [    ] o.a.s.c.c.SolrZkClient Using default ZkCredentialsProvider
   [junit4]   2> 2946395 INFO  (jetty-launcher-10696-thread-1) [    ] o.a.s.c.c.ConnectionManager Waiting for client to connect to ZooKeeper
   [junit4]   2> 2946396 INFO  (jetty-launcher-10696-thread-2) [    ] o.a.s.c.c.ConnectionManager Waiting for client to connect to ZooKeeper
   [junit4]   2> 2946399 INFO  (zkCallback-10704-thread-1) [    ] o.a.s.c.c.ConnectionManager Watcher org.apache.solr.common.cloud.ConnectionManager@1248302 name:ZooKeeperConnection Watcher:127.0.0.1:60246 got event WatchedEvent state:SyncConnected type:None path:null path:null type:None
   [junit4]   2> 2946399 INFO  (jetty-launcher-10696-thread-1) [    ] o.a.s.c.c.ConnectionManager Client is connected to ZooKeeper
   [junit4]   2> 2946399 INFO  (zkCallback-10705-thread-1) [    ] o.a.s.c.c.ConnectionManager Watcher org.apache.solr.common.cloud.ConnectionManager@64cc28 name:ZooKeeperConnection Watcher:127.0.0.1:60246 got event WatchedEvent state:SyncConnected type:None path:null path:null type:None
   [junit4]   2> 2946399 INFO  (jetty-launcher-10696-thread-2) [    ] o.a.s.c.c.ConnectionManager Client is connected to ZooKeeper
   [junit4]   2> 2946399 INFO  (jetty-launcher-10696-thread-1) [    ] o.a.s.c.c.SolrZkClient Using default ZkACLProvider
   [junit4]   2> 2946400 INFO  (jetty-launcher-10696-thread-2) [    ] o.a.s.c.c.SolrZkClient Using default ZkACLProvider
   [junit4]   2> 2946401 INFO  (jetty-launcher-10696-thread-1) [n:127.0.0.1:60250_solr    ] o.a.s.c.ZkController Added new OnReconnect listener org.apache.solr.cloud.ZkController$$Lambda$45/31500522@40c668
   [junit4]   2> 2946402 WARN  (NIOServerCxn.Factory:0.0.0.0/0.0.0.0:0) [    ] o.a.z.s.NIOServerCnxn caught end of stream exception
   [junit4]   2> EndOfStreamException: Unable to read additional data from client sessionid 0x155a42de40b0003, likely client has closed socket
   [junit4]   2> 	at org.apache.zookeeper.server.NIOServerCnxn.doIO(NIOServerCnxn.java:228)
   [junit4]   2> 	at org.apache.zookeeper.server.NIOServerCnxnFactory.run(NIOServerCnxnFactory.java:208)
   [junit4]   2> 	at java.lang.Thread.run(Thread.java:745)
   [junit4]   2> 2946404 INFO  (jetty-launcher-10696-thread-1) [n:127.0.0.1:60250_solr    ] o.a.s.c.c.ConnectionManager Waiting for client to connect to ZooKeeper
   [junit4]   2> 2946405 INFO  (jetty-launcher-10696-thread-2) [n:127.0.0.1:60253_solr    ] o.a.s.c.ZkController Added new OnReconnect listener org.apache.solr.cloud.ZkController$$Lambda$45/31500522@1149d52
   [junit4]   2> 2946406 INFO  (jetty-launcher-10696-thread-2) [n:127.0.0.1:60253_solr    ] o.a.s.c.c.ConnectionManager Waiting for client to connect to ZooKeeper
   [junit4]   2> 2946408 INFO  (zkCallback-10706-thread-1-processing-n:127.0.0.1:60250_solr) [n:127.0.0.1:60250_solr    ] o.a.s.c.c.ConnectionManager Watcher org.apache.solr.common.cloud.ConnectionManager@14046d9 name:ZooKeeperConnection Watcher:127.0.0.1:60246/solr got event WatchedEvent state:SyncConnected type:None path:null path:null type:None
   [junit4]   2> 2946408 INFO  (jetty-launcher-10696-thread-1) [n:127.0.0.1:60250_solr    ] o.a.s.c.c.ConnectionManager Client is connected to ZooKeeper
   [junit4]   2> 2946409 INFO  (zkCallback-10707-thread-1-processing-n:127.0.0.1:60253_solr) [n:127.0.0.1:60253_solr    ] o.a.s.c.c.ConnectionManager Watcher org.apache.solr.common.cloud.ConnectionManager@19051b4 name:ZooKeeperConnection Watcher:127.0.0.1:60246/solr got event WatchedEvent state:SyncConnected type:None path:null path:null type:None
   [junit4]   2> 2946410 INFO  (jetty-launcher-10696-thread-2) [n:127.0.0.1:60253_solr    ] o.a.s.c.c.ConnectionManager Client is connected to ZooKeeper
   [junit4]   2> 2946410 INFO  (jetty-launcher-10696-thread-1) [n:127.0.0.1:60250_solr    ] o.a.s.c.c.SolrZkClient makePath: /overseer/queue
   [junit4]   2> 2946413 INFO  (jetty-launcher-10696-thread-2) [n:127.0.0.1:60253_solr    ] o.a.s.c.c.SolrZkClient makePath: /overseer/queue
   [junit4]   2> 2946417 INFO  (jetty-launcher-10696-thread-1) [n:127.0.0.1:60250_solr    ] o.a.s.c.c.SolrZkClient makePath: /overseer/collection-queue-work
   [junit4]   2> 2946419 INFO  (jetty-launcher-10696-thread-2) [n:127.0.0.1:60253_solr    ] o.a.s.c.c.SolrZkClient makePath: /overseer/collection-queue-work
   [junit4]   2> 2946424 INFO  (jetty-launcher-10696-thread-1) [n:127.0.0.1:60250_solr    ] o.a.s.c.c.SolrZkClient makePath: /overseer/collection-map-running
   [junit4]   2> 2946426 INFO  (jetty-launcher-10696-thread-2) [n:127.0.0.1:60253_solr    ] o.a.s.c.c.SolrZkClient makePath: /overseer/collection-map-running
   [junit4]   2> 2946428 INFO  (jetty-launcher-10696-thread-1) [n:127.0.0.1:60250_solr    ] o.a.s.c.c.SolrZkClient makePath: /overseer/collection-map-completed
   [junit4]   2> 2946430 INFO  (jetty-launcher-10696-thread-2) [n:127.0.0.1:60253_solr    ] o.a.s.c.c.SolrZkClient makePath: /overseer/collection-map-completed
   [junit4]   2> 2946432 INFO  (jetty-launcher-10696-thread-1) [n:127.0.0.1:60250_solr    ] o.a.s.c.c.SolrZkClient makePath: /overseer/collection-map-failure
   [junit4]   2> 2946433 INFO  (jetty-launcher-10696-thread-2) [n:127.0.0.1:60253_solr    ] o.a.s.c.c.SolrZkClient makePath: /overseer/collection-map-failure
   [junit4]   2> 2946435 INFO  (jetty-launcher-10696-thread-1) [n:127.0.0.1:60250_solr    ] o.a.s.c.c.SolrZkClient makePath: /live_nodes
   [junit4]   2> 2946437 INFO  (jetty-launcher-10696-thread-2) [n:127.0.0.1:60253_solr    ] o.a.s.c.c.SolrZkClient makePath: /live_nodes
   [junit4]   2> 2946440 INFO  (jetty-launcher-10696-thread-1) [n:127.0.0.1:60250_solr    ] o.a.s.c.c.SolrZkClient makePath: /collections
   [junit4]   2> 2946440 INFO  (jetty-launcher-10696-thread-2) [n:127.0.0.1:60253_solr    ] o.a.s.c.c.SolrZkClient makePath: /collections
   [junit4]   2> 2946443 INFO  (jetty-launcher-10696-thread-2) [n:127.0.0.1:60253_solr    ] o.a.s.c.c.SolrZkClient makePath: /aliases.json
   [junit4]   2> 2946443 INFO  (jetty-launcher-10696-thread-1) [n:127.0.0.1:60250_solr    ] o.a.s.c.c.SolrZkClient makePath: /aliases.json
   [junit4]   2> 2946446 INFO  (jetty-launcher-10696-thread-1) [n:127.0.0.1:60250_solr    ] o.a.s.c.c.SolrZkClient makePath: /clusterstate.json
   [junit4]   2> 2946446 INFO  (jetty-launcher-10696-thread-2) [n:127.0.0.1:60253_solr    ] o.a.s.c.c.SolrZkClient makePath: /clusterstate.json
   [junit4]   2> 2946449 INFO  (jetty-launcher-10696-thread-2) [n:127.0.0.1:60253_solr    ] o.a.s.c.c.SolrZkClient makePath: /security.json
   [junit4]   2> 2946449 INFO  (jetty-launcher-10696-thread-1) [n:127.0.0.1:60250_solr    ] o.a.s.c.c.SolrZkClient makePath: /security.json
   [junit4]   2> 2946451 INFO  (jetty-launcher-10696-thread-1) [n:127.0.0.1:60250_solr    ] o.a.s.c.c.ZkStateReader Updating cluster state from ZooKeeper... 
   [junit4]   2> 2946451 INFO  (jetty-launcher-10696-thread-2) [n:127.0.0.1:60253_solr    ] o.a.s.c.c.ZkStateReader Updating cluster state from ZooKeeper... 
   [junit4]   2> 2946453 INFO  (jetty-launcher-10696-thread-1) [n:127.0.0.1:60250_solr    ] o.a.s.c.c.ZkStateReader Loaded empty cluster properties
   [junit4]   2> 2946453 INFO  (jetty-launcher-10696-thread-2) [n:127.0.0.1:60253_solr    ] o.a.s.c.c.ZkStateReader Loaded empty cluster properties
   [junit4]   2> 2946454 INFO  (jetty-launcher-10696-thread-2) [n:127.0.0.1:60253_solr    ] o.a.s.c.c.ZkStateReader Updated live nodes from ZooKeeper... (0) -> (0)
   [junit4]   2> 2946455 INFO  (jetty-launcher-10696-thread-1) [n:127.0.0.1:60250_solr    ] o.a.s.c.c.ZkStateReader Updated live nodes from ZooKeeper... (0) -> (0)
   [junit4]   2> 2946461 INFO  (jetty-launcher-10696-thread-2) [n:127.0.0.1:60253_solr    ] o.a.s.c.c.SolrZkClient makePath: /overseer_elect
   [junit4]   2> 2946462 INFO  (jetty-launcher-10696-thread-1) [n:127.0.0.1:60250_solr    ] o.a.s.c.c.SolrZkClient makePath: /overseer_elect
   [junit4]   2> 2946464 INFO  (jetty-launcher-10696-thread-1) [n:127.0.0.1:60250_solr    ] o.a.s.c.c.SolrZkClient makePath: /overseer_elect/election
   [junit4]   2> 2946464 INFO  (jetty-launcher-10696-thread-2) [n:127.0.0.1:60253_solr    ] o.a.s.c.c.SolrZkClient makePath: /overseer_elect/election
   [junit4]   2> 2946466 INFO  (jetty-launcher-10696-thread-2) [n:127.0.0.1:60253_solr    ] o.a.s.c.Overseer Overseer (id=null) closing
   [junit4]   2> 2946467 INFO  (jetty-launcher-10696-thread-2) [n:127.0.0.1:60253_solr    ] o.a.s.c.LeaderElector Joined leadership election with path: /overseer_elect/election/96163484064743430-127.0.0.1:60253_solr-n_0000000000
   [junit4]   2> 2946467 INFO  (jetty-launcher-10696-thread-1) [n:127.0.0.1:60250_solr    ] o.a.s.c.Overseer Overseer (id=null) closing
   [junit4]   2> 2946467 INFO  (jetty-launcher-10696-thread-2) [n:127.0.0.1:60253_solr    ] o.a.s.c.OverseerElectionContext I am going to be the leader 127.0.0.1:60253_solr
   [junit4]   2> 2946467 INFO  (jetty-launcher-10696-thread-2) [n:127.0.0.1:60253_solr    ] o.a.s.c.c.SolrZkClient makePath: /overseer_elect/leader
   [junit4]   2> 2946467 INFO  (jetty-launcher-10696-thread-1) [n:127.0.0.1:60250_solr    ] o.a.s.c.LeaderElector Joined leadership election with path: /overseer_elect/election/96163484064743429-127.0.0.1:60250_solr-n_0000000001
   [junit4]   2> 2946469 INFO  (jetty-launcher-10696-thread-1) [n:127.0.0.1:60250_solr    ] o.a.s.c.LeaderElector Watching path /overseer_elect/election/96163484064743430-127.0.0.1:60253_solr-n_0000000000 to know if I could be the leader
   [junit4]   2> 2946470 INFO  (jetty-launcher-10696-thread-1) [n:127.0.0.1:60250_solr    ] o.a.s.c.ZkController Register node as live in ZooKeeper:/live_nodes/127.0.0.1:60250_solr
   [junit4]   2> 2946470 INFO  (jetty-launcher-10696-thread-1) [n:127.0.0.1:60250_solr    ] o.a.s.c.c.SolrZkClient makePath: /live_nodes/127.0.0.1:60250_solr
   [junit4]   2> 2946471 INFO  (jetty-launcher-10696-thread-2) [n:127.0.0.1:60253_solr    ] o.a.s.c.Overseer Overseer (id=96163484064743430-127.0.0.1:60253_solr-n_0000000000) starting
   [junit4]   2> 2946474 INFO  (zkCallback-10706-thread-1-processing-n:127.0.0.1:60250_solr) [n:127.0.0.1:60250_solr    ] o.a.s.c.c.ZkStateReader A live node change: [WatchedEvent state:SyncConnected type:NodeChildrenChanged path:/live_nodes], has occurred - updating... (live nodes size: [0])
   [junit4]   2> 2946474 INFO  (zkCallback-10707-thread-1-processing-n:127.0.0.1:60253_solr) [n:127.0.0.1:60253_solr    ] o.a.s.c.c.ZkStateReader A live node change: [WatchedEvent state:SyncConnected type:NodeChildrenChanged path:/live_nodes], has occurred - updating... (live nodes size: [0])
   [junit4]   2> 2946476 INFO  (zkCallback-10707-thread-1-processing-n:127.0.0.1:60253_solr) [n:127.0.0.1:60253_solr    ] o.a.s.c.c.ZkStateReader Updated live nodes from ZooKeeper... (0) -> (1)
   [junit4]   2> 2946477 INFO  (zkCallback-10706-thread-1-processing-n:127.0.0.1:60250_solr) [n:127.0.0.1:60250_solr    ] o.a.s.c.c.ZkStateReader Updated live nodes from ZooKeeper... (0) -> (1)
   [junit4]   2> 2946478 INFO  (jetty-launcher-10696-thread-2) [n:127.0.0.1:60253_solr    ] o.a.s.c.c.SolrZkClient makePath: /overseer/queue-work
   [junit4]   2> 2946493 INFO  (jetty-launcher-10696-thread-2) [n:127.0.0.1:60253_solr    ] o.a.s.c.OverseerAutoReplicaFailoverThread Starting OverseerAutoReplicaFailoverThread autoReplicaFailoverWorkLoopDelay=10000 autoReplicaFailoverWaitAfterExpiration=30000 autoReplicaFailoverBadNodeExpiration=60000
   [junit4]   2> 2946494 INFO  (OverseerCollectionConfigSetProcessor-96163484064743430-127.0.0.1:60253_solr-n_0000000000) [n:127.0.0.1:60253_solr    ] o.a.s.c.OverseerTaskProcessor Process current queue of overseer operations
   [junit4]   2> 2946494 INFO  (jetty-launcher-10696-thread-2) [n:127.0.0.1:60253_solr    ] o.a.s.c.ZkController Publish node=127.0.0.1:60253_solr as DOWN
   [junit4]   2> 2946495 INFO  (OverseerStateUpdate-96163484064743430-127.0.0.1:60253_solr-n_0000000000) [n:127.0.0.1:60253_solr    ] o.a.s.c.Overseer Starting to work on the main queue
   [junit4]   2> 2946498 INFO  (jetty-launcher-10696-thread-2) [n:127.0.0.1:60253_solr    ] o.a.s.c.ZkController Register node as live in ZooKeeper:/live_nodes/127.0.0.1:60253_solr
   [junit4]   2> 2946498 INFO  (jetty-launcher-10696-thread-2) [n:127.0.0.1:60253_solr    ] o.a.s.c.c.SolrZkClient makePath: /live_nodes/127.0.0.1:60253_solr
   [junit4]   2> 2946500 INFO  (OverseerStateUpdate-96163484064743430-127.0.0.1:60253_solr-n_0000000000) [n:127.0.0.1:60253_solr    ] o.a.s.c.c.ZkStateReader Updated live nodes from ZooKeeper... (1) -> (1)
   [junit4]   2> 2946503 INFO  (zkCallback-10706-thread-1-processing-n:127.0.0.1:60250_solr) [n:127.0.0.1:60250_solr    ] o.a.s.c.c.ZkStateReader A live node change: [WatchedEvent state:SyncConnected type:NodeChildrenChanged path:/live_nodes], has occurred - updating... (live nodes size: [1])
   [junit4]   2> 2946503 INFO  (zkCallback-10707-thread-1-processing-n:127.0.0.1:60253_solr) [n:127.0.0.1:60253_solr    ] o.a.s.c.c.ZkStateReader A live node change: [WatchedEvent state:SyncConnected type:NodeChildrenChanged path:/live_nodes], has occurred - updating... (live nodes size: [1])
   [junit4]   2> 2946504 INFO  (zkCallback-10707-thread-1-processing-n:127.0.0.1:60253_solr) [n:127.0.0.1:60253_solr    ] o.a.s.c.c.ZkStateReader Updated live nodes from ZooKeeper... (1) -> (2)
   [junit4]   2> 2946506 INFO  (zkCallback-10706-thread-1-processing-n:127.0.0.1:60250_solr) [n:127.0.0.1:60250_solr    ] o.a.s.c.c.ZkStateReader Updated live nodes from ZooKeeper... (1) -> (2)
   [junit4]   2> 2946507 INFO  (OverseerStateUpdate-96163484064743430-127.0.0.1:60253_solr-n_0000000000) [n:127.0.0.1:60253_solr    ] o.a.s.c.Overseer processMessage: queueSize: 1, message = {
   [junit4]   2>   "operation":"downnode",
   [junit4]   2>   "node_name":"127.0.0.1:60253_solr"} current state version: 0
   [junit4]   2> 2946507 INFO  (OverseerStateUpdate-96163484064743430-127.0.0.1:60253_solr-n_0000000000) [n:127.0.0.1:60253_solr    ] o.a.s.c.o.NodeMutator DownNode state invoked for node: 127.0.0.1:60253_solr
   [junit4]   2> 2946523 INFO  (jetty-launcher-10696-thread-1) [n:127.0.0.1:60250_solr    ] o.a.s.c.CoreContainer Security conf doesn't exist. Skipping setup for authorization module.
   [junit4]   2> 2946523 INFO  (jetty-launcher-10696-thread-1) [n:127.0.0.1:60250_solr    ] o.a.s.c.CoreContainer No authentication plugin used.
   [junit4]   2> 2946524 INFO  (jetty-launcher-10696-thread-1) [n:127.0.0.1:60250_solr    ] o.a.s.c.CorePropertiesLocator Looking for core definitions underneath C:\Users\jenkins\workspace\Lucene-Solr-6.x-Windows\solr\build\solr-core\test\J1\temp\solr.schema.TestManagedSchemaAPI_FD633F85EC5E265D-001\tempDir-001\node1\.
   [junit4]   2> 2946525 INFO  (jetty-launcher-10696-thread-1) [n:127.0.0.1:60250_solr    ] o.a.s.c.CorePropertiesLocator Found 0 core definitions
   [junit4]   2> 2946526 INFO  (jetty-launcher-10696-thread-1) [n:127.0.0.1:60250_solr    ] o.a.s.s.SolrDispatchFilter user.dir=C:\Users\jenkins\workspace\Lucene-Solr-6.x-Windows\solr\build\solr-core\test\J1
   [junit4]   2> 2946526 INFO  (jetty-launcher-10696-thread-1) [n:127.0.0.1:60250_solr    ] o.a.s.s.SolrDispatchFilter SolrDispatchFilter.init() done
   [junit4]   2> 2946553 INFO  (jetty-launcher-10696-thread-2) [n:127.0.0.1:60253_solr    ] o.a.s.c.CoreContainer Security conf doesn't exist. Skipping setup for authorization module.
   [junit4]   2> 2946553 INFO  (jetty-launcher-10696-thread-2) [n:127.0.0.1:60253_solr    ] o.a.s.c.CoreContainer No authentication plugin used.
   [junit4]   2> 2946554 INFO  (jetty-launcher-10696-thread-2) [n:127.0.0.1:60253_solr    ] o.a.s.c.CorePropertiesLocator Looking for core definitions underneath C:\Users\jenkins\workspace\Lucene-Solr-6.x-Windows\solr\build\solr-core\test\J1\temp\solr.schema.TestManagedSchemaAPI_FD633F85EC5E265D-001\tempDir-001\node2\.
   [junit4]   2> 2946555 INFO  (jetty-launcher-10696-thread-2) [n:127.0.0.1:60253_solr    ] o.a.s.c.CorePropertiesLocator Found 0 core definitions
   [junit4]   2> 2946557 INFO  (jetty-launcher-10696-thread-2) [n:127.0.0.1:60253_solr    ] o.a.s.s.SolrDispatchFilter user.dir=C:\Users\jenkins\workspace\Lucene-Solr-6.x-Windows\solr\build\solr-core\test\J1
   [junit4]   2> 2946557 INFO  (jetty-launcher-10696-thread-2) [n:127.0.0.1:60253_solr    ] o.a.s.s.SolrDispatchFilter SolrDispatchFilter.init() done
   [junit4]   2> 2946557 INFO  (SUITE-TestManagedSchemaAPI-seed#[FD633F85EC5E265D]-worker) [    ] o.a.s.c.c.SolrZkClient Using default ZkCredentialsProvider
   [junit4]   2> 2946558 INFO  (SUITE-TestManagedSchemaAPI-seed#[FD633F85EC5E265D]-worker) [    ] o.a.s.c.c.ConnectionManager Waiting for client to connect to ZooKeeper
   [junit4]   2> 2946560 INFO  (zkCallback-10710-thread-1) [    ] o.a.s.c.c.ConnectionManager Watcher org.apache.solr.common.cloud.ConnectionManager@17138c2 name:ZooKeeperConnection Watcher:127.0.0.1:60246 got event WatchedEvent state:SyncConnected type:None path:null path:null type:None
   [junit4]   2> 2946560 INFO  (SUITE-TestManagedSchemaAPI-seed#[FD633F85EC5E265D]-worker) [    ] o.a.s.c.c.ConnectionManager Client is connected to ZooKeeper
   [junit4]   2> 2946560 INFO  (SUITE-TestManagedSchemaAPI-seed#[FD633F85EC5E265D]-worker) [    ] o.a.s.c.c.SolrZkClient Using default ZkACLProvider
   [junit4]   2> 2946563 WARN  (NIOServerCxn.Factory:0.0.0.0/0.0.0.0:0) [    ] o.a.z.s.NIOServerCnxn caught end of stream exception
   [junit4]   2> EndOfStreamException: Unable to read additional data from client sessionid 0x155a42de40b0007, likely client has closed socket
   [junit4]   2> 	at org.apache.zookeeper.server.NIOServerCnxn.doIO(NIOServerCnxn.java:228)
   [junit4]   2> 	at org.apache.zookeeper.server.NIOServerCnxnFactory.run(NIOServerCnxnFactory.java:208)
   [junit4]   2> 	at java.lang.Thread.run(Thread.java:745)
   [junit4]   2> 2946565 INFO  (SUITE-TestManagedSchemaAPI-seed#[FD633F85EC5E265D]-worker) [    ] o.a.s.c.s.i.CloudSolrClient Final constructed zkHost string: 127.0.0.1:60246/solr
   [junit4]   2> 2946565 INFO  (SUITE-TestManagedSchemaAPI-seed#[FD633F85EC5E265D]-worker) [    ] o.a.s.c.c.SolrZkClient Using default ZkCredentialsProvider
   [junit4]   2> 2946566 INFO  (SUITE-TestManagedSchemaAPI-seed#[FD633F85EC5E265D]-worker) [    ] o.a.s.c.c.ConnectionManager Waiting for client to connect to ZooKeeper
   [junit4]   2> 2946570 INFO  (zkCallback-10713-thread-1) [    ] o.a.s.c.c.ConnectionManager Watcher org.apache.solr.common.cloud.ConnectionManager@fe253f name:ZooKeeperConnection Watcher:127.0.0.1:60246/solr got event WatchedEvent state:SyncConnected type:None path:null path:null type:None
   [junit4]   2> 2946570 INFO  (SUITE-TestManagedSchemaAPI-seed#[FD633F85EC5E265D]-worker) [    ] o.a.s.c.c.ConnectionManager Client is connected to ZooKeeper
   [junit4]   2> 2946570 INFO  (SUITE-TestManagedSchemaAPI-seed#[FD633F85EC5E265D]-worker) [    ] o.a.s.c.c.SolrZkClient Using default ZkACLProvider
   [junit4]   2> 2946570 INFO  (SUITE-TestManagedSchemaAPI-seed#[FD633F85EC5E265D]-worker) [    ] o.a.s.c.c.ZkStateReader Updating cluster state from ZooKeeper... 
   [junit4]   2> 2946571 INFO  (SUITE-TestManagedSchemaAPI-seed#[FD633F85EC5E265D]-worker) [    ] o.a.s.c.c.ZkStateReader Loaded empty cluster properties
   [junit4]   2> 2946573 INFO  (SUITE-TestManagedSchemaAPI-seed#[FD633F85EC5E265D]-worker) [    ] o.a.s.c.c.ZkStateReader Updated live nodes from ZooKeeper... (0) -> (2)
   [junit4]   2> 2946577 INFO  (SUITE-TestManagedSchemaAPI-seed#[FD633F85EC5E265D]-worker) [    ] o.a.s.c.c.SolrZkClient makePath: /configs/conf1/managed-schema
   [junit4]   2> 2946582 INFO  (SUITE-TestManagedSchemaAPI-seed#[FD633F85EC5E265D]-worker) [    ] o.a.s.c.c.SolrZkClient makePath: /configs/conf1/solrconfig.xml
   [junit4]   2> 2946610 INFO  (TEST-TestManagedSchemaAPI.test-seed#[FD633F85EC5E265D]) [    ] o.a.s.SolrTestCaseJ4 ###Starting test
   [junit4]   2> 2946616 INFO  (qtp5547021-47635) [n:127.0.0.1:60253_solr    ] o.a.s.h.a.CollectionsHandler Invoked Collection Action :create with params replicationFactor=2&collection.configName=conf1&name=testschemaapi&action=CREATE&numShards=1&wt=javabin&version=2 and sendToOCPQueue=true
   [junit4]   2> 2946621 INFO  (OverseerCollectionConfigSetProcessor-96163484064743430-127.0.0.1:60253_solr-n_0000000000) [n:127.0.0.1:60253_solr    ] o.a.s.c.OverseerTaskProcessor Overseer Collection Message Handler: Get the message id:/overseer/collection-queue-work/qn-0000000000 message:{
   [junit4]   2>   "name":"testschemaapi",
   [junit4]   2>   "fromApi":"true",
   [junit4]   2>   "replicationFactor":"2",
   [junit4]   2>   "collection.configName":"conf1",
   [junit4]   2>   "numShards":"1",
   [junit4]   2>   "stateFormat":"2",
   [junit4]   2>   "operation":"create"}
   [junit4]   2> 2946622 INFO  (OverseerThreadFactory-12226-thread-1-processing-n:127.0.0.1:60253_solr) [n:127.0.0.1:60253_solr    ] o.a.s.c.OverseerCollectionMessageHandler OverseerCollectionMessageHandler.processMessage : create , {
   [junit4]   2>   "name":"testschemaapi",
   [junit4]   2>   "fromApi":"true",
   [junit4]   2>   "replicationFactor":"2",
   [junit4]   2>   "collection.configName":"conf1",
   [junit4]   2>   "numShards":"1",
   [junit4]   2>   "stateFormat":"2",
   [junit4]   2>   "operation":"create"}
   [junit4]   2> 2946622 INFO  (OverseerThreadFactory-12226-thread-1-processing-n:127.0.0.1:60253_solr) [n:127.0.0.1:60253_solr    ] o.a.s.c.OverseerCollectionMessageHandler Create collection testschemaapi
   [junit4]   2> 2946623 INFO  (OverseerThreadFactory-12226-thread-1-processing-n:127.0.0.1:60253_solr) [n:127.0.0.1:60253_solr    ] o.a.s.c.OverseerCollectionMessageHandler creating collections conf node /collections/testschemaapi 
   [junit4]   2> 2946623 INFO  (OverseerThreadFactory-12226-thread-1-processing-n:127.0.0.1:60253_solr) [n:127.0.0.1:60253_solr    ] o.a.s.c.c.SolrZkClient makePath: /collections/testschemaapi
   [junit4]   2> 2946626 INFO  (zkCallback-10706-thread-1-processing-n:127.0.0.1:60250_solr) [n:127.0.0.1:60250_solr    ] o.a.s.c.c.ZkStateReader A collections change: [WatchedEvent state:SyncConnected type:NodeChildrenChanged path:/collections], has occurred - updating...
   [junit4]   2> 2946626 INFO  (zkCallback-10707-thread-1-processing-n:127.0.0.1:60253_solr) [n:127.0.0.1:60253_solr    ] o.a.s.c.c.ZkStateReader A collections change: [WatchedEvent state:SyncConnected type:NodeChildrenChanged path:/collections], has occurred - updating...
   [junit4]   2> 2946626 INFO  (zkCallback-10713-thread-1) [    ] o.a.s.c.c.ZkStateReader A collections change: [WatchedEvent state:SyncConnected type:NodeChildrenChanged path:/collections], has occurred - updating...
   [junit4]   2> 2946635 INFO  (OverseerStateUpdate-96163484064743430-127.0.0.1:60253_solr-n_0000000000) [n:127.0.0.1:60253_solr    ] o.a.s.c.Overseer processMessage: queueSize: 1, message = {
   [junit4]   2>   "name":"testschemaapi",
   [junit4]   2>   "fromApi":"true",
   [junit4]   2>   "replicationFactor":"2",
   [junit4]   2>   "collection.configName":"conf1",
   [junit4]   2>   "numShards":"1",
   [junit4]   2>   "stateFormat":"2",
   [junit4]   2>   "operation":"create"} current state version: 0
   [junit4]   2> 2946635 INFO  (OverseerStateUpdate-96163484064743430-127.0.0.1:60253_solr-n_0000000000) [n:127.0.0.1:60253_solr    ] o.a.s.c.o.ClusterStateMutator building a new cName: testschemaapi
   [junit4]   2> 2946638 INFO  (OverseerStateUpdate-96163484064743430-127.0.0.1:60253_solr-n_0000000000) [n:127.0.0.1:60253_solr    ] o.a.s.c.o.ZkStateWriter going to create_collection /collections/testschemaapi/state.json
   [junit4]   2> 2946734 INFO  (OverseerThreadFactory-12226-thread-1-processing-n:127.0.0.1:60253_solr) [n:127.0.0.1:60253_solr    ] o.a.s.c.OverseerCollectionMessageHandler Creating SolrCores for new collection testschemaapi, shardNames [shard1] , replicationFactor : 2
   [junit4]   2> 2946734 INFO  (OverseerThreadFactory-12226-thread-1-processing-n:127.0.0.1:60253_solr) [n:127.0.0.1:60253_solr    ] o.a.s.c.OverseerCollectionMessageHandler Creating core testschemaapi_shard1_replica1 as part of shard shard1 of collection testschemaapi on 127.0.0.1:60253_solr
   [junit4]   2> 2946735 INFO  (OverseerThreadFactory-12226-thread-1-processing-n:127.0.0.1:60253_solr) [n:127.0.0.1:60253_solr    ] o.a.s.c.OverseerCollectionMessageHandler Creating core testschemaapi_shard1_replica2 as part of shard shard1 of collection testschemaapi on 127.0.0.1:60250_solr
   [junit4]   2> 2946742 INFO  (qtp5547021-47636) [n:127.0.0.1:60253_solr    ] o.a.s.h.a.CoreAdminOperation core create command qt=/admin/cores&collection.configName=conf1&name=testschemaapi_shard1_replica1&action=CREATE&numShards=1&collection=testschemaapi&shard=shard1&wt=javabin&version=2
   [junit4]   2> 2946742 INFO  (qtp7552249-47637) [n:127.0.0.1:60250_solr    ] o.a.s.h.a.CoreAdminOperation core create command qt=/admin/cores&collection.configName=conf1&name=testschemaapi_shard1_replica2&action=CREATE&numShards=1&collection=testschemaapi&shard=shard1&wt=javabin&version=2
   [junit4]   2> 2946745 INFO  (qtp5547021-47636) [n:127.0.0.1:60253_solr    ] o.a.s.c.CoreDescriptor Created CoreDescriptor: {name=testschemaapi_shard1_replica1, collection.configName=conf1, config=solrconfig.xml, transient=false, schema=schema.xml, loadOnStartup=true, configSetProperties=configsetprops.json, collection=testschemaapi, numShards=1, dataDir=data\, shard=shard1}
   [junit4]   2> 2946745 INFO  (qtp7552249-47637) [n:127.0.0.1:60250_solr    ] o.a.s.c.CoreDescriptor Created CoreDescriptor: {name=testschemaapi_shard1_replica2, collection.configName=conf1, config=solrconfig.xml, transient=false, schema=schema.xml, loadOnStartup=true, configSetProperties=configsetprops.json, collection=testschemaapi, numShards=1, dataDir=data\, shard=shard1}
   [junit4]   2> 2946746 INFO  (qtp5547021-47636) [n:127.0.0.1:60253_solr c:testschemaapi s:shard1  x:testschemaapi_shard1_replica1] o.a.s.c.ZkController publishing state=down
   [junit4]   2> 2946746 INFO  (qtp7552249-47637) [n:127.0.0.1:60250_solr c:testschemaapi s:shard1  x:testschemaapi_shard1_replica2] o.a.s.c.ZkController publishing state=down
   [junit4]   2> 2946748 INFO  (qtp7552249-47637) [n:127.0.0.1:60250_solr c:testschemaapi s:shard1  x:testschemaapi_shard1_replica2] o.a.s.c.ZkController Registering watch for collection testschemaapi
   [junit4]   2> 2946749 INFO  (qtp5547021-47636) [n:127.0.0.1:60253_solr c:testschemaapi s:shard1  x:testschemaapi_shard1_replica1] o.a.s.c.ZkController Registering watch for collection testschemaapi
   [junit4]   2> 2946750 INFO  (qtp7552249-47637) [n:127.0.0.1:60250_solr c:testschemaapi s:shard1  x:testschemaapi_shard1_replica2] o.a.s.c.c.ZkStateReader Add data for [testschemaapi] ver [0]
   [junit4]   2> 2946750 INFO  (qtp5547021-47636) [n:127.0.0.1:60253_solr c:testschemaapi s:shard1  x:testschemaapi_shard1_replica1] o.a.s.c.c.ZkStateReader Add data for [testschemaapi] ver [0]
   [junit4]   2> 2946750 INFO  (qtp7552249-47637) [n:127.0.0.1:60250_solr c:testschemaapi s:shard1  x:testschemaapi_shard1_replica2] o.a.s.c.ZkController look for our core node name
   [junit4]   2> 2946750 INFO  (qtp5547021-47636) [n:127.0.0.1:60253_solr c:testschemaapi s:shard1  x:testschemaapi_shard1_replica1] o.a.s.c.ZkController look for our core node name
   [junit4]   2> 2946751 INFO  (OverseerStateUpdate-96163484064743430-127.0.0.1:60253_solr-n_0000000000) [n:127.0.0.1:60253_solr    ] o.a.s.c.Overseer processMessage: queueSize: 2, message = {
   [junit4]   2>   "core":"testschemaapi_shard1_replica2",
   [junit4]   2>   "roles":null,
   [junit4]   2>   "base_url":"http://127.0.0.1:60250/solr",
   [junit4]   2>   "node_name":"127.0.0.1:60250_solr",
   [junit4]   2>   "numShards":"1",
   [junit4]   2>   "state":"down",
   [junit4]   2>   "shard":"shard1",
   [junit4]   2>   "collection":"testschemaapi",
   [junit4]   2>   "operation":"state"} current state version: 0
   [junit4]   2> 2946751 INFO  (OverseerStateUpdate-96163484064743430-127.0.0.1:60253_solr-n_0000000000) [n:127.0.0.1:60253_solr    ] o.a.s.c.o.ReplicaMutator Update state numShards=1 message={
   [junit4]   2>   "core":"testschemaapi_shard1_replica2",
   [junit4]   2>   "roles":null,
   [junit4]   2>   "base_url":"http://127.0.0.1:60250/solr",
   [junit4]   2>   "node_name":"127.0.0.1:60250_solr",
   [junit4]   2>   "numShards":"1",
   [junit4]   2>   "state":"down",
   [junit4]   2>   "shard":"shard1",
   [junit4]   2>   "collection":"testschemaapi",
   [junit4]   2>   "operation":"state"}
   [junit4]   2> 2946756 INFO  (OverseerStateUpdate-96163484064743430-127.0.0.1:60253_solr-n_0000000000) [n:127.0.0.1:60253_solr    ] o.a.s.c.Overseer processMessage: queueSize: 2, message = {
   [junit4]   2>   "core":"testschemaapi_shard1_replica1",
   [junit4]   2>   "roles":null,
   [junit4]   2>   "base_url":"http://127.0.0.1:60253/solr",
   [junit4]   2>   "node_name":"127.0.0.1:60253_solr",
   [junit4]   2>   "numShards":"1",
   [junit4]   2>   "state":"down",
   [junit4]   2>   "shard":"shard1",
   [junit4]   2>   "collection":"testschemaapi",
   [junit4]   2>   "operation":"state"} current state version: 0
   [junit4]   2> 2946756 INFO  (OverseerStateUpdate-96163484064743430-127.0.0.1:60253_solr-n_0000000000) [n:127.0.0.1:60253_solr    ] o.a.s.c.o.ReplicaMutator Update state numShards=1 message={
   [junit4]   2>   "core":"testschemaapi_shard1_replica1",
   [junit4]   2>   "roles":null,
   [junit4]   2>   "base_url":"http://127.0.0.1:60253/solr",
   [junit4]   2>   "node_name":"127.0.0.1:60253_solr",
   [junit4]   2>   "numShards":"1",
   [junit4]   2>   "state":"down",
   [junit4]   2>   "shard":"shard1",
   [junit4]   2>   "collection":"testschemaapi",
   [junit4]   2>   "operation":"state"}
   [junit4]   2> 2946862 INFO  (OverseerStateUpdate-96163484064743430-127.0.0.1:60253_solr-n_0000000000) [n:127.0.0.1:60253_solr    ] o.a.s.c.o.ZkStateWriter going to update_collection /collections/testschemaapi/state.json version: 0
   [junit4]   2> 2946863 INFO  (zkCallback-10706-thread-1-processing-n:127.0.0.1:60250_solr) [n:127.0.0.1:60250_solr    ] o.a.s.c.c.ZkStateReader A cluster state change: [WatchedEvent state:SyncConnected type:NodeDataChanged path:/collections/testschemaapi/state.json] for collection [testschemaapi] has occurred - updating... (live nodes size: [2])
   [junit4]   2> 2946863 INFO  (zkCallback-10707-thread-3-processing-n:127.0.0.1:60253_solr) [n:127.0.0.1:60253_solr    ] o.a.s.c.c.ZkStateReader A cluster state change: [WatchedEvent state:SyncConnected type:NodeDataChanged path:/collections/testschemaapi/state.json] for collection [testschemaapi] has occurred - updating... (live nodes size: [2])
   [junit4]   2> 2946864 INFO  (zkCallback-10707-thread-3-processing-n:127.0.0.1:60253_solr) [n:127.0.0.1:60253_solr    ] o.a.s.c.c.ZkStateReader Updating data for [testschemaapi] from [0] to [1]
   [junit4]   2> 2946864 INFO  (zkCallback-10706-thread-1-processing-n:127.0.0.1:60250_solr) [n:127.0.0.1:60250_solr    ] o.a.s.c.c.ZkStateReader Updating data for [testschemaapi] from [0] to [1]
   [junit4]   2> 2947751 INFO  (qtp5547021-47636) [n:127.0.0.1:60253_solr c:testschemaapi s:shard1  x:testschemaapi_shard1_replica1] o.a.s.c.ZkController waiting to find shard id in clusterstate for testschemaapi_shard1_replica1
   [junit4]   2> 2947751 INFO  (qtp5547021-47636) [n:127.0.0.1:60253_solr c:testschemaapi s:shard1  x:testschemaapi_shard1_replica1] o.a.s.c.ZkController Check for collection zkNode:testschemaapi
   [junit4]   2> 2947752 INFO  (qtp5547021-47636) [n:127.0.0.1:60253_solr c:testschemaapi s:shard1  x:testschemaapi_shard1_replica1] o.a.s.c.ZkController Collection zkNode exists
   [junit4]   2> 2947752 INFO  (qtp7552249-47637) [n:127.0.0.1:60250_solr c:testschemaapi s:shard1  x:testschemaapi_shard1_replica2] o.a.s.c.ZkController waiting to find shard id in clusterstate for testschemaapi_shard1_replica2
   [junit4]   2> 2947752 INFO  (qtp5547021-47636) [n:127.0.0.1:60253_solr c:testschemaapi s:shard1  x:testschemaapi_shard1_replica1] o.a.s.c.c.ZkStateReader Load collection config from: [/collections/testschemaapi]
   [junit4]   2> 2947752 INFO  (qtp7552249-47637) [n:127.0.0.1:60250_solr c:testschemaapi s:shard1  x:testschemaapi_shard1_replica2] o.a.s.c.ZkController Check for collection zkNode:testschemaapi
   [junit4]   2> 2947753 INFO  (qtp5547021-47636) [n:127.0.0.1:60253_solr c:testschemaapi s:shard1  x:testschemaapi_shard1_replica1] o.a.s.c.c.ZkStateReader path=[/collections/testschemaapi] [configName]=[conf1] specified config exists in ZooKeeper
   [junit4]   2> 2947753 INFO  (qtp5547021-47636) [n:127.0.0.1:60253_solr c:testschemaapi s:shard1  x:testschemaapi_shard1_replica1] o.a.s.c.SolrResourceLoader new SolrResourceLoader for directory: 'C:\Users\jenkins\workspace\Lucene-Solr-6.x-Windows\solr\build\solr-core\test\J1\temp\solr.schema.TestManagedSchemaAPI_FD633F85EC5E265D-001\tempDir-001\node2\testschemaapi_shard1_replica1'
   [junit4]   2> 2947754 INFO  (qtp5547021-47636) [n:127.0.0.1:60253_solr c:testschemaapi s:shard1  x:testschemaapi_shard1_replica1] o.a.s.c.SolrResourceLoader JNDI not configured for solr (NoInitialContextEx)
   [junit4]   2> 2947754 INFO  (qtp5547021-47636) [n:127.0.0.1:60253_solr c:testschemaapi s:shard1  x:testschemaapi_shard1_replica1] o.a.s.c.SolrResourceLoader solr home defaulted to 'solr/' (could not find system property or JNDI)
   [junit4]   2> 2947755 INFO  (qtp7552249-47637) [n:127.0.0.1:60250_solr c:testschemaapi s:shard1  x:testschemaapi_shard1_replica2] o.a.s.c.ZkController Collection zkNode exists
   [junit4]   2> 2947755 INFO  (qtp7552249-47637) [n:127.0.0.1:60250_solr c:testschemaapi s:shard1  x:testschemaapi_shard1_replica2] o.a.s.c.c.ZkStateReader Load collection config from: [/collections/testschemaapi]
   [junit4]   2> 2947758 INFO  (qtp7552249-47637) [n:127.0.0.1:60250_solr c:testschemaapi s:shard1  x:testschemaapi_shard1_replica2] o.a.s.c.c.ZkStateReader path=[/collections/testschemaapi] [configName]=[conf1] specified config exists in ZooKeeper
   [junit4]   2> 2947758 INFO  (qtp7552249-47637) [n:127.0.0.1:60250_solr c:testschemaapi s:shard1  x:testschemaapi_shard1_replica2] o.a.s.c.SolrResourceLoader new SolrResourceLoader for directory: 'C:\Users\jenkins\workspace\Lucene-Solr-6.x-Windows\solr\build\solr-core\test\J1\temp\solr.schema.TestManagedSchemaAPI_FD633F85EC5E265D-001\tempDir-001\node1\testschemaapi_shard1_replica2'
   [junit4]   2> 2947758 INFO  (qtp7552249-47637) [n:127.0.0.1:60250_solr c:testschemaapi s:shard1  x:testschemaapi_shard1_replica2] o.a.s.c.SolrResourceLoader JNDI not configured for solr (NoInitialContextEx)
   [junit4]   2> 2947758 INFO  (qtp7552249-47637) [n:127.0.0.1:60250_solr c:testschemaapi s:shard1  x:testschemaapi_shard1_replica2] o.a.s.c.SolrResourceLoader solr home defaulted to 'solr/' (could not find system property or JNDI)
   [junit4]   2> 2947759 INFO  (qtp5547021-47636) [n:127.0.0.1:60253_solr c:testschemaapi s:shard1  x:testschemaapi_shard1_replica1] o.a.s.c.Config loaded config solrconfig.xml with version 0 
   [junit4]   2> 2947762 INFO  (qtp7552249-47637) [n:127.0.0.1:60250_solr c:testschemaapi s:shard1  x:testschemaapi_shard1_replica2] o.a.s.c.Config loaded config solrconfig.xml with version 0 
   [junit4]   2> 2947771 INFO  (qtp7552249-47637) [n:127.0.0.1:60250_solr c:testschemaapi s:shard1  x:testschemaapi_shard1_replica2] o.a.s.c.SolrConfig current version of requestparams : -1
   [junit4]   2> 2947775 INFO  (qtp7552249-47637) [n:127.0.0.1:60250_solr c:testschemaapi s:shard1  x:testschemaapi_shard1_replica2] o.a.s.c.SolrConfig Using Lucene MatchVersion: 6.2.0
   [junit4]   2> 2947778 INFO  (qtp5547021-47636) [n:127.0.0.1:60253_solr c:testschemaapi s:shard1  x:testschemaapi_shard1_replica1] o.a.s.c.SolrConfig current version of requestparams : -1
   [junit4]   2> 2947781 INFO  (qtp5547021-47636) [n:127.0.0.1:60253_solr c:testschemaapi s:shard1  x:testschemaapi_shard1_replica1] o.a.s.c.SolrConfig Using Lucene MatchVersion: 6.2.0
   [junit4]   2> 2947783 INFO  (qtp7552249-47637) [n:127.0.0.1:60250_solr c:testschemaapi s:shard1  x:testschemaapi_shard1_replica2] o.a.s.c.SolrConfig Loaded SolrConfig: solrconfig.xml
   [junit4]   2> 2947787 INFO  (qtp5547021-47636) [n:127.0.0.1:60253_solr c:testschemaapi s:shard1  x:testschemaapi_shard1_replica1] o.a.s.c.SolrConfig Loaded SolrConfig: solrconfig.xml
   [junit4]   2> 2947790 INFO  (qtp7552249-47637) [n:127.0.0.1:60250_solr c:testschemaapi s:shard1  x:testschemaapi_shard1_replica2] o.a.s.s.IndexSchema [testschemaapi_shard1_replica2] Schema name=minimal
   [junit4]   2> 2947791 INFO  (qtp5547021-47636) [n:127.0.0.1:60253_solr c:testschemaapi s:shard1  x:testschemaapi_shard1_replica1] o.a.s.s.IndexSchema [testschemaapi_shard1_replica1] Schema name=minimal
   [junit4]   2> 2947799 INFO  (qtp5547021-47636) [n:127.0.0.1:60253_solr c:testschemaapi s:shard1  x:testschemaapi_shard1_replica1] o.a.s.s.IndexSchema unique key field: id
   [junit4]   2> 2947799 INFO  (qtp7552249-47637) [n:127.0.0.1:60250_solr c:testschemaapi s:shard1  x:testschemaapi_shard1_replica2] o.a.s.s.IndexSchema unique key field: id
   [junit4]   2> 2947805 INFO  (qtp7552249-47637) [n:127.0.0.1:60250_solr c:testschemaapi s:shard1  x:testschemaapi_shard1_replica2] o.a.s.c.ConfigSetProperties Did not find ConfigSet properties, assuming default properties: Can't find resource 'configsetprops.json' in classpath or '/configs/conf1', cwd=C:\Users\jenkins\workspace\Lucene-Solr-6.x-Windows\solr\build\solr-core\test\J1
   [junit4]   2> 2947805 INFO  (qtp7552249-47637) [n:127.0.0.1:60250_solr c:testschemaapi s:shard1  x:testschemaapi_shard1_replica2] o.a.s.c.CoreContainer Creating SolrCore 'testschemaapi_shard1_replica2' using configuration from collection testschemaapi
   [junit4]   2> 2947805 INFO  (qtp5547021-47636) [n:127.0.0.1:60253_solr c:testschemaapi s:shard1  x:testschemaapi_shard1_replica1] o.a.s.c.ConfigSetProperties Did not find ConfigSet properties, assuming default properties: Can't find resource 'configsetprops.json' in classpath or '/configs/conf1', cwd=C:\Users\jenkins\workspace\Lucene-Solr-6.x-Windows\solr\build\solr-core\test\J1
   [junit4]   2> 2947805 INFO  (qtp5547021-47636) [n:127.0.0.1:60253_solr c:testschemaapi s:shard1  x:testschemaapi_shard1_replica1] o.a.s.c.CoreContainer Creating SolrCore 'testschemaapi_shard1_replica1' using configuration from collection testschemaapi
   [junit4]   2> 2947806 INFO  (qtp7552249-47637) [n:127.0.0.1:60250_solr c:testschemaapi s:shard1 r:core_node1 x:testschemaapi_shard1_replica2] o.a.s.c.SolrCore org.apache.solr.core.MockDirectoryFactory
   [junit4]   2> 2947806 INFO  (qtp5547021-47636) [n:127.0.0.1:60253_solr c:testschemaapi s:shard1 r:core_node2 x:testschemaapi_shard1_replica1] o.a.s.c.SolrCore org.apache.solr.core.MockDirectoryFactory
   [junit4]   2> 2947806 INFO  (qtp7552249-47637) [n:127.0.0.1:60250_solr c:testschemaapi s:shard1 r:core_node1 x:testschemaapi_shard1_replica2] o.a.s.c.SolrCore [[testschemaapi_shard1_replica2] ] Opening new SolrCore at [C:\Users\jenkins\workspace\Lucene-Solr-6.x-Windows\solr\build\solr-core\test\J1\temp\solr.schema.TestManagedSchemaAPI_FD633F85EC5E265D-001\tempDir-001\node1\testschemaapi_shard1_replica2], dataDir=[C:\Users\jenkins\workspace\Lucene-Solr-6.x-Windows\solr\build\solr-core\test\J1\temp\solr.schema.TestManagedSchemaAPI_FD633F85EC5E265D-001\tempDir-001\node1\.\testschemaapi_shard1_replica2\data\]
   [junit4]   2> 2947806 INFO  (qtp7552249-47637) [n:127.0.0.1:60250_solr c:testschemaapi s:shard1 r:core_node1 x:testschemaapi_shard1_replica2] o.a.s.c.SolrCore JMX monitoring not detected for core: testschemaapi_shard1_replica2
   [junit4]   2> 2947806 INFO  (qtp5547021-47636) [n:127.0.0.1:60253_solr c:testschemaapi s:shard1 r:core_node2 x:testschemaapi_shard1_replica1] o.a.s.c.SolrCore [[testschemaapi_shard1_replica1] ] Opening new SolrCore at [C:\Users\jenkins\workspace\Lucene-Solr-6.x-Windows\solr\build\solr-core\test\J1\temp\solr.schema.TestManagedSchemaAPI_FD633F85EC5E265D-001\tempDir-001\node2\testschemaapi_shard1_replica1], dataDir=[C:\Users\jenkins\workspace\Lucene-Solr-6.x-Windows\solr\build\solr-core\test\J1\temp\solr.schema.TestManagedSchemaAPI_FD633F85EC5E265D-001\tempDir-001\node2\.\testschemaapi_shard1_replica1\data\]
   [junit4]   2> 2947807 INFO  (qtp7552249-47637) [n:127.0.0.1:60250_solr c:testschemaapi s:shard1 r:core_node1 x:testschemaapi_shard1_replica2] o.a.s.c.CachingDirectoryFactory return new directory for C:\Users\jenkins\workspace\Lucene-Solr-6.x-Windows\solr\build\solr-core\test\J1\temp\solr.schema.TestManagedSchemaAPI_FD633F85EC5E265D-001\tempDir-001\node1\.\testschemaapi_shard1_replica2\data\
   [junit4]   2> 2947807 INFO  (qtp5547021-47636) [n:127.0.0.1:60253_solr c:testschemaapi s:shard1 r:core_node2 x:testschemaapi_shard1_replica1] o.a.s.c.SolrCore JMX monitoring not detected for core: testschemaapi_shard1_replica1
   [junit4]   2> 2947808 INFO  (qtp7552249-47637) [n:127.0.0.1:60250_solr c:testschemaapi s:shard1 r:core_node1 x:testschemaapi_shard1_replica2] o.a.s.c.SolrCore New index directory detected: old=null new=C:\Users\jenkins\workspace\Lucene-Solr-6.x-Windows\solr\build\solr-core\test\J1\temp\solr.schema.TestManagedSchemaAPI_FD633F85EC5E265D-001\tempDir-001\node1\.\testschemaapi_shard1_replica2\data\index/
   [junit4]   2> 2947808 WARN  (qtp7552249-47637) [n:127.0.0.1:60250_solr c:testschemaapi s:shard1 r:core_node1 x:testschemaapi_shard1_replica2] o.a.s.c.SolrCore [testschemaapi_shard1_replica2] Solr index directory 'C:\Users\jenkins\workspace\Lucene-Solr-6.x-Windows\solr\build\solr-core\test\J1\temp\solr.schema.TestManagedSchemaAPI_FD633F85EC5E265D-001\tempDir-001\node1\.\testschemaapi_shard1_replica2\data\index' doesn't exist. Creating new index...
   [junit4]   2> 2947808 INFO  (qtp5547021-47636) [n:127.0.0.1:60253_solr c:testschemaapi s:shard1 r:core_node2 x:testschemaapi_shard1_replica1] o.a.s.c.CachingDirectoryFactory return new directory for C:\Users\jenkins\workspace\Lucene-Solr-6.x-Windows\solr\build\solr-core\test\J1\temp\solr.schema.TestManagedSchemaAPI_FD633F85EC5E265D-001\tempDir-001\node2\.\testschemaapi_shard1_replica1\data\
   [junit4]   2> 2947809 INFO  (qtp5547021-47636) [n:127.0.0.1:60253_solr c:testschemaapi s:shard1 r:core_node2 x:testschemaapi_shard1_replica1] o.a.s.c.SolrCore New index directory detected: old=null new=C:\Users\jenkins\workspace\Lucene-Solr-6.x-Windows\solr\build\solr-core\test\J1\temp\solr.schema.TestManagedSchemaAPI_FD633F85EC5E265D-001\tempDir-001\node2\.\testschemaapi_shard1_replica1\data\index/
   [junit4]   2> 2947809 WARN  (qtp5547021-47636) [n:127.0.0.1:60253_solr c:testschemaapi s:shard1 r:core_node2 x:testschemaapi_shard1_replica1] o.a.s.c.SolrCore [testschemaapi_shard1_replica1] Solr index directory 'C:\Users\jenkins\workspace\Lucene-Solr-6.x-Windows\solr\build\solr-core\test\J1\temp\solr.schema.TestManagedSchemaAPI_FD633F85EC5E265D-001\tempDir-001\node2\.\testschemaapi_shard1_replica1\data\index' doesn't exist. Creating new index...
   [junit4]   2> 2947809 INFO  (qtp7552249-47637) [n:127.0.0.1:60250_solr c:testschemaapi s:shard1 r:core_node1 x:testschemaapi_shard1_replica2] o.a.s.c.CachingDirectoryFactory return new directory for C:\Users\jenkins\workspace\Lucene-Solr-6.x-Windows\solr\build\solr-core\test\J1\temp\solr.schema.TestManagedSchemaAPI_FD633F85EC5E265D-001\tempDir-001\node1\.\testschemaapi_shard1_replica2\data\index
   [junit4]   2> 2947809 INFO  (qtp5547021-47636) [n:127.0.0.1:60253_solr c:testschemaapi s:shard1 r:core_node2 x:testschemaapi_shard1_replica1] o.a.s.c.CachingDirectoryFactory return new directory for C:\Users\jenkins\workspace\Lucene-Solr-6.x-Windows\solr\build\solr-core\test\J1\temp\solr.schema.TestManagedSchemaAPI_FD633F85EC5E265D-001\tempDir-001\node2\.\testschemaapi_shard1_replica1\data\index
   [junit4]   2> 2947810 INFO  (qtp7552249-47637) [n:127.0.0.1:60250_solr c:testschemaapi s:shard1 r:core_node1 x:testschemaapi_shard1_replica2] o.a.s.c.SolrDeletionPolicy SolrDeletionPolicy.onCommit: commits: num=1
   [junit4]   2> 	commit{dir=MockDirectoryWrapper(RAMDirectory@581dc9 lockFactory=org.apache.lucene.store.SingleInstanceLockFactory@527b6f),segFN=segments_1,generation=1}
   [junit4]   2> 2947811 INFO  (qtp7552249-47637) [n:127.0.0.1:60250_solr c:testschemaapi s:shard1 r:core_node1 x:testschemaapi_shard1_replica2] o.a.s.c.SolrDeletionPolicy newest commit generation = 1
   [junit4]   2> 2947811 INFO  (qtp5547021-47636) [n:127.0.0.1:60253_solr c:testschemaapi s:shard1 r:core_node2 x:testschemaapi_shard1_replica1] o.a.s.c.SolrDeletionPolicy SolrDeletionPolicy.onCommit: commits: num=1
   [junit4]   2> 	commit{dir=MockDirectoryWrapper(RAMDirectory@13aaea0 lockFactory=org.apache.lucene.store.SingleInstanceLockFactory@120b50),segFN=segments_1,generation=1}
   [junit4]   2> 2947811 INFO  (qtp5547021-47636) [n:127.0.0.1:60253_solr c:testschemaapi s:shard1 r:core_node2 x:testschemaapi_shard1_replica1] o.a.s.c.SolrDeletionPolicy newest commit generation = 1
   [junit4]   2> 2947813 INFO  (qtp7552249-47637) [n:127.0.0.1:60250_solr c:testschemaapi s:shard1 r:core_node1 x:testschemaapi_shard1_replica2] o.a.s.c.SolrCore no updateRequestProcessorChain defined as default, creating implicit default
   [junit4]   2> 2947814 INFO  (qtp5547021-47636) [n:127.0.0.1:60253_solr c:testschemaapi s:shard1 r:core_node2 x:testschemaapi_shard1_replica1] o.a.s.c.SolrCore no updateRequestProcessorChain defined as default, creating implicit default
   [junit4]   2> 2947821 INFO  (qtp5547021-47636) [n:127.0.0.1:60253_solr c:testschemaapi s:shard1 r:core_node2 x:testschemaapi_shard1_replica1] o.a.s.h.l.XMLLoader xsltCacheLifetimeSeconds=60
   [junit4]   2> 2947822 INFO  (qtp7552249-47637) [n:127.0.0.1:60250_solr c:testschemaapi s:shard1 r:core_node1 x:testschemaapi_shard1_replica2] o.a.s.h.l.XMLLoader xsltCacheLifetimeSeconds=60
   [junit4]   2> 2947822 INFO  (qtp5547021-47636) [n:127.0.0.1:60253_solr c:testschemaapi s:shard1 r:core_node2 x:testschemaapi_shard1_replica1] o.a.s.h.l.XMLLoader xsltCacheLifetimeSeconds=60
   [junit4]   2> 2947825 INFO  (qtp5547021-47636) [n:127.0.0.1:60253_solr c:testschemaapi s:shard1 r:core_node2 x:testschemaapi_shard1_replica1] o.a.s.h.l.XMLLoader xsltCacheLifetimeSeconds=60
   [junit4]   2> 2947826 INFO  (qtp5547021-47636) [n:127.0.0.1:60253_solr c:testschemaapi s:shard1 r:core_node2 x:testschemaapi_shard1_replica1] o.a.s.h.l.XMLLoader xsltCacheLifetimeSeconds=60
   [junit4]   2> 2947827 INFO  (qtp7552249-47637) [n:127.0.0.1:60250_solr c:testschemaapi s:shard1 r:core_node1 x:testschemaapi_shard1_replica2] o.a.s.h.l.XMLLoader xsltCacheLifetimeSeconds=60
   [junit4]   2> 2947827 INFO  (qtp5547021-47636) [n:127.0.0.1:60253_solr c:testschemaapi s:shard1 r:core_node2 x:testschemaapi_shard1_replica1] o.a.s.c.RequestHandlers Registered paths: /admin/mbeans,/update/csv,/sql,/update/json/docs,/admin/luke,/graph,/export,/select,/admin/segments,/get,/admin/system,/replication,/admin/properties,/config,/stream,/schema,/admin/plugins,/admin/logging,/update/json,/admin/ping,/admin/threads,/update,/admin/file
   [junit4]   2> 2947827 INFO  (qtp5547021-47636) [n:127.0.0.1:60253_solr c:testschemaapi s:shard1 r:core_node2 x:testschemaapi_shard1_replica1] o.a.s.c.SolrCore Using default statsCache cache: org.apache.solr.search.stats.LocalStatsCache
   [junit4]   2> 2947829 INFO  (qtp5547021-47636) [n:127.0.0.1:60253_solr c:testschemaapi s:shard1 r:core_node2 x:testschemaapi_shard1_replica1] o.a.s.u.UpdateHandler Using UpdateLog implementation: org.apache.solr.update.UpdateLog
   [junit4]   2> 2947829 INFO  (qtp5547021-47636) [n:127.0.0.1:60253_solr c:testschemaapi s:shard1 r:core_node2 x:testschemaapi_shard1_replica1] o.a.s.u.UpdateLog Initializing UpdateLog: dataDir=null defaultSyncLevel=FLUSH numRecordsToKeep=100 maxNumLogsToKeep=10 numVersionBuckets=65536
   [junit4]   2> 2947831 INFO  (qtp7552249-47637) [n:127.0.0.1:60250_solr c:testschemaapi s:shard1 r:core_node1 x:testschemaapi_shard1_replica2] o.a.s.h.l.XMLLoader xsltCacheLifetimeSeconds=60
   [junit4]   2> 2947831 INFO  (OldIndexDirectoryCleanupThreadForCore-testschemaapi_shard1_replica2) [n:127.0.0.1:60250_solr c:testschemaapi s:shard1 r:core_node1 x:testschemaapi_shard1_replica2] o.a.s.c.SolrCore Looking for old index directories to cleanup for core testschemaapi_shard1_replica2 in C:\Users\jenkins\workspace\Lucene-Solr-6.x-Windows\solr\build\solr-core\test\J1\temp\solr.schema.TestManagedSchemaAPI_FD633F85EC5E265D-001\tempDir-001\node1\.\testschemaapi_shard1_replica2\data\
   [junit4]   2> 2947834 INFO  (qtp5547021-47636) [n:127.0.0.1:60253_solr c:testschemaapi s:shard1 r:core_node2 x:testschemaapi_shard1_replica1] o.a.s.u.CommitTracker Hard AutoCommit: disabled
   [junit4]   2> 2947834 INFO  (qtp5547021-47636) [n:127.0.0.1:60253_solr c:testschemaapi s:shard1 r:core_node2 x:testschemaapi_shard1_replica1] o.a.s.u.CommitTracker Soft AutoCommit: disabled
   [junit4]   2> 2947834 INFO  (OldIndexDirectoryCleanupThreadForCore-testschemaapi_shard1_replica1) [n:127.0.0.1:60253_solr c:testschemaapi s:shard1 r:core_node2 x:testschemaapi_shard1_replica1] o.a.s.c.SolrCore Looking for old index directories to cleanup for core testschemaapi_shard1_replica1 in C:\Users\jenkins\workspace\Lucene-Solr-6.x-Windows\solr\build\solr-core\test\J1\temp\solr.schema.TestManagedSchemaAPI_FD633F85EC5E265D-001\tempDir-001\node2\.\testschemaapi_shard1_replica1\data\
   [junit4]   2> 2947832 INFO  (qtp7552249-47637) [n:127.0.0.1:60250_solr c:testschemaapi s:shard1 r:core_node1 x:testschemaapi_shard1_replica2] o.a.s.h.l.XMLLoader xsltCacheLifetimeSeconds=60
   [junit4]   2> 2947836 INFO  (qtp7552249-47637) [n:127.0.0.1:60250_solr c:testschemaapi s:shard1 r:core_node1 x:testschemaapi_shard1_replica2] o.a.s.c.RequestHandlers Registered paths: /admin/mbeans,/update/csv,/sql,/update/json/docs,/admin/luke,/graph,/export,/select,/admin/segments,/get,/admin/system,/replication,/admin/properties,/config,/stream,/schema,/admin/plugins,/admin/logging,/update/json,/admin/ping,/admin/threads,/update,/admin/file
   [junit4]   2> 2947837 INFO  (qtp7552249-47637) [n:127.0.0.1:60250_solr c:testschemaapi s:shard1 r:core_node1 x:testschemaapi_shard1_replica2] o.a.s.c.SolrCore Using default statsCache cache: org.apache.solr.search.stats.LocalStatsCache
   [junit4]   2> 2947837 WARN  (OldIndexDirectoryCleanupThreadForCore-testschemaapi_shard1_replica2) [n:127.0.0.1:60250_solr c:testschemaapi s:shard1 r:core_node1 x:testschemaapi_shard1_replica2] o.a.s.c.DirectoryFactory C:\Users\jenkins\workspace\Lucene-Solr-6.x-Windows\solr\build\solr-core\test\J1\temp\solr.schema.TestManagedSchemaAPI_FD633F85EC5E265D-001\tempDir-001\node1\.\testschemaapi_shard1_replica2\data\ does not point to a valid data directory; skipping clean-up of old index directories.
   [junit4]   2> 2947838 INFO  (qtp7552249-47637) [n:127.0.0.1:60250_solr c:testschemaapi s:shard1 r:core_node1 x:testschemaapi_shard1_replica2] o.a.s.u.UpdateHandler Using UpdateLog implementation: org.apache.solr.update.UpdateLog
   [junit4]   2> 2947838 INFO  (qtp7552249-47637) [n:127.0.0.1:60250_solr c:testschemaapi s:shard1 r:core_node1 x:testschemaapi_shard1_replica2] o.a.s.u.UpdateLog Initializing UpdateLog: dataDir=null defaultSyncLevel=FLUSH numRecordsToKeep=100 maxNumLogsToKeep=10 numVersionBuckets=65536
   [junit4]   2> 2947839 INFO  (qtp5547021-47636) [n:127.0.0.1:60253_solr c:testschemaapi s:shard1 r:core_node2 x:testschemaapi_shard1_replica1] o.a.s.c.SolrDeletionPolicy SolrDeletionPolicy.onInit: commits: num=1
   [junit4]   2> 	commit{dir=MockDirectoryWrapper(RAMDirectory@13aaea0 lockFactory=org.apache.lucene.store.SingleInstanceLockFactory@120b50),segFN=segments_1,generation=1}
   [junit4]   2> 2947839 INFO  (qtp5547021-47636) [n:127.0.0.1:60253_solr c:testschemaapi s:shard1 r:core_node2 x:testschemaapi_shard1_replica1] o.a.s.c.SolrDeletionPolicy newest commit generation = 1
   [junit4]   2> 2947840 INFO  (qtp5547021-47636) [n:127.0.0.1:60253_solr c:testschemaapi s:shard1 r:core_node2 x:testschemaapi_shard1_replica1] o.a.s.s.SolrIndexSearcher Opening [Searcher@1414783[testschemaapi_shard1_replica1] main]
   [junit4]   2> 2947841 INFO  (qtp5547021-47636) [n:127.0.0.1:60253_solr c:testschemaapi s:shard1 r:core_node2 x:testschemaapi_shard1_replica1] o.a.s.c.c.ZkStateReader Load collection config from: [/collections/testschemaapi]
   [junit4]   2> 2947841 INFO  (qtp7552249-47637) [n:127.0.0.1:60250_solr c:testschemaapi s:shard1 r:core_node1 x:testschemaapi_shard1_replica2] o.a.s.u.CommitTracker Hard AutoCommit: disabled
   [junit4]   2> 2947841 INFO  (qtp7552249-47637) [n:127.0.0.1:60250_solr c:testschemaapi s:shard1 r:core_node1 x:testschemaapi_shard1_replica2] o.a.s.u.CommitTracker Soft AutoCommit: disabled
   [junit4]   2> 2947843 INFO  (qtp5547021-47636) [n:127.0.0.1:60253_solr c:testschemaapi s:shard1 r:core_node2 x:testschemaapi_shard1_replica1] o.a.s.c.c.ZkStateReader path=[/collections/testschemaapi] [configName]=[conf1] specified config exists in ZooKeeper
   [junit4]   2> 2947843 INFO  (qtp5547021-47636) [n:127.0.0.1:60253_solr c:testschemaapi s:shard1 r:core_node2 x:testschemaapi_shard1_replica1] o.a.s.r.ManagedResourceStorage Setting up ZooKeeper-based storage for the RestManager with znodeBase: /configs/conf1
   [junit4]   2> 2947844 INFO  (qtp5547021-47636) [n:127.0.0.1:60253_solr c:testschemaapi s:shard1 r:core_node2 x:testschemaapi_shard1_replica1] o.a.s.r.ManagedResourceStorage Configured ZooKeeperStorageIO with znodeBase: /configs/conf1
   [junit4]   2> 2947844 INFO  (qtp5547021-47636) [n:127.0.0.1:60253_solr c:testschemaapi s:shard1 r:core_node2 x:testschemaapi_shard1_replica1] o.a.s.r.RestManager Initializing RestManager with initArgs: {}
   [junit4]   2> 2947844 INFO  (qtp7552249-47637) [n:127.0.0.1:60250_solr c:testschemaapi s:shard1 r:core_node1 x:testschemaapi_shard1_replica2] o.a.s.c.SolrDeletionPolicy SolrDeletionPolicy.onInit: commits: num=1
   [junit4]   2> 	commit{dir=MockDirectoryWrapper(RAMDirectory@581dc9 lockFactory=org.apache.lucene.store.SingleInstanceLockFactory@527b6f),segFN=segments_1,generation=1}
   [junit4]   2> 2947844 INFO  (qtp5547021-47636) [n:127.0.0.1:60253_solr c:testschemaapi s:shard1 r:core_node2 x:testschemaapi_shard1_replica1] o.a.s.r.ManagedResourceStorage Reading _rest_managed.json using ZooKeeperStorageIO:path=/configs/conf1
   [junit4]   2> 2947844 INFO  (qtp7552249-47637) [n:127.0.0.1:60250_solr c:testschemaapi s:shard1 r:core_node1 x:testschemaapi_shard1_replica2] o.a.s.c.SolrDeletionPolicy newest commit generation = 1
   [junit4]   2> 2947844 INFO  (qtp7552249-47637) [n:127.0.0.1:60250_solr c:testschemaapi s:shard1 r:core_node1 x:testschemaapi_shard1_replica2] o.a.s.s.SolrIndexSearcher Opening [Searcher@fbd347[testschemaapi_shard1_replica2] main]
   [junit4]   2> 2947844 INFO  (qtp7552249-47637) [n:127.0.0.1:60250_solr c:testschemaapi s:shard1 r:core_node1 x:testschemaapi_shard1_replica2] o.a.s.c.c.ZkStateReader Load collection config from: [/collections/testschemaapi]
   [junit4]   2> 2947845 INFO  (qtp5547021-47636) [n:127.0.0.1:60253_solr c:testschemaapi s:shard1 r:core_node2 x:testschemaapi_shard1_replica1] o.a.s.r.ManagedResourceStorage No data found for znode /configs/conf1/_rest_managed.json
   [junit4]   2> 2947845 INFO  (qtp5547021-47636) [n:127.0.0.1:60253_solr c:testschemaapi s:shard1 r:core_node2 x:testschemaapi_shard1_replica1] o.a.s.r.ManagedResourceStorage Loaded null at path _rest_managed.json using ZooKeeperStorageIO:path=/configs/conf1
   [junit4]   2> 2947845 INFO  (qtp5547021-47636) [n:127.0.0.1:60253_solr c:testschemaapi s:shard1 r:core_node2 x:testschemaapi_shard1_replica1] o.a.s.r.RestManager Initializing 0 registered ManagedResources
   [junit4]   2> 2947845 INFO  (qtp5547021-47636) [n:127.0.0.1:60253_solr c:testschemaapi s:shard1 r:core_node2 x:testschemaapi_shard1_replica1] o.a.s.s.ZkIndexSchemaReader Creating ZooKeeper watch for the managed schema at /configs/conf1/managed-schema
   [junit4]   2> 2947846 INFO  (qtp5547021-47636) [n:127.0.0.1:60253_solr c:testschemaapi s:shard1 r:core_node2 x:testschemaapi_shard1_replica1] o.a.s.c.ZkController Added new OnReconnect listener ZkIndexSchemaReader: /configs/conf1/managed-schema, uniqueCoreId: testschemaapi_shard1_replica1:480970114563221
   [junit4]   2> 2947846 INFO  (qtp5547021-47636) [n:127.0.0.1:60253_solr c:testschemaapi s:shard1 r:core_node2 x:testschemaapi_shard1_replica1] o.a.s.h.ReplicationHandler Commits will be reserved for  10000
   [junit4]   2> 2947846 INFO  (qtp7552249-47637) [n:127.0.0.1:60250_solr c:testschemaapi s:shard1 r:core_node1 x:testschemaapi_shard1_replica2] o.a.s.c.c.ZkStateReader path=[/collections/testschemaapi] [configName]=[conf1] specified config exists in ZooKeeper
   [junit4]   2> 2947846 INFO  (qtp7552249-47637) [n:127.0.0.1:60250_solr c:testschemaapi s:shard1 r:core_node1 x:testschemaapi_shard1_replica2] o.a.s.r.ManagedResourceStorage Setting up ZooKeeper-based storage for the RestManager with znodeBase: /configs/conf1
   [junit4]   2> 2947846 INFO  (searcherExecutor-12232-thread-1-processing-n:127.0.0.1:60253_solr x:testschemaapi_shard1_replica1 s:shard1 c:testschemaapi r:core_node2) [n:127.0.0.1:60253_solr c:testschemaapi s:shard1 r:core_node2 x:testschemaapi_shard1_replica1] o.a.s.c.SolrCore [testschemaapi_shard1_replica1] Registered new searcher Searcher@1414783[testschemaapi_shard1_replica1] main{ExitableDirectoryReader(UninvertingDirectoryReader())}
   [junit4]   2> 2947846 INFO  (qtp5547021-47636) [n:127.0.0.1:60253_solr c:testschemaapi s:shard1 r:core_node2 x:testschemaapi_shard1_replica1] o.a.s.u.UpdateLog Looking up max value of version field to seed version buckets
   [junit4]   2> 2947846 INFO  (qtp5547021-47636) [n:127.0.0.1:60253_solr c:testschemaapi s:shard1 r:core_node2 x:testschemaapi_shard1_replica1] o.a.s.u.VersionInfo Refreshing highest value of _version_ for 65536 version buckets from index
   [junit4]   2> 2947846 INFO  (qtp5547021-47636) [n:127.0.0.1:60253_solr c:testschemaapi s:shard1 r:core_node2 x:testschemaapi_shard1_replica1] o.a.s.u.VersionInfo No terms found for _version_, cannot seed version bucket highest value from index
   [junit4]   2> 2947847 INFO  (qtp5547021-47636) [n:127.0.0.1:60253_solr c:testschemaapi s:shard1 r:core_node2 x:testschemaapi_shard1_replica1] o.a.s.u.UpdateLog Could not find max version in index or recent updates, using new clock 1538615746728296448
   [junit4]   2> 2947847 INFO  (qtp7552249-47637) [n:127.0.0.1:60250_solr c:testschemaapi s:shard1 r:core_node1 x:testschemaapi_shard1_replica2] o.a.s.r.ManagedResourceStorage Configured ZooKeeperStorageIO with znodeBase: /configs/conf1
   [junit4]   2> 2947847 INFO  (qtp7552249-47637) [n:127.0.0.1:60250_solr c:testschemaapi s:shard1 r:core_node1 x:testschemaapi_shard1_replica2] o.a.s.r.RestManager Initializing RestManager with initArgs: {}
   [junit4]   2> 2947847 INFO  (qtp7552249-47637) [n:127.0.0.1:60250_solr c:testschemaapi s:shard1 r:core_node1 x:testschemaapi_shard1_replica2] o.a.s.r.ManagedResourceStorage Reading _rest_managed.json using ZooKeeperStorageIO:path=/configs/conf1
   [junit4]   2> 2947848 INFO  (qtp7552249-47637) [n:127.0.0.1:60250_solr c:testschemaapi s:shard1 r:core_node1 x:testschemaapi_shard1_replica2] o.a.s.r.ManagedResourceStorage No data found for znode /configs/conf1/_rest_managed.json
   [junit4]   2> 2947848 INFO  (qtp7552249-47637) [n:127.0.0.1:60250_solr c:testschemaapi s:shard1 r:core_node1 x:testschemaapi_shard1_replica2] o.a.s.r.ManagedResourceStorage Loaded null at path _rest_managed.json using ZooKeeperStorageIO:path=/configs/conf1
   [junit4]   2> 2947848 INFO  (qtp7552249-47637) [n:127.0.0.1:60250_solr c:testschemaapi s:shard1 r:core_node1 x:testschemaapi_shard1_replica2] o.a.s.r.RestManager Initializing 0 registered ManagedResources
   [junit4]   2> 2947848 INFO  (qtp7552249-47637) [n:127.0.0.1:60250_solr c:testschemaapi s:shard1 r:core_node1 x:testschemaapi_shard1_replica2] o.a.s.s.ZkIndexSchemaReader Creating ZooKeeper watch for the managed schema at /configs/conf1/managed-schema
   [junit4]   2> 2947849 INFO  (qtp5547021-47636) [n:127.0.0.1:60253_solr c:testschemaapi s:shard1 r:core_node2 x:testschemaapi_shard1_replica1] o.a.s.u.UpdateLog Took 2.0ms to seed version buckets with highest version 1538615746728296448
   [junit4]   2> 2947849 INFO  (qtp5547021-47636) [n:127.0.0.1:60253_solr c:testschemaapi s:shard1 r:core_node2 x:testschemaapi_shard1_replica1] o.a.s.c.ZkController watch zkdir /configs/conf1
   [junit4]   2> 2947849 INFO  (qtp7552249-47637) [n:127.0.0.1:60250_solr c:testschemaapi s:shard1 r:core_node1 x:testschemaapi_shard1_replica2] o.a.s.c.ZkController Added new OnReconnect listener ZkIndexSchemaReader: /configs/conf1/managed-schema, uniqueCoreId: testschemaapi_shard1_replica2:480970114305217
   [junit4]   2> 2947849 INFO  (qtp7552249-47637) [n:127.0.0.1:60250_solr c:testschemaapi s:shard1 r:core_node1 x:testschemaapi_shard1_replica2] o.a.s.h.ReplicationHandler Commits will be reserved for  10000
   [junit4]   2> 2947850 INFO  (qtp7552249-47637) [n:127.0.0.1:60250_solr c:testschemaapi s:shard1 r:core_node1 x:testschemaapi_shard1_replica2] o.a.s.u.UpdateLog Looking up max value of version field to seed version buckets
   [junit4]   2> 2947850 INFO  (searcherExecutor-12231-thread-1-processing-n:127.0.0.1:60250_solr x:testschemaapi_shard1_replica2 s:shard1 c:testschemaapi r:core_node1) [n:127.0.0.1:60250_solr c:testschemaapi s:shard1 r:core_node1 x:testschemaapi_shard1_replica2] o.a.s.c.SolrCore [testschemaapi_shard1_replica2] Registered new searcher Searcher@fbd347[testschemaapi_shard1_replica2] main{ExitableDirectoryReader(UninvertingDirectoryReader())}
   [junit4]   2> 2947850 INFO  (qtp7552249-47637) [n:127.0.0.1:60250_solr c:testschemaapi s:shard1 r:core_node1 x:testschemaapi_shard1_replica2] o.a.s.u.VersionInfo Refreshing highest value of _version_ for 65536 version buckets from index
   [junit4]   2> 2947850 INFO  (qtp7552249-47637) [n:127.0.0.1:60250_solr c:testschemaapi s:shard1 r:core_node1 x:testschemaapi_shard1_replica2] o.a.s.u.VersionInfo No terms found for _version_, cannot seed version bucket highest value from index
   [junit4]   2> 2947850 INFO  (qtp7552249-47637) [n:127.0.0.1:60250_solr c:testschemaapi s:shard1 r:core_node1 x:testschemaapi_shard1_replica2] o.a.s.u.UpdateLog Could not find max version in index or recent updates, using new clock 1538615746731442176
   [junit4]   2> 2947850 INFO  (qtp5547021-47636) [n:127.0.0.1:60253_solr c:testschemaapi s:shard1 r:core_node2 x:testschemaapi_shard1_replica1] o.a.s.c.CoreContainer registering core: testschemaapi_shard1_replica1
   [junit4]   2> 2947850 INFO  (qtp5547021-47636) [n:127.0.0.1:60253_solr c:testschemaapi s:shard1 r:core_node2 x:testschemaapi_sh

[...truncated too long message...]

rTest, PrimUtilsTest, TestSolrJ, SliceStateTest, SystemInfoHandlerTest, FileUtilsTest, CircularListTest, DistributedMLTComponentTest, DistributedIntervalFacetingTest, SolrTestCaseJ4Test, TestDistributedMissingSort, TestHighlightDedupGrouping, ConnectionReuseTest, ActionThrottleTest, AliasIntegrationTest, CollectionReloadTest, CollectionTooManyReplicasTest, ConcurrentDeleteAndCreateCollectionTest, ConfigSetsAPITest, ConnectionManagerTest, CreateCollectionCleanupTest, CustomCollectionTest, DistributedQueueTest, DistributedVersionInfoTest, LeaderFailoverAfterPartitionTest, LeaderInitiatedRecoveryOnShardRestartTest, MigrateRouteKeyTest, OverseerRolesTest, SaslZkACLProviderTest, SharedFSAutoReplicaFailoverTest, SolrXmlInZkTest, TestCloudDeleteByQuery, TestCloudInspectUtil, TestCloudPivotFacet, TestCollectionAPI, TestConfigSetsAPIZkFailure, TestCryptoKeys, TestLeaderElectionZkExpiry, TestMiniSolrCloudClusterSSL, TestOnReconnectListenerSupport, TestRandomRequestDistribution, TestSolrCloudWithKerberosAlt, TestTolerantUpdateProcessorCloud, VMParamsZkACLAndCredentialsProvidersTest, HdfsBasicDistributedZk2Test, HdfsChaosMonkeySafeLeaderTest, HdfsRecoverLeaseTest, HdfsWriteToMultipleCollectionsTest, ZkStateReaderTest, RuleEngineTest, ExitableDirectoryReaderTest, HdfsDirectoryFactoryTest, TestBackupRepositoryFactory, TestConfigOverlay, TestConfigSetImmutable, TestConfigSetProperties, TestConfigSets, TestNRTOpen, RequestLoggingTest, TestBlobHandler, CoreMergeIndexesAdminHandlerTest, DistributedDebugComponentTest, DistributedFacetPivotLargeTest, DistributedFacetPivotSmallAdvancedTest, FacetPivotSmallTest, SpatialHeatmapFacetsTest, TestCustomDocTransformer, TestGeoJSONResponseWriter, TestSubQueryTransformerCrossCore, TestManagedResource, TestManagedResourceStorage, TestRestManager, TestBulkSchemaAPI, TestDynamicFieldCollectionResource, TestDynamicFieldResource, TestFieldTypeResource, TestSchemaNameResource, TestSchemaResource, TestSchemaVersionResource, TestUniqueKeyFieldResource, TestManagedStopFilterFactory, BadCopyFieldTest, BooleanFieldTest, ChangedSchemaMergeTest, DateRangeFieldTest, DocValuesMissingTest, SpatialRPTFieldTypeTest, TestCollationFieldDocValues, TestManagedSchema, TestManagedSchemaAPI]
   [junit4]   2> NOTE: reproduce with: ant test  -Dtestcase=TestManagedSchemaAPI -Dtests.seed=FD633F85EC5E265D -Dtests.slow=true -Dtests.locale=ar-SD -Dtests.timezone=America/Cayenne -Dtests.asserts=true -Dtests.file.encoding=Cp1252
   [junit4] ERROR   0.00s J1 | TestManagedSchemaAPI (suite) <<<
   [junit4]    > Throwable #1: java.lang.AssertionError: ObjectTracker found 8 object(s) that were not released!!! [MDCAwareThreadPoolExecutor, MockDirectoryWrapper, MockDirectoryWrapper, TransactionLog, TransactionLog, MDCAwareThreadPoolExecutor, MockDirectoryWrapper, MockDirectoryWrapper]
   [junit4]    > 	at __randomizedtesting.SeedInfo.seed([FD633F85EC5E265D]:0)
   [junit4]    > 	at org.apache.solr.SolrTestCaseJ4.teardownTestCases(SolrTestCaseJ4.java:257)
   [junit4]    > 	at java.lang.Thread.run(Thread.java:745)Throwable #2: java.io.IOException: Could not remove the following files (in the order of attempts):
   [junit4]    >    C:\Users\jenkins\workspace\Lucene-Solr-6.x-Windows\solr\build\solr-core\test\J1\temp\solr.schema.TestManagedSchemaAPI_FD633F85EC5E265D-001\tempDir-001\node1\testschemaapi_shard1_replica2\data\tlog\tlog.0000000000000000000: java.nio.file.FileSystemException: C:\Users\jenkins\workspace\Lucene-Solr-6.x-Windows\solr\build\solr-core\test\J1\temp\solr.schema.TestManagedSchemaAPI_FD633F85EC5E265D-001\tempDir-001\node1\testschemaapi_shard1_replica2\data\tlog\tlog.0000000000000000000: The process cannot access the file because it is being used by another process.
   [junit4]    >    C:\Users\jenkins\workspace\Lucene-Solr-6.x-Windows\solr\build\solr-core\test\J1\temp\solr.schema.TestManagedSchemaAPI_FD633F85EC5E265D-001\tempDir-001\node1\testschemaapi_shard1_replica2\data\tlog: java.nio.file.DirectoryNotEmptyException: C:\Users\jenkins\workspace\Lucene-Solr-6.x-Windows\solr\build\solr-core\test\J1\temp\solr.schema.TestManagedSchemaAPI_FD633F85EC5E265D-001\tempDir-001\node1\testschemaapi_shard1_replica2\data\tlog
   [junit4]    >    C:\Users\jenkins\workspace\Lucene-Solr-6.x-Windows\solr\build\solr-core\test\J1\temp\solr.schema.TestManagedSchemaAPI_FD633F85EC5E265D-001\tempDir-001\node1\testschemaapi_shard1_replica2\data: java.nio.file.DirectoryNotEmptyException: C:\Users\jenkins\workspace\Lucene-Solr-6.x-Windows\solr\build\solr-core\test\J1\temp\solr.schema.TestManagedSchemaAPI_FD633F85EC5E265D-001\tempDir-001\node1\testschemaapi_shard1_replica2\data
   [junit4]    >    C:\Users\jenkins\workspace\Lucene-Solr-6.x-Windows\solr\build\solr-core\test\J1\temp\solr.schema.TestManagedSchemaAPI_FD633F85EC5E265D-001\tempDir-001\node1\testschemaapi_shard1_replica2: java.nio.file.DirectoryNotEmptyException: C:\Users\jenkins\workspace\Lucene-Solr-6.x-Windows\solr\build\solr-core\test\J1\temp\solr.schema.TestManagedSchemaAPI_FD633F85EC5E265D-001\tempDir-001\node1\testschemaapi_shard1_replica2
   [junit4]    >    C:\Users\jenkins\workspace\Lucene-Solr-6.x-Windows\solr\build\solr-core\test\J1\temp\solr.schema.TestManagedSchemaAPI_FD633F85EC5E265D-001\tempDir-001\node1: java.nio.file.DirectoryNotEmptyException: C:\Users\jenkins\workspace\Lucene-Solr-6.x-Windows\solr\build\solr-core\test\J1\temp\solr.schema.TestManagedSchemaAPI_FD633F85EC5E265D-001\tempDir-001\node1
   [junit4]    >    C:\Users\jenkins\workspace\Lucene-Solr-6.x-Windows\solr\build\solr-core\test\J1\temp\solr.schema.TestManagedSchemaAPI_FD633F85EC5E265D-001\tempDir-001\node2\testschemaapi_shard1_replica1\data\tlog\tlog.0000000000000000001: java.nio.file.FileSystemException: C:\Users\jenkins\workspace\Lucene-Solr-6.x-Windows\solr\build\solr-core\test\J1\temp\solr.schema.TestManagedSchemaAPI_FD633F85EC5E265D-001\tempDir-001\node2\testschemaapi_shard1_replica1\data\tlog\tlog.0000000000000000001: The process cannot access the file because it is being used by another process.
   [junit4]    >    C:\Users\jenkins\workspace\Lucene-Solr-6.x-Windows\solr\build\solr-core\test\J1\temp\solr.schema.TestManagedSchemaAPI_FD633F85EC5E265D-001\tempDir-001\node2\testschemaapi_shard1_replica1\data\tlog: java.nio.file.DirectoryNotEmptyException: C:\Users\jenkins\workspace\Lucene-Solr-6.x-Windows\solr\build\solr-core\test\J1\temp\solr.schema.TestManagedSchemaAPI_FD633F85EC5E265D-001\tempDir-001\node2\testschemaapi_shard1_replica1\data\tlog
   [junit4]    >    C:\Users\jenkins\workspace\Lucene-Solr-6.x-Windows\solr\build\solr-core\test\J1\temp\solr.schema.TestManagedSchemaAPI_FD633F85EC5E265D-001\tempDir-001\node2\testschemaapi_shard1_replica1\data: java.nio.file.DirectoryNotEmptyException: C:\Users\jenkins\workspace\Lucene-Solr-6.x-Windows\solr\build\solr-core\test\J1\temp\solr.schema.TestManagedSchemaAPI_FD633F85EC5E265D-001\tempDir-001\node2\testschemaapi_shard1_replica1\data
   [junit4]    >    C:\Users\jenkins\workspace\Lucene-Solr-6.x-Windows\solr\build\solr-core\test\J1\temp\solr.schema.TestManagedSchemaAPI_FD633F85EC5E265D-001\tempDir-001\node2\testschemaapi_shard1_replica1: java.nio.file.DirectoryNotEmptyException: C:\Users\jenkins\workspace\Lucene-Solr-6.x-Windows\solr\build\solr-core\test\J1\temp\solr.schema.TestManagedSchemaAPI_FD633F85EC5E265D-001\tempDir-001\node2\testschemaapi_shard1_replica1
   [junit4]    >    C:\Users\jenkins\workspace\Lucene-Solr-6.x-Windows\solr\build\solr-core\test\J1\temp\solr.schema.TestManagedSchemaAPI_FD633F85EC5E265D-001\tempDir-001\node2: java.nio.file.DirectoryNotEmptyException: C:\Users\jenkins\workspace\Lucene-Solr-6.x-Windows\solr\build\solr-core\test\J1\temp\solr.schema.TestManagedSchemaAPI_FD633F85EC5E265D-001\tempDir-001\node2
   [junit4]    >    C:\Users\jenkins\workspace\Lucene-Solr-6.x-Windows\solr\build\solr-core\test\J1\temp\solr.schema.TestManagedSchemaAPI_FD633F85EC5E265D-001\tempDir-001: java.nio.file.DirectoryNotEmptyException: C:\Users\jenkins\workspace\Lucene-Solr-6.x-Windows\solr\build\solr-core\test\J1\temp\solr.schema.TestManagedSchemaAPI_FD633F85EC5E265D-001\tempDir-001
   [junit4]    >    C:\Users\jenkins\workspace\Lucene-Solr-6.x-Windows\solr\build\solr-core\test\J1\temp\solr.schema.TestManagedSchemaAPI_FD633F85EC5E265D-001: java.nio.file.DirectoryNotEmptyException: C:\Users\jenkins\workspace\Lucene-Solr-6.x-Windows\solr\build\solr-core\test\J1\temp\solr.schema.TestManagedSchemaAPI_FD633F85EC5E265D-001
   [junit4]    > 	at org.apache.lucene.util.IOUtils.rm(IOUtils.java:323)
   [junit4]    > 	at java.lang.Thread.run(Thread.java:745)
   [junit4] Completed [555/618 (1!)] on J1 in 11.47s, 1 test, 1 failure, 1 error <<< FAILURES!

[...truncated 238 lines...]
BUILD FAILED
C:\Users\jenkins\workspace\Lucene-Solr-6.x-Windows\build.xml:740: The following error occurred while executing this line:
C:\Users\jenkins\workspace\Lucene-Solr-6.x-Windows\build.xml:684: The following error occurred while executing this line:
C:\Users\jenkins\workspace\Lucene-Solr-6.x-Windows\build.xml:59: The following error occurred while executing this line:
C:\Users\jenkins\workspace\Lucene-Solr-6.x-Windows\solr\build.xml:233: The following error occurred while executing this line:
C:\Users\jenkins\workspace\Lucene-Solr-6.x-Windows\solr\common-build.xml:530: The following error occurred while executing this line:
C:\Users\jenkins\workspace\Lucene-Solr-6.x-Windows\lucene\common-build.xml:1427: The following error occurred while executing this line:
C:\Users\jenkins\workspace\Lucene-Solr-6.x-Windows\lucene\common-build.xml:984: There were test failures: 618 suites (10 ignored), 2591 tests, 2 suite-level errors, 127 ignored (82 assumptions) [seed: FD633F85EC5E265D]

Total time: 81 minutes 47 seconds
Build step 'Invoke Ant' marked build as failure
Archiving artifacts
[WARNINGS] Skipping publisher since build result is FAILURE
Recording test results
Email was triggered for: Failure - Any
Sending email for trigger: Failure - Any



Mime
View raw message