lucene-dev mailing list archives

Site index · List index
Message view « Date » · « Thread »
Top « Date » · « Thread »
From Apache Jenkins Server <jenk...@builds.apache.org>
Subject [JENKINS] Lucene-Solr-Tests-master - Build # 1246 - Still Failing
Date Sat, 02 Jul 2016 02:15:29 GMT
Build: https://builds.apache.org/job/Lucene-Solr-Tests-master/1246/

3 tests failed.
FAILED:  org.apache.solr.cloud.overseer.ZkStateReaderTest.testStateFormatUpdateWithExplicitRefreshLazy

Error Message:
Could not find collection : c1

Stack Trace:
org.apache.solr.common.SolrException: Could not find collection : c1
	at __randomizedtesting.SeedInfo.seed([19C96D06875AAD62:7286CD7BFE557058]:0)
	at org.apache.solr.common.cloud.ClusterState.getCollection(ClusterState.java:192)
	at org.apache.solr.cloud.overseer.ZkStateReaderTest.testStateFormatUpdate(ZkStateReaderTest.java:129)
	at org.apache.solr.cloud.overseer.ZkStateReaderTest.testStateFormatUpdateWithExplicitRefreshLazy(ZkStateReaderTest.java:48)
	at sun.reflect.NativeMethodAccessorImpl.invoke0(Native Method)
	at sun.reflect.NativeMethodAccessorImpl.invoke(NativeMethodAccessorImpl.java:62)
	at sun.reflect.DelegatingMethodAccessorImpl.invoke(DelegatingMethodAccessorImpl.java:43)
	at java.lang.reflect.Method.invoke(Method.java:498)
	at com.carrotsearch.randomizedtesting.RandomizedRunner.invoke(RandomizedRunner.java:1764)
	at com.carrotsearch.randomizedtesting.RandomizedRunner$8.evaluate(RandomizedRunner.java:871)
	at com.carrotsearch.randomizedtesting.RandomizedRunner$9.evaluate(RandomizedRunner.java:907)
	at com.carrotsearch.randomizedtesting.RandomizedRunner$10.evaluate(RandomizedRunner.java:921)
	at com.carrotsearch.randomizedtesting.rules.SystemPropertiesRestoreRule$1.evaluate(SystemPropertiesRestoreRule.java:57)
	at org.apache.lucene.util.TestRuleSetupTeardownChained$1.evaluate(TestRuleSetupTeardownChained.java:49)
	at org.apache.lucene.util.AbstractBeforeAfterRule$1.evaluate(AbstractBeforeAfterRule.java:45)
	at org.apache.lucene.util.TestRuleThreadAndTestName$1.evaluate(TestRuleThreadAndTestName.java:48)
	at org.apache.lucene.util.TestRuleIgnoreAfterMaxFailures$1.evaluate(TestRuleIgnoreAfterMaxFailures.java:64)
	at org.apache.lucene.util.TestRuleMarkFailure$1.evaluate(TestRuleMarkFailure.java:47)
	at com.carrotsearch.randomizedtesting.rules.StatementAdapter.evaluate(StatementAdapter.java:36)
	at com.carrotsearch.randomizedtesting.ThreadLeakControl$StatementRunner.run(ThreadLeakControl.java:367)
	at com.carrotsearch.randomizedtesting.ThreadLeakControl.forkTimeoutingTask(ThreadLeakControl.java:809)
	at com.carrotsearch.randomizedtesting.ThreadLeakControl$3.evaluate(ThreadLeakControl.java:460)
	at com.carrotsearch.randomizedtesting.RandomizedRunner.runSingleTest(RandomizedRunner.java:880)
	at com.carrotsearch.randomizedtesting.RandomizedRunner$5.evaluate(RandomizedRunner.java:781)
	at com.carrotsearch.randomizedtesting.RandomizedRunner$6.evaluate(RandomizedRunner.java:816)
	at com.carrotsearch.randomizedtesting.RandomizedRunner$7.evaluate(RandomizedRunner.java:827)
	at com.carrotsearch.randomizedtesting.rules.StatementAdapter.evaluate(StatementAdapter.java:36)
	at com.carrotsearch.randomizedtesting.rules.SystemPropertiesRestoreRule$1.evaluate(SystemPropertiesRestoreRule.java:57)
	at org.apache.lucene.util.AbstractBeforeAfterRule$1.evaluate(AbstractBeforeAfterRule.java:45)
	at com.carrotsearch.randomizedtesting.rules.StatementAdapter.evaluate(StatementAdapter.java:36)
	at org.apache.lucene.util.TestRuleStoreClassName$1.evaluate(TestRuleStoreClassName.java:41)
	at com.carrotsearch.randomizedtesting.rules.NoShadowingOrOverridesOnMethodsRule$1.evaluate(NoShadowingOrOverridesOnMethodsRule.java:40)
	at com.carrotsearch.randomizedtesting.rules.NoShadowingOrOverridesOnMethodsRule$1.evaluate(NoShadowingOrOverridesOnMethodsRule.java:40)
	at com.carrotsearch.randomizedtesting.rules.StatementAdapter.evaluate(StatementAdapter.java:36)
	at com.carrotsearch.randomizedtesting.rules.StatementAdapter.evaluate(StatementAdapter.java:36)
	at com.carrotsearch.randomizedtesting.rules.StatementAdapter.evaluate(StatementAdapter.java:36)
	at org.apache.lucene.util.TestRuleAssertionsRequired$1.evaluate(TestRuleAssertionsRequired.java:53)
	at org.apache.lucene.util.TestRuleMarkFailure$1.evaluate(TestRuleMarkFailure.java:47)
	at org.apache.lucene.util.TestRuleIgnoreAfterMaxFailures$1.evaluate(TestRuleIgnoreAfterMaxFailures.java:64)
	at org.apache.lucene.util.TestRuleIgnoreTestSuites$1.evaluate(TestRuleIgnoreTestSuites.java:54)
	at com.carrotsearch.randomizedtesting.rules.StatementAdapter.evaluate(StatementAdapter.java:36)
	at com.carrotsearch.randomizedtesting.ThreadLeakControl$StatementRunner.run(ThreadLeakControl.java:367)
	at java.lang.Thread.run(Thread.java:745)


FAILED:  org.apache.solr.cloud.overseer.ZkStateReaderTest.testStateFormatUpdateWithTimeDelay

Error Message:
expected:<2> but was:<1>

Stack Trace:
java.lang.AssertionError: expected:<2> but was:<1>
	at __randomizedtesting.SeedInfo.seed([19C96D06875AAD62:6657DA83EE3880E8]:0)
	at org.junit.Assert.fail(Assert.java:93)
	at org.junit.Assert.failNotEquals(Assert.java:647)
	at org.junit.Assert.assertEquals(Assert.java:128)
	at org.junit.Assert.assertEquals(Assert.java:472)
	at org.junit.Assert.assertEquals(Assert.java:456)
	at org.apache.solr.cloud.overseer.ZkStateReaderTest.testStateFormatUpdate(ZkStateReaderTest.java:130)
	at org.apache.solr.cloud.overseer.ZkStateReaderTest.testStateFormatUpdateWithTimeDelay(ZkStateReaderTest.java:53)
	at sun.reflect.NativeMethodAccessorImpl.invoke0(Native Method)
	at sun.reflect.NativeMethodAccessorImpl.invoke(NativeMethodAccessorImpl.java:62)
	at sun.reflect.DelegatingMethodAccessorImpl.invoke(DelegatingMethodAccessorImpl.java:43)
	at java.lang.reflect.Method.invoke(Method.java:498)
	at com.carrotsearch.randomizedtesting.RandomizedRunner.invoke(RandomizedRunner.java:1764)
	at com.carrotsearch.randomizedtesting.RandomizedRunner$8.evaluate(RandomizedRunner.java:871)
	at com.carrotsearch.randomizedtesting.RandomizedRunner$9.evaluate(RandomizedRunner.java:907)
	at com.carrotsearch.randomizedtesting.RandomizedRunner$10.evaluate(RandomizedRunner.java:921)
	at com.carrotsearch.randomizedtesting.rules.SystemPropertiesRestoreRule$1.evaluate(SystemPropertiesRestoreRule.java:57)
	at org.apache.lucene.util.TestRuleSetupTeardownChained$1.evaluate(TestRuleSetupTeardownChained.java:49)
	at org.apache.lucene.util.AbstractBeforeAfterRule$1.evaluate(AbstractBeforeAfterRule.java:45)
	at org.apache.lucene.util.TestRuleThreadAndTestName$1.evaluate(TestRuleThreadAndTestName.java:48)
	at org.apache.lucene.util.TestRuleIgnoreAfterMaxFailures$1.evaluate(TestRuleIgnoreAfterMaxFailures.java:64)
	at org.apache.lucene.util.TestRuleMarkFailure$1.evaluate(TestRuleMarkFailure.java:47)
	at com.carrotsearch.randomizedtesting.rules.StatementAdapter.evaluate(StatementAdapter.java:36)
	at com.carrotsearch.randomizedtesting.ThreadLeakControl$StatementRunner.run(ThreadLeakControl.java:367)
	at com.carrotsearch.randomizedtesting.ThreadLeakControl.forkTimeoutingTask(ThreadLeakControl.java:809)
	at com.carrotsearch.randomizedtesting.ThreadLeakControl$3.evaluate(ThreadLeakControl.java:460)
	at com.carrotsearch.randomizedtesting.RandomizedRunner.runSingleTest(RandomizedRunner.java:880)
	at com.carrotsearch.randomizedtesting.RandomizedRunner$5.evaluate(RandomizedRunner.java:781)
	at com.carrotsearch.randomizedtesting.RandomizedRunner$6.evaluate(RandomizedRunner.java:816)
	at com.carrotsearch.randomizedtesting.RandomizedRunner$7.evaluate(RandomizedRunner.java:827)
	at com.carrotsearch.randomizedtesting.rules.StatementAdapter.evaluate(StatementAdapter.java:36)
	at com.carrotsearch.randomizedtesting.rules.SystemPropertiesRestoreRule$1.evaluate(SystemPropertiesRestoreRule.java:57)
	at org.apache.lucene.util.AbstractBeforeAfterRule$1.evaluate(AbstractBeforeAfterRule.java:45)
	at com.carrotsearch.randomizedtesting.rules.StatementAdapter.evaluate(StatementAdapter.java:36)
	at org.apache.lucene.util.TestRuleStoreClassName$1.evaluate(TestRuleStoreClassName.java:41)
	at com.carrotsearch.randomizedtesting.rules.NoShadowingOrOverridesOnMethodsRule$1.evaluate(NoShadowingOrOverridesOnMethodsRule.java:40)
	at com.carrotsearch.randomizedtesting.rules.NoShadowingOrOverridesOnMethodsRule$1.evaluate(NoShadowingOrOverridesOnMethodsRule.java:40)
	at com.carrotsearch.randomizedtesting.rules.StatementAdapter.evaluate(StatementAdapter.java:36)
	at com.carrotsearch.randomizedtesting.rules.StatementAdapter.evaluate(StatementAdapter.java:36)
	at com.carrotsearch.randomizedtesting.rules.StatementAdapter.evaluate(StatementAdapter.java:36)
	at org.apache.lucene.util.TestRuleAssertionsRequired$1.evaluate(TestRuleAssertionsRequired.java:53)
	at org.apache.lucene.util.TestRuleMarkFailure$1.evaluate(TestRuleMarkFailure.java:47)
	at org.apache.lucene.util.TestRuleIgnoreAfterMaxFailures$1.evaluate(TestRuleIgnoreAfterMaxFailures.java:64)
	at org.apache.lucene.util.TestRuleIgnoreTestSuites$1.evaluate(TestRuleIgnoreTestSuites.java:54)
	at com.carrotsearch.randomizedtesting.rules.StatementAdapter.evaluate(StatementAdapter.java:36)
	at com.carrotsearch.randomizedtesting.ThreadLeakControl$StatementRunner.run(ThreadLeakControl.java:367)
	at java.lang.Thread.run(Thread.java:745)


FAILED:  org.apache.solr.cloud.overseer.ZkStateReaderTest.testStateFormatUpdateWithExplicitRefresh

Error Message:
Could not find collection : c1

Stack Trace:
org.apache.solr.common.SolrException: Could not find collection : c1
	at __randomizedtesting.SeedInfo.seed([19C96D06875AAD62:6731CF1573A6BA7]:0)
	at org.apache.solr.common.cloud.ClusterState.getCollection(ClusterState.java:192)
	at org.apache.solr.cloud.overseer.ZkStateReaderTest.testStateFormatUpdate(ZkStateReaderTest.java:129)
	at org.apache.solr.cloud.overseer.ZkStateReaderTest.testStateFormatUpdateWithExplicitRefresh(ZkStateReaderTest.java:43)
	at sun.reflect.NativeMethodAccessorImpl.invoke0(Native Method)
	at sun.reflect.NativeMethodAccessorImpl.invoke(NativeMethodAccessorImpl.java:62)
	at sun.reflect.DelegatingMethodAccessorImpl.invoke(DelegatingMethodAccessorImpl.java:43)
	at java.lang.reflect.Method.invoke(Method.java:498)
	at com.carrotsearch.randomizedtesting.RandomizedRunner.invoke(RandomizedRunner.java:1764)
	at com.carrotsearch.randomizedtesting.RandomizedRunner$8.evaluate(RandomizedRunner.java:871)
	at com.carrotsearch.randomizedtesting.RandomizedRunner$9.evaluate(RandomizedRunner.java:907)
	at com.carrotsearch.randomizedtesting.RandomizedRunner$10.evaluate(RandomizedRunner.java:921)
	at com.carrotsearch.randomizedtesting.rules.SystemPropertiesRestoreRule$1.evaluate(SystemPropertiesRestoreRule.java:57)
	at org.apache.lucene.util.TestRuleSetupTeardownChained$1.evaluate(TestRuleSetupTeardownChained.java:49)
	at org.apache.lucene.util.AbstractBeforeAfterRule$1.evaluate(AbstractBeforeAfterRule.java:45)
	at org.apache.lucene.util.TestRuleThreadAndTestName$1.evaluate(TestRuleThreadAndTestName.java:48)
	at org.apache.lucene.util.TestRuleIgnoreAfterMaxFailures$1.evaluate(TestRuleIgnoreAfterMaxFailures.java:64)
	at org.apache.lucene.util.TestRuleMarkFailure$1.evaluate(TestRuleMarkFailure.java:47)
	at com.carrotsearch.randomizedtesting.rules.StatementAdapter.evaluate(StatementAdapter.java:36)
	at com.carrotsearch.randomizedtesting.ThreadLeakControl$StatementRunner.run(ThreadLeakControl.java:367)
	at com.carrotsearch.randomizedtesting.ThreadLeakControl.forkTimeoutingTask(ThreadLeakControl.java:809)
	at com.carrotsearch.randomizedtesting.ThreadLeakControl$3.evaluate(ThreadLeakControl.java:460)
	at com.carrotsearch.randomizedtesting.RandomizedRunner.runSingleTest(RandomizedRunner.java:880)
	at com.carrotsearch.randomizedtesting.RandomizedRunner$5.evaluate(RandomizedRunner.java:781)
	at com.carrotsearch.randomizedtesting.RandomizedRunner$6.evaluate(RandomizedRunner.java:816)
	at com.carrotsearch.randomizedtesting.RandomizedRunner$7.evaluate(RandomizedRunner.java:827)
	at com.carrotsearch.randomizedtesting.rules.StatementAdapter.evaluate(StatementAdapter.java:36)
	at com.carrotsearch.randomizedtesting.rules.SystemPropertiesRestoreRule$1.evaluate(SystemPropertiesRestoreRule.java:57)
	at org.apache.lucene.util.AbstractBeforeAfterRule$1.evaluate(AbstractBeforeAfterRule.java:45)
	at com.carrotsearch.randomizedtesting.rules.StatementAdapter.evaluate(StatementAdapter.java:36)
	at org.apache.lucene.util.TestRuleStoreClassName$1.evaluate(TestRuleStoreClassName.java:41)
	at com.carrotsearch.randomizedtesting.rules.NoShadowingOrOverridesOnMethodsRule$1.evaluate(NoShadowingOrOverridesOnMethodsRule.java:40)
	at com.carrotsearch.randomizedtesting.rules.NoShadowingOrOverridesOnMethodsRule$1.evaluate(NoShadowingOrOverridesOnMethodsRule.java:40)
	at com.carrotsearch.randomizedtesting.rules.StatementAdapter.evaluate(StatementAdapter.java:36)
	at com.carrotsearch.randomizedtesting.rules.StatementAdapter.evaluate(StatementAdapter.java:36)
	at com.carrotsearch.randomizedtesting.rules.StatementAdapter.evaluate(StatementAdapter.java:36)
	at org.apache.lucene.util.TestRuleAssertionsRequired$1.evaluate(TestRuleAssertionsRequired.java:53)
	at org.apache.lucene.util.TestRuleMarkFailure$1.evaluate(TestRuleMarkFailure.java:47)
	at org.apache.lucene.util.TestRuleIgnoreAfterMaxFailures$1.evaluate(TestRuleIgnoreAfterMaxFailures.java:64)
	at org.apache.lucene.util.TestRuleIgnoreTestSuites$1.evaluate(TestRuleIgnoreTestSuites.java:54)
	at com.carrotsearch.randomizedtesting.rules.StatementAdapter.evaluate(StatementAdapter.java:36)
	at com.carrotsearch.randomizedtesting.ThreadLeakControl$StatementRunner.run(ThreadLeakControl.java:367)
	at java.lang.Thread.run(Thread.java:745)




Build Log:
[...truncated 10898 lines...]
   [junit4] Suite: org.apache.solr.cloud.overseer.ZkStateReaderTest
   [junit4]   2> Creating dataDir: /x1/jenkins/jenkins-slave/workspace/Lucene-Solr-Tests-master/solr/build/solr-core/test/J2/temp/solr.cloud.overseer.ZkStateReaderTest_19C96D06875AAD62-001/init-core-data-001
   [junit4]   2> 331812 INFO  (SUITE-ZkStateReaderTest-seed#[19C96D06875AAD62]-worker) [    ] o.a.s.SolrTestCaseJ4 Randomized ssl (true) and clientAuth (false) via: @org.apache.solr.util.RandomizeSSL(reason=, value=NaN, ssl=NaN, clientAuth=NaN)
   [junit4]   2> 331815 INFO  (TEST-ZkStateReaderTest.testWatchedCollectionCreation-seed#[19C96D06875AAD62]) [    ] o.a.s.SolrTestCaseJ4 ###Starting testWatchedCollectionCreation
   [junit4]   2> 331815 INFO  (TEST-ZkStateReaderTest.testWatchedCollectionCreation-seed#[19C96D06875AAD62]) [    ] o.a.s.c.ZkTestServer STARTING ZK TEST SERVER
   [junit4]   2> 331815 INFO  (Thread-1244) [    ] o.a.s.c.ZkTestServer client port:0.0.0.0/0.0.0.0:0
   [junit4]   2> 331815 INFO  (Thread-1244) [    ] o.a.s.c.ZkTestServer Starting server
   [junit4]   2> 331915 INFO  (TEST-ZkStateReaderTest.testWatchedCollectionCreation-seed#[19C96D06875AAD62]) [    ] o.a.s.c.ZkTestServer start zk server on port:53505
   [junit4]   2> 331915 INFO  (TEST-ZkStateReaderTest.testWatchedCollectionCreation-seed#[19C96D06875AAD62]) [    ] o.a.s.c.c.SolrZkClient Using default ZkCredentialsProvider
   [junit4]   2> 331916 INFO  (TEST-ZkStateReaderTest.testWatchedCollectionCreation-seed#[19C96D06875AAD62]) [    ] o.a.s.c.c.ConnectionManager Waiting for client to connect to ZooKeeper
   [junit4]   2> 331918 INFO  (zkCallback-627-thread-1) [    ] o.a.s.c.c.ConnectionManager Watcher org.apache.solr.common.cloud.ConnectionManager@7fb8e6d name:ZooKeeperConnection Watcher:127.0.0.1:53505 got event WatchedEvent state:SyncConnected type:None path:null path:null type:None
   [junit4]   2> 331918 INFO  (TEST-ZkStateReaderTest.testWatchedCollectionCreation-seed#[19C96D06875AAD62]) [    ] o.a.s.c.c.ConnectionManager Client is connected to ZooKeeper
   [junit4]   2> 331919 INFO  (TEST-ZkStateReaderTest.testWatchedCollectionCreation-seed#[19C96D06875AAD62]) [    ] o.a.s.c.c.SolrZkClient Using default ZkACLProvider
   [junit4]   2> 331920 INFO  (TEST-ZkStateReaderTest.testWatchedCollectionCreation-seed#[19C96D06875AAD62]) [    ] o.a.s.c.c.SolrZkClient Using default ZkCredentialsProvider
   [junit4]   2> 331921 INFO  (TEST-ZkStateReaderTest.testWatchedCollectionCreation-seed#[19C96D06875AAD62]) [    ] o.a.s.c.c.ConnectionManager Waiting for client to connect to ZooKeeper
   [junit4]   2> 331922 INFO  (zkCallback-628-thread-1) [    ] o.a.s.c.c.ConnectionManager Watcher org.apache.solr.common.cloud.ConnectionManager@6fd7de7d name:ZooKeeperConnection Watcher:127.0.0.1:53505 got event WatchedEvent state:SyncConnected type:None path:null path:null type:None
   [junit4]   2> 331922 INFO  (TEST-ZkStateReaderTest.testWatchedCollectionCreation-seed#[19C96D06875AAD62]) [    ] o.a.s.c.c.ConnectionManager Client is connected to ZooKeeper
   [junit4]   2> 331922 INFO  (TEST-ZkStateReaderTest.testWatchedCollectionCreation-seed#[19C96D06875AAD62]) [    ] o.a.s.c.c.SolrZkClient Using default ZkACLProvider
   [junit4]   2> 331922 INFO  (TEST-ZkStateReaderTest.testWatchedCollectionCreation-seed#[19C96D06875AAD62]) [    ] o.a.s.c.c.SolrZkClient makePath: /solr
   [junit4]   2> 331926 INFO  (TEST-ZkStateReaderTest.testWatchedCollectionCreation-seed#[19C96D06875AAD62]) [    ] o.a.s.c.c.SolrZkClient Using default ZkCredentialsProvider
   [junit4]   2> 331929 INFO  (TEST-ZkStateReaderTest.testWatchedCollectionCreation-seed#[19C96D06875AAD62]) [    ] o.a.s.c.c.ConnectionManager Waiting for client to connect to ZooKeeper
   [junit4]   2> 331933 INFO  (zkCallback-629-thread-1) [    ] o.a.s.c.c.ConnectionManager Watcher org.apache.solr.common.cloud.ConnectionManager@455215af name:ZooKeeperConnection Watcher:127.0.0.1:53505/solr got event WatchedEvent state:SyncConnected type:None path:null path:null type:None
   [junit4]   2> 331933 INFO  (TEST-ZkStateReaderTest.testWatchedCollectionCreation-seed#[19C96D06875AAD62]) [    ] o.a.s.c.c.ConnectionManager Client is connected to ZooKeeper
   [junit4]   2> 331933 INFO  (TEST-ZkStateReaderTest.testWatchedCollectionCreation-seed#[19C96D06875AAD62]) [    ] o.a.s.c.c.SolrZkClient Using default ZkACLProvider
   [junit4]   2> 331934 INFO  (TEST-ZkStateReaderTest.testWatchedCollectionCreation-seed#[19C96D06875AAD62]) [    ] o.a.s.c.c.SolrZkClient makePath: /live_nodes
   [junit4]   2> 331935 INFO  (TEST-ZkStateReaderTest.testWatchedCollectionCreation-seed#[19C96D06875AAD62]) [    ] o.a.s.c.c.SolrZkClient makePath: /collections
   [junit4]   2> 331935 INFO  (TEST-ZkStateReaderTest.testWatchedCollectionCreation-seed#[19C96D06875AAD62]) [    ] o.a.s.c.c.SolrZkClient makePath: /aliases.json
   [junit4]   2> 331936 INFO  (TEST-ZkStateReaderTest.testWatchedCollectionCreation-seed#[19C96D06875AAD62]) [    ] o.a.s.c.c.SolrZkClient makePath: /clusterstate.json
   [junit4]   2> 331937 INFO  (TEST-ZkStateReaderTest.testWatchedCollectionCreation-seed#[19C96D06875AAD62]) [    ] o.a.s.c.c.SolrZkClient makePath: /security.json
   [junit4]   2> 331938 INFO  (TEST-ZkStateReaderTest.testWatchedCollectionCreation-seed#[19C96D06875AAD62]) [    ] o.a.s.c.c.ZkStateReader Updating cluster state from ZooKeeper... 
   [junit4]   2> 331939 INFO  (TEST-ZkStateReaderTest.testWatchedCollectionCreation-seed#[19C96D06875AAD62]) [    ] o.a.s.c.c.ZkStateReader Loaded empty cluster properties
   [junit4]   2> 331939 INFO  (TEST-ZkStateReaderTest.testWatchedCollectionCreation-seed#[19C96D06875AAD62]) [    ] o.a.s.c.c.ZkStateReader Updated live nodes from ZooKeeper... (0) -> (0)
   [junit4]   2> 331941 INFO  (TEST-ZkStateReaderTest.testWatchedCollectionCreation-seed#[19C96D06875AAD62]) [    ] o.a.s.c.c.ZkStateReader Deleting data for [c1]
   [junit4]   2> 331941 INFO  (TEST-ZkStateReaderTest.testWatchedCollectionCreation-seed#[19C96D06875AAD62]) [    ] o.a.s.c.c.SolrZkClient makePath: /collections/c1
   [junit4]   2> 331942 INFO  (zkCallback-629-thread-1) [    ] o.a.s.c.c.ZkStateReader A collections change: [WatchedEvent state:SyncConnected type:NodeChildrenChanged path:/collections], has occurred - updating...
   [junit4]   2> 331945 INFO  (TEST-ZkStateReaderTest.testWatchedCollectionCreation-seed#[19C96D06875AAD62]) [    ] o.a.s.c.o.ZkStateWriter going to create_collection /collections/c1/state.json
   [junit4]   2> 331946 INFO  (zkCallback-629-thread-1) [    ] o.a.s.c.c.ZkStateReader A cluster state change: [WatchedEvent state:SyncConnected type:NodeCreated path:/collections/c1/state.json] for collection [c1] has occurred - updating... (live nodes size: [0])
   [junit4]   2> 331947 INFO  (zkCallback-629-thread-1) [    ] o.a.s.c.c.ZkStateReader Add data for [c1] ver [0]
   [junit4]   2> 331953 INFO  (TEST-ZkStateReaderTest.testWatchedCollectionCreation-seed#[19C96D06875AAD62]) [    ] o.a.s.c.ZkTestServer connecting to 127.0.0.1:53505 53505
   [junit4]   2> 332184 INFO  (Thread-1244) [    ] o.a.s.c.ZkTestServer connecting to 127.0.0.1:53505 53505
   [junit4]   2> 332185 INFO  (TEST-ZkStateReaderTest.testWatchedCollectionCreation-seed#[19C96D06875AAD62]) [    ] o.a.s.SolrTestCaseJ4 ###Ending testWatchedCollectionCreation
   [junit4]   2> 332188 INFO  (TEST-ZkStateReaderTest.testStateFormatUpdateWithExplicitRefreshLazy-seed#[19C96D06875AAD62]) [    ] o.a.s.SolrTestCaseJ4 ###Starting testStateFormatUpdateWithExplicitRefreshLazy
   [junit4]   2> 332189 INFO  (TEST-ZkStateReaderTest.testStateFormatUpdateWithExplicitRefreshLazy-seed#[19C96D06875AAD62]) [    ] o.a.s.c.ZkTestServer STARTING ZK TEST SERVER
   [junit4]   2> 332190 INFO  (Thread-1245) [    ] o.a.s.c.ZkTestServer client port:0.0.0.0/0.0.0.0:0
   [junit4]   2> 332190 INFO  (Thread-1245) [    ] o.a.s.c.ZkTestServer Starting server
   [junit4]   2> 332290 INFO  (TEST-ZkStateReaderTest.testStateFormatUpdateWithExplicitRefreshLazy-seed#[19C96D06875AAD62]) [    ] o.a.s.c.ZkTestServer start zk server on port:45486
   [junit4]   2> 332290 INFO  (TEST-ZkStateReaderTest.testStateFormatUpdateWithExplicitRefreshLazy-seed#[19C96D06875AAD62]) [    ] o.a.s.c.c.SolrZkClient Using default ZkCredentialsProvider
   [junit4]   2> 332293 INFO  (TEST-ZkStateReaderTest.testStateFormatUpdateWithExplicitRefreshLazy-seed#[19C96D06875AAD62]) [    ] o.a.s.c.c.ConnectionManager Waiting for client to connect to ZooKeeper
   [junit4]   2> 332294 INFO  (zkCallback-631-thread-1) [    ] o.a.s.c.c.ConnectionManager Watcher org.apache.solr.common.cloud.ConnectionManager@a5afa8 name:ZooKeeperConnection Watcher:127.0.0.1:45486 got event WatchedEvent state:SyncConnected type:None path:null path:null type:None
   [junit4]   2> 332294 INFO  (TEST-ZkStateReaderTest.testStateFormatUpdateWithExplicitRefreshLazy-seed#[19C96D06875AAD62]) [    ] o.a.s.c.c.ConnectionManager Client is connected to ZooKeeper
   [junit4]   2> 332294 INFO  (TEST-ZkStateReaderTest.testStateFormatUpdateWithExplicitRefreshLazy-seed#[19C96D06875AAD62]) [    ] o.a.s.c.c.SolrZkClient Using default ZkACLProvider
   [junit4]   2> 332296 INFO  (TEST-ZkStateReaderTest.testStateFormatUpdateWithExplicitRefreshLazy-seed#[19C96D06875AAD62]) [    ] o.a.s.c.c.SolrZkClient Using default ZkCredentialsProvider
   [junit4]   2> 332298 INFO  (TEST-ZkStateReaderTest.testStateFormatUpdateWithExplicitRefreshLazy-seed#[19C96D06875AAD62]) [    ] o.a.s.c.c.ConnectionManager Waiting for client to connect to ZooKeeper
   [junit4]   2> 332300 INFO  (zkCallback-632-thread-1) [    ] o.a.s.c.c.ConnectionManager Watcher org.apache.solr.common.cloud.ConnectionManager@5c0f19fd name:ZooKeeperConnection Watcher:127.0.0.1:45486 got event WatchedEvent state:SyncConnected type:None path:null path:null type:None
   [junit4]   2> 332300 INFO  (TEST-ZkStateReaderTest.testStateFormatUpdateWithExplicitRefreshLazy-seed#[19C96D06875AAD62]) [    ] o.a.s.c.c.ConnectionManager Client is connected to ZooKeeper
   [junit4]   2> 332300 INFO  (TEST-ZkStateReaderTest.testStateFormatUpdateWithExplicitRefreshLazy-seed#[19C96D06875AAD62]) [    ] o.a.s.c.c.SolrZkClient Using default ZkACLProvider
   [junit4]   2> 332300 INFO  (TEST-ZkStateReaderTest.testStateFormatUpdateWithExplicitRefreshLazy-seed#[19C96D06875AAD62]) [    ] o.a.s.c.c.SolrZkClient makePath: /solr
   [junit4]   2> 332302 INFO  (TEST-ZkStateReaderTest.testStateFormatUpdateWithExplicitRefreshLazy-seed#[19C96D06875AAD62]) [    ] o.a.s.c.c.SolrZkClient Using default ZkCredentialsProvider
   [junit4]   2> 332305 INFO  (TEST-ZkStateReaderTest.testStateFormatUpdateWithExplicitRefreshLazy-seed#[19C96D06875AAD62]) [    ] o.a.s.c.c.ConnectionManager Waiting for client to connect to ZooKeeper
   [junit4]   2> 332305 INFO  (zkCallback-633-thread-1) [    ] o.a.s.c.c.ConnectionManager Watcher org.apache.solr.common.cloud.ConnectionManager@3c9f7840 name:ZooKeeperConnection Watcher:127.0.0.1:45486/solr got event WatchedEvent state:SyncConnected type:None path:null path:null type:None
   [junit4]   2> 332306 INFO  (TEST-ZkStateReaderTest.testStateFormatUpdateWithExplicitRefreshLazy-seed#[19C96D06875AAD62]) [    ] o.a.s.c.c.ConnectionManager Client is connected to ZooKeeper
   [junit4]   2> 332306 INFO  (TEST-ZkStateReaderTest.testStateFormatUpdateWithExplicitRefreshLazy-seed#[19C96D06875AAD62]) [    ] o.a.s.c.c.SolrZkClient Using default ZkACLProvider
   [junit4]   2> 332306 INFO  (TEST-ZkStateReaderTest.testStateFormatUpdateWithExplicitRefreshLazy-seed#[19C96D06875AAD62]) [    ] o.a.s.c.c.SolrZkClient makePath: /live_nodes
   [junit4]   2> 332307 INFO  (TEST-ZkStateReaderTest.testStateFormatUpdateWithExplicitRefreshLazy-seed#[19C96D06875AAD62]) [    ] o.a.s.c.c.SolrZkClient makePath: /collections
   [junit4]   2> 332307 INFO  (TEST-ZkStateReaderTest.testStateFormatUpdateWithExplicitRefreshLazy-seed#[19C96D06875AAD62]) [    ] o.a.s.c.c.SolrZkClient makePath: /aliases.json
   [junit4]   2> 332308 INFO  (TEST-ZkStateReaderTest.testStateFormatUpdateWithExplicitRefreshLazy-seed#[19C96D06875AAD62]) [    ] o.a.s.c.c.SolrZkClient makePath: /clusterstate.json
   [junit4]   2> 332308 INFO  (TEST-ZkStateReaderTest.testStateFormatUpdateWithExplicitRefreshLazy-seed#[19C96D06875AAD62]) [    ] o.a.s.c.c.SolrZkClient makePath: /security.json
   [junit4]   2> 332309 INFO  (TEST-ZkStateReaderTest.testStateFormatUpdateWithExplicitRefreshLazy-seed#[19C96D06875AAD62]) [    ] o.a.s.c.c.ZkStateReader Updating cluster state from ZooKeeper... 
   [junit4]   2> 332309 INFO  (TEST-ZkStateReaderTest.testStateFormatUpdateWithExplicitRefreshLazy-seed#[19C96D06875AAD62]) [    ] o.a.s.c.c.ZkStateReader Loaded empty cluster properties
   [junit4]   2> 332309 INFO  (TEST-ZkStateReaderTest.testStateFormatUpdateWithExplicitRefreshLazy-seed#[19C96D06875AAD62]) [    ] o.a.s.c.c.ZkStateReader Updated live nodes from ZooKeeper... (0) -> (0)
   [junit4]   2> 332310 INFO  (TEST-ZkStateReaderTest.testStateFormatUpdateWithExplicitRefreshLazy-seed#[19C96D06875AAD62]) [    ] o.a.s.c.c.SolrZkClient makePath: /collections/c1
   [junit4]   2> 332311 INFO  (TEST-ZkStateReaderTest.testStateFormatUpdateWithExplicitRefreshLazy-seed#[19C96D06875AAD62]) [    ] o.a.s.c.o.ZkStateWriter going to create_collection /collections/c1/state.json
   [junit4]   2> 332314 ERROR (TEST-ZkStateReaderTest.testStateFormatUpdateWithExplicitRefreshLazy-seed#[19C96D06875AAD62]-EventThread) [    ] o.a.z.ClientCnxn Error while calling watcher 
   [junit4]   2> java.util.concurrent.RejectedExecutionException: Task org.apache.solr.common.util.ExecutorUtil$MDCAwareThreadPoolExecutor$$Lambda$7/1315155847@74edc4da rejected from org.apache.solr.common.util.ExecutorUtil$MDCAwareThreadPoolExecutor@31ef4423[Shutting down, pool size = 2, active threads = 2, queued tasks = 0, completed tasks = 0]
   [junit4]   2> 	at java.util.concurrent.ThreadPoolExecutor$AbortPolicy.rejectedExecution(ThreadPoolExecutor.java:2047)
   [junit4]   2> 	at java.util.concurrent.ThreadPoolExecutor.reject(ThreadPoolExecutor.java:823)
   [junit4]   2> 	at java.util.concurrent.ThreadPoolExecutor.execute(ThreadPoolExecutor.java:1369)
   [junit4]   2> 	at org.apache.solr.common.util.ExecutorUtil$MDCAwareThreadPoolExecutor.execute(ExecutorUtil.java:214)
   [junit4]   2> 	at java.util.concurrent.AbstractExecutorService.submit(AbstractExecutorService.java:112)
   [junit4]   2> 	at org.apache.solr.common.cloud.SolrZkClient$3.process(SolrZkClient.java:265)
   [junit4]   2> 	at org.apache.zookeeper.ClientCnxn$EventThread.processEvent(ClientCnxn.java:522)
   [junit4]   2> 	at org.apache.zookeeper.ClientCnxn$EventThread.run(ClientCnxn.java:498)
   [junit4]   2> 332314 INFO  (zkCallback-633-thread-2) [    ] o.a.s.c.c.ZkStateReader A collections change: [WatchedEvent state:SyncConnected type:NodeChildrenChanged path:/collections], has occurred - updating...
   [junit4]   2> 332314 WARN  (zkCallback-633-thread-2) [    ] o.a.s.c.c.ZkStateReader ZooKeeper watch triggered, but Solr cannot talk to ZK: [KeeperErrorCode = Session expired for /collections]
   [junit4]   2> 332322 INFO  (TEST-ZkStateReaderTest.testStateFormatUpdateWithExplicitRefreshLazy-seed#[19C96D06875AAD62]) [    ] o.a.s.c.ZkTestServer connecting to 127.0.0.1:45486 45486
   [junit4]   2> 332440 INFO  (Thread-1245) [    ] o.a.s.c.ZkTestServer connecting to 127.0.0.1:45486 45486
   [junit4]   2> 332441 INFO  (TEST-ZkStateReaderTest.testStateFormatUpdateWithExplicitRefreshLazy-seed#[19C96D06875AAD62]) [    ] o.a.s.SolrTestCaseJ4 ###Ending testStateFormatUpdateWithExplicitRefreshLazy
   [junit4]   2> NOTE: reproduce with: ant test  -Dtestcase=ZkStateReaderTest -Dtests.method=testStateFormatUpdateWithExplicitRefreshLazy -Dtests.seed=19C96D06875AAD62 -Dtests.multiplier=2 -Dtests.slow=true -Dtests.locale=de-AT -Dtests.timezone=Africa/Porto-Novo -Dtests.asserts=true -Dtests.file.encoding=UTF-8
   [junit4] ERROR   0.26s J2 | ZkStateReaderTest.testStateFormatUpdateWithExplicitRefreshLazy <<<
   [junit4]    > Throwable #1: org.apache.solr.common.SolrException: Could not find collection : c1
   [junit4]    > 	at __randomizedtesting.SeedInfo.seed([19C96D06875AAD62:7286CD7BFE557058]:0)
   [junit4]    > 	at org.apache.solr.common.cloud.ClusterState.getCollection(ClusterState.java:192)
   [junit4]    > 	at org.apache.solr.cloud.overseer.ZkStateReaderTest.testStateFormatUpdate(ZkStateReaderTest.java:129)
   [junit4]    > 	at org.apache.solr.cloud.overseer.ZkStateReaderTest.testStateFormatUpdateWithExplicitRefreshLazy(ZkStateReaderTest.java:48)
   [junit4]    > 	at java.lang.Thread.run(Thread.java:745)
   [junit4]   2> 332444 INFO  (TEST-ZkStateReaderTest.testExternalCollectionWatchedNotWatched-seed#[19C96D06875AAD62]) [    ] o.a.s.SolrTestCaseJ4 ###Starting testExternalCollectionWatchedNotWatched
   [junit4]   2> 332444 INFO  (TEST-ZkStateReaderTest.testExternalCollectionWatchedNotWatched-seed#[19C96D06875AAD62]) [    ] o.a.s.c.ZkTestServer STARTING ZK TEST SERVER
   [junit4]   2> 332445 INFO  (Thread-1246) [    ] o.a.s.c.ZkTestServer client port:0.0.0.0/0.0.0.0:0
   [junit4]   2> 332445 INFO  (Thread-1246) [    ] o.a.s.c.ZkTestServer Starting server
   [junit4]   2> 332545 INFO  (TEST-ZkStateReaderTest.testExternalCollectionWatchedNotWatched-seed#[19C96D06875AAD62]) [    ] o.a.s.c.ZkTestServer start zk server on port:51717
   [junit4]   2> 332545 INFO  (TEST-ZkStateReaderTest.testExternalCollectionWatchedNotWatched-seed#[19C96D06875AAD62]) [    ] o.a.s.c.c.SolrZkClient Using default ZkCredentialsProvider
   [junit4]   2> 332566 INFO  (TEST-ZkStateReaderTest.testExternalCollectionWatchedNotWatched-seed#[19C96D06875AAD62]) [    ] o.a.s.c.c.ConnectionManager Waiting for client to connect to ZooKeeper
   [junit4]   2> 332585 INFO  (zkCallback-635-thread-1) [    ] o.a.s.c.c.ConnectionManager Watcher org.apache.solr.common.cloud.ConnectionManager@7d9d2258 name:ZooKeeperConnection Watcher:127.0.0.1:51717 got event WatchedEvent state:SyncConnected type:None path:null path:null type:None
   [junit4]   2> 332585 INFO  (TEST-ZkStateReaderTest.testExternalCollectionWatchedNotWatched-seed#[19C96D06875AAD62]) [    ] o.a.s.c.c.ConnectionManager Client is connected to ZooKeeper
   [junit4]   2> 332585 INFO  (TEST-ZkStateReaderTest.testExternalCollectionWatchedNotWatched-seed#[19C96D06875AAD62]) [    ] o.a.s.c.c.SolrZkClient Using default ZkACLProvider
   [junit4]   2> 332586 INFO  (TEST-ZkStateReaderTest.testExternalCollectionWatchedNotWatched-seed#[19C96D06875AAD62]) [    ] o.a.s.c.c.SolrZkClient Using default ZkCredentialsProvider
   [junit4]   2> 332586 INFO  (TEST-ZkStateReaderTest.testExternalCollectionWatchedNotWatched-seed#[19C96D06875AAD62]) [    ] o.a.s.c.c.ConnectionManager Waiting for client to connect to ZooKeeper
   [junit4]   2> 332589 INFO  (zkCallback-636-thread-1) [    ] o.a.s.c.c.ConnectionManager Watcher org.apache.solr.common.cloud.ConnectionManager@625ac2fd name:ZooKeeperConnection Watcher:127.0.0.1:51717 got event WatchedEvent state:SyncConnected type:None path:null path:null type:None
   [junit4]   2> 332589 INFO  (TEST-ZkStateReaderTest.testExternalCollectionWatchedNotWatched-seed#[19C96D06875AAD62]) [    ] o.a.s.c.c.ConnectionManager Client is connected to ZooKeeper
   [junit4]   2> 332589 INFO  (TEST-ZkStateReaderTest.testExternalCollectionWatchedNotWatched-seed#[19C96D06875AAD62]) [    ] o.a.s.c.c.SolrZkClient Using default ZkACLProvider
   [junit4]   2> 332589 INFO  (TEST-ZkStateReaderTest.testExternalCollectionWatchedNotWatched-seed#[19C96D06875AAD62]) [    ] o.a.s.c.c.SolrZkClient makePath: /solr
   [junit4]   2> 332590 INFO  (TEST-ZkStateReaderTest.testExternalCollectionWatchedNotWatched-seed#[19C96D06875AAD62]) [    ] o.a.s.c.c.SolrZkClient Using default ZkCredentialsProvider
   [junit4]   2> 332592 INFO  (TEST-ZkStateReaderTest.testExternalCollectionWatchedNotWatched-seed#[19C96D06875AAD62]) [    ] o.a.s.c.c.ConnectionManager Waiting for client to connect to ZooKeeper
   [junit4]   2> 332592 INFO  (zkCallback-637-thread-1) [    ] o.a.s.c.c.ConnectionManager Watcher org.apache.solr.common.cloud.ConnectionManager@ac4457f name:ZooKeeperConnection Watcher:127.0.0.1:51717/solr got event WatchedEvent state:SyncConnected type:None path:null path:null type:None
   [junit4]   2> 332592 INFO  (TEST-ZkStateReaderTest.testExternalCollectionWatchedNotWatched-seed#[19C96D06875AAD62]) [    ] o.a.s.c.c.ConnectionManager Client is connected to ZooKeeper
   [junit4]   2> 332593 INFO  (TEST-ZkStateReaderTest.testExternalCollectionWatchedNotWatched-seed#[19C96D06875AAD62]) [    ] o.a.s.c.c.SolrZkClient Using default ZkACLProvider
   [junit4]   2> 332593 INFO  (TEST-ZkStateReaderTest.testExternalCollectionWatchedNotWatched-seed#[19C96D06875AAD62]) [    ] o.a.s.c.c.SolrZkClient makePath: /live_nodes
   [junit4]   2> 332594 INFO  (TEST-ZkStateReaderTest.testExternalCollectionWatchedNotWatched-seed#[19C96D06875AAD62]) [    ] o.a.s.c.c.SolrZkClient makePath: /collections
   [junit4]   2> 332595 INFO  (TEST-ZkStateReaderTest.testExternalCollectionWatchedNotWatched-seed#[19C96D06875AAD62]) [    ] o.a.s.c.c.SolrZkClient makePath: /aliases.json
   [junit4]   2> 332595 INFO  (TEST-ZkStateReaderTest.testExternalCollectionWatchedNotWatched-seed#[19C96D06875AAD62]) [    ] o.a.s.c.c.SolrZkClient makePath: /clusterstate.json
   [junit4]   2> 332596 INFO  (TEST-ZkStateReaderTest.testExternalCollectionWatchedNotWatched-seed#[19C96D06875AAD62]) [    ] o.a.s.c.c.SolrZkClient makePath: /security.json
   [junit4]   2> 332596 INFO  (TEST-ZkStateReaderTest.testExternalCollectionWatchedNotWatched-seed#[19C96D06875AAD62]) [    ] o.a.s.c.c.ZkStateReader Updating cluster state from ZooKeeper... 
   [junit4]   2> 332596 INFO  (TEST-ZkStateReaderTest.testExternalCollectionWatchedNotWatched-seed#[19C96D06875AAD62]) [    ] o.a.s.c.c.ZkStateReader Loaded empty cluster properties
   [junit4]   2> 332597 INFO  (TEST-ZkStateReaderTest.testExternalCollectionWatchedNotWatched-seed#[19C96D06875AAD62]) [    ] o.a.s.c.c.ZkStateReader Updated live nodes from ZooKeeper... (0) -> (0)
   [junit4]   2> 332597 INFO  (TEST-ZkStateReaderTest.testExternalCollectionWatchedNotWatched-seed#[19C96D06875AAD62]) [    ] o.a.s.c.c.SolrZkClient makePath: /collections/c1
   [junit4]   2> 332598 INFO  (zkCallback-637-thread-1) [    ] o.a.s.c.c.ZkStateReader A collections change: [WatchedEvent state:SyncConnected type:NodeChildrenChanged path:/collections], has occurred - updating...
   [junit4]   2> 332598 INFO  (TEST-ZkStateReaderTest.testExternalCollectionWatchedNotWatched-seed#[19C96D06875AAD62]) [    ] o.a.s.c.o.ZkStateWriter going to create_collection /collections/c1/state.json
   [junit4]   2> 332599 INFO  (TEST-ZkStateReaderTest.testExternalCollectionWatchedNotWatched-seed#[19C96D06875AAD62]) [    ] o.a.s.c.c.ZkStateReader Add data for [c1] ver [0]
   [junit4]   2> 332600 INFO  (TEST-ZkStateReaderTest.testExternalCollectionWatchedNotWatched-seed#[19C96D06875AAD62]) [    ] o.a.s.c.ZkTestServer connecting to 127.0.0.1:51717 51717
   [junit4]   2> 332772 INFO  (Thread-1246) [    ] o.a.s.c.ZkTestServer connecting to 127.0.0.1:51717 51717
   [junit4]   2> 332772 INFO  (TEST-ZkStateReaderTest.testExternalCollectionWatchedNotWatched-seed#[19C96D06875AAD62]) [    ] o.a.s.SolrTestCaseJ4 ###Ending testExternalCollectionWatchedNotWatched
   [junit4]   2> 332774 INFO  (TEST-ZkStateReaderTest.testStateFormatUpdateWithTimeDelay-seed#[19C96D06875AAD62]) [    ] o.a.s.SolrTestCaseJ4 ###Starting testStateFormatUpdateWithTimeDelay
   [junit4]   2> 332774 INFO  (TEST-ZkStateReaderTest.testStateFormatUpdateWithTimeDelay-seed#[19C96D06875AAD62]) [    ] o.a.s.c.ZkTestServer STARTING ZK TEST SERVER
   [junit4]   2> 332776 INFO  (Thread-1247) [    ] o.a.s.c.ZkTestServer client port:0.0.0.0/0.0.0.0:0
   [junit4]   2> 332776 INFO  (Thread-1247) [    ] o.a.s.c.ZkTestServer Starting server
   [junit4]   2> 332876 INFO  (TEST-ZkStateReaderTest.testStateFormatUpdateWithTimeDelay-seed#[19C96D06875AAD62]) [    ] o.a.s.c.ZkTestServer start zk server on port:35842
   [junit4]   2> 332876 INFO  (TEST-ZkStateReaderTest.testStateFormatUpdateWithTimeDelay-seed#[19C96D06875AAD62]) [    ] o.a.s.c.c.SolrZkClient Using default ZkCredentialsProvider
   [junit4]   2> 332891 INFO  (TEST-ZkStateReaderTest.testStateFormatUpdateWithTimeDelay-seed#[19C96D06875AAD62]) [    ] o.a.s.c.c.ConnectionManager Waiting for client to connect to ZooKeeper
   [junit4]   2> 332929 INFO  (zkCallback-639-thread-1) [    ] o.a.s.c.c.ConnectionManager Watcher org.apache.solr.common.cloud.ConnectionManager@694724d4 name:ZooKeeperConnection Watcher:127.0.0.1:35842 got event WatchedEvent state:SyncConnected type:None path:null path:null type:None
   [junit4]   2> 332929 INFO  (TEST-ZkStateReaderTest.testStateFormatUpdateWithTimeDelay-seed#[19C96D06875AAD62]) [    ] o.a.s.c.c.ConnectionManager Client is connected to ZooKeeper
   [junit4]   2> 332929 INFO  (TEST-ZkStateReaderTest.testStateFormatUpdateWithTimeDelay-seed#[19C96D06875AAD62]) [    ] o.a.s.c.c.SolrZkClient Using default ZkACLProvider
   [junit4]   2> 332930 INFO  (TEST-ZkStateReaderTest.testStateFormatUpdateWithTimeDelay-seed#[19C96D06875AAD62]) [    ] o.a.s.c.c.SolrZkClient Using default ZkCredentialsProvider
   [junit4]   2> 332943 INFO  (TEST-ZkStateReaderTest.testStateFormatUpdateWithTimeDelay-seed#[19C96D06875AAD62]) [    ] o.a.s.c.c.ConnectionManager Waiting for client to connect to ZooKeeper
   [junit4]   2> 332957 INFO  (zkCallback-640-thread-1) [    ] o.a.s.c.c.ConnectionManager Watcher org.apache.solr.common.cloud.ConnectionManager@c961ac3 name:ZooKeeperConnection Watcher:127.0.0.1:35842 got event WatchedEvent state:SyncConnected type:None path:null path:null type:None
   [junit4]   2> 332957 INFO  (TEST-ZkStateReaderTest.testStateFormatUpdateWithTimeDelay-seed#[19C96D06875AAD62]) [    ] o.a.s.c.c.ConnectionManager Client is connected to ZooKeeper
   [junit4]   2> 332957 INFO  (TEST-ZkStateReaderTest.testStateFormatUpdateWithTimeDelay-seed#[19C96D06875AAD62]) [    ] o.a.s.c.c.SolrZkClient Using default ZkACLProvider
   [junit4]   2> 332957 INFO  (TEST-ZkStateReaderTest.testStateFormatUpdateWithTimeDelay-seed#[19C96D06875AAD62]) [    ] o.a.s.c.c.SolrZkClient makePath: /solr
   [junit4]   2> 332958 INFO  (TEST-ZkStateReaderTest.testStateFormatUpdateWithTimeDelay-seed#[19C96D06875AAD62]) [    ] o.a.s.c.c.SolrZkClient Using default ZkCredentialsProvider
   [junit4]   2> 332973 INFO  (TEST-ZkStateReaderTest.testStateFormatUpdateWithTimeDelay-seed#[19C96D06875AAD62]) [    ] o.a.s.c.c.ConnectionManager Waiting for client to connect to ZooKeeper
   [junit4]   2> 332975 INFO  (zkCallback-641-thread-1) [    ] o.a.s.c.c.ConnectionManager Watcher org.apache.solr.common.cloud.ConnectionManager@3bdd188b name:ZooKeeperConnection Watcher:127.0.0.1:35842/solr got event WatchedEvent state:SyncConnected type:None path:null path:null type:None
   [junit4]   2> 332975 INFO  (TEST-ZkStateReaderTest.testStateFormatUpdateWithTimeDelay-seed#[19C96D06875AAD62]) [    ] o.a.s.c.c.ConnectionManager Client is connected to ZooKeeper
   [junit4]   2> 332975 INFO  (TEST-ZkStateReaderTest.testStateFormatUpdateWithTimeDelay-seed#[19C96D06875AAD62]) [    ] o.a.s.c.c.SolrZkClient Using default ZkACLProvider
   [junit4]   2> 332975 INFO  (TEST-ZkStateReaderTest.testStateFormatUpdateWithTimeDelay-seed#[19C96D06875AAD62]) [    ] o.a.s.c.c.SolrZkClient makePath: /live_nodes
   [junit4]   2> 332976 INFO  (TEST-ZkStateReaderTest.testStateFormatUpdateWithTimeDelay-seed#[19C96D06875AAD62]) [    ] o.a.s.c.c.SolrZkClient makePath: /collections
   [junit4]   2> 332976 INFO  (TEST-ZkStateReaderTest.testStateFormatUpdateWithTimeDelay-seed#[19C96D06875AAD62]) [    ] o.a.s.c.c.SolrZkClient makePath: /aliases.json
   [junit4]   2> 332977 INFO  (TEST-ZkStateReaderTest.testStateFormatUpdateWithTimeDelay-seed#[19C96D06875AAD62]) [    ] o.a.s.c.c.SolrZkClient makePath: /clusterstate.json
   [junit4]   2> 332977 INFO  (TEST-ZkStateReaderTest.testStateFormatUpdateWithTimeDelay-seed#[19C96D06875AAD62]) [    ] o.a.s.c.c.SolrZkClient makePath: /security.json
   [junit4]   2> 332978 INFO  (TEST-ZkStateReaderTest.testStateFormatUpdateWithTimeDelay-seed#[19C96D06875AAD62]) [    ] o.a.s.c.c.ZkStateReader Updating cluster state from ZooKeeper... 
   [junit4]   2> 332978 INFO  (TEST-ZkStateReaderTest.testStateFormatUpdateWithTimeDelay-seed#[19C96D06875AAD62]) [    ] o.a.s.c.c.ZkStateReader Loaded empty cluster properties
   [junit4]   2> 332978 INFO  (TEST-ZkStateReaderTest.testStateFormatUpdateWithTimeDelay-seed#[19C96D06875AAD62]) [    ] o.a.s.c.c.ZkStateReader Updated live nodes from ZooKeeper... (0) -> (0)
   [junit4]   2> 332979 INFO  (TEST-ZkStateReaderTest.testStateFormatUpdateWithTimeDelay-seed#[19C96D06875AAD62]) [    ] o.a.s.c.c.ZkStateReader Deleting data for [c1]
   [junit4]   2> 332979 INFO  (TEST-ZkStateReaderTest.testStateFormatUpdateWithTimeDelay-seed#[19C96D06875AAD62]) [    ] o.a.s.c.c.SolrZkClient makePath: /collections/c1
   [junit4]   2> 332979 INFO  (zkCallback-641-thread-1) [    ] o.a.s.c.c.ZkStateReader A collections change: [WatchedEvent state:SyncConnected type:NodeChildrenChanged path:/collections], has occurred - updating...
   [junit4]   2> 332986 INFO  (zkCallback-641-thread-1) [    ] o.a.s.c.c.ZkStateReader A cluster state change: [WatchedEvent state:SyncConnected type:NodeDataChanged path:/clusterstate.json], has occurred - updating... (live nodes size: [0])
   [junit4]   2> 332991 INFO  (TEST-ZkStateReaderTest.testStateFormatUpdateWithTimeDelay-seed#[19C96D06875AAD62]) [    ] o.a.s.c.o.ZkStateWriter going to create_collection /collections/c1/state.json
   [junit4]   2> 332992 INFO  (zkCallback-641-thread-1) [    ] o.a.s.c.c.ZkStateReader A cluster state change: [WatchedEvent state:SyncConnected type:NodeCreated path:/collections/c1/state.json] for collection [c1] has occurred - updating... (live nodes size: [0])
   [junit4]   2> 332992 INFO  (zkCallback-641-thread-1) [    ] o.a.s.c.c.ZkStateReader Add data for [c1] ver [0]
   [junit4]   2> 332997 INFO  (zkCallback-641-thread-2) [    ] o.a.s.c.c.ZkStateReader A cluster state change: [WatchedEvent state:SyncConnected type:NodeDataChanged path:/clusterstate.json], has occurred - updating... (live nodes size: [0])
   [junit4]   2> 333000 INFO  (TEST-ZkStateReaderTest.testStateFormatUpdateWithTimeDelay-seed#[19C96D06875AAD62]) [    ] o.a.s.c.ZkTestServer connecting to 127.0.0.1:35842 35842
   [junit4]   2> 333099 INFO  (Thread-1247) [    ] o.a.s.c.ZkTestServer connecting to 127.0.0.1:35842 35842
   [junit4]   2> 333099 INFO  (TEST-ZkStateReaderTest.testStateFormatUpdateWithTimeDelay-seed#[19C96D06875AAD62]) [    ] o.a.s.SolrTestCaseJ4 ###Ending testStateFormatUpdateWithTimeDelay
   [junit4]   2> NOTE: reproduce with: ant test  -Dtestcase=ZkStateReaderTest -Dtests.method=testStateFormatUpdateWithTimeDelay -Dtests.seed=19C96D06875AAD62 -Dtests.multiplier=2 -Dtests.slow=true -Dtests.locale=de-AT -Dtests.timezone=Africa/Porto-Novo -Dtests.asserts=true -Dtests.file.encoding=UTF-8
   [junit4] FAILURE 0.33s J2 | ZkStateReaderTest.testStateFormatUpdateWithTimeDelay <<<
   [junit4]    > Throwable #1: java.lang.AssertionError: expected:<2> but was:<1>
   [junit4]    > 	at __randomizedtesting.SeedInfo.seed([19C96D06875AAD62:6657DA83EE3880E8]:0)
   [junit4]    > 	at org.apache.solr.cloud.overseer.ZkStateReaderTest.testStateFormatUpdate(ZkStateReaderTest.java:130)
   [junit4]    > 	at org.apache.solr.cloud.overseer.ZkStateReaderTest.testStateFormatUpdateWithTimeDelay(ZkStateReaderTest.java:53)
   [junit4]    > 	at java.lang.Thread.run(Thread.java:745)
   [junit4]   2> 333102 INFO  (TEST-ZkStateReaderTest.testStateFormatUpdateWithExplicitRefresh-seed#[19C96D06875AAD62]) [    ] o.a.s.SolrTestCaseJ4 ###Starting testStateFormatUpdateWithExplicitRefresh
   [junit4]   2> 333102 INFO  (TEST-ZkStateReaderTest.testStateFormatUpdateWithExplicitRefresh-seed#[19C96D06875AAD62]) [    ] o.a.s.c.ZkTestServer STARTING ZK TEST SERVER
   [junit4]   2> 333103 INFO  (Thread-1248) [    ] o.a.s.c.ZkTestServer client port:0.0.0.0/0.0.0.0:0
   [junit4]   2> 333103 INFO  (Thread-1248) [    ] o.a.s.c.ZkTestServer Starting server
   [junit4]   2> 333203 INFO  (TEST-ZkStateReaderTest.testStateFormatUpdateWithExplicitRefresh-seed#[19C96D06875AAD62]) [    ] o.a.s.c.ZkTestServer start zk server on port:34606
   [junit4]   2> 333203 INFO  (TEST-ZkStateReaderTest.testStateFormatUpdateWithExplicitRefresh-seed#[19C96D06875AAD62]) [    ] o.a.s.c.c.SolrZkClient Using default ZkCredentialsProvider
   [junit4]   2> 333204 INFO  (TEST-ZkStateReaderTest.testStateFormatUpdateWithExplicitRefresh-seed#[19C96D06875AAD62]) [    ] o.a.s.c.c.ConnectionManager Waiting for client to connect to ZooKeeper
   [junit4]   2> 333205 INFO  (zkCallback-643-thread-1) [    ] o.a.s.c.c.ConnectionManager Watcher org.apache.solr.common.cloud.ConnectionManager@69bd467 name:ZooKeeperConnection Watcher:127.0.0.1:34606 got event WatchedEvent state:SyncConnected type:None path:null path:null type:None
   [junit4]   2> 333205 INFO  (TEST-ZkStateReaderTest.testStateFormatUpdateWithExplicitRefresh-seed#[19C96D06875AAD62]) [    ] o.a.s.c.c.ConnectionManager Client is connected to ZooKeeper
   [junit4]   2> 333206 INFO  (TEST-ZkStateReaderTest.testStateFormatUpdateWithExplicitRefresh-seed#[19C96D06875AAD62]) [    ] o.a.s.c.c.SolrZkClient Using default ZkACLProvider
   [junit4]   2> 333206 INFO  (TEST-ZkStateReaderTest.testStateFormatUpdateWithExplicitRefresh-seed#[19C96D06875AAD62]) [    ] o.a.s.c.c.SolrZkClient Using default ZkCredentialsProvider
   [junit4]   2> 333207 INFO  (TEST-ZkStateReaderTest.testStateFormatUpdateWithExplicitRefresh-seed#[19C96D06875AAD62]) [    ] o.a.s.c.c.ConnectionManager Waiting for client to connect to ZooKeeper
   [junit4]   2> 333207 INFO  (zkCallback-644-thread-1) [    ] o.a.s.c.c.ConnectionManager Watcher org.apache.solr.common.cloud.ConnectionManager@4468d892 name:ZooKeeperConnection Watcher:127.0.0.1:34606 got event WatchedEvent state:SyncConnected type:None path:null path:null type:None
   [junit4]   2> 333208 INFO  (TEST-ZkStateReaderTest.testStateFormatUpdateWithExplicitRefresh-seed#[19C96D06875AAD62]) [    ] o.a.s.c.c.ConnectionManager Client is connected to ZooKeeper
   [junit4]   2> 333208 INFO  (TEST-ZkStateReaderTest.testStateFormatUpdateWithExplicitRefresh-seed#[19C96D06875AAD62]) [    ] o.a.s.c.c.SolrZkClient Using default ZkACLProvider
   [junit4]   2> 333208 INFO  (TEST-ZkStateReaderTest.testStateFormatUpdateWithExplicitRefresh-seed#[19C96D06875AAD62]) [    ] o.a.s.c.c.SolrZkClient makePath: /solr
   [junit4]   2> 333214 INFO  (TEST-ZkStateReaderTest.testStateFormatUpdateWithExplicitRefresh-seed#[19C96D06875AAD62]) [    ] o.a.s.c.c.SolrZkClient Using default ZkCredentialsProvider
   [junit4]   2> 333215 INFO  (TEST-ZkStateReaderTest.testStateFormatUpdateWithExplicitRefresh-seed#[19C96D06875AAD62]) [    ] o.a.s.c.c.ConnectionManager Waiting for client to connect to ZooKeeper
   [junit4]   2> 333216 INFO  (zkCallback-645-thread-1) [    ] o.a.s.c.c.ConnectionManager Watcher org.apache.solr.common.cloud.ConnectionManager@70755ba9 name:ZooKeeperConnection Watcher:127.0.0.1:34606/solr got event WatchedEvent state:SyncConnected type:None path:null path:null type:None
   [junit4]   2> 333216 INFO  (TEST-ZkStateReaderTest.testStateFormatUpdateWithExplicitRefresh-seed#[19C96D06875AAD62]) [    ] o.a.s.c.c.ConnectionManager Client is connected to ZooKeeper
   [junit4]   2> 333216 INFO  (TEST-ZkStateReaderTest.testStateFormatUpdateWithExplicitRefresh-seed#[19C96D06875AAD62]) [    ] o.a.s.c.c.SolrZkClient Using default ZkACLProvider
   [junit4]   2> 333216 INFO  (TEST-ZkStateReaderTest.testStateFormatUpdateWithExplicitRefresh-seed#[19C96D06875AAD62]) [    ] o.a.s.c.c.SolrZkClient makePath: /live_nodes
   [junit4]   2> 333217 INFO  (TEST-ZkStateReaderTest.testStateFormatUpdateWithExplicitRefresh-seed#[19C96D06875AAD62]) [    ] o.a.s.c.c.SolrZkClient makePath: /collections
   [junit4]   2> 333218 INFO  (TEST-ZkStateReaderTest.testStateFormatUpdateWithExplicitRefresh-seed#[19C96D06875AAD62]) [    ] o.a.s.c.c.SolrZkClient makePath: /aliases.json
   [junit4]   2> 333219 INFO  (TEST-ZkStateReaderTest.testStateFormatUpdateWithExplicitRefresh-seed#[19C96D06875AAD62]) [    ] o.a.s.c.c.SolrZkClient makePath: /clusterstate.json
   [junit4]   2> 333220 INFO  (TEST-ZkStateReaderTest.testStateFormatUpdateWithExplicitRefresh-seed#[19C96D06875AAD62]) [    ] o.a.s.c.c.SolrZkClient makePath: /security.json
   [junit4]   2> 333220 INFO  (TEST-ZkStateReaderTest.testStateFormatUpdateWithExplicitRefresh-seed#[19C96D06875AAD62]) [    ] o.a.s.c.c.ZkStateReader Updating cluster state from ZooKeeper... 
   [junit4]   2> 333221 INFO  (TEST-ZkStateReaderTest.testStateFormatUpdateWithExplicitRefresh-seed#[19C96D06875AAD62]) [    ] o.a.s.c.c.ZkStateReader Loaded empty cluster properties
   [junit4]   2> 333221 INFO  (TEST-ZkStateReaderTest.testStateFormatUpdateWithExplicitRefresh-seed#[19C96D06875AAD62]) [    ] o.a.s.c.c.ZkStateReader Updated live nodes from ZooKeeper... (0) -> (0)
   [junit4]   2> 333223 INFO  (TEST-ZkStateReaderTest.testStateFormatUpdateWithExplicitRefresh-seed#[19C96D06875AAD62]) [    ] o.a.s.c.c.ZkStateReader Deleting data for [c1]
   [junit4]   2> 333223 INFO  (TEST-ZkStateReaderTest.testStateFormatUpdateWithExplicitRefresh-seed#[19C96D06875AAD62]) [    ] o.a.s.c.c.SolrZkClient makePath: /collections/c1
   [junit4]   2> 333224 INFO  (zkCallback-645-thread-1) [    ] o.a.s.c.c.ZkStateReader A collections change: [WatchedEvent state:SyncConnected type:NodeChildrenChanged path:/collections], has occurred - updating...
   [junit4]   2> 333225 INFO  (zkCallback-645-thread-2) [    ] o.a.s.c.c.ZkStateReader A cluster state change: [WatchedEvent state:SyncConnected type:NodeDataChanged path:/clusterstate.json], has occurred - updating... (live nodes size: [0])
   [junit4]   2> 333230 INFO  (TEST-ZkStateReaderTest.testStateFormatUpdateWithExplicitRefresh-seed#[19C96D06875AAD62]) [    ] o.a.s.c.o.ZkStateWriter going to create_collection /collections/c1/state.json
   [junit4]   2> 333230 INFO  (zkCallback-645-thread-2) [    ] o.a.s.c.c.ZkStateReader A cluster state change: [WatchedEvent state:SyncConnected type:NodeCreated path:/collections/c1/state.json] for collection [c1] has occurred - updating... (live nodes size: [0])
   [junit4]   2> 333230 INFO  (zkCallback-645-thread-1) [    ] o.a.s.c.c.ZkStateReader A cluster state change: [WatchedEvent state:SyncConnected type:NodeDataChanged path:/clusterstate.json], has occurred - updating... (live nodes size: [0])
   [junit4]   2> 333231 INFO  (zkCallback-645-thread-2) [    ] o.a.s.c.c.ZkStateReader Add data for [c1] ver [0]
   [junit4]   2> 333232 INFO  (TEST-ZkStateReaderTest.testStateFormatUpdateWithExplicitRefresh-seed#[19C96D06875AAD62]) [    ] o.a.s.c.ZkTestServer connecting to 127.0.0.1:34606 34606
   [junit4]   2> 333389 INFO  (Thread-1248) [    ] o.a.s.c.ZkTestServer connecting to 127.0.0.1:34606 34606
   [junit4]   2> 333390 INFO  (TEST-ZkStateReaderTest.testStateFormatUpdateWithExplicitRefresh-seed#[19C96D06875AAD62]) [    ] o.a.s.SolrTestCaseJ4 ###Ending testStateFormatUpdateWithExplicitRefresh
   [junit4]   2> NOTE: reproduce with: ant test  -Dtestcase=ZkStateReaderTest -Dtests.method=testStateFormatUpdateWithExplicitRefresh -Dtests.seed=19C96D06875AAD62 -Dtests.multiplier=2 -Dtests.slow=true -Dtests.locale=de-AT -Dtests.timezone=Africa/Porto-Novo -Dtests.asserts=true -Dtests.file.encoding=UTF-8
   [junit4] ERROR   0.29s J2 | ZkStateReaderTest.testStateFormatUpdateWithExplicitRefresh <<<
   [junit4]    > Throwable #1: org.apache.solr.common.SolrException: Could not find collection : c1
   [junit4]    > 	at __randomizedtesting.SeedInfo.seed([19C96D06875AAD62:6731CF1573A6BA7]:0)
   [junit4]    > 	at org.apache.solr.common.cloud.ClusterState.getCollection(ClusterState.java:192)
   [junit4]    > 	at org.apache.solr.cloud.overseer.ZkStateReaderTest.testStateFormatUpdate(ZkStateReaderTest.java:129)
   [junit4]    > 	at org.apache.solr.cloud.overseer.ZkStateReaderTest.testStateFormatUpdateWithExplicitRefresh(ZkStateReaderTest.java:43)
   [junit4]    > 	at java.lang.Thread.run(Thread.java:745)
   [junit4]   2> 333391 INFO  (TEST-ZkStateReaderTest.testStateFormatUpdateWithTimeDelayLazy-seed#[19C96D06875AAD62]) [    ] o.a.s.SolrTestCaseJ4 ###Starting testStateFormatUpdateWithTimeDelayLazy
   [junit4]   2> 333392 INFO  (TEST-ZkStateReaderTest.testStateFormatUpdateWithTimeDelayLazy-seed#[19C96D06875AAD62]) [    ] o.a.s.c.ZkTestServer STARTING ZK TEST SERVER
   [junit4]   2> 333392 INFO  (Thread-1249) [    ] o.a.s.c.ZkTestServer client port:0.0.0.0/0.0.0.0:0
   [junit4]   2> 333396 INFO  (Thread-1249) [    ] o.a.s.c.ZkTestServer Starting server
   [junit4]   2> 333493 INFO  (TEST-ZkStateReaderTest.testStateFormatUpdateWithTimeDelayLazy-seed#[19C96D06875AAD62]) [    ] o.a.s.c.ZkTestServer start zk server on port:55124
   [junit4]   2> 333493 INFO  (TEST-ZkStateReaderTest.testStateFormatUpdateWithTimeDelayLazy-seed#[19C96D06875AAD62]) [    ] o.a.s.c.c.SolrZkClient Using default ZkCredentialsProvider
   [junit4]   2> 333509 INFO  (TEST-ZkStateReaderTest.testStateFormatUpdateWithTimeDelayLazy-seed#[19C96D06875AAD62]) [    ] o.a.s.c.c.ConnectionManager Waiting for client to connect to ZooKeeper
   [junit4]   2> 333521 INFO  (zkCallback-647-thread-1) [    ] o.a.s.c.c.ConnectionManager Watcher org.apache.solr.common.cloud.ConnectionManager@4dec38e6 name:ZooKeeperConnection Watcher:127.0.0.1:55124 got event WatchedEvent state:SyncConnected type:None path:null path:null type:None
   [junit4]   2> 333525 INFO  (TEST-ZkStateReaderTest.testStateFormatUpdateWithTimeDelayLazy-seed#[19C96D06875AAD62]) [    ] o.a.s.c.c.ConnectionManager Client is connected to ZooKeeper
   [junit4]   2> 333525 INFO  (TEST-ZkStateReaderTest.testStateFormatUpdateWithTimeDelayLazy-seed#[19C96D06875AAD62]) [    ] o.a.s.c.c.SolrZkClient Using default ZkACLProvider
   [junit4]   2> 333569 INFO  (TEST-ZkStateReaderTest.testStateFormatUpdateWithTimeDelayLazy-seed#[19C96D06875AAD62]) [    ] o.a.s.c.c.SolrZkClient Using default ZkCredentialsProvider
   [junit4]   2> 333577 INFO  (TEST-ZkStateReaderTest.testStateFormatUpdateWithTimeDelayLazy-seed#[19C96D06875AAD62]) [    ] o.a.s.c.c.ConnectionManager Waiting for client to connect to ZooKeeper
   [junit4]   2> 333595 INFO  (zkCallback-648-thread-1) [    ] o.a.s.c.c.ConnectionManager Watcher org.apache.solr.common.cloud.ConnectionManager@3d3470f3 name:ZooKeeperConnection Watcher:127.0.0.1:55124 got event WatchedEvent state:SyncConnected type:None path:null path:null type:None
   [junit4]   2> 333595 INFO  (TEST-ZkStateReaderTest.testStateFormatUpdateWithTimeDelayLazy-seed#[19C96D06875AAD62]) [    ] o.a.s.c.c.ConnectionManager Client is connected to ZooKeeper
   [junit4]   2> 333596 INFO  (TEST-ZkStateReaderTest.testStateFormatUpdateWithTimeDelayLazy-seed#[19C96D06875AAD62]) [    ] o.a.s.c.c.SolrZkClient Using default ZkACLProvider
   [junit4]   2> 333596 INFO  (TEST-ZkStateReaderTest.testStateFormatUpdateWithTimeDelayLazy-seed#[19C96D06875AAD62]) [    ] o.a.s.c.c.SolrZkClient makePath: /solr
   [junit4]   2> 333597 INFO  (TEST-ZkStateReaderTest.testStateFormatUpdateWithTimeDelayLazy-seed#[19C96D06875AAD62]) [    ] o.a.s.c.c.SolrZkClient Using default ZkCredentialsProvider
   [junit4]   2> 333613 INFO  (TEST-ZkStateReaderTest.testStateFormatUpdateWithTimeDelayLazy-seed#[19C96D06875AAD62]) [    ] o.a.s.c.c.ConnectionManager Waiting for client to connect to ZooKeeper
   [junit4]   2> 333625 INFO  (zkCallback-649-thread-1) [    ] o.a.s.c.c.ConnectionManager Watcher org.apache.solr.common.cloud.ConnectionManager@1c28fc65 name:ZooKeeperConnection Watcher:127.0.0.1:55124/solr got event WatchedEvent state:SyncConnected type:None path:null path:null type:None
   [junit4]   2> 333625 INFO  (TEST-ZkStateReaderTest.testStateFormatUpdateWithTimeDelayLazy-seed#[19C96D06875AAD62]) [    ] o.a.s.c.c.ConnectionManager Client is connected to ZooKeeper
   [junit4]   2> 333625 INFO  (TEST-ZkStateReaderTest.testStateFormatUpdateWithTimeDelayLazy-seed#[19C96D06875AAD62]) [    ] o.a.s.c.c.SolrZkClient Using default ZkACLProvider
   [junit4]   2> 333627 INFO  (TEST-ZkStateReaderTest.testStateFormatUpdateWithTimeDelayLazy-seed#[19C96D06875AAD62]) [    ] o.a.s.c.c.SolrZkClient makePath: /live_nodes
   [junit4]   2> 333628 INFO  (TEST-ZkStateReaderTest.testStateFormatUpdateWithTimeDelayLazy-seed#[19C96D06875AAD62]) [    ] o.a.s.c.c.SolrZkClient makePath: /collections
   [junit4]   2> 333628 INFO  (TEST-ZkStateReaderTest.testStateFormatUpdateWithTimeDelayLazy-seed#[19C96D06875AAD62]) [    ] o.a.s.c.c.SolrZkClient makePath: /aliases.json
   [junit4]   2> 333629 INFO  (TEST-ZkStateReaderTest.testStateFormatUpdateWithTimeDelayLazy-seed#[19C96D06875AAD62]) [    ] o.a.s.c.c.SolrZkClient makePath: /clusterstate.json
   [junit4]   2> 333629 INFO  (TEST-ZkStateReaderTest.testStateFormatUpdateWithTimeDelayLazy-seed#[19C96D06875AAD62]) [    ] o.a.s.c.c.SolrZkClient makePath: /security.json
   [junit4]   2> 333630 INFO  (TEST-ZkStateReaderTest.testStateFormatUpdateWithTimeDelayLazy-seed#[19C96D06875AAD62]) [    ] o.a.s.c.c.ZkStateReader Updating cluster state from ZooKeeper... 
   [junit4]   2> 333630 INFO  (TEST-ZkStateReaderTest.testStateFormatUpdateWithTimeDelayLazy-seed#[19C96D06875AAD62]) [    ] o.a.s.c.c.ZkStateReader Loaded empty cluster properties
   [junit4]   2> 333631 INFO  (TEST-ZkStateReaderTest.testStateFormatUpdateWithTimeDelayLazy-seed#[19C96D06875AAD62]) [    ] o.a.s.c.c.ZkStateReader Updated live nodes from ZooKeeper... (0) -> (0)
   [junit4]   2> 333631 INFO  (TEST-ZkStateReaderTest.testStateFormatUpdateWithTimeDelayLazy-seed#[19C96D06875AAD62]) [    ] o.a.s.c.c.SolrZkClient makePath: /collections/c1
   [junit4]   2> 333632 INFO  (TEST-ZkStateReaderTest.testStateFormatUpdateWithTimeDelayLazy-seed#[19C96D06875AAD62]) [    ] o.a.s.c.c.ZkStateReader Deleting data for [c1]
   [junit4]   2> 333633 INFO  (zkCallback-649-thread-2) [    ] o.a.s.c.c.ZkStateReader A cluster state change: [WatchedEvent state:SyncConnected type:NodeDataChanged path:/clusterstate.json], has occurred - updating... (live nodes size: [0])
   [junit4]   2> 333637 INFO  (zkCallback-649-thread-1) [    ] o.a.s.c.c.ZkStateReader A collections change: [WatchedEvent state:SyncConnected type:NodeChildrenChanged path:/collections], has occurred - updating...
   [junit4]   2> 333653 INFO  (TEST-ZkStateReaderTest.testStateFormatUpdateWithTimeDelayLazy-seed#[19C96D06875AAD62]) [    ] o.a.s.c.o.ZkStateWriter going to create_collection /collections/c1/state.json
   [junit4]   2> 333656 INFO  (TEST-ZkStateReaderTest.testStateFormatUpdateWithTimeDelayLazy-seed#[19C96D06875AAD62]) [    ] o.a.s.c.c.ZkStateReader Add data for [c1] ver [0]
   [junit4]   2> 333657 INFO  (zkCallback-649-thread-1) [    ] o.a.s.c.c.ZkStateReader A cluster state change: [WatchedEvent state:SyncConnected type:NodeCreated path:/collections/c1/state.json] for collection [c1] has occurred - updating... (live nodes size: [0])
   [junit4]   2> 333657 INFO  (zkCallback-649-thread-2) [    ] o.a.s.c.c.ZkStateReader A cluster state change: [WatchedEvent state:SyncConnected type:NodeDataChanged path:/clusterstate.json], has occurred - updating... (live nodes size: [0])
   [junit4]   2> 333659 INFO  (zkCallback-649-thread-1) [    ] o.a.s.c.c.ZkStateReader Removing uninteresting collection [c1]
   [junit4]   2> 333665 INFO  (TEST-ZkStateReaderTest.testStateFormatUpdateWithTimeDelayLazy-seed#[19C96D06875AAD62]) [    ] o.a.s.c.ZkTestServer connecting to 127.0.0.1:55124 55124
   [junit4]   2> 333797 INFO  (Thread-1249) [    ] o.a.s.c.ZkTestServer connecting to 127.0.0.1:55124 55124
   [junit4]   2> 333797 WARN  (Thread-1249) [    ] o.a.s.c.ZkTestServer Watch limit violations: 
   [junit4]   2> Maximum concurrent data watches above limit:
   [junit4]   2> 
   [junit4]   2> 	2	/solr/collections/c1/state.json
   [junit4]   2> 
   [junit4]   2> 333798 INFO  (TEST-ZkStateReaderTest.testStateFormatUpdateWithTimeDelayLazy-seed#[19C96D06875AAD62]) [    ] o.a.s.SolrTestCaseJ4 ###Ending testStateFormatUpdateWithTimeDelayLazy
   [junit4]   2> 333798 INFO  (SUITE-ZkStateReaderTest-seed#[19C96D06875AAD62]-worker) [    ] o.a.s.SolrTestCaseJ4 ###deleteCore
   [junit4]   2> NOTE: leaving temporary files on disk at: /x1/jenkins/jenkins-slave/workspace/Lucene-Solr-Tests-master/solr/build/solr-core/test/J2/temp/solr.cloud.overseer.ZkStateReaderTest_19C96D06875AAD62-001
   [junit4]   2> Jul 02, 2016 1:43:56 AM com.carrotsearch.randomizedtesting.ThreadLeakControl checkThreadLeaks
   [junit4]   2> WARNING: Will linger awaiting termination of 1 leaked thread(s).
   [junit4]   2> NOTE: test params are: codec=CheapBastard, sim=ClassicSimilarity, locale=de-AT, timezone=Africa/Porto-Novo
   [junit4]   2> NOTE: Linux 3.13.0-85-generic amd64/Oracle Corporation 1.8.0_74 (64-bit)/cpus=4,threads=1,free=161579112,total=524288000
   [junit4]   2> NOTE: All tests run in this JVM: [CoreAdminHandlerTest, HdfsLockFactoryTest, TestOrdValues, TestTrackingShardHandlerFactory, TestSubQueryTransformerDistrib, ExitableDirectoryReaderTest, HdfsThreadLeakTest, PluginInfoTest, SharedFSAutoReplicaFailoverUtilsTest, TestGeoJSONResponseWriter, TestCopyFieldCollectionResource, BinaryUpdateRequestHandlerTest, TestDistributedMissingSort, DistributedQueryComponentOptimizationTest, OverriddenZkACLAndCredentialsProvidersTest, DateRangeFieldTest, TestConfigSetProperties, TestSort, TestSchemaResource, LukeRequestHandlerTest, QueryParsingTest, RecoveryAfterSoftCommitTest, TermVectorComponentDistributedTest, TestSSLRandomization, HdfsBasicDistributedZkTest, SearchHandlerTest, BasicDistributedZk2Test, RestartWhileUpdatingTest, TestReloadDeadlock, TestExtendedDismaxParser, DirectUpdateHandlerOptimizeTest, TestReplicaProperties, LeaderElectionTest, TestPerFieldSimilarityWithDefaultOverride, TestOverriddenPrefixQueryForCustomFieldType, TestIntervalFaceting, TestGraphTermsQParserPlugin, TestSerializedLuceneMatchVersion, TestSearchPerf, TestCoreDiscovery, TestLRUStatsCache, ZkStateReaderTest]
   [junit4] Completed [116/617 (1!)] on J2 in 2.54s, 6 tests, 1 failure, 2 errors <<< FAILURES!

[...truncated 1633 lines...]
BUILD FAILED
/x1/jenkins/jenkins-slave/workspace/Lucene-Solr-Tests-master/build.xml:740: The following error occurred while executing this line:
/x1/jenkins/jenkins-slave/workspace/Lucene-Solr-Tests-master/build.xml:684: The following error occurred while executing this line:
/x1/jenkins/jenkins-slave/workspace/Lucene-Solr-Tests-master/build.xml:59: The following error occurred while executing this line:
/x1/jenkins/jenkins-slave/workspace/Lucene-Solr-Tests-master/solr/build.xml:233: The following error occurred while executing this line:
/x1/jenkins/jenkins-slave/workspace/Lucene-Solr-Tests-master/solr/common-build.xml:530: The following error occurred while executing this line:
/x1/jenkins/jenkins-slave/workspace/Lucene-Solr-Tests-master/lucene/common-build.xml:1427: The following error occurred while executing this line:
/x1/jenkins/jenkins-slave/workspace/Lucene-Solr-Tests-master/lucene/common-build.xml:984: There were test failures: 617 suites (10 ignored), 2584 tests, 2 errors, 1 failure, 87 ignored (72 assumptions) [seed: 19C96D06875AAD62]

Total time: 62 minutes 25 seconds
Build step 'Invoke Ant' marked build as failure
Archiving artifacts
Recording test results
Email was triggered for: Failure - Any
Sending email for trigger: Failure - Any




Mime
View raw message