lucene-dev mailing list archives

Site index · List index
Message view « Date » · « Thread »
Top « Date » · « Thread »
From Policeman Jenkins Server <jenk...@thetaphi.de>
Subject [JENKINS] Lucene-Solr-master-MacOSX (64bit/jdk1.8.0) - Build # 3377 - Failure!
Date Fri, 01 Jul 2016 12:56:38 GMT
Build: http://jenkins.thetaphi.de/job/Lucene-Solr-master-MacOSX/3377/
Java: 64bit/jdk1.8.0 -XX:+UseCompressedOops -XX:+UseSerialGC

3 tests failed.
FAILED:  org.apache.solr.security.BasicAuthIntegrationTest.testBasics

Error Message:
IOException occured when talking to server at: http://127.0.0.1:56857/solr/testSolrCloudCollection_shard1_replica2

Stack Trace:
org.apache.solr.client.solrj.impl.CloudSolrClient$RouteException: IOException occured when talking to server at: http://127.0.0.1:56857/solr/testSolrCloudCollection_shard1_replica2
	at __randomizedtesting.SeedInfo.seed([60105D025CD632A5:5DC8F32E64386CD5]:0)
	at org.apache.solr.client.solrj.impl.CloudSolrClient.directUpdate(CloudSolrClient.java:699)
	at org.apache.solr.client.solrj.impl.CloudSolrClient.sendRequest(CloudSolrClient.java:1109)
	at org.apache.solr.client.solrj.impl.CloudSolrClient.requestWithRetryOnStaleState(CloudSolrClient.java:998)
	at org.apache.solr.client.solrj.impl.CloudSolrClient.request(CloudSolrClient.java:934)
	at org.apache.solr.client.solrj.SolrClient.request(SolrClient.java:1219)
	at org.apache.solr.security.BasicAuthIntegrationTest.doExtraTests(BasicAuthIntegrationTest.java:194)
	at org.apache.solr.cloud.TestMiniSolrCloudClusterBase.testCollectionCreateSearchDelete(TestMiniSolrCloudClusterBase.java:196)
	at org.apache.solr.cloud.TestMiniSolrCloudClusterBase.testBasics(TestMiniSolrCloudClusterBase.java:79)
	at sun.reflect.NativeMethodAccessorImpl.invoke0(Native Method)
	at sun.reflect.NativeMethodAccessorImpl.invoke(NativeMethodAccessorImpl.java:62)
	at sun.reflect.DelegatingMethodAccessorImpl.invoke(DelegatingMethodAccessorImpl.java:43)
	at java.lang.reflect.Method.invoke(Method.java:498)
	at com.carrotsearch.randomizedtesting.RandomizedRunner.invoke(RandomizedRunner.java:1764)
	at com.carrotsearch.randomizedtesting.RandomizedRunner$8.evaluate(RandomizedRunner.java:871)
	at com.carrotsearch.randomizedtesting.RandomizedRunner$9.evaluate(RandomizedRunner.java:907)
	at com.carrotsearch.randomizedtesting.RandomizedRunner$10.evaluate(RandomizedRunner.java:921)
	at com.carrotsearch.randomizedtesting.rules.SystemPropertiesRestoreRule$1.evaluate(SystemPropertiesRestoreRule.java:57)
	at org.apache.lucene.util.TestRuleSetupTeardownChained$1.evaluate(TestRuleSetupTeardownChained.java:49)
	at org.apache.lucene.util.AbstractBeforeAfterRule$1.evaluate(AbstractBeforeAfterRule.java:45)
	at org.apache.lucene.util.TestRuleThreadAndTestName$1.evaluate(TestRuleThreadAndTestName.java:48)
	at org.apache.lucene.util.TestRuleIgnoreAfterMaxFailures$1.evaluate(TestRuleIgnoreAfterMaxFailures.java:64)
	at org.apache.lucene.util.TestRuleMarkFailure$1.evaluate(TestRuleMarkFailure.java:47)
	at com.carrotsearch.randomizedtesting.rules.StatementAdapter.evaluate(StatementAdapter.java:36)
	at com.carrotsearch.randomizedtesting.ThreadLeakControl$StatementRunner.run(ThreadLeakControl.java:367)
	at com.carrotsearch.randomizedtesting.ThreadLeakControl.forkTimeoutingTask(ThreadLeakControl.java:809)
	at com.carrotsearch.randomizedtesting.ThreadLeakControl$3.evaluate(ThreadLeakControl.java:460)
	at com.carrotsearch.randomizedtesting.RandomizedRunner.runSingleTest(RandomizedRunner.java:880)
	at com.carrotsearch.randomizedtesting.RandomizedRunner$5.evaluate(RandomizedRunner.java:781)
	at com.carrotsearch.randomizedtesting.RandomizedRunner$6.evaluate(RandomizedRunner.java:816)
	at com.carrotsearch.randomizedtesting.RandomizedRunner$7.evaluate(RandomizedRunner.java:827)
	at com.carrotsearch.randomizedtesting.rules.StatementAdapter.evaluate(StatementAdapter.java:36)
	at com.carrotsearch.randomizedtesting.rules.SystemPropertiesRestoreRule$1.evaluate(SystemPropertiesRestoreRule.java:57)
	at org.apache.lucene.util.AbstractBeforeAfterRule$1.evaluate(AbstractBeforeAfterRule.java:45)
	at com.carrotsearch.randomizedtesting.rules.StatementAdapter.evaluate(StatementAdapter.java:36)
	at org.apache.lucene.util.TestRuleStoreClassName$1.evaluate(TestRuleStoreClassName.java:41)
	at com.carrotsearch.randomizedtesting.rules.NoShadowingOrOverridesOnMethodsRule$1.evaluate(NoShadowingOrOverridesOnMethodsRule.java:40)
	at com.carrotsearch.randomizedtesting.rules.NoShadowingOrOverridesOnMethodsRule$1.evaluate(NoShadowingOrOverridesOnMethodsRule.java:40)
	at com.carrotsearch.randomizedtesting.rules.StatementAdapter.evaluate(StatementAdapter.java:36)
	at com.carrotsearch.randomizedtesting.rules.StatementAdapter.evaluate(StatementAdapter.java:36)
	at com.carrotsearch.randomizedtesting.rules.StatementAdapter.evaluate(StatementAdapter.java:36)
	at org.apache.lucene.util.TestRuleAssertionsRequired$1.evaluate(TestRuleAssertionsRequired.java:53)
	at org.apache.lucene.util.TestRuleMarkFailure$1.evaluate(TestRuleMarkFailure.java:47)
	at org.apache.lucene.util.TestRuleIgnoreAfterMaxFailures$1.evaluate(TestRuleIgnoreAfterMaxFailures.java:64)
	at org.apache.lucene.util.TestRuleIgnoreTestSuites$1.evaluate(TestRuleIgnoreTestSuites.java:54)
	at com.carrotsearch.randomizedtesting.rules.StatementAdapter.evaluate(StatementAdapter.java:36)
	at com.carrotsearch.randomizedtesting.ThreadLeakControl$StatementRunner.run(ThreadLeakControl.java:367)
	at java.lang.Thread.run(Thread.java:745)
Caused by: org.apache.solr.client.solrj.SolrServerException: IOException occured when talking to server at: http://127.0.0.1:56857/solr/testSolrCloudCollection_shard1_replica2
	at org.apache.solr.client.solrj.impl.HttpSolrClient.executeMethod(HttpSolrClient.java:620)
	at org.apache.solr.client.solrj.impl.HttpSolrClient.request(HttpSolrClient.java:259)
	at org.apache.solr.client.solrj.impl.HttpSolrClient.request(HttpSolrClient.java:248)
	at org.apache.solr.client.solrj.impl.LBHttpSolrClient.doRequest(LBHttpSolrClient.java:413)
	at org.apache.solr.client.solrj.impl.LBHttpSolrClient.request(LBHttpSolrClient.java:366)
	at org.apache.solr.client.solrj.impl.CloudSolrClient.lambda$directUpdate$0(CloudSolrClient.java:674)
	at java.util.concurrent.FutureTask.run(FutureTask.java:266)
	at org.apache.solr.common.util.ExecutorUtil$MDCAwareThreadPoolExecutor.lambda$execute$0(ExecutorUtil.java:229)
	at java.util.concurrent.ThreadPoolExecutor.runWorker(ThreadPoolExecutor.java:1142)
	at java.util.concurrent.ThreadPoolExecutor$Worker.run(ThreadPoolExecutor.java:617)
	... 1 more
Caused by: org.apache.http.NoHttpResponseException: 127.0.0.1:56857 failed to respond
	at org.apache.http.impl.conn.DefaultHttpResponseParser.parseHead(DefaultHttpResponseParser.java:143)
	at org.apache.http.impl.conn.DefaultHttpResponseParser.parseHead(DefaultHttpResponseParser.java:57)
	at org.apache.http.impl.io.AbstractMessageParser.parse(AbstractMessageParser.java:261)
	at org.apache.http.impl.DefaultBHttpClientConnection.receiveResponseHeader(DefaultBHttpClientConnection.java:165)
	at org.apache.http.impl.conn.CPoolProxy.receiveResponseHeader(CPoolProxy.java:167)
	at org.apache.http.protocol.HttpRequestExecutor.doReceiveResponse(HttpRequestExecutor.java:272)
	at org.apache.http.protocol.HttpRequestExecutor.execute(HttpRequestExecutor.java:124)
	at org.apache.http.impl.execchain.MainClientExec.execute(MainClientExec.java:271)
	at org.apache.http.impl.execchain.ProtocolExec.execute(ProtocolExec.java:184)
	at org.apache.http.impl.execchain.RetryExec.execute(RetryExec.java:88)
	at org.apache.http.impl.execchain.RedirectExec.execute(RedirectExec.java:110)
	at org.apache.http.impl.client.InternalHttpClient.doExecute(InternalHttpClient.java:184)
	at org.apache.http.impl.client.CloseableHttpClient.execute(CloseableHttpClient.java:82)
	at org.apache.http.impl.client.CloseableHttpClient.execute(CloseableHttpClient.java:55)
	at org.apache.solr.client.solrj.impl.HttpSolrClient.executeMethod(HttpSolrClient.java:511)
	... 10 more


FAILED:  junit.framework.TestSuite.org.apache.solr.security.BasicAuthIntegrationTest

Error Message:
1 thread leaked from SUITE scope at org.apache.solr.security.BasicAuthIntegrationTest:     1) Thread[id=50884, name=Connection evictor, state=TIMED_WAITING, group=TGRP-BasicAuthIntegrationTest]         at java.lang.Thread.sleep(Native Method)         at org.apache.http.impl.client.IdleConnectionEvictor$1.run(IdleConnectionEvictor.java:66)         at java.lang.Thread.run(Thread.java:745)

Stack Trace:
com.carrotsearch.randomizedtesting.ThreadLeakError: 1 thread leaked from SUITE scope at org.apache.solr.security.BasicAuthIntegrationTest: 
   1) Thread[id=50884, name=Connection evictor, state=TIMED_WAITING, group=TGRP-BasicAuthIntegrationTest]
        at java.lang.Thread.sleep(Native Method)
        at org.apache.http.impl.client.IdleConnectionEvictor$1.run(IdleConnectionEvictor.java:66)
        at java.lang.Thread.run(Thread.java:745)
	at __randomizedtesting.SeedInfo.seed([60105D025CD632A5]:0)


FAILED:  junit.framework.TestSuite.org.apache.solr.update.processor.DocExpirationUpdateProcessorFactoryTest

Error Message:
ObjectTracker found 1 object(s) that were not released!!! [InternalHttpClient]

Stack Trace:
java.lang.AssertionError: ObjectTracker found 1 object(s) that were not released!!! [InternalHttpClient]
	at __randomizedtesting.SeedInfo.seed([60105D025CD632A5]:0)
	at org.junit.Assert.fail(Assert.java:93)
	at org.junit.Assert.assertTrue(Assert.java:43)
	at org.junit.Assert.assertNull(Assert.java:551)
	at org.apache.solr.SolrTestCaseJ4.teardownTestCases(SolrTestCaseJ4.java:256)
	at sun.reflect.GeneratedMethodAccessor63.invoke(Unknown Source)
	at sun.reflect.DelegatingMethodAccessorImpl.invoke(DelegatingMethodAccessorImpl.java:43)
	at java.lang.reflect.Method.invoke(Method.java:498)
	at com.carrotsearch.randomizedtesting.RandomizedRunner.invoke(RandomizedRunner.java:1764)
	at com.carrotsearch.randomizedtesting.RandomizedRunner$7.evaluate(RandomizedRunner.java:834)
	at com.carrotsearch.randomizedtesting.rules.StatementAdapter.evaluate(StatementAdapter.java:36)
	at com.carrotsearch.randomizedtesting.rules.SystemPropertiesRestoreRule$1.evaluate(SystemPropertiesRestoreRule.java:57)
	at org.apache.lucene.util.AbstractBeforeAfterRule$1.evaluate(AbstractBeforeAfterRule.java:45)
	at com.carrotsearch.randomizedtesting.rules.StatementAdapter.evaluate(StatementAdapter.java:36)
	at org.apache.lucene.util.TestRuleStoreClassName$1.evaluate(TestRuleStoreClassName.java:41)
	at com.carrotsearch.randomizedtesting.rules.NoShadowingOrOverridesOnMethodsRule$1.evaluate(NoShadowingOrOverridesOnMethodsRule.java:40)
	at com.carrotsearch.randomizedtesting.rules.NoShadowingOrOverridesOnMethodsRule$1.evaluate(NoShadowingOrOverridesOnMethodsRule.java:40)
	at com.carrotsearch.randomizedtesting.rules.StatementAdapter.evaluate(StatementAdapter.java:36)
	at com.carrotsearch.randomizedtesting.rules.StatementAdapter.evaluate(StatementAdapter.java:36)
	at com.carrotsearch.randomizedtesting.rules.StatementAdapter.evaluate(StatementAdapter.java:36)
	at org.apache.lucene.util.TestRuleAssertionsRequired$1.evaluate(TestRuleAssertionsRequired.java:53)
	at org.apache.lucene.util.TestRuleMarkFailure$1.evaluate(TestRuleMarkFailure.java:47)
	at org.apache.lucene.util.TestRuleIgnoreAfterMaxFailures$1.evaluate(TestRuleIgnoreAfterMaxFailures.java:64)
	at org.apache.lucene.util.TestRuleIgnoreTestSuites$1.evaluate(TestRuleIgnoreTestSuites.java:54)
	at com.carrotsearch.randomizedtesting.rules.StatementAdapter.evaluate(StatementAdapter.java:36)
	at com.carrotsearch.randomizedtesting.ThreadLeakControl$StatementRunner.run(ThreadLeakControl.java:367)
	at java.lang.Thread.run(Thread.java:745)




Build Log:
[...truncated 12341 lines...]
   [junit4] Suite: org.apache.solr.security.BasicAuthIntegrationTest
   [junit4]   2> 3109966 INFO  (TEST-BasicAuthIntegrationTest.testBasics-seed#[60105D025CD632A5]) [    ] o.a.s.c.ZkTestServer STARTING ZK TEST SERVER
   [junit4]   2> 3109966 INFO  (Thread-7306) [    ] o.a.s.c.ZkTestServer client port:0.0.0.0/0.0.0.0:0
   [junit4]   2> 3109966 INFO  (Thread-7306) [    ] o.a.s.c.ZkTestServer Starting server
   [junit4]   2> 3110068 INFO  (TEST-BasicAuthIntegrationTest.testBasics-seed#[60105D025CD632A5]) [    ] o.a.s.c.ZkTestServer start zk server on port:56854
   [junit4]   2> 3110068 INFO  (TEST-BasicAuthIntegrationTest.testBasics-seed#[60105D025CD632A5]) [    ] o.a.s.c.c.SolrZkClient Using default ZkCredentialsProvider
   [junit4]   2> 3110069 INFO  (TEST-BasicAuthIntegrationTest.testBasics-seed#[60105D025CD632A5]) [    ] o.a.s.c.c.ConnectionManager Waiting for client to connect to ZooKeeper
   [junit4]   2> 3110128 INFO  (zkCallback-11067-thread-1) [    ] o.a.s.c.c.ConnectionManager Watcher org.apache.solr.common.cloud.ConnectionManager@59e0582e name:ZooKeeperConnection Watcher:127.0.0.1:56854 got event WatchedEvent state:SyncConnected type:None path:null path:null type:None
   [junit4]   2> 3110128 INFO  (TEST-BasicAuthIntegrationTest.testBasics-seed#[60105D025CD632A5]) [    ] o.a.s.c.c.ConnectionManager Client is connected to ZooKeeper
   [junit4]   2> 3110129 INFO  (TEST-BasicAuthIntegrationTest.testBasics-seed#[60105D025CD632A5]) [    ] o.a.s.c.c.SolrZkClient Using default ZkACLProvider
   [junit4]   2> 3110129 INFO  (TEST-BasicAuthIntegrationTest.testBasics-seed#[60105D025CD632A5]) [    ] o.a.s.c.c.SolrZkClient makePath: /solr/solr.xml
   [junit4]   2> 3110190 INFO  (jetty-launcher-11066-thread-1) [    ] o.e.j.s.Server jetty-9.3.8.v20160314
   [junit4]   2> 3110190 INFO  (jetty-launcher-11066-thread-2) [    ] o.e.j.s.Server jetty-9.3.8.v20160314
   [junit4]   2> 3110191 INFO  (jetty-launcher-11066-thread-3) [    ] o.e.j.s.Server jetty-9.3.8.v20160314
   [junit4]   2> 3110192 INFO  (jetty-launcher-11066-thread-4) [    ] o.e.j.s.Server jetty-9.3.8.v20160314
   [junit4]   2> 3110193 INFO  (jetty-launcher-11066-thread-5) [    ] o.e.j.s.Server jetty-9.3.8.v20160314
   [junit4]   2> 3110198 INFO  (jetty-launcher-11066-thread-3) [    ] o.e.j.s.h.ContextHandler Started o.e.j.s.ServletContextHandler@4ec3bd98{/solr,null,AVAILABLE}
   [junit4]   2> 3110198 INFO  (jetty-launcher-11066-thread-2) [    ] o.e.j.s.h.ContextHandler Started o.e.j.s.ServletContextHandler@7324dbb7{/solr,null,AVAILABLE}
   [junit4]   2> 3110199 INFO  (jetty-launcher-11066-thread-3) [    ] o.e.j.s.ServerConnector Started ServerConnector@12153d7a{HTTP/1.1,[http/1.1]}{127.0.0.1:56857}
   [junit4]   2> 3110199 INFO  (jetty-launcher-11066-thread-2) [    ] o.e.j.s.ServerConnector Started ServerConnector@68a8668e{HTTP/1.1,[http/1.1]}{127.0.0.1:56858}
   [junit4]   2> 3110199 INFO  (jetty-launcher-11066-thread-3) [    ] o.e.j.s.Server Started @3118618ms
   [junit4]   2> 3110199 INFO  (jetty-launcher-11066-thread-2) [    ] o.e.j.s.Server Started @3118618ms
   [junit4]   2> 3110199 INFO  (jetty-launcher-11066-thread-3) [    ] o.a.s.c.s.e.JettySolrRunner Jetty properties: {hostContext=/solr, hostPort=56857}
   [junit4]   2> 3110199 INFO  (jetty-launcher-11066-thread-2) [    ] o.a.s.c.s.e.JettySolrRunner Jetty properties: {hostContext=/solr, hostPort=56858}
   [junit4]   2> 3110200 INFO  (jetty-launcher-11066-thread-3) [    ] o.a.s.s.SolrDispatchFilter SolrDispatchFilter.init(): sun.misc.Launcher$AppClassLoader@4554617c
   [junit4]   2> 3110200 INFO  (jetty-launcher-11066-thread-2) [    ] o.a.s.s.SolrDispatchFilter SolrDispatchFilter.init(): sun.misc.Launcher$AppClassLoader@4554617c
   [junit4]   2> 3110200 INFO  (jetty-launcher-11066-thread-3) [    ] o.a.s.c.SolrResourceLoader new SolrResourceLoader for directory: '/Users/jenkins/workspace/Lucene-Solr-master-MacOSX/solr/build/solr-core/test/J1/temp/solr.security.BasicAuthIntegrationTest_60105D025CD632A5-001/tempDir-001/node3'
   [junit4]   2> 3110200 INFO  (jetty-launcher-11066-thread-2) [    ] o.a.s.c.SolrResourceLoader new SolrResourceLoader for directory: '/Users/jenkins/workspace/Lucene-Solr-master-MacOSX/solr/build/solr-core/test/J1/temp/solr.security.BasicAuthIntegrationTest_60105D025CD632A5-001/tempDir-001/node2'
   [junit4]   2> 3110200 INFO  (jetty-launcher-11066-thread-3) [    ] o.a.s.c.SolrResourceLoader JNDI not configured for solr (NoInitialContextEx)
   [junit4]   2> 3110200 INFO  (jetty-launcher-11066-thread-2) [    ] o.a.s.c.SolrResourceLoader JNDI not configured for solr (NoInitialContextEx)
   [junit4]   2> 3110200 INFO  (jetty-launcher-11066-thread-3) [    ] o.a.s.c.SolrResourceLoader solr home defaulted to 'solr/' (could not find system property or JNDI)
   [junit4]   2> 3110200 INFO  (jetty-launcher-11066-thread-2) [    ] o.a.s.c.SolrResourceLoader solr home defaulted to 'solr/' (could not find system property or JNDI)
   [junit4]   2> 3110201 INFO  (jetty-launcher-11066-thread-3) [    ] o.a.s.c.c.SolrZkClient Using default ZkCredentialsProvider
   [junit4]   2> 3110201 INFO  (jetty-launcher-11066-thread-2) [    ] o.a.s.c.c.SolrZkClient Using default ZkCredentialsProvider
   [junit4]   2> 3110201 INFO  (jetty-launcher-11066-thread-3) [    ] o.a.s.c.c.ConnectionManager Waiting for client to connect to ZooKeeper
   [junit4]   2> 3110202 INFO  (jetty-launcher-11066-thread-5) [    ] o.e.j.s.h.ContextHandler Started o.e.j.s.ServletContextHandler@7be17694{/solr,null,AVAILABLE}
   [junit4]   2> 3110204 INFO  (jetty-launcher-11066-thread-5) [    ] o.e.j.s.ServerConnector Started ServerConnector@75867c7c{HTTP/1.1,[http/1.1]}{127.0.0.1:56860}
   [junit4]   2> 3110204 INFO  (jetty-launcher-11066-thread-5) [    ] o.e.j.s.Server Started @3118622ms
   [junit4]   2> 3110204 INFO  (jetty-launcher-11066-thread-5) [    ] o.a.s.c.s.e.JettySolrRunner Jetty properties: {hostContext=/solr, hostPort=56860}
   [junit4]   2> 3110204 INFO  (jetty-launcher-11066-thread-5) [    ] o.a.s.s.SolrDispatchFilter SolrDispatchFilter.init(): sun.misc.Launcher$AppClassLoader@4554617c
   [junit4]   2> 3110204 INFO  (jetty-launcher-11066-thread-4) [    ] o.e.j.s.h.ContextHandler Started o.e.j.s.ServletContextHandler@5ae10c39{/solr,null,AVAILABLE}
   [junit4]   2> 3110204 INFO  (jetty-launcher-11066-thread-5) [    ] o.a.s.c.SolrResourceLoader new SolrResourceLoader for directory: '/Users/jenkins/workspace/Lucene-Solr-master-MacOSX/solr/build/solr-core/test/J1/temp/solr.security.BasicAuthIntegrationTest_60105D025CD632A5-001/tempDir-001/node5'
   [junit4]   2> 3110204 INFO  (jetty-launcher-11066-thread-5) [    ] o.a.s.c.SolrResourceLoader JNDI not configured for solr (NoInitialContextEx)
   [junit4]   2> 3110204 INFO  (jetty-launcher-11066-thread-5) [    ] o.a.s.c.SolrResourceLoader solr home defaulted to 'solr/' (could not find system property or JNDI)
   [junit4]   2> 3110204 INFO  (jetty-launcher-11066-thread-4) [    ] o.e.j.s.ServerConnector Started ServerConnector@24f36e7d{HTTP/1.1,[http/1.1]}{127.0.0.1:56861}
   [junit4]   2> 3110204 INFO  (jetty-launcher-11066-thread-4) [    ] o.e.j.s.Server Started @3118623ms
   [junit4]   2> 3110204 INFO  (jetty-launcher-11066-thread-4) [    ] o.a.s.c.s.e.JettySolrRunner Jetty properties: {hostContext=/solr, hostPort=56861}
   [junit4]   2> 3110205 INFO  (jetty-launcher-11066-thread-4) [    ] o.a.s.s.SolrDispatchFilter SolrDispatchFilter.init(): sun.misc.Launcher$AppClassLoader@4554617c
   [junit4]   2> 3110205 INFO  (jetty-launcher-11066-thread-5) [    ] o.a.s.c.c.SolrZkClient Using default ZkCredentialsProvider
   [junit4]   2> 3110205 INFO  (jetty-launcher-11066-thread-4) [    ] o.a.s.c.SolrResourceLoader new SolrResourceLoader for directory: '/Users/jenkins/workspace/Lucene-Solr-master-MacOSX/solr/build/solr-core/test/J1/temp/solr.security.BasicAuthIntegrationTest_60105D025CD632A5-001/tempDir-001/node4'
   [junit4]   2> 3110205 INFO  (jetty-launcher-11066-thread-4) [    ] o.a.s.c.SolrResourceLoader JNDI not configured for solr (NoInitialContextEx)
   [junit4]   2> 3110205 INFO  (jetty-launcher-11066-thread-4) [    ] o.a.s.c.SolrResourceLoader solr home defaulted to 'solr/' (could not find system property or JNDI)
   [junit4]   2> 3110205 INFO  (jetty-launcher-11066-thread-4) [    ] o.a.s.c.c.SolrZkClient Using default ZkCredentialsProvider
   [junit4]   2> 3110205 INFO  (jetty-launcher-11066-thread-5) [    ] o.a.s.c.c.ConnectionManager Waiting for client to connect to ZooKeeper
   [junit4]   2> 3110206 INFO  (jetty-launcher-11066-thread-4) [    ] o.a.s.c.c.ConnectionManager Waiting for client to connect to ZooKeeper
   [junit4]   2> 3110207 INFO  (jetty-launcher-11066-thread-2) [    ] o.a.s.c.c.ConnectionManager Waiting for client to connect to ZooKeeper
   [junit4]   2> 3110208 INFO  (jetty-launcher-11066-thread-1) [    ] o.e.j.s.h.ContextHandler Started o.e.j.s.ServletContextHandler@3bf61c20{/solr,null,AVAILABLE}
   [junit4]   2> 3110208 INFO  (jetty-launcher-11066-thread-1) [    ] o.e.j.s.ServerConnector Started ServerConnector@30c87642{HTTP/1.1,[http/1.1]}{127.0.0.1:56865}
   [junit4]   2> 3110208 INFO  (jetty-launcher-11066-thread-1) [    ] o.e.j.s.Server Started @3118626ms
   [junit4]   2> 3110208 INFO  (jetty-launcher-11066-thread-1) [    ] o.a.s.c.s.e.JettySolrRunner Jetty properties: {hostContext=/solr, hostPort=56865}
   [junit4]   2> 3110208 INFO  (jetty-launcher-11066-thread-1) [    ] o.a.s.s.SolrDispatchFilter SolrDispatchFilter.init(): sun.misc.Launcher$AppClassLoader@4554617c
   [junit4]   2> 3110208 INFO  (jetty-launcher-11066-thread-1) [    ] o.a.s.c.SolrResourceLoader new SolrResourceLoader for directory: '/Users/jenkins/workspace/Lucene-Solr-master-MacOSX/solr/build/solr-core/test/J1/temp/solr.security.BasicAuthIntegrationTest_60105D025CD632A5-001/tempDir-001/node1'
   [junit4]   2> 3110208 INFO  (jetty-launcher-11066-thread-1) [    ] o.a.s.c.SolrResourceLoader JNDI not configured for solr (NoInitialContextEx)
   [junit4]   2> 3110208 INFO  (jetty-launcher-11066-thread-1) [    ] o.a.s.c.SolrResourceLoader solr home defaulted to 'solr/' (could not find system property or JNDI)
   [junit4]   2> 3110209 INFO  (jetty-launcher-11066-thread-1) [    ] o.a.s.c.c.SolrZkClient Using default ZkCredentialsProvider
   [junit4]   2> 3110209 INFO  (jetty-launcher-11066-thread-1) [    ] o.a.s.c.c.ConnectionManager Waiting for client to connect to ZooKeeper
   [junit4]   2> 3110218 INFO  (zkCallback-11068-thread-1) [    ] o.a.s.c.c.ConnectionManager Watcher org.apache.solr.common.cloud.ConnectionManager@52cf147 name:ZooKeeperConnection Watcher:127.0.0.1:56854/solr got event WatchedEvent state:SyncConnected type:None path:null path:null type:None
   [junit4]   2> 3110218 INFO  (jetty-launcher-11066-thread-3) [    ] o.a.s.c.c.ConnectionManager Client is connected to ZooKeeper
   [junit4]   2> 3110219 INFO  (jetty-launcher-11066-thread-3) [    ] o.a.s.c.c.SolrZkClient Using default ZkACLProvider
   [junit4]   2> 3110228 INFO  (jetty-launcher-11066-thread-3) [    ] o.a.s.s.SolrDispatchFilter solr.xml found in ZooKeeper. Loading...
   [junit4]   2> 3110228 INFO  (zkCallback-11070-thread-1) [    ] o.a.s.c.c.ConnectionManager Watcher org.apache.solr.common.cloud.ConnectionManager@299ca522 name:ZooKeeperConnection Watcher:127.0.0.1:56854/solr got event WatchedEvent state:SyncConnected type:None path:null path:null type:None
   [junit4]   2> 3110228 INFO  (jetty-launcher-11066-thread-5) [    ] o.a.s.c.c.ConnectionManager Client is connected to ZooKeeper
   [junit4]   2> 3110228 INFO  (jetty-launcher-11066-thread-5) [    ] o.a.s.c.c.SolrZkClient Using default ZkACLProvider
   [junit4]   2> 3110229 INFO  (zkCallback-11071-thread-1) [    ] o.a.s.c.c.ConnectionManager Watcher org.apache.solr.common.cloud.ConnectionManager@55d26def name:ZooKeeperConnection Watcher:127.0.0.1:56854/solr got event WatchedEvent state:SyncConnected type:None path:null path:null type:None
   [junit4]   2> 3110229 INFO  (jetty-launcher-11066-thread-4) [    ] o.a.s.c.c.ConnectionManager Client is connected to ZooKeeper
   [junit4]   2> 3110229 INFO  (jetty-launcher-11066-thread-4) [    ] o.a.s.c.c.SolrZkClient Using default ZkACLProvider
   [junit4]   2> 3110229 INFO  (zkCallback-11072-thread-1) [    ] o.a.s.c.c.ConnectionManager Watcher org.apache.solr.common.cloud.ConnectionManager@398c9164 name:ZooKeeperConnection Watcher:127.0.0.1:56854/solr got event WatchedEvent state:SyncConnected type:None path:null path:null type:None
   [junit4]   2> 3110230 INFO  (jetty-launcher-11066-thread-1) [    ] o.a.s.c.c.ConnectionManager Client is connected to ZooKeeper
   [junit4]   2> 3110230 INFO  (jetty-launcher-11066-thread-1) [    ] o.a.s.c.c.SolrZkClient Using default ZkACLProvider
   [junit4]   2> 3110231 INFO  (zkCallback-11069-thread-1) [    ] o.a.s.c.c.ConnectionManager Watcher org.apache.solr.common.cloud.ConnectionManager@20323c8f name:ZooKeeperConnection Watcher:127.0.0.1:56854/solr got event WatchedEvent state:SyncConnected type:None path:null path:null type:None
   [junit4]   2> 3110231 INFO  (jetty-launcher-11066-thread-5) [    ] o.a.s.s.SolrDispatchFilter solr.xml found in ZooKeeper. Loading...
   [junit4]   2> 3110231 INFO  (jetty-launcher-11066-thread-2) [    ] o.a.s.c.c.ConnectionManager Client is connected to ZooKeeper
   [junit4]   2> 3110231 INFO  (jetty-launcher-11066-thread-2) [    ] o.a.s.c.c.SolrZkClient Using default ZkACLProvider
   [junit4]   2> 3110232 INFO  (jetty-launcher-11066-thread-4) [    ] o.a.s.s.SolrDispatchFilter solr.xml found in ZooKeeper. Loading...
   [junit4]   2> 3110232 INFO  (jetty-launcher-11066-thread-1) [    ] o.a.s.s.SolrDispatchFilter solr.xml found in ZooKeeper. Loading...
   [junit4]   2> 3110233 INFO  (jetty-launcher-11066-thread-2) [    ] o.a.s.s.SolrDispatchFilter solr.xml found in ZooKeeper. Loading...
   [junit4]   2> 3110257 INFO  (jetty-launcher-11066-thread-3) [    ] o.a.s.c.CorePropertiesLocator Config-defined core root directory: /Users/jenkins/workspace/Lucene-Solr-master-MacOSX/solr/build/solr-core/test/J1/temp/solr.security.BasicAuthIntegrationTest_60105D025CD632A5-001/tempDir-001/node3/.
   [junit4]   2> 3110257 INFO  (jetty-launcher-11066-thread-5) [    ] o.a.s.c.CorePropertiesLocator Config-defined core root directory: /Users/jenkins/workspace/Lucene-Solr-master-MacOSX/solr/build/solr-core/test/J1/temp/solr.security.BasicAuthIntegrationTest_60105D025CD632A5-001/tempDir-001/node5/.
   [junit4]   2> 3110257 INFO  (jetty-launcher-11066-thread-3) [    ] o.a.s.c.CoreContainer New CoreContainer 2097561144
   [junit4]   2> 3110258 INFO  (jetty-launcher-11066-thread-5) [    ] o.a.s.c.CoreContainer New CoreContainer 1685376927
   [junit4]   2> 3110258 INFO  (jetty-launcher-11066-thread-3) [    ] o.a.s.c.CoreContainer Loading cores into CoreContainer [instanceDir=/Users/jenkins/workspace/Lucene-Solr-master-MacOSX/solr/build/solr-core/test/J1/temp/solr.security.BasicAuthIntegrationTest_60105D025CD632A5-001/tempDir-001/node3]
   [junit4]   2> 3110258 INFO  (jetty-launcher-11066-thread-5) [    ] o.a.s.c.CoreContainer Loading cores into CoreContainer [instanceDir=/Users/jenkins/workspace/Lucene-Solr-master-MacOSX/solr/build/solr-core/test/J1/temp/solr.security.BasicAuthIntegrationTest_60105D025CD632A5-001/tempDir-001/node5]
   [junit4]   2> 3110258 WARN  (jetty-launcher-11066-thread-3) [    ] o.a.s.c.CoreContainer Couldn't add files from /Users/jenkins/workspace/Lucene-Solr-master-MacOSX/solr/build/solr-core/test/J1/temp/solr.security.BasicAuthIntegrationTest_60105D025CD632A5-001/tempDir-001/node3/lib to classpath: /Users/jenkins/workspace/Lucene-Solr-master-MacOSX/solr/build/solr-core/test/J1/temp/solr.security.BasicAuthIntegrationTest_60105D025CD632A5-001/tempDir-001/node3/lib
   [junit4]   2> 3110258 WARN  (jetty-launcher-11066-thread-5) [    ] o.a.s.c.CoreContainer Couldn't add files from /Users/jenkins/workspace/Lucene-Solr-master-MacOSX/solr/build/solr-core/test/J1/temp/solr.security.BasicAuthIntegrationTest_60105D025CD632A5-001/tempDir-001/node5/lib to classpath: /Users/jenkins/workspace/Lucene-Solr-master-MacOSX/solr/build/solr-core/test/J1/temp/solr.security.BasicAuthIntegrationTest_60105D025CD632A5-001/tempDir-001/node5/lib
   [junit4]   2> 3110258 INFO  (jetty-launcher-11066-thread-3) [    ] o.a.s.h.c.HttpShardHandlerFactory created with socketTimeout : 90000,urlScheme : ,connTimeout : 15000,maxConnectionsPerHost : 20,maxConnections : 10000,corePoolSize : 0,maximumPoolSize : 2147483647,maxThreadIdleTime : 5,sizeOfQueue : -1,fairnessPolicy : false,
   [junit4]   2> 3110258 INFO  (jetty-launcher-11066-thread-5) [    ] o.a.s.h.c.HttpShardHandlerFactory created with socketTimeout : 90000,urlScheme : ,connTimeout : 15000,maxConnectionsPerHost : 20,maxConnections : 10000,corePoolSize : 0,maximumPoolSize : 2147483647,maxThreadIdleTime : 5,sizeOfQueue : -1,fairnessPolicy : false,
   [junit4]   2> 3110262 INFO  (jetty-launcher-11066-thread-5) [    ] o.a.s.u.UpdateShardHandler Created UpdateShardHandler HTTP client with params: socketTimeout=340000&connTimeout=45000&maxConnections=100000&maxConnectionsPerHost=100000
   [junit4]   2> 3110262 INFO  (jetty-launcher-11066-thread-5) [    ] o.a.s.l.LogWatcher SLF4J impl is org.slf4j.impl.Log4jLoggerFactory
   [junit4]   2> 3110262 INFO  (jetty-launcher-11066-thread-5) [    ] o.a.s.l.LogWatcher Registering Log Listener [Log4j (org.slf4j.impl.Log4jLoggerFactory)]
   [junit4]   2> 3110262 INFO  (jetty-launcher-11066-thread-5) [    ] o.a.s.c.ZkContainer Zookeeper client=127.0.0.1:56854/solr
   [junit4]   2> 3110262 INFO  (jetty-launcher-11066-thread-3) [    ] o.a.s.u.UpdateShardHandler Created UpdateShardHandler HTTP client with params: socketTimeout=340000&connTimeout=45000&maxConnections=100000&maxConnectionsPerHost=100000
   [junit4]   2> 3110262 INFO  (jetty-launcher-11066-thread-5) [    ] o.a.s.c.ZkController zkHost includes chroot
   [junit4]   2> 3110262 INFO  (jetty-launcher-11066-thread-3) [    ] o.a.s.l.LogWatcher SLF4J impl is org.slf4j.impl.Log4jLoggerFactory
   [junit4]   2> 3110262 INFO  (jetty-launcher-11066-thread-3) [    ] o.a.s.l.LogWatcher Registering Log Listener [Log4j (org.slf4j.impl.Log4jLoggerFactory)]
   [junit4]   2> 3110262 INFO  (jetty-launcher-11066-thread-5) [    ] o.a.s.c.c.SolrZkClient Using default ZkCredentialsProvider
   [junit4]   2> 3110263 INFO  (jetty-launcher-11066-thread-3) [    ] o.a.s.c.ZkContainer Zookeeper client=127.0.0.1:56854/solr
   [junit4]   2> 3110263 INFO  (jetty-launcher-11066-thread-3) [    ] o.a.s.c.ZkController zkHost includes chroot
   [junit4]   2> 3110263 INFO  (jetty-launcher-11066-thread-3) [    ] o.a.s.c.c.SolrZkClient Using default ZkCredentialsProvider
   [junit4]   2> 3110263 INFO  (jetty-launcher-11066-thread-5) [    ] o.a.s.c.c.ConnectionManager Waiting for client to connect to ZooKeeper
   [junit4]   2> 3110264 INFO  (jetty-launcher-11066-thread-3) [    ] o.a.s.c.c.ConnectionManager Waiting for client to connect to ZooKeeper
   [junit4]   2> 3110267 INFO  (jetty-launcher-11066-thread-4) [    ] o.a.s.c.CorePropertiesLocator Config-defined core root directory: /Users/jenkins/workspace/Lucene-Solr-master-MacOSX/solr/build/solr-core/test/J1/temp/solr.security.BasicAuthIntegrationTest_60105D025CD632A5-001/tempDir-001/node4/.
   [junit4]   2> 3110267 INFO  (jetty-launcher-11066-thread-1) [    ] o.a.s.c.CorePropertiesLocator Config-defined core root directory: /Users/jenkins/workspace/Lucene-Solr-master-MacOSX/solr/build/solr-core/test/J1/temp/solr.security.BasicAuthIntegrationTest_60105D025CD632A5-001/tempDir-001/node1/.
   [junit4]   2> 3110267 INFO  (jetty-launcher-11066-thread-4) [    ] o.a.s.c.CoreContainer New CoreContainer 1296829576
   [junit4]   2> 3110267 INFO  (jetty-launcher-11066-thread-1) [    ] o.a.s.c.CoreContainer New CoreContainer 1791059428
   [junit4]   2> 3110267 INFO  (jetty-launcher-11066-thread-4) [    ] o.a.s.c.CoreContainer Loading cores into CoreContainer [instanceDir=/Users/jenkins/workspace/Lucene-Solr-master-MacOSX/solr/build/solr-core/test/J1/temp/solr.security.BasicAuthIntegrationTest_60105D025CD632A5-001/tempDir-001/node4]
   [junit4]   2> 3110267 INFO  (jetty-launcher-11066-thread-1) [    ] o.a.s.c.CoreContainer Loading cores into CoreContainer [instanceDir=/Users/jenkins/workspace/Lucene-Solr-master-MacOSX/solr/build/solr-core/test/J1/temp/solr.security.BasicAuthIntegrationTest_60105D025CD632A5-001/tempDir-001/node1]
   [junit4]   2> 3110268 WARN  (jetty-launcher-11066-thread-4) [    ] o.a.s.c.CoreContainer Couldn't add files from /Users/jenkins/workspace/Lucene-Solr-master-MacOSX/solr/build/solr-core/test/J1/temp/solr.security.BasicAuthIntegrationTest_60105D025CD632A5-001/tempDir-001/node4/lib to classpath: /Users/jenkins/workspace/Lucene-Solr-master-MacOSX/solr/build/solr-core/test/J1/temp/solr.security.BasicAuthIntegrationTest_60105D025CD632A5-001/tempDir-001/node4/lib
   [junit4]   2> 3110268 INFO  (jetty-launcher-11066-thread-2) [    ] o.a.s.c.CorePropertiesLocator Config-defined core root directory: /Users/jenkins/workspace/Lucene-Solr-master-MacOSX/solr/build/solr-core/test/J1/temp/solr.security.BasicAuthIntegrationTest_60105D025CD632A5-001/tempDir-001/node2/.
   [junit4]   2> 3110268 INFO  (jetty-launcher-11066-thread-4) [    ] o.a.s.h.c.HttpShardHandlerFactory created with socketTimeout : 90000,urlScheme : ,connTimeout : 15000,maxConnectionsPerHost : 20,maxConnections : 10000,corePoolSize : 0,maximumPoolSize : 2147483647,maxThreadIdleTime : 5,sizeOfQueue : -1,fairnessPolicy : false,
   [junit4]   2> 3110268 WARN  (jetty-launcher-11066-thread-1) [    ] o.a.s.c.CoreContainer Couldn't add files from /Users/jenkins/workspace/Lucene-Solr-master-MacOSX/solr/build/solr-core/test/J1/temp/solr.security.BasicAuthIntegrationTest_60105D025CD632A5-001/tempDir-001/node1/lib to classpath: /Users/jenkins/workspace/Lucene-Solr-master-MacOSX/solr/build/solr-core/test/J1/temp/solr.security.BasicAuthIntegrationTest_60105D025CD632A5-001/tempDir-001/node1/lib
   [junit4]   2> 3110268 INFO  (jetty-launcher-11066-thread-1) [    ] o.a.s.h.c.HttpShardHandlerFactory created with socketTimeout : 90000,urlScheme : ,connTimeout : 15000,maxConnectionsPerHost : 20,maxConnections : 10000,corePoolSize : 0,maximumPoolSize : 2147483647,maxThreadIdleTime : 5,sizeOfQueue : -1,fairnessPolicy : false,
   [junit4]   2> 3110268 INFO  (jetty-launcher-11066-thread-2) [    ] o.a.s.c.CoreContainer New CoreContainer 658798150
   [junit4]   2> 3110269 INFO  (jetty-launcher-11066-thread-2) [    ] o.a.s.c.CoreContainer Loading cores into CoreContainer [instanceDir=/Users/jenkins/workspace/Lucene-Solr-master-MacOSX/solr/build/solr-core/test/J1/temp/solr.security.BasicAuthIntegrationTest_60105D025CD632A5-001/tempDir-001/node2]
   [junit4]   2> 3110269 WARN  (jetty-launcher-11066-thread-2) [    ] o.a.s.c.CoreContainer Couldn't add files from /Users/jenkins/workspace/Lucene-Solr-master-MacOSX/solr/build/solr-core/test/J1/temp/solr.security.BasicAuthIntegrationTest_60105D025CD632A5-001/tempDir-001/node2/lib to classpath: /Users/jenkins/workspace/Lucene-Solr-master-MacOSX/solr/build/solr-core/test/J1/temp/solr.security.BasicAuthIntegrationTest_60105D025CD632A5-001/tempDir-001/node2/lib
   [junit4]   2> 3110269 INFO  (jetty-launcher-11066-thread-2) [    ] o.a.s.h.c.HttpShardHandlerFactory created with socketTimeout : 90000,urlScheme : ,connTimeout : 15000,maxConnectionsPerHost : 20,maxConnections : 10000,corePoolSize : 0,maximumPoolSize : 2147483647,maxThreadIdleTime : 5,sizeOfQueue : -1,fairnessPolicy : false,
   [junit4]   2> 3110269 INFO  (jetty-launcher-11066-thread-4) [    ] o.a.s.u.UpdateShardHandler Created UpdateShardHandler HTTP client with params: socketTimeout=340000&connTimeout=45000&maxConnections=100000&maxConnectionsPerHost=100000
   [junit4]   2> 3110269 INFO  (jetty-launcher-11066-thread-4) [    ] o.a.s.l.LogWatcher SLF4J impl is org.slf4j.impl.Log4jLoggerFactory
   [junit4]   2> 3110270 INFO  (jetty-launcher-11066-thread-4) [    ] o.a.s.l.LogWatcher Registering Log Listener [Log4j (org.slf4j.impl.Log4jLoggerFactory)]
   [junit4]   2> 3110270 INFO  (jetty-launcher-11066-thread-4) [    ] o.a.s.c.ZkContainer Zookeeper client=127.0.0.1:56854/solr
   [junit4]   2> 3110270 INFO  (jetty-launcher-11066-thread-4) [    ] o.a.s.c.ZkController zkHost includes chroot
   [junit4]   2> 3110270 INFO  (jetty-launcher-11066-thread-4) [    ] o.a.s.c.c.SolrZkClient Using default ZkCredentialsProvider
   [junit4]   2> 3110270 INFO  (jetty-launcher-11066-thread-4) [    ] o.a.s.c.c.ConnectionManager Waiting for client to connect to ZooKeeper
   [junit4]   2> 3110271 INFO  (jetty-launcher-11066-thread-1) [    ] o.a.s.u.UpdateShardHandler Created UpdateShardHandler HTTP client with params: socketTimeout=340000&connTimeout=45000&maxConnections=100000&maxConnectionsPerHost=100000
   [junit4]   2> 3110271 INFO  (jetty-launcher-11066-thread-1) [    ] o.a.s.l.LogWatcher SLF4J impl is org.slf4j.impl.Log4jLoggerFactory
   [junit4]   2> 3110272 INFO  (jetty-launcher-11066-thread-1) [    ] o.a.s.l.LogWatcher Registering Log Listener [Log4j (org.slf4j.impl.Log4jLoggerFactory)]
   [junit4]   2> 3110272 INFO  (jetty-launcher-11066-thread-1) [    ] o.a.s.c.ZkContainer Zookeeper client=127.0.0.1:56854/solr
   [junit4]   2> 3110272 INFO  (jetty-launcher-11066-thread-1) [    ] o.a.s.c.ZkController zkHost includes chroot
   [junit4]   2> 3110272 INFO  (jetty-launcher-11066-thread-1) [    ] o.a.s.c.c.SolrZkClient Using default ZkCredentialsProvider
   [junit4]   2> 3110272 INFO  (jetty-launcher-11066-thread-2) [    ] o.a.s.u.UpdateShardHandler Created UpdateShardHandler HTTP client with params: socketTimeout=340000&connTimeout=45000&maxConnections=100000&maxConnectionsPerHost=100000
   [junit4]   2> 3110272 INFO  (jetty-launcher-11066-thread-2) [    ] o.a.s.l.LogWatcher SLF4J impl is org.slf4j.impl.Log4jLoggerFactory
   [junit4]   2> 3110272 INFO  (jetty-launcher-11066-thread-2) [    ] o.a.s.l.LogWatcher Registering Log Listener [Log4j (org.slf4j.impl.Log4jLoggerFactory)]
   [junit4]   2> 3110272 INFO  (jetty-launcher-11066-thread-2) [    ] o.a.s.c.ZkContainer Zookeeper client=127.0.0.1:56854/solr
   [junit4]   2> 3110272 INFO  (jetty-launcher-11066-thread-2) [    ] o.a.s.c.ZkController zkHost includes chroot
   [junit4]   2> 3110272 INFO  (jetty-launcher-11066-thread-2) [    ] o.a.s.c.c.SolrZkClient Using default ZkCredentialsProvider
   [junit4]   2> 3110272 INFO  (jetty-launcher-11066-thread-1) [    ] o.a.s.c.c.ConnectionManager Waiting for client to connect to ZooKeeper
   [junit4]   2> 3110273 INFO  (jetty-launcher-11066-thread-2) [    ] o.a.s.c.c.ConnectionManager Waiting for client to connect to ZooKeeper
   [junit4]   2> 3110277 INFO  (zkCallback-11077-thread-1) [    ] o.a.s.c.c.ConnectionManager Watcher org.apache.solr.common.cloud.ConnectionManager@3d2cff57 name:ZooKeeperConnection Watcher:127.0.0.1:56854 got event WatchedEvent state:SyncConnected type:None path:null path:null type:None
   [junit4]   2> 3110277 INFO  (jetty-launcher-11066-thread-5) [    ] o.a.s.c.c.ConnectionManager Client is connected to ZooKeeper
   [junit4]   2> 3110277 INFO  (zkCallback-11078-thread-1) [    ] o.a.s.c.c.ConnectionManager Watcher org.apache.solr.common.cloud.ConnectionManager@5045a694 name:ZooKeeperConnection Watcher:127.0.0.1:56854 got event WatchedEvent state:SyncConnected type:None path:null path:null type:None
   [junit4]   2> 3110278 INFO  (jetty-launcher-11066-thread-5) [    ] o.a.s.c.c.SolrZkClient Using default ZkACLProvider
   [junit4]   2> 3110278 INFO  (jetty-launcher-11066-thread-3) [    ] o.a.s.c.c.ConnectionManager Client is connected to ZooKeeper
   [junit4]   2> 3110278 INFO  (jetty-launcher-11066-thread-3) [    ] o.a.s.c.c.SolrZkClient Using default ZkACLProvider
   [junit4]   2> 3110288 INFO  (zkCallback-11083-thread-1) [    ] o.a.s.c.c.ConnectionManager Watcher org.apache.solr.common.cloud.ConnectionManager@26f6aa85 name:ZooKeeperConnection Watcher:127.0.0.1:56854 got event WatchedEvent state:SyncConnected type:None path:null path:null type:None
   [junit4]   2> 3110289 INFO  (jetty-launcher-11066-thread-4) [    ] o.a.s.c.c.ConnectionManager Client is connected to ZooKeeper
   [junit4]   2> 3110289 INFO  (jetty-launcher-11066-thread-4) [    ] o.a.s.c.c.SolrZkClient Using default ZkACLProvider
   [junit4]   2> 3110289 INFO  (zkCallback-11086-thread-1) [    ] o.a.s.c.c.ConnectionManager Watcher org.apache.solr.common.cloud.ConnectionManager@678f7df4 name:ZooKeeperConnection Watcher:127.0.0.1:56854 got event WatchedEvent state:SyncConnected type:None path:null path:null type:None
   [junit4]   2> 3110289 INFO  (jetty-launcher-11066-thread-1) [    ] o.a.s.c.c.ConnectionManager Client is connected to ZooKeeper
   [junit4]   2> 3110289 INFO  (zkCallback-11087-thread-1) [    ] o.a.s.c.c.ConnectionManager Watcher org.apache.solr.common.cloud.ConnectionManager@65a0a76a name:ZooKeeperConnection Watcher:127.0.0.1:56854 got event WatchedEvent state:SyncConnected type:None path:null path:null type:None
   [junit4]   2> 3110289 INFO  (jetty-launcher-11066-thread-1) [    ] o.a.s.c.c.SolrZkClient Using default ZkACLProvider
   [junit4]   2> 3110290 INFO  (jetty-launcher-11066-thread-2) [    ] o.a.s.c.c.ConnectionManager Client is connected to ZooKeeper
   [junit4]   2> 3110290 INFO  (jetty-launcher-11066-thread-2) [    ] o.a.s.c.c.SolrZkClient Using default ZkACLProvider
   [junit4]   2> 3110301 INFO  (jetty-launcher-11066-thread-5) [n:127.0.0.1:56860_solr    ] o.a.s.c.ZkController Added new OnReconnect listener org.apache.solr.cloud.ZkController$$Lambda$9/625822907@3902f404
   [junit4]   2> 3110301 INFO  (jetty-launcher-11066-thread-3) [n:127.0.0.1:56857_solr    ] o.a.s.c.ZkController Added new OnReconnect listener org.apache.solr.cloud.ZkController$$Lambda$9/625822907@1cd83663
   [junit4]   2> 3110302 INFO  (jetty-launcher-11066-thread-5) [n:127.0.0.1:56860_solr    ] o.a.s.c.c.ConnectionManager Waiting for client to connect to ZooKeeper
   [junit4]   2> 3110302 INFO  (jetty-launcher-11066-thread-3) [n:127.0.0.1:56857_solr    ] o.a.s.c.c.ConnectionManager Waiting for client to connect to ZooKeeper
   [junit4]   2> 3110310 INFO  (jetty-launcher-11066-thread-2) [n:127.0.0.1:56858_solr    ] o.a.s.c.ZkController Added new OnReconnect listener org.apache.solr.cloud.ZkController$$Lambda$9/625822907@1bc93767
   [junit4]   2> 3110310 INFO  (jetty-launcher-11066-thread-1) [n:127.0.0.1:56865_solr    ] o.a.s.c.ZkController Added new OnReconnect listener org.apache.solr.cloud.ZkController$$Lambda$9/625822907@27439f16
   [junit4]   2> 3110311 INFO  (jetty-launcher-11066-thread-4) [n:127.0.0.1:56861_solr    ] o.a.s.c.ZkController Added new OnReconnect listener org.apache.solr.cloud.ZkController$$Lambda$9/625822907@6e5ce386
   [junit4]   2> 3110311 INFO  (jetty-launcher-11066-thread-2) [n:127.0.0.1:56858_solr    ] o.a.s.c.c.ConnectionManager Waiting for client to connect to ZooKeeper
   [junit4]   2> 3110312 INFO  (jetty-launcher-11066-thread-1) [n:127.0.0.1:56865_solr    ] o.a.s.c.c.ConnectionManager Waiting for client to connect to ZooKeeper
   [junit4]   2> 3110312 INFO  (jetty-launcher-11066-thread-4) [n:127.0.0.1:56861_solr    ] o.a.s.c.c.ConnectionManager Waiting for client to connect to ZooKeeper
   [junit4]   2> 3110321 INFO  (zkCallback-11088-thread-1-processing-n:127.0.0.1:56860_solr) [n:127.0.0.1:56860_solr    ] o.a.s.c.c.ConnectionManager Watcher org.apache.solr.common.cloud.ConnectionManager@52546985 name:ZooKeeperConnection Watcher:127.0.0.1:56854/solr got event WatchedEvent state:SyncConnected type:None path:null path:null type:None
   [junit4]   2> 3110321 INFO  (zkCallback-11089-thread-1-processing-n:127.0.0.1:56857_solr) [n:127.0.0.1:56857_solr    ] o.a.s.c.c.ConnectionManager Watcher org.apache.solr.common.cloud.ConnectionManager@63b08c98 name:ZooKeeperConnection Watcher:127.0.0.1:56854/solr got event WatchedEvent state:SyncConnected type:None path:null path:null type:None
   [junit4]   2> 3110321 INFO  (jetty-launcher-11066-thread-5) [n:127.0.0.1:56860_solr    ] o.a.s.c.c.ConnectionManager Client is connected to ZooKeeper
   [junit4]   2> 3110321 INFO  (jetty-launcher-11066-thread-3) [n:127.0.0.1:56857_solr    ] o.a.s.c.c.ConnectionManager Client is connected to ZooKeeper
   [junit4]   2> 3110330 INFO  (zkCallback-11090-thread-1-processing-n:127.0.0.1:56858_solr) [n:127.0.0.1:56858_solr    ] o.a.s.c.c.ConnectionManager Watcher org.apache.solr.common.cloud.ConnectionManager@2690d323 name:ZooKeeperConnection Watcher:127.0.0.1:56854/solr got event WatchedEvent state:SyncConnected type:None path:null path:null type:None
   [junit4]   2> 3110330 INFO  (jetty-launcher-11066-thread-2) [n:127.0.0.1:56858_solr    ] o.a.s.c.c.ConnectionManager Client is connected to ZooKeeper
   [junit4]   2> 3110331 INFO  (zkCallback-11091-thread-1-processing-n:127.0.0.1:56865_solr) [n:127.0.0.1:56865_solr    ] o.a.s.c.c.ConnectionManager Watcher org.apache.solr.common.cloud.ConnectionManager@48620388 name:ZooKeeperConnection Watcher:127.0.0.1:56854/solr got event WatchedEvent state:SyncConnected type:None path:null path:null type:None
   [junit4]   2> 3110331 INFO  (jetty-launcher-11066-thread-1) [n:127.0.0.1:56865_solr    ] o.a.s.c.c.ConnectionManager Client is connected to ZooKeeper
   [junit4]   2> 3110332 INFO  (zkCallback-11092-thread-1-processing-n:127.0.0.1:56861_solr) [n:127.0.0.1:56861_solr    ] o.a.s.c.c.ConnectionManager Watcher org.apache.solr.common.cloud.ConnectionManager@1938ff name:ZooKeeperConnection Watcher:127.0.0.1:56854/solr got event WatchedEvent state:SyncConnected type:None path:null path:null type:None
   [junit4]   2> 3110332 INFO  (jetty-launcher-11066-thread-4) [n:127.0.0.1:56861_solr    ] o.a.s.c.c.ConnectionManager Client is connected to ZooKeeper
   [junit4]   2> 3110360 INFO  (jetty-launcher-11066-thread-5) [n:127.0.0.1:56860_solr    ] o.a.s.c.c.SolrZkClient makePath: /overseer/queue
   [junit4]   2> 3110360 INFO  (jetty-launcher-11066-thread-3) [n:127.0.0.1:56857_solr    ] o.a.s.c.c.SolrZkClient makePath: /overseer/queue
   [junit4]   2> 3110361 INFO  (jetty-launcher-11066-thread-4) [n:127.0.0.1:56861_solr    ] o.a.s.c.c.SolrZkClient makePath: /overseer/queue
   [junit4]   2> 3110361 INFO  (jetty-launcher-11066-thread-2) [n:127.0.0.1:56858_solr    ] o.a.s.c.c.SolrZkClient makePath: /overseer/queue
   [junit4]   2> 3110361 INFO  (jetty-launcher-11066-thread-1) [n:127.0.0.1:56865_solr    ] o.a.s.c.c.SolrZkClient makePath: /overseer/queue
   [junit4]   2> 3110405 INFO  (jetty-launcher-11066-thread-3) [n:127.0.0.1:56857_solr    ] o.a.s.c.c.SolrZkClient makePath: /overseer/collection-queue-work
   [junit4]   2> 3110406 INFO  (jetty-launcher-11066-thread-4) [n:127.0.0.1:56861_solr    ] o.a.s.c.c.SolrZkClient makePath: /overseer/collection-queue-work
   [junit4]   2> 3110405 INFO  (jetty-launcher-11066-thread-2) [n:127.0.0.1:56858_solr    ] o.a.s.c.c.SolrZkClient makePath: /overseer/collection-queue-work
   [junit4]   2> 3110405 INFO  (jetty-launcher-11066-thread-5) [n:127.0.0.1:56860_solr    ] o.a.s.c.c.SolrZkClient makePath: /overseer/collection-queue-work
   [junit4]   2> 3110406 INFO  (jetty-launcher-11066-thread-1) [n:127.0.0.1:56865_solr    ] o.a.s.c.c.SolrZkClient makePath: /overseer/collection-queue-work
   [junit4]   2> 3110475 INFO  (jetty-launcher-11066-thread-2) [n:127.0.0.1:56858_solr    ] o.a.s.c.c.SolrZkClient makePath: /overseer/collection-map-running
   [junit4]   2> 3110488 INFO  (jetty-launcher-11066-thread-3) [n:127.0.0.1:56857_solr    ] o.a.s.c.c.SolrZkClient makePath: /overseer/collection-map-running
   [junit4]   2> 3110488 INFO  (jetty-launcher-11066-thread-4) [n:127.0.0.1:56861_solr    ] o.a.s.c.c.SolrZkClient makePath: /overseer/collection-map-running
   [junit4]   2> 3110488 INFO  (jetty-launcher-11066-thread-1) [n:127.0.0.1:56865_solr    ] o.a.s.c.c.SolrZkClient makePath: /overseer/collection-map-running
   [junit4]   2> 3110488 INFO  (jetty-launcher-11066-thread-5) [n:127.0.0.1:56860_solr    ] o.a.s.c.c.SolrZkClient makePath: /overseer/collection-map-running
   [junit4]   2> 3110522 INFO  (jetty-launcher-11066-thread-2) [n:127.0.0.1:56858_solr    ] o.a.s.c.c.SolrZkClient makePath: /overseer/collection-map-completed
   [junit4]   2> 3110532 INFO  (jetty-launcher-11066-thread-3) [n:127.0.0.1:56857_solr    ] o.a.s.c.c.SolrZkClient makePath: /overseer/collection-map-completed
   [junit4]   2> 3110543 INFO  (jetty-launcher-11066-thread-4) [n:127.0.0.1:56861_solr    ] o.a.s.c.c.SolrZkClient makePath: /overseer/collection-map-completed
   [junit4]   2> 3110543 INFO  (jetty-launcher-11066-thread-5) [n:127.0.0.1:56860_solr    ] o.a.s.c.c.SolrZkClient makePath: /overseer/collection-map-completed
   [junit4]   2> 3110544 INFO  (jetty-launcher-11066-thread-1) [n:127.0.0.1:56865_solr    ] o.a.s.c.c.SolrZkClient makePath: /overseer/collection-map-completed
   [junit4]   2> 3110577 INFO  (jetty-launcher-11066-thread-3) [n:127.0.0.1:56857_solr    ] o.a.s.c.c.SolrZkClient makePath: /overseer/collection-map-failure
   [junit4]   2> 3110580 INFO  (jetty-launcher-11066-thread-2) [n:127.0.0.1:56858_solr    ] o.a.s.c.c.SolrZkClient makePath: /overseer/collection-map-failure
   [junit4]   2> 3110589 INFO  (jetty-launcher-11066-thread-4) [n:127.0.0.1:56861_solr    ] o.a.s.c.c.SolrZkClient makePath: /overseer/collection-map-failure
   [junit4]   2> 3110590 INFO  (jetty-launcher-11066-thread-5) [n:127.0.0.1:56860_solr    ] o.a.s.c.c.SolrZkClient makePath: /overseer/collection-map-failure
   [junit4]   2> 3110590 INFO  (jetty-launcher-11066-thread-1) [n:127.0.0.1:56865_solr    ] o.a.s.c.c.SolrZkClient makePath: /overseer/collection-map-failure
   [junit4]   2> 3110599 INFO  (jetty-launcher-11066-thread-2) [n:127.0.0.1:56858_solr    ] o.a.s.c.c.SolrZkClient makePath: /live_nodes
   [junit4]   2> 3110617 INFO  (jetty-launcher-11066-thread-3) [n:127.0.0.1:56857_solr    ] o.a.s.c.c.SolrZkClient makePath: /live_nodes
   [junit4]   2> 3110617 INFO  (jetty-launcher-11066-thread-4) [n:127.0.0.1:56861_solr    ] o.a.s.c.c.SolrZkClient makePath: /live_nodes
   [junit4]   2> 3110618 INFO  (jetty-launcher-11066-thread-5) [n:127.0.0.1:56860_solr    ] o.a.s.c.c.SolrZkClient makePath: /live_nodes
   [junit4]   2> 3110627 INFO  (jetty-launcher-11066-thread-1) [n:127.0.0.1:56865_solr    ] o.a.s.c.c.SolrZkClient makePath: /collections
   [junit4]   2> 3110648 INFO  (jetty-launcher-11066-thread-5) [n:127.0.0.1:56860_solr    ] o.a.s.c.c.SolrZkClient makePath: /aliases.json
   [junit4]   2> 3110648 INFO  (jetty-launcher-11066-thread-4) [n:127.0.0.1:56861_solr    ] o.a.s.c.c.SolrZkClient makePath: /aliases.json
   [junit4]   2> 3110648 INFO  (jetty-launcher-11066-thread-3) [n:127.0.0.1:56857_solr    ] o.a.s.c.c.SolrZkClient makePath: /aliases.json
   [junit4]   2> 3110648 INFO  (jetty-launcher-11066-thread-2) [n:127.0.0.1:56858_solr    ] o.a.s.c.c.SolrZkClient makePath: /aliases.json
   [junit4]   2> 3110649 INFO  (jetty-launcher-11066-thread-1) [n:127.0.0.1:56865_solr    ] o.a.s.c.c.SolrZkClient makePath: /aliases.json
   [junit4]   2> 3110669 INFO  (jetty-launcher-11066-thread-2) [n:127.0.0.1:56858_solr    ] o.a.s.c.c.SolrZkClient makePath: /clusterstate.json
   [junit4]   2> 3110669 INFO  (jetty-launcher-11066-thread-3) [n:127.0.0.1:56857_solr    ] o.a.s.c.c.SolrZkClient makePath: /clusterstate.json
   [junit4]   2> 3110669 INFO  (jetty-launcher-11066-thread-5) [n:127.0.0.1:56860_solr    ] o.a.s.c.c.SolrZkClient makePath: /clusterstate.json
   [junit4]   2> 3110669 INFO  (jetty-launcher-11066-thread-4) [n:127.0.0.1:56861_solr    ] o.a.s.c.c.SolrZkClient makePath: /clusterstate.json
   [junit4]   2> 3110670 INFO  (jetty-launcher-11066-thread-1) [n:127.0.0.1:56865_solr    ] o.a.s.c.c.SolrZkClient makePath: /clusterstate.json
   [junit4]   2> 3110679 INFO  (jetty-launcher-11066-thread-4) [n:127.0.0.1:56861_solr    ] o.a.s.c.c.SolrZkClient makePath: /security.json
   [junit4]   2> 3110679 INFO  (jetty-launcher-11066-thread-2) [n:127.0.0.1:56858_solr    ] o.a.s.c.c.SolrZkClient makePath: /security.json
   [junit4]   2> 3110688 INFO  (jetty-launcher-11066-thread-3) [n:127.0.0.1:56857_solr    ] o.a.s.c.c.SolrZkClient makePath: /security.json
   [junit4]   2> 3110688 INFO  (jetty-launcher-11066-thread-5) [n:127.0.0.1:56860_solr    ] o.a.s.c.c.SolrZkClient makePath: /security.json
   [junit4]   2> 3110699 INFO  (jetty-launcher-11066-thread-1) [n:127.0.0.1:56865_solr    ] o.a.s.c.c.ZkStateReader Updating cluster state from ZooKeeper... 
   [junit4]   2> 3110699 INFO  (jetty-launcher-11066-thread-2) [n:127.0.0.1:56858_solr    ] o.a.s.c.c.ZkStateReader Updating cluster state from ZooKeeper... 
   [junit4]   2> 3110700 INFO  (jetty-launcher-11066-thread-4) [n:127.0.0.1:56861_solr    ] o.a.s.c.c.ZkStateReader Updating cluster state from ZooKeeper... 
   [junit4]   2> 3110722 INFO  (jetty-launcher-11066-thread-3) [n:127.0.0.1:56857_solr    ] o.a.s.c.c.ZkStateReader Updating cluster state from ZooKeeper... 
   [junit4]   2> 3110764 INFO  (jetty-launcher-11066-thread-5) [n:127.0.0.1:56860_solr    ] o.a.s.c.c.ZkStateReader Updating cluster state from ZooKeeper... 
   [junit4]   2> 3110764 INFO  (jetty-launcher-11066-thread-1) [n:127.0.0.1:56865_solr    ] o.a.s.c.c.ZkStateReader Loaded empty cluster properties
   [junit4]   2> 3110765 INFO  (jetty-launcher-11066-thread-2) [n:127.0.0.1:56858_solr    ] o.a.s.c.c.ZkStateReader Loaded empty cluster properties
   [junit4]   2> 3110766 INFO  (jetty-launcher-11066-thread-4) [n:127.0.0.1:56861_solr    ] o.a.s.c.c.ZkStateReader Loaded empty cluster properties
   [junit4]   2> 3110766 INFO  (jetty-launcher-11066-thread-3) [n:127.0.0.1:56857_solr    ] o.a.s.c.c.ZkStateReader Loaded empty cluster properties
   [junit4]   2> 3110766 INFO  (jetty-launcher-11066-thread-5) [n:127.0.0.1:56860_solr    ] o.a.s.c.c.ZkStateReader Loaded empty cluster properties
   [junit4]   2> 3110766 INFO  (jetty-launcher-11066-thread-1) [n:127.0.0.1:56865_solr    ] o.a.s.c.c.ZkStateReader Updated live nodes from ZooKeeper... (0) -> (0)
   [junit4]   2> 3110767 INFO  (jetty-launcher-11066-thread-2) [n:127.0.0.1:56858_solr    ] o.a.s.c.c.ZkStateReader Updated live nodes from ZooKeeper... (0) -> (0)
   [junit4]   2> 3110768 INFO  (jetty-launcher-11066-thread-3) [n:127.0.0.1:56857_solr    ] o.a.s.c.c.ZkStateReader Updated live nodes from ZooKeeper... (0) -> (0)
   [junit4]   2> 3110768 INFO  (jetty-launcher-11066-thread-4) [n:127.0.0.1:56861_solr    ] o.a.s.c.c.ZkStateReader Updated live nodes from ZooKeeper... (0) -> (0)
   [junit4]   2> 3110769 INFO  (jetty-launcher-11066-thread-5) [n:127.0.0.1:56860_solr    ] o.a.s.c.c.ZkStateReader Updated live nodes from ZooKeeper... (0) -> (0)
   [junit4]   2> 3110776 INFO  (jetty-launcher-11066-thread-1) [n:127.0.0.1:56865_solr    ] o.a.s.c.c.SolrZkClient makePath: /overseer_elect
   [junit4]   2> 3110777 INFO  (jetty-launcher-11066-thread-2) [n:127.0.0.1:56858_solr    ] o.a.s.c.c.SolrZkClient makePath: /overseer_elect
   [junit4]   2> 3110778 INFO  (jetty-launcher-11066-thread-3) [n:127.0.0.1:56857_solr    ] o.a.s.c.c.SolrZkClient makePath: /overseer_elect
   [junit4]   2> 3110865 INFO  (jetty-launcher-11066-thread-4) [n:127.0.0.1:56861_solr    ] o.a.s.c.c.SolrZkClient makePath: /overseer_elect/election
   [junit4]   2> 3110902 INFO  (jetty-launcher-11066-thread-5) [n:127.0.0.1:56860_solr    ] o.a.s.c.c.SolrZkClient makePath: /overseer_elect/election
   [junit4]   2> 3110902 INFO  (jetty-launcher-11066-thread-1) [n:127.0.0.1:56865_solr    ] o.a.s.c.c.SolrZkClient makePath: /overseer_elect/election
   [junit4]   2> 3110904 INFO  (jetty-launcher-11066-thread-2) [n:127.0.0.1:56858_solr    ] o.a.s.c.c.SolrZkClient makePath: /overseer_elect/election
   [junit4]   2> 3110904 INFO  (jetty-launcher-11066-thread-3) [n:127.0.0.1:56857_solr    ] o.a.s.c.c.SolrZkClient makePath: /overseer_elect/election
   [junit4]   2> 3110959 INFO  (jetty-launcher-11066-thread-4) [n:127.0.0.1:56861_solr    ] o.a.s.c.Overseer Overseer (id=null) closing
   [junit4]   2> 3111019 INFO  (jetty-launcher-11066-thread-1) [n:127.0.0.1:56865_solr    ] o.a.s.c.Overseer Overseer (id=null) closing
   [junit4]   2> 3111019 INFO  (jetty-launcher-11066-thread-5) [n:127.0.0.1:56860_solr    ] o.a.s.c.Overseer Overseer (id=null) closing
   [junit4]   2> 3111048 INFO  (jetty-launcher-11066-thread-4) [n:127.0.0.1:56861_solr    ] o.a.s.c.LeaderElector Joined leadership election with path: /overseer_elect/election/96166066035294223-127.0.0.1:56861_solr-n_0000000000
   [junit4]   2> 3111054 INFO  (jetty-launcher-11066-thread-2) [n:127.0.0.1:56858_solr    ] o.a.s.c.Overseer Overseer (id=null) closing
   [junit4]   2> 3111054 INFO  (jetty-launcher-11066-thread-3) [n:127.0.0.1:56857_solr    ] o.a.s.c.Overseer Overseer (id=null) closing
   [junit4]   2> 3111054 INFO  (jetty-launcher-11066-thread-1) [n:127.0.0.1:56865_solr    ] o.a.s.c.LeaderElector Joined leadership election with path: /overseer_elect/election/96166066035294222-127.0.0.1:56865_solr-n_0000000001
   [junit4]   2> 3111055 INFO  (jetty-launcher-11066-thread-5) [n:127.0.0.1:56860_solr    ] o.a.s.c.LeaderElector Joined leadership election with path: /overseer_elect/election/96166066035294219-127.0.0.1:56860_solr-n_0000000002
   [junit4]   2> 3111055 INFO  (jetty-launcher-11066-thread-4) [n:127.0.0.1:56861_solr    ] o.a.s.c.OverseerElectionContext I am going to be the leader 127.0.0.1:56861_solr
   [junit4]   2> 3111055 INFO  (jetty-launcher-11066-thread-4) [n:127.0.0.1:56861_solr    ] o.a.s.c.c.SolrZkClient makePath: /overseer_elect/leader
   [junit4]   2> 3111063 INFO  (jetty-launcher-11066-thread-2) [n:127.0.0.1:56858_solr    ] o.a.s.c.LeaderElector Joined leadership election with path: /overseer_elect/election/96166066035294221-127.0.0.1:56858_solr-n_0000000003
   [junit4]   2> 3111064 INFO  (jetty-launcher-11066-thread-3) [n:127.0.0.1:56857_solr    ] o.a.s.c.LeaderElector Joined leadership election with path: /overseer_elect/election/96166066035294220-127.0.0.1:56857_solr-n_0000000004
   [junit4]   2> 3111064 INFO  (jetty-launcher-11066-thread-1) [n:127.0.0.1:56865_solr    ] o.a.s.c.LeaderElector Watching path /overseer_elect/election/96166066035294223-127.0.0.1:56861_solr-n_0000000000 to know if I could be the leader
   [junit4]   2> 3111065 INFO  (jetty-launcher-11066-thread-5) [n:127.0.0.1:56860_solr    ] o.a.s.c.LeaderElector Watching path /overseer_elect/election/96166066035294222-127.0.0.1:56865_solr-n_0000000001 to know if I could be the leader
   [junit4]   2> 3111066 INFO  (jetty-launcher-11066-thread-1) [n:127.0.0.1:56865_solr    ] o.a.s.c.ZkController Register node as live in ZooKeeper:/live_nodes/127.0.0.1:56865_solr
   [junit4]   2> 3111066 INFO  (jetty-launcher-11066-thread-1) [n:127.0.0.1:56865_solr    ] o.a.s.c.c.SolrZkClient makePath: /live_nodes/127.0.0.1:56865_solr
   [junit4]   2> 3111066 INFO  (jetty-launcher-11066-thread-2) [n:127.0.0.1:56858_solr    ] o.a.s.c.LeaderElector Watching path /overseer_elect/election/96166066035294219-127.0.0.1:56860_solr-n_0000000002 to know if I could be the leader
   [junit4]   2> 3111086 INFO  (jetty-launcher-11066-thread-3) [n:127.0.0.1:56857_solr    ] o.a.s.c.LeaderElector Watching path /overseer_elect/election/96166066035294221-127.0.0.1:56858_solr-n_0000000003 to know if I could be the leader
   [junit4]   2> 3111086 INFO  (jetty-launcher-11066-thread-5) [n:127.0.0.1:56860_solr    ] o.a.s.c.ZkController Register node as live in ZooKeeper:/live_nodes/127.0.0.1:56860_solr
   [junit4]   2> 3111086 INFO  (jetty-launcher-11066-thread-5) [n:127.0.0.1:56860_solr    ] o.a.s.c.c.SolrZkClient makePath: /live_nodes/127.0.0.1:56860_solr
   [junit4]   2> 3111086 INFO  (jetty-launcher-11066-thread-2) [n:127.0.0.1:56858_solr    ] o.a.s.c.ZkController Register node as live in ZooKeeper:/live_nodes/127.0.0.1:56858_solr
   [junit4]   2> 3111086 INFO  (jetty-launcher-11066-thread-2) [n:127.0.0.1:56858_solr    ] o.a.s.c.c.SolrZkClient makePath: /live_nodes/127.0.0.1:56858_solr
   [junit4]   2> 3111087 INFO  (jetty-launcher-11066-thread-4) [n:127.0.0.1:56861_solr    ] o.a.s.c.Overseer Overseer (id=96166066035294223-127.0.0.1:56861_solr-n_0000000000) starting
   [junit4]   2> 3111088 INFO  (jetty-launcher-11066-thread-3) [n:127.0.0.1:56857_solr    ] o.a.s.c.ZkController Register node as live in ZooKeeper:/live_nodes/127.0.0.1:56857_solr
   [junit4]   2> 3111088 INFO  (jetty-launcher-11066-thread-3) [n:127.0.0.1:56857_solr    ] o.a.s.c.c.SolrZkClient makePath: /live_nodes/127.0.0.1:56857_solr
   [junit4]   2> 3111106 INFO  (zkCallback-11090-thread-1-processing-n:127.0.0.1:56858_solr) [n:127.0.0.1:56858_solr    ] o.a.s.c.c.ZkStateReader A live node change: [WatchedEvent state:SyncConnected type:NodeChildrenChanged path:/live_nodes], has occurred - updating... (live nodes size: [0])
   [junit4]   2> 3111107 INFO  (zkCallback-11089-thread-1-processing-n:127.0.0.1:56857_solr) [n:127.0.0.1:56857_solr    ] o.a.s.c.c.ZkStateReader A live node change: [WatchedEvent state:SyncConnected type:NodeChildrenChanged path:/live_nodes], has occurred - updating... (live nodes size: [0])
   [junit4]   2> 3111107 INFO  (zkCallback-11091-thread-1-processing-n:127.0.0.1:56865_solr) [n:127.0.0.1:56865_solr    ] o.a.s.c.c.ZkStateReader A live node change: [WatchedEvent state:SyncConnected type:NodeChildrenChanged path:/live_nodes], has occurred - updating... (live nodes size: [0])
   [junit4]   2> 3111107 INFO  (zkCallback-11088-thread-1-processing-n:127.0.0.1:56860_solr) [n:127.0.0.1:56860_solr    ] o.a.s.c.c.ZkStateReader A live node change: [WatchedEvent state:SyncConnected type:NodeChildrenChanged path:/live_nodes], has occurred - updating... (live nodes size: [0])
   [junit4]   2> 3111106 INFO  (zkCallback-11092-thread-1-processing-n:127.0.0.1:56861_solr) [n:127.0.0.1:56861_solr    ] o.a.s.c.c.ZkStateReader A live node change: [WatchedEvent state:SyncConnected type:NodeChildrenChanged path:/live_nodes], has occurred - updating... (live nodes size: [0])
   [junit4]   2> 3111129 INFO  (zkCallback-11090-thread-1-processing-n:127.0.0.1:56858_solr) [n:127.0.0.1:56858_solr    ] o.a.s.c.c.ZkStateReader Updated live nodes from ZooKeeper... (0) -> (3)
   [junit4]   2> 3111129 INFO  (zkCallback-11091-thread-1-processing-n:127.0.0.1:56865_solr) [n:127.0.0.1:56865_solr    ] o.a.s.c.c.ZkStateReader Updated live nodes from ZooKeeper... (0) -> (3)
   [junit4]   2> 3111129 INFO  (zkCallback-11088-thread-1-processing-n:127.0.0.1:56860_solr) [n:127.0.0.1:56860_solr    ] o.a.s.c.c.ZkStateReader Updated live nodes from ZooKeeper... (0) -> (3)
   [junit4]   2> 3111129 INFO  (zkCallback-11092-thread-1-processing-n:127.0.0.1:56861_solr) [n:127.0.0.1:56861_solr    ] o.a.s.c.c.ZkStateReader Updated live nodes from ZooKeeper... (0) -> (3)
   [junit4]   2> 3111130 INFO  (zkCallback-11089-thread-1-processing-n:127.0.0.1:56857_solr) [n:127.0.0.1:56857_solr    ] o.a.s.c.c.ZkStateReader Updated live nodes from ZooKeeper... (0) -> (3)
   [junit4]   2> 3111134 INFO  (jetty-launcher-11066-thread-1) [n:127.0.0.1:56865_solr    ] o.a.s.c.CoreContainer Security conf doesn't exist. Skipping setup for authorization module.
   [junit4]   2> 3111134 INFO  (jetty-launcher-11066-thread-1) [n:127.0.0.1:56865_solr    ] o.a.s.c.CoreContainer No authentication plugin used.
   [junit4]   2> 3111138 INFO  (zkCallback-11090-thread-1-processing-n:127.0.0.1:56858_solr) [n:127.0.0.1:56858_solr    ] o.a.s.c.c.ZkStateReader A live node change: [WatchedEvent state:SyncConnected type:NodeChildrenChanged path:/live_nodes], has occurred - updating... (live nodes size: [3])
   [junit4]   2> 3111138 INFO  (zkCallback-11092-thread-1-processing-n:127.0.0.1:56861_solr) [n:127.0.0.1:56861_solr    ] o.a.s.c.c.ZkStateReader A live node change: [WatchedEvent state:SyncConnected type:NodeChildrenChanged path:/live_nodes], has occurred - updating... (live nodes size: [3])
   [junit4]   2> 3111139 INFO  (zkCallback-11089-thread-1-processing-n:127.0.0.1:56857_solr) [n:127.0.0.1:56857_solr    ] o.a.s.c.c.ZkStateReader A live node change: [WatchedEvent state:SyncConnected type:NodeChildrenChanged path:/live_nodes], has occurred - updating... (live nodes size: [3])
   [junit4]   2> 3111139 INFO  (zkCallback-11091-thread-1-processing-n:127.0.0.1:56865_solr) [n:127.0.0.1:56865_solr    ] o.a.s.c.c.ZkStateReader A live node change: [WatchedEvent state:SyncConnected type:NodeChildrenChanged path:/live_nodes], has occurred - updating... (live nodes size: [3])
   [junit4]   2> 3111139 INFO  (zkCallback-11088-thread-1-processing-n:127.0.0.1:56860_solr) [n:127.0.0.1:56860_solr    ] o.a.s.c.c.ZkStateReader A live node change: [WatchedEvent state:SyncConnected type:NodeChildrenChanged path:/live_nodes], has occurred - updating... (live nodes size: [3])
   [junit4]   2> 3111145 INFO  (jetty-launcher-11066-thread-5) [n:127.0.0.1:56860_solr    ] o.a.s.c.CoreContainer Security conf doesn't exist. Skipping setup for authorization module.
   [junit4]   2> 3111145 INFO  (jetty-launcher-11066-thread-5) [n:127.0.0.1:56860_solr    ] o.a.s.c.CoreContainer No authentication plugin used.
   [junit4]   2> 3111146 INFO  (jetty-launcher-11066-thread-2) [n:127.0.0.1:56858_solr    ] o.a.s.c.CoreContainer Security conf doesn't exist. Skipping setup for authorization module.
   [junit4]   2> 3111146 INFO  (jetty-launcher-11066-thread-2) [n:127.0.0.1:56858_solr    ] o.a.s.c.CoreContainer No authentication plugin used.
   [junit4]   2> 3111149 INFO  (zkCallback-11089-thread-1-processing-n:127.0.0.1:56857_solr) [n:127.0.0.1:56857_solr    ] o.a.s.c.c.ZkStateReader Updated live nodes from ZooKeeper... (3) -> (4)
   [junit4]   2> 3111149 INFO  (zkCallback-11091-thread-1-processing-n:127.0.0.1:56865_solr) [n:127.0.0.1:56865_solr    ] o.a.s.c.c.ZkStateReader Updated live nodes from ZooKeeper... (3) -> (4)
   [junit4]   2> 3111150 INFO  (zkCallback-11090-thread-1-processing-n:127.0.0.1:56858_solr) [n:127.0.0.1:56858_solr    ] o.a.s.c.c.ZkStateReader Updated live nodes from ZooKeeper... (3) -> (4)
   [junit4]   2> 3111150 INFO  (zkCallback-11088-thread-1-processing-n:127.0.0.1:56860_solr) [n:127.0.0.1:56860_solr    ] o.a.s.c.c.ZkStateReader Updated live nodes from ZooKeeper... (3) -> (4)
   [junit4]   2> 3111150 INFO  (zkCallback-11092-thread-1-processing-n:127.0.0.1:56861_solr) [n:127.0.0.1:56861_solr    ] o.a.s.c.c.ZkStateReader Updated live nodes from ZooKeeper... (3) -> (4)
   [junit4]   2> 3111153 INFO  (jetty-launcher-11066-thread-5) [n:127.0.0.1:56860_solr    ] o.a.s.c.CorePropertiesLocator Looking for core definitions underneath /Users/jenkins/workspace/Lucene-Solr-master-MacOSX/solr/build/solr-core/test/J1/temp/solr.security.BasicAuthIntegrationTest_60105D025CD632A5-001/tempDir-001/node5/.
   [junit4]   2> 3111154 INFO  (jetty-launcher-11066-thread-5) [n:127.0.0.1:56860_solr    ] o.a.s.c.CorePropertiesLocator Found 0 core definitions
   [junit4]   2> 3111155 INFO  (jetty-launcher-11066-thread-1) [n:127.0.0.1:56865_solr    ] o.a.s.c.CorePropertiesLocator Looking for core definitions underneath /Users/jenkins/workspace/Lucene-Solr-master-MacOSX/solr/build/solr-core/test/J1/temp/solr.security.BasicAuthIntegrationTest_60105D025CD632A5-001/tempDir-001/node1/.
   [junit4]   2> 3111155 INFO  (jetty-launcher-11066-thread-1) [n:127.0.0.1:56865_solr    ] o.a.s.c.CorePropertiesLocator Found 0 core definitions
   [junit4]   2> 3111156 INFO  (jetty-launcher-11066-thread-4) [n:127.0.0.1:56861_solr    ] o.a.s.c.c.SolrZkClient makePath: /overseer/queue-work
   [junit4]   2> 3111157 INFO  (jetty-launcher-11066-thread-1) [n:127.0.0.1:56865_solr    ] o.a.s.s.SolrDispatchFilter user.dir=/Users/jenkins/workspace/Lucene-Solr-master-MacOSX/solr/build/solr-core/test/J1
   [junit4]   2> 3111157 INFO  (jetty-launcher-11066-thread-1) [n:127.0.0.1:56865_solr    ] o.a.s.s.SolrDispatchFilter SolrDispatchFilter.init() done
   [junit4]   2> 3111159 INFO  (jetty-launcher-11066-thread-5) [n:127.0.0.1:56860_solr    ] o.a.s.s.SolrDispatchFilter user.dir=/Users/jenkins/workspace/Lucene-Solr-master-MacOSX/solr/build/solr-core/test/J1
   [junit4]   2> 3111159 INFO  (jetty-launcher-11066-thread-5) [n:127.0.0.1:56860_solr    ] o.a.s.s.SolrDispatchFilter SolrDispatchFilter.init() done
   [junit4]   2> 3111160 INFO  (jetty-launcher-11066-thread-2) [n:127.0.0.1:56858_solr    ] o.a.s.c.CorePropertiesLocator Looking for core definitions underneath /Users/jenkins/workspace/Lucene-Solr-master-MacOSX/solr/build/solr-core/test/J1/temp/solr.security.BasicAuthIntegrationTest_60105D025CD632A5-001/tempDir-001/node2/.
   [junit4]   2> 3111160 INFO  (jetty-launcher-11066-thread-2) [n:127.0.0.1:56858_solr    ] o.a.s.c.CorePropertiesLocator Found 0 core definitions
   [junit4]   2> 3111161 INFO  (jetty-launcher-11066-thread-2) [n:127.0.0.1:56858_solr    ] o.a.s.s.SolrDispatchFilter user.dir=/Users/jenkins/workspace/Lucene-Solr-master-MacOSX/solr/build/solr-core/test/J1
   [junit4]   2> 3111162 INFO  (jetty-launcher-11066-thread-2) [n:127.0.0.1:56858_solr    ] o.a.s.s.SolrDispatchFilter SolrDispatchFilter.init() done
   [junit4]   2> 3111164 INFO  (jetty-launcher-11066-thread-3) [n:127.0.0.1:56857_solr    ] o.a.s.c.CoreContainer Security conf doesn't exist. Skipping setup for authorization module.
   [junit4]   2> 3111164 INFO  (jetty-launcher-11066-thread-3) [n:127.0.0.1:56857_solr    ] o.a.s.c.CoreContainer No authentication plugin used.
   [junit4]   2> 3111165 INFO  (jetty-launcher-11066-thread-3) [n:127.0.0.1:56857_solr    ] o.a.s.c.CorePropertiesLocator Looking for core definitions underneath /Users/jenkins/workspace/Lucene-Solr-master-MacOSX/solr/build/solr-core/test/J1/temp/solr.security.BasicAuthIntegrationTest_60105D025CD632A5-001/tempDir-001/node3/.
   [junit4]   2> 3111166 INFO  (jetty-launcher-11066-thread-3) [n:127.0.0.1:56857_solr    ] o.a.s.c.CorePropertiesLocator Found 0 core definitions
   [junit4]   2> 3111168 INFO  (jetty-launcher-11066-thread-3) [n:127.0.0.1:56857_solr    ] o.a.s.s.SolrDispatchFilter user.dir=/Users/jenkins/workspace/Lucene-Solr-master-MacOSX/solr/build/solr-core/test/J1
   [junit4]   2> 3111168 INFO  (jetty-launcher-11066-thread-3) [n:127.0.0.1:56857_solr    ] o.a.s.s.SolrDispatchFilter SolrDispatchFilter.init() done
   [junit4]   2> 3111184 INFO  (jetty-launcher-11066-thread-4) [n:127.0.0.1:56861_solr    ] o.a.s.c.OverseerAutoReplicaFailoverThread Starting OverseerAutoReplicaFailoverThread autoReplicaFailoverWorkLoopDelay=10000 autoReplicaFailoverWaitAfterExpiration=30000 autoReplicaFailoverBadNodeExpiration=60000
   [junit4]   2> 3111184 INFO  (OverseerCollectionConfigSetProcessor-96166066035294223-127.0.0.1:56861_solr-n_0000000000) [n:127.0.0.1:56861_solr    ] o.a.s.c.OverseerTaskProcessor Process current queue of overseer operations
   [junit4]   2> 3111185 INFO  (OverseerStateUpdate-96166066035294223-127.0.0.1:56861_solr-n_0000000000) [n:127.0.0.1:56861_solr    ] o.a.s.c.Overseer Starting to work on the main queue
   [junit4]   2> 3111185 INFO  (jetty-launcher-11066-thread-4) [n:127.0.0.1:56861_solr    ] o.a.s.c.ZkController Publish node=127.0.0.1:56861_solr as DOWN
   [junit4]   2> 3111192 INFO  (jetty-launcher-11066-thread-4) [n:127.0.0.1:56861_solr    ] o.a.s.c.ZkController Register node as live in ZooKeeper:/live_nodes/127.0.0.1:56861_solr
   [junit4]   2> 3111192 INFO  (OverseerStateUpdate-96166066035294223-127.0.0.1:56861_solr-n_0000000000) [n:127.0.0.1:56861_solr    ] o.a.s.c.c.ZkStateReader Updated live nodes from ZooKeeper... (4) -> (4)
   [junit4]   2> 3111192 INFO  (jetty-launcher-11066-thread-4) [n:127.0.0.1:56861_solr    ] o.a.s.c.c.SolrZkClient makePath: /live_nodes/127.0.0.1:56861_solr
   [junit4]   2> 3111194 INFO  (OverseerStateUpdate-96166066035294223-127.0.0.1:56861_solr-n_0000000000) [n:127.0.0.1:56861_solr    ] o.a.s.c.Overseer processMessage: queueSize: 1, message = {
   [junit4]   2>   "operation":"downnode",
   [junit4]   2>   "node_name":"127.0.0.1:56861_solr"} current state version: 0
   [junit4]   2> 3111194 INFO  (OverseerStateUpdate-96166066035294223-127.0.0.1:56861_solr-n_0000000000) [n:127.0.0.1:56861_solr    ] o.a.s.c.o.NodeMutator DownNode state invoked for node: 127.0.0.1:56861_solr
   [junit4]   2> 3111196 INFO  (zkCallback-11090-thread-1-processing-n:127.0.0.1:56858_solr) [n:127.0.0.1:56858_solr    ] o.a.s.c.c.ZkStateReader A live node change: [WatchedEvent state:SyncConnected type:NodeChildrenChanged path:/live_nodes], has occurred - updating... (live nodes size: [4])
   [junit4]   2> 3111196 INFO  (zkCallback-11089-thread-1-processing-n:127.0.0.1:56857_solr) [n:127.0.0.1:56857_solr    ] o.a.s.c.c.ZkStateReader A live node change: [WatchedEvent state:SyncConnected type:NodeChildrenChanged path:/live_nodes], has occurred - updating... (live nodes size: [4])
   [junit4]   2> 3111196 INFO  (zkCallback-11088-thread-1-processing-n:127.0.0.1:56860_solr) [n:127.0.0.1:56860_solr    ] o.a.s.c.c.ZkStateReader A live node change: [WatchedEvent state:SyncConnected type:NodeChildrenChanged path:/live_nodes], has occurred - updating... (live nodes size: [4])
   [junit4]   2> 3111196 INFO  (zkCallback-11091-thread-1-processing-n:127.0.0.1:56865_solr) [n:127.0.0.1:56865_solr    ] o.a.s.c.c.ZkStateReader A live node change: [WatchedEvent state:SyncConnected type:NodeChildrenChanged path:/live_nodes], has occurred - updating... (live nodes size: [4])
   [junit4]   2> 3111196 INFO  (zkCallback-11092-thread-1-processing-n:127.0.0.1:56861_solr) [n:127.0.0.1:56861_solr    ] o.a.s.c.c.ZkStateReader A live node change: [WatchedEvent state:SyncConnected type:NodeChildrenChanged path:/live_nodes], has occurred - updating... (live nodes size: [4])
   [junit4]   2> 3111197 INFO  (zkCallback-11090-thread-1-processing-n:127.0.0.1:56858_solr) [n:127.0.0.1:56858_solr    ] o.a.s.c.c.ZkStateReader Updated live nodes from ZooKeeper... (4) -> (5)
   [junit4]   2> 3111199 INFO  (zkCallback-11092-thread-1-processing-n:127.0.0.1:56861_solr) [n:127.0.0.1:56861_solr    ] o.a.s.c.c.ZkStateReader Updated live nodes from ZooKeeper... (4) -> (5)
   [junit4]   2> 3111200 INFO  (zkCallback-11089-thread-1-processing-n:127.0.0.1:56857_solr) [n:127.0.0.1:56857_solr    ] o.a.s.c.c.ZkStateReader Updated live nodes from ZooKeeper... (4) -> (5)
   [junit4]   2> 3111200 INFO  (zkCallback-11091-thread-1-processing-n:127.0.0.1:56865_solr) [n:127.0.0.1:56865_solr    ] o.a.s.c.c.ZkStateReader Updated live nodes from ZooKeeper... (4) -> (5)
   [junit4]   2> 3111200 INFO  (zkCallback-11088-thread-1-processing-n:127.0.0.1:56860_solr) [n:127.0.0.1:56860_solr    ] o.a.s.c.c.ZkStateReader Updated live nodes from ZooKeeper... (4) -> (5)
   [junit4]   2> 3111236 INFO  (jetty-launcher-11066-thread-4) [n:127.0.0.1:56861_solr    ] o.a.s.c.CoreContainer Security conf doesn't exist. Skipping setup for authorization module.
   [junit4]   2> 3111236 INFO  (jetty-launcher-11066-thread-4) [n:127.0.0.1:56861_solr    ] o.a.s.c.CoreContainer No authentication plugin used.
   [junit4]   2> 3111237 INFO  (jetty-launcher-11066-thread-4) [n:127.0.0.1:56861_solr    ] o.a.s.c.CorePropertiesLocator Looking for core definitions underneath /Users/jenkins/workspace/Lucene-Solr-master-MacOSX/solr/build/solr-core/test/J1/temp/solr.security.BasicAuthIntegrationTest_60105D025CD632A5-001/tempDir-001/node4/.
   [junit4]   2> 3111238 INFO  (jetty-launcher-11066-thread-4) [n:127.0.0.1:56861_solr    ] o.a.s.c.CorePropertiesLocator Found 0 core definitions
   [junit4]   2> 3111239 INFO  (jetty-launcher-11066-thread-4) [n:127.0.0.1:56861_solr    ] o.a.s.s.SolrDispatchFilter user.dir=/Users/jenkins/workspace/Lucene-Solr-master-MacOSX/solr/build/solr-core/test/J1
   [junit4]   2> 3111239 INFO  (jetty-launcher-11066-thread-4) [n:127.0.0.1:56861_solr    ] o.a.s.s.SolrDispatchFilter SolrDispatchFilter.init() done
   [junit4]   2> 3111239 INFO  (TEST-BasicAuthIntegrationTest.testBasics-seed#[60105D025CD632A5]) [    ] o.a.s.c.c.SolrZkClient Using default ZkCredentialsProvider
   [junit4]   2> 3111239 INFO  (TEST-BasicAuthIntegrationTest.testBasics-seed#[60105D025CD632A5]) [    ] o.a.s.c.c.ConnectionManager Waiting for client to connect to ZooKeeper
   [junit4]   2> 3111243 INFO  (zkCallback-11098-thread-1) [    ] o.a.s.c.c.ConnectionManager Watcher org.apache.solr.common.cloud.ConnectionManager@2ddcf306 name:ZooKeeperConnection Watcher:127.0.0.1:56854 got event WatchedEvent state:SyncConnected type:None path:null path:null type:None
   [junit4]   2> 3111243 INFO  (TEST-BasicAuthIntegrationTest.testBasics-seed#[60105D025CD632A5]) [    ] o.a.s.c.c.ConnectionManager Client is connected to ZooKeeper
   [junit4]   2> 3111244 INFO  (TEST-BasicAuthIntegrationTest.testBasics-seed#[60105D025CD632A5]) [    ] o.a.s.c.c.SolrZkClient Using default ZkACLProvider
   [junit4]   2> 3111248 INFO  (TEST-BasicAuthIntegrationTest.testBasics-seed#[60105D025CD632A5]) [    ] o.a.s.c.s.i.CloudSolrClient Final constructed zkHost string: 127.0.0.1:56854/solr
   [junit4]   2> 3111250 INFO  (TEST-BasicAuthIntegrationTest.testBasics-seed#[60105D025CD632A5]) [    ] o.e.j.s.ServerConnector Stopped ServerConnector@30c87642{HTTP/1.1,[http/1.1]}{127.0.0.1:0}
   [junit4]   2> 3111250 INFO  (TEST-BasicAuthIntegrationTest.testBasics-seed#[60105D025CD632A5]) [    ] o.a.s.c.CoreContainer Shutting down CoreContainer instance=1791059428
   [junit4]   2> 3111250 INFO  (TEST-BasicAuthIntegrationTest.testBasics-seed#[60105D025CD632A5]) [    ] o.a.s.c.ZkController Publish node=127.0.0.1:56865_solr as DOWN
   [junit4]   2> 3111271 INFO  (OverseerStateUpdate-96166066035294223-127.0.0.1:56861_solr-n_0000000000) [n:127.0.0.1:56861_solr    ] o.a.s.c.Overseer processMessage: queueSize: 1, message = {
   [junit4]   2>   "operation":"downnode",
   [junit4]   2>   "node_name":"127.0.0.1:56865_solr"} current state version: 0
   [junit4]   2> 3111271 INFO  (zkCallback-11089-thread-1-processing-n:127.0.0.1:56857_solr) [n:127.0.0.1:56857_solr    ] o.a.s.c.c.ZkStateReader A live node change: [WatchedEvent state:SyncConnected type:NodeChildrenChanged path:/live_nodes], has occurred - updating... (live nodes size: [5])
   [junit4]   2> 3111271 INFO  (zkCallback-11090-thread-1-processing-n:127.0.0.1:56858_solr) [n:127.0.0.1:56858_solr    ] o.a.s.c.c.ZkStateReader A live node change: [WatchedEvent state:SyncConnected type:NodeChildrenChanged path:/live_nodes], has occurred - updating... (live nodes size: [5])
   [junit4]   2> 3111271 INFO  (zkCallback-11092-thread-1-processing-n:127.0.0.1:56861_solr) [n:127.0.0.1:56861_solr    ] o.a.s.c.c.ZkStateReader A live node change: [WatchedEvent state:SyncConnected type:NodeChildrenChanged path:/live_nodes], has occurred - updating... (live nodes size: [5])
   [junit4]   2> 3111271 INFO  (zkCallback-11091-thread-1-processing-n:127.0.0.1:56865_solr) [n:127.0.0.1:56865_solr    ] o.a.s.c.c.ZkStateReader A live node change: [WatchedEvent state:SyncConnected type:NodeChildrenChanged path:/live_nodes], has occurred - updating... (live nodes size: [5])
   [junit4]   2> 3111271 WARN  (zkCallback-11091-thread-1-processing-n:127.0.0.1:56865_solr) [n:127.0.0.1:56865_solr    ] o.a.s.c.c.ZkStateReader ZooKeeper watch triggered, but Solr cannot talk to ZK: [KeeperErrorCode = Session expired for /live_nodes]
   [junit4]   2> 3111272 INFO  (zkCallback-11088-thread-2-processing-n:127.0.0.1:56860_solr) [n:127.0.0.1:56860_solr    ] o.a.s.c.c.ZkStateReader A live node change: [WatchedEvent state:SyncConnected type:NodeChildrenChanged path:/live_nodes], has occurred - updating... (live nodes size: [5])
   [junit4]   2> 3111271 INFO  (OverseerStateUpdate-96166066035294223-127.0.0.1:56861_solr-n_0000000000) [n:127.0.0.1:56861_solr    ] o.a.s.c.o.NodeMutator DownNode state invoked for node: 127.0.0.1:56865_solr
   [junit4]   2> 3111272 INFO  (TEST-BasicAuthIntegrationTest.testBasics-seed#[60105D025CD632A5]) [    ] o.e.j.s.h.ContextHandler Stopped o.e.j.s.ServletContextHandler@3bf61c20{/solr,null,UNAVAILABLE}
   [junit4]   2> 3111273 INFO  (zkCallback-11089-thread-1-processing-n:127.0.0.1:56857_solr) [n:127.0.0.1:56857_solr    ] o.a.s.c.c.ZkStateReader Updated live nodes from ZooKeeper... (5) -> (4)
   [junit4]   2> 3111273 INFO  (zkCallback-11090-thread-1-processing-n:127.0.0.1:56858_solr) [n:127.0.0.1:56858_solr    ] o.a.s.c.c.ZkStateReader Updated live nodes from ZooKeeper... (5) -> (4)
   [junit4]   2> 3111273 INFO  (zkCallback-11088-thread-2-processing-n:127.0.0.1:56860_solr) [n:127.0.0.1:56860_solr    ] o.a.s.c.c.ZkStateReader Updated live nodes from ZooKeeper... (5) -> (4)
   [junit4]   2> 3111275 INFO  (zkCallback-11092-thread-1-processing-n:127.0.0.1:56861_solr) [n:127.0.0.1:56861_solr    ] o.a.s.c.c.ZkStateReader Updated live nodes from ZooKeeper... (5) -> (4)
   [junit4]   2> 3111275 INFO  (zkCallback-11088-thread-1-processing-n:127.0.0.1:56860_solr) [n:127.0.0.1:56860_solr    ] o.a.s.c.LeaderElector Watching path /overseer_elect/election/96166066035294223-127.0.0.1:56861_solr-n_0000000000 to know if I could be the leader
   [junit4]   2> 3111275 INFO  (TEST-BasicAuthIntegrationTest.testBasics-seed#[60105D025CD632A5]) [    ] o.e.j.s.Server jetty-9.3.8.v20160314
   [junit4]   2> 3111278 INFO  (TEST-BasicAuthIntegrationTest.testBasics-seed#[60105D025CD632A5]) [    ] o.e.j.s.h.ContextHandler Started o.e.j.s.ServletContextHandler@3461e9e9{/solr,null,AVAILABLE}
   [junit4]   2> 3111278 INFO  (TEST-BasicAuthIntegrationTest.testBasics-seed#[60105D025CD632A5]) [    ] o.e.j.s.ServerConnector Started ServerConnector@8129b43{HTTP/1.1,[http/1.1]}{127.0.0.1:56879}
   [junit4]   2> 3111278 INFO  (TEST-BasicAuthIntegrationTest.testBasics-seed#[60105D025CD632A5]) [    ] o.e.j.s.Server Started @3119696ms
   [junit4]   2> 3111278 INFO  (TEST-BasicAuthIntegrationTest.testBasics-seed#[60105D025CD632A5]) [    ] o.a.s.c.s.e.JettySolrRunner Jetty properties: {hostContext=/solr, hostPort=56879}
   [junit4]   2> 3111278 INFO  (TEST-BasicAuthIntegrationTest.testBasics-seed#[60105D025CD632A5]) [    ] o.a.s.s.SolrDispatchFilter SolrDispatchFilter.init(): sun.misc.Launcher$AppClassLoader@4554617c
   [junit4]   2> 3111278 INFO  (TEST-BasicAuthIntegrationTest.testBasics-seed#[60105D025CD632A5]) [    ] o.a.s.c.SolrResourceLoader new SolrResourceLoader for directory: '/Users/jenkins/workspace/Lucene-Solr-master-MacOSX/solr/build/solr-core/test/J1/temp/solr.security.BasicAuthIntegrationTest_60105D025CD632A5-001/tempDir-001/node6'
   [junit4]   2> 3111279 INFO  (TEST-BasicAuthIntegrationTest.testBasics-seed#[60105D025CD632A5]) [    ] o.a.s.c.SolrResourceLoader JNDI not configured for solr (NoInitialContextEx)
   [junit4]   2> 3111279 INFO  (TEST-BasicAuthIntegrationTest.testBasics-seed#[60105D025CD632A5]) [    ] o.a.s.c.SolrResourceLoader solr home defaulted to 'solr/' (could not find system property or JNDI)
   [junit4]   2> 3111279 INFO  (TEST-BasicAuthIntegrationTest.testBasics-seed#[60105D025CD632A5]) [    ] o.a.s.c.c.SolrZkClient Using default ZkCredentialsProvider
   [junit4]   2> 3111280 INFO  (TEST-BasicAuthIntegrationTest.testBasics-seed#[60105D025CD632A5]) [    ] o.a.s.c.c.ConnectionManager Waiting for client to connect to ZooKeeper
   [junit4]   2> 3111295 INFO  (zkCallback-11100-thread-1) [    ] o.a.s.c.c.ConnectionManager Watcher org.apache.solr.common.cloud.ConnectionManager@d8ad931 name:ZooKeeperConnection Watcher:127.0.0.1:56854/solr got event WatchedEvent state:SyncConnected type:None path:null path:null type:None
   [junit4]   2> 3111295 INFO  (TEST-BasicAuthIntegrationTest.testBasics-seed#[60105D025CD632A5]) [    ] o.a.s.c.c.ConnectionManager Client is connected to ZooKeeper
   [junit4]   2> 3111295 INFO  (TEST-BasicAuthIntegrationTest.testBasics-seed#[60105D025CD632A5]) [    ] o.a.s.c.c.SolrZkClient Using default ZkACLProvider
   [junit4]   2> 3111296 INFO  (TEST-BasicAuthIntegrationTest.testBasics-seed#[60105D025CD632A5]) [    ] o.a.s.s.SolrDispatchFilter solr.xml found in ZooKeeper. Loading...
   [junit4]   2> 3111314 INFO  (TEST-BasicAuthIntegrationTest.testBasics-seed#[60105D025CD632A5]) [    ] o.a.s.c.CorePropertiesLocator Config-defined core root directory: /Users/jenkins/workspace/Lucene-Solr-master-MacOSX/solr/build/solr-core/test/J1/temp/solr.security.BasicAuthIntegrationTest_60105D025CD632A5-001/tempDir-001/node6/.
   [junit4]   2> 3111315 INFO  (TEST-BasicAuthIntegrationTest.testBasics-seed#[60105D025CD632A5]) [    ] o.a.s.c.CoreContainer New CoreContainer 913255426
   [junit4]   2> 3111315 INFO  (TEST-BasicAuthIntegrationTest.testBasics-seed#[60105D025CD632A5]) [    ] o.a.s.c.CoreContainer Loading cores into CoreContainer [instanceDir=/Users/jenkins/workspace/Lucene-Solr-master-MacOSX/solr/build/solr-core/test/J1/temp/solr.security.BasicAuthIntegrationTest_60105D025CD632A5-001/tempDir-001/node6]
   [junit4]   2> 3111315 WARN  (TEST-BasicAuthIntegrationTest.testBasics-seed#[60105D025CD632A5]) [    ] o.a.s.c.CoreContainer Couldn't add files from /Users/jenkins/workspace/Lucene-Solr-master-MacOSX/solr/build/solr-core/test/J1/temp/solr.security.BasicAuthIntegrationTest_60105D025CD632A5-001/tempDir-001/node6/lib to classpath: /Users/jenkins/workspace/Lucene-Solr-master-MacOSX/solr/build/solr-core/test/J1/temp/solr.security.BasicAuthIntegrationTest_60105D025CD632A5-001/tempDir-001/node6/lib
   [junit4]   2> 3111316 INFO  (TEST-BasicAuthIntegrationTest.testBasics-seed#[60105D025CD632A5]) [    ] o.a.s.h.c.HttpShardHandlerFactory created with socketTimeout : 90000,urlScheme : ,connTimeout : 15000,maxConnectionsPerHost : 20,maxConnections : 10000,corePoolSize : 0,maximumPoolSize : 2147483647,maxThreadIdleTime : 5,sizeOfQueue : -1,fairnessPolicy : false,
   [junit4]   2> 3111317 INFO  (TEST-BasicAuthIntegrationTest.testBasics-seed#[60105D025CD632A5]) [    ] o.a.s.u.UpdateShardHandler Created UpdateShardHandler HTTP client with params: socketTimeout=340000&connTimeout=45000&maxConnections=100000&maxConnectionsPerHost=100000
   [junit4]   2> 3111317 INFO  (TEST-BasicAuthIntegrationTest.testBasics-seed#[60105D025CD632A5]) [    ] o.a.s.l.LogWatcher SLF4J impl is org.slf4j.impl.Log4jLoggerFactory
   [junit4]   2> 3111318 INFO  (TEST-BasicAuthIntegrationTest.testBasics-seed#[60105D025CD632A5]) [    ] o.a.s.l.LogWatcher Registering Log Listener [Log4j (org.slf4j.impl.Log4jLoggerFactory)]
   [junit4]   2> 3111318 INFO  (TEST-BasicAuthIntegrationTest.testBasics-seed#[60105D025CD632A5]) [    ] o.a.s.c.ZkContainer Zookeeper client=127.0.0.1:56854/solr
   [junit4]   2> 3111318 INFO  (TEST-BasicAuthIntegrationTest.testBasics-seed#[60105D025CD632A5]) [    ] o.a.s.c.ZkController zkHost includes chroot
   [junit4]   2> 3111318 INFO  (TEST-BasicAuthIntegrationTest.testBasics-seed#[60105D025CD632A5]) [    ] o.a.s.c.c.SolrZkClient Using default ZkCredentialsProvider
   [junit4]   2> 3111318 INFO  (TEST-BasicAuthIntegrationTest.testBasics-seed#[60105D025CD632A5]) [    ] o.a.s.c.c.ConnectionManager Waiting for client to connect to ZooKeeper
   [junit4]   2> 3111321 INFO  (zkCallback-11103-thread-1) [    ] o.a.s.c.c.ConnectionManager Watcher org.apache.solr.common.cloud.ConnectionManager@6c1c3e3b name:ZooKeeperConnection Watcher:127.0.0.1:56854 got event WatchedEvent state:SyncConnected type:None path:null path:null type:None
   [junit4]   2> 3111321 INFO  (TEST-BasicAuthIntegrationTest.testBasics-seed#[60105D025CD632A5]) [    ] o.a.s.c.c.ConnectionManager Client is connected to ZooKeeper
   [junit4]   2> 3111322 INFO  (TEST-BasicAuthIntegrationTest.testBasics-seed#[60105D025CD632A5]) [    ] o.a.s.c.c.SolrZkClient Using default ZkACLProvider
   [junit4]   2> 3111325 INFO  (TEST-BasicAuthIntegrationTest.testBasics-seed#[60105D025CD632A5]) [n:127.0.0.1:56879_solr    ] o.a.s.c.ZkController Added new OnReconnect listener org.apache.solr.cloud.ZkController$$Lambda$9/625822907@6cd77366
   [junit4]   2> 3111325 INFO  (TEST-BasicAuthIntegrationTest.testBasics-seed#[60105D025CD632A5]) [n:127.0.0.1:56879_solr    ] o.a.s.c.c.ConnectionManager Waiting for client to connect to ZooKeeper
   [junit4]   2> 3111328 INFO  (zkCallback-11104-thread-1-processing-n:127.0.0.1:56879_solr) [n:127.0.0.1:56879_solr    ] o.a.s.c.c.ConnectionManager Watcher org.apache.solr.common.cloud.ConnectionManager@11869c65 name:ZooKeeperConnection Watcher:127.0.0.1:56854/solr got event WatchedEvent state:SyncConnected type:None path:null path:null type:None
   [junit4]   2> 3111328 INFO  (TEST-BasicAuthIntegrationTest.testBasics-seed#[60105D025CD632A5]) [n:127.0.0.1:56879_solr    ] o.a.s.c.c.ConnectionManager Client is connected to ZooKeeper
   [junit4]   2> 3111351 INFO  (TEST-BasicAuthIntegrationTest.testBasics-seed#[60105D025CD632A5]) [n:127.0.0.1:56879_solr    ] o.a.s.c.c.ZkStateReader Updating cluster state from ZooKeeper... 
   [junit4]   2> 3111353 INFO  (TEST-BasicAuthIntegrationTest.testBasics-seed#[60105D025CD632A5]) [n:127.0.0.1:56879_solr    ] o.a.s.c.c.ZkStateReader Loaded empty cluster properties
   [junit4]   2> 3111354 INFO  (TEST-BasicAuthIntegrationTest.testBasics-seed#[60105D025CD632A5]) [n:127.0.0.1:56879_solr    ] o.a.s.c.c.ZkStateReader Updated live nodes from ZooKeeper... (0) -> (4)
   [junit4]   2> 3111359 INFO  (TEST-BasicAuthIntegrationTest.testBasics-seed#[60105D025CD632A5]) [n:127.0.0.1:56879_solr    ] o.a.s.c.Overseer Overseer (id=null) closing
   [junit4]   2> 3111375 INFO  (TEST-BasicAuthIntegrationTest.testBasics-seed#[60105D025CD632A5]) [n:127.0.0.1:56879_solr    ] o.a.s.c.LeaderElector Joined leadership election with path: /overseer_elect/election/96166066035294227-127.0.0.1:56879_solr-n_0000000005
   [junit4]   2> 3111376 INFO  (TEST-BasicAuthIntegrationTest.testBasics-seed#[60105D025CD632A5]) [n:127.0.0.1:56879_solr    ] o.a.s.c.LeaderElector Watching path /overseer_elect/election/96166066035294220-127.0.0.1:56857_solr-n_0000000004 to know if I could be the leader
   [junit4]   2> 3111377 INFO  (TEST-BasicAuthIntegrationTest.testBasics-seed#[60105D025CD632A5]) [n:127.0.0.1:56879_solr    ] o.a.s.c.ZkController Publish node=127.0.0.1:56879_solr as DOWN
   [junit4]   2> 3111409 INFO  (TEST-BasicAuthIntegrationTest.testBasics-seed#[60105D025CD632A5]) [n:127.0.0.1:56879_solr    ] o.a.s.c.ZkController Register node as live in ZooKeeper:/live_nodes/127.0.0.1:56879_solr
   [junit4]   2> 3111409 INFO  (TEST-BasicAuthIntegrationTest.testBasics-seed#[60105D025CD632A5]) [n:127.0.0.1:56879_solr    ] o.a.s.c.c.SolrZkClient makePath: /live_nodes/127.0.0.1:56879_solr
   [junit4]   2> 3111410 INFO  (OverseerStateUpdate-96166066035294223-127.0.0.1:56861_solr-n_0000000000) [n:127.0.0.1:56861_solr    ] o.a.s.c.Overseer processMessage: queueSize: 1, message = {
   [junit4]   2>   "operation":"downnode",
   [junit4]   2>   "node_name":"127.0.0.1:56879_solr"} current state version: 0
   [junit4]   2> 3111410 INFO  (OverseerStateUpdate-961

[...truncated too long message...]

   [junit4]   2> 	at org.apache.lucene.util.TestRuleAssertionsRequired$1.evaluate(TestRuleAssertionsRequired.java:53)
   [junit4]   2> 	at org.apache.lucene.util.TestRuleMarkFailure$1.evaluate(TestRuleMarkFailure.java:47)
   [junit4]   2> 	at org.apache.lucene.util.TestRuleIgnoreAfterMaxFailures$1.evaluate(TestRuleIgnoreAfterMaxFailures.java:64)
   [junit4]   2> 	at org.apache.lucene.util.TestRuleIgnoreTestSuites$1.evaluate(TestRuleIgnoreTestSuites.java:54)
   [junit4]   2> 	at com.carrotsearch.randomizedtesting.rules.StatementAdapter.evaluate(StatementAdapter.java:36)
   [junit4]   2> 	at com.carrotsearch.randomizedtesting.ThreadLeakControl$StatementRunner.run(ThreadLeakControl.java:367)
   [junit4]   2> 	at java.lang.Thread.run(Thread.java:745)
   [junit4]   2> 
   [junit4]   2> NOTE: test params are: codec=Asserting(Lucene62): {}, docValues:{}, maxPointsInLeafNode=1449, maxMBSortInHeap=7.210853884374522, sim=ClassicSimilarity, locale=en-IE, timezone=America/Mexico_City
   [junit4]   2> NOTE: Mac OS X 10.11.5 x86_64/Oracle Corporation 1.8.0_92 (64-bit)/cpus=3,threads=1,free=248855816,total=518979584
   [junit4]   2> NOTE: All tests run in this JVM: [PKIAuthenticationIntegrationTest, TestSolrQueryResponse, TestSimpleTrackingShardHandler, DebugComponentTest, WrapperMergePolicyFactoryTest, CleanupOldIndexTest, LeaderInitiatedRecoveryOnShardRestartTest, TestAddFieldRealTimeGet, ConfigSetsAPITest, TestBulkSchemaConcurrent, TestManagedSchemaAPI, TestDefaultStatsCache, TestJsonRequest, TestLMJelinekMercerSimilarityFactory, TestLeaderElectionZkExpiry, TestMacros, TestCollectionAPI, BadIndexSchemaTest, ShowFileRequestHandlerTest, TermVectorComponentDistributedTest, AtomicUpdatesTest, DataDrivenBlockJoinTest, TestCharFilters, TestAtomicUpdateErrorCases, SolrCmdDistributorTest, TestGeoJSONResponseWriter, BasicFunctionalityTest, ForceLeaderTest, InfoHandlerTest, TestJoin, TestIndexSearcher, TestZkChroot, SearchHandlerTest, UpdateRequestProcessorFactoryTest, TriLevelCompositeIdRoutingTest, TestDownShardTolerantSearch, CursorMarkTest, TermVectorComponentTest, SolrIndexSplitterTest, SuggesterWFSTTest, TestSolrIndexConfig, LoggingHandlerTest, LukeRequestHandlerTest, HdfsUnloadDistributedZkTest, TestRecovery, TestMiniSolrCloudClusterSSL, TestInitParams, DirectSolrConnectionTest, OutputWriterTest, TestMiniSolrCloudClusterBase, TestFilteredDocIdSet, TestCrossCoreJoin, DistributedQueryComponentCustomSortTest, ZkSolrClientTest, TestCollationFieldDocValues, TestRequestStatusCollectionAPI, TestIndexingPerformance, TestSolrCoreProperties, DirectUpdateHandlerOptimizeTest, TestSubQueryTransformerCrossCore, TestTestInjection, TestScoreJoinQPNoScore, TestUseDocValuesAsStored, TestTolerantUpdateProcessorRandomCloud, TestCustomSort, DistributedQueueTest, CdcrVersionReplicationTest, TestQueryWrapperFilter, BlockJoinFacetDistribTest, RecoveryAfterSoftCommitTest, HdfsBasicDistributedZk2Test, SynonymTokenizerTest, TestSortByMinMaxFunction, TestPerFieldSimilarity, TestReplicaProperties, TestHashQParserPlugin, TestXmlQParser, CurrencyFieldOpenExchangeTest, TestRangeQuery, TestFieldResource, CoreAdminHandlerTest, BooleanFieldTest, DeleteStatusTest, WordBreakSolrSpellCheckerTest, DistanceFunctionTest, ConjunctionSolrSpellCheckerTest, AnalyticsMergeStrategyTest, TestFieldCacheWithThreads, TestStressUserVersions, TestPKIAuthenticationPlugin, TestSolrConfigHandler, SaslZkACLProviderTest, TestDFISimilarityFactory, OpenCloseCoreStressTest, TestSolrFieldCacheMBean, TestBM25SimilarityFactory, TestDynamicFieldResource, TestSchemaVersionResource, BigEndianAscendingWordSerializerTest, TestWriterPerf, TestExactSharedStatsCache, TestBlendedInfixSuggestions, CollectionReloadTest, SpatialHeatmapFacetsTest, TestBinaryField, IndexSchemaRuntimeFieldTest, TestUtils, TestCloudBackupRestore, TestSolrQueryParserDefaultOperatorResource, TestSchemaResource, CollectionTooManyReplicasTest, TestFuzzyAnalyzedSuggestions, OverseerModifyCollectionTest, SimpleCollectionCreateDeleteTest, OverseerStatusTest, CacheHeaderTest, TestReversedWildcardFilterFactory, EnumFieldTest, BinaryUpdateRequestHandlerTest, TestCloudInspectUtil, TestQueryUtils, DefaultValueUpdateProcessorTest, TestUniqueKeyFieldResource, TestFieldCacheSortRandom, HdfsThreadLeakTest, BlockJoinFacetSimpleTest, FieldMutatingUpdateProcessorTest, SuggesterTSTTest, TestBackupRepositoryFactory, FieldAnalysisRequestHandlerTest, OverriddenZkACLAndCredentialsProvidersTest, UniqFieldsUpdateProcessorFactoryTest, SpellingQueryConverterTest, ChaosMonkeySafeLeaderTest, TestHdfsBackupRestoreCore, TestSuggestSpellingConverter, TestManagedResource, TestConfigSets, TestCSVResponseWriter, TestRTGBase, TestFastOutputStream, DistanceUnitsTest, TestSolr4Spatial, TolerantUpdateProcessorTest, CopyFieldTest, SolrInfoMBeanTest, TestSolrDeletionPolicy2, TestOmitPositions, AliasIntegrationTest, HdfsLockFactoryTest, TestBlobHandler, TestRecoveryHdfs, BasicDistributedZkTest, BasicDistributedZk2Test, CollectionsAPIDistributedZkTest, LeaderElectionIntegrationTest, BasicZkTest, ClusterStateUpdateTest, TestRandomFaceting, ZkCLITest, TestFaceting, TestHashPartitioner, HardAutoCommitTest, SolrCoreTest, StatsComponentTest, TestBadConfig, HighlighterTest, SoftAutoCommitTest, DocValuesTest, XsltUpdateRequestHandlerTest, TestSurroundQueryParser, TestQueryTypes, RequestHandlersTest, PathHierarchyTokenizerFactoryTest, FastVectorHighlighterTest, SolrPluginUtilsTest, TestCollationField, MBeansHandlerTest, TestPartialUpdateDeduplication, PingRequestHandlerTest, TestMergePolicyConfig, MultiTermTest, NumericFieldsTest, MinimalSchemaTest, TestElisionMultitermQuery, ExternalFileFieldSortTest, NotRequiredUniqueKeyTest, TestLuceneMatchVersion, SpellPossibilityIteratorTest, TestCodecSupport, EchoParamsTest, TestDFRSimilarityFactory, TestIBSimilarityFactory, TestFastWriter, ResourceLoaderTest, OpenExchangeRatesOrgProviderTest, URLClassifyProcessorTest, PluginInfoTest, TestFastLRUCache, DateMathParserTest, ChaosMonkeyNothingIsSafeTest, TestDistributedMissingSort, BaseCdcrDistributedZkTest, CdcrReplicationDistributedZkTest, CdcrReplicationHandlerTest, CdcrRequestHandlerTest, CloudExitableDirectoryReaderTest, CollectionsAPIAsyncDistributedZkTest, CreateCollectionCleanupTest, CustomCollectionTest, DistribDocExpirationUpdateProcessorTest, DistributedVersionInfoTest, LeaderFailoverAfterPartitionTest, LeaderInitiatedRecoveryOnCommitTest, MultiThreadedOCPTest, SharedFSAutoReplicaFailoverTest, SolrCloudExampleTest, TestCryptoKeys, TestLockTree, TestMiniSolrCloudCluster, TestRequestForwarding, TestShortCircuitedRequests, TestStressLiveNodes, TlogReplayBufferedWhileIndexingTest, HdfsChaosMonkeyNothingIsSafeTest, HdfsChaosMonkeySafeLeaderTest, HdfsCollectionsAPIDistributedZkTest, HdfsNNFailoverTest, HdfsRecoverLeaseTest, HdfsRecoveryZkTest, HdfsRestartWhileUpdatingTest, HdfsSyncSliceTest, HdfsWriteToMultipleCollectionsTest, StressHdfsTest, TestClusterStateMutator, ZkStateReaderTest, RulesTest, TestSolrConfigHandlerConcurrent, DistributedFacetPivotLongTailTest, DistributedSuggestComponentTest, TestDistributedStatsComponentCardinality, TestDefaultSearchFieldResource, TestDynamicFieldCollectionResource, TestFieldTypeCollectionResource, TestFieldTypeResource, ChangedSchemaMergeTest, DateRangeFieldTest, SpatialRPTFieldTypeTest, AnalyticsQueryTest, RankQueryTest, SortSpecParsingTest, TestCollapseQParserPlugin, TestFieldSortValues, TestMaxScoreQueryParser, TestNoOpRegenerator, TestRandomCollapseQParserPlugin, TestOrdValues, BJQParserTest, BlockJoinFacetRandomTest, SimpleMLTQParserTest, TestNonDefinedSimilarityFactory, TestPerFieldSimilarityWithDefaultOverride, TestExactStatsCache, BasicAuthIntegrationTest, BufferStoreTest, TestDocTermOrds, TestFieldCache, TestFieldCacheReopen, TestFieldCacheSanityChecker, TestFieldCacheVsDocValues, TestLegacyFieldCache, TestNumericTerms32, TestNumericTerms64, DocExpirationUpdateProcessorFactoryTest]
   [junit4]   2> NOTE: reproduce with: ant test  -Dtestcase=DocExpirationUpdateProcessorFactoryTest -Dtests.seed=60105D025CD632A5 -Dtests.slow=true -Dtests.locale=en-IE -Dtests.timezone=America/Mexico_City -Dtests.asserts=true -Dtests.file.encoding=UTF-8
   [junit4] ERROR   0.00s J1 | DocExpirationUpdateProcessorFactoryTest (suite) <<<
   [junit4]    > Throwable #1: java.lang.AssertionError: ObjectTracker found 1 object(s) that were not released!!! [InternalHttpClient]
   [junit4]    > 	at __randomizedtesting.SeedInfo.seed([60105D025CD632A5]:0)
   [junit4]    > 	at org.apache.solr.SolrTestCaseJ4.teardownTestCases(SolrTestCaseJ4.java:256)
   [junit4]    > 	at java.lang.Thread.run(Thread.java:745)
   [junit4] Completed [617/617 (2!)] on J1 in 6.35s, 5 tests, 1 failure <<< FAILURES!

[...truncated 12 lines...]
BUILD FAILED
/Users/jenkins/workspace/Lucene-Solr-master-MacOSX/build.xml:740: The following error occurred while executing this line:
/Users/jenkins/workspace/Lucene-Solr-master-MacOSX/build.xml:684: The following error occurred while executing this line:
/Users/jenkins/workspace/Lucene-Solr-master-MacOSX/build.xml:59: The following error occurred while executing this line:
/Users/jenkins/workspace/Lucene-Solr-master-MacOSX/solr/build.xml:233: The following error occurred while executing this line:
/Users/jenkins/workspace/Lucene-Solr-master-MacOSX/solr/common-build.xml:530: The following error occurred while executing this line:
/Users/jenkins/workspace/Lucene-Solr-master-MacOSX/lucene/common-build.xml:1427: The following error occurred while executing this line:
/Users/jenkins/workspace/Lucene-Solr-master-MacOSX/lucene/common-build.xml:984: There were test failures: 617 suites (10 ignored), 2584 tests, 2 suite-level errors, 1 error, 123 ignored (72 assumptions) [seed: 60105D025CD632A5]

Total time: 79 minutes 46 seconds
Build step 'Invoke Ant' marked build as failure
Archiving artifacts
[WARNINGS] Skipping publisher since build result is FAILURE
Recording test results
Email was triggered for: Failure - Any
Sending email for trigger: Failure - Any



Mime
View raw message