lucene-dev mailing list archives

Site index · List index
Message view « Date » · « Thread »
Top « Date » · « Thread »
From Policeman Jenkins Server <jenk...@thetaphi.de>
Subject [JENKINS-EA] Lucene-Solr-6.x-Linux (32bit/jdk-9-ea+125) - Build # 1052 - Failure!
Date Mon, 04 Jul 2016 18:27:39 GMT
Build: http://jenkins.thetaphi.de/job/Lucene-Solr-6.x-Linux/1052/
Java: 32bit/jdk-9-ea+125 -client -XX:+UseConcMarkSweepGC

4 tests failed.
FAILED:  junit.framework.TestSuite.org.apache.solr.cloud.CollectionsAPIDistributedZkTest

Error Message:
5 threads leaked from SUITE scope at org.apache.solr.cloud.CollectionsAPIDistributedZkTest:     1) Thread[id=3933, name=zkCallback-504-thread-2, state=TIMED_WAITING, group=TGRP-CollectionsAPIDistributedZkTest]         at jdk.internal.misc.Unsafe.park(java.base@9-ea/Native Method)         at java.util.concurrent.locks.LockSupport.parkNanos(java.base@9-ea/LockSupport.java:230)         at java.util.concurrent.SynchronousQueue$TransferStack.awaitFulfill(java.base@9-ea/SynchronousQueue.java:461)         at java.util.concurrent.SynchronousQueue$TransferStack.transfer(java.base@9-ea/SynchronousQueue.java:362)         at java.util.concurrent.SynchronousQueue.poll(java.base@9-ea/SynchronousQueue.java:937)         at java.util.concurrent.ThreadPoolExecutor.getTask(java.base@9-ea/ThreadPoolExecutor.java:1082)         at java.util.concurrent.ThreadPoolExecutor.runWorker(java.base@9-ea/ThreadPoolExecutor.java:1143)         at java.util.concurrent.ThreadPoolExecutor$Worker.run(java.base@9-ea/ThreadPoolExecutor.java:632)         at java.lang.Thread.run(java.base@9-ea/Thread.java:843)    2) Thread[id=3863, name=TEST-CollectionsAPIDistributedZkTest.test-seed#[6253143A87F2A51]-EventThread, state=WAITING, group=TGRP-CollectionsAPIDistributedZkTest]         at jdk.internal.misc.Unsafe.park(java.base@9-ea/Native Method)         at java.util.concurrent.locks.LockSupport.park(java.base@9-ea/LockSupport.java:190)         at java.util.concurrent.locks.AbstractQueuedSynchronizer$ConditionObject.await(java.base@9-ea/AbstractQueuedSynchronizer.java:2064)         at java.util.concurrent.LinkedBlockingQueue.take(java.base@9-ea/LinkedBlockingQueue.java:442)         at org.apache.zookeeper.ClientCnxn$EventThread.run(ClientCnxn.java:494)    3) Thread[id=3864, name=zkCallback-504-thread-1, state=TIMED_WAITING, group=TGRP-CollectionsAPIDistributedZkTest]         at jdk.internal.misc.Unsafe.park(java.base@9-ea/Native Method)         at java.util.concurrent.locks.LockSupport.parkNanos(java.base@9-ea/LockSupport.java:230)         at java.util.concurrent.SynchronousQueue$TransferStack.awaitFulfill(java.base@9-ea/SynchronousQueue.java:461)         at java.util.concurrent.SynchronousQueue$TransferStack.transfer(java.base@9-ea/SynchronousQueue.java:362)         at java.util.concurrent.SynchronousQueue.poll(java.base@9-ea/SynchronousQueue.java:937)         at java.util.concurrent.ThreadPoolExecutor.getTask(java.base@9-ea/ThreadPoolExecutor.java:1082)         at java.util.concurrent.ThreadPoolExecutor.runWorker(java.base@9-ea/ThreadPoolExecutor.java:1143)         at java.util.concurrent.ThreadPoolExecutor$Worker.run(java.base@9-ea/ThreadPoolExecutor.java:632)         at java.lang.Thread.run(java.base@9-ea/Thread.java:843)    4) Thread[id=3862, name=TEST-CollectionsAPIDistributedZkTest.test-seed#[6253143A87F2A51]-SendThread(127.0.0.1:41826), state=TIMED_WAITING, group=TGRP-CollectionsAPIDistributedZkTest]         at java.lang.Thread.sleep(java.base@9-ea/Native Method)         at org.apache.zookeeper.ClientCnxn$SendThread.run(ClientCnxn.java:994)    5) Thread[id=3934, name=zkCallback-504-thread-3, state=TIMED_WAITING, group=TGRP-CollectionsAPIDistributedZkTest]         at jdk.internal.misc.Unsafe.park(java.base@9-ea/Native Method)         at java.util.concurrent.locks.LockSupport.parkNanos(java.base@9-ea/LockSupport.java:230)         at java.util.concurrent.SynchronousQueue$TransferStack.awaitFulfill(java.base@9-ea/SynchronousQueue.java:461)         at java.util.concurrent.SynchronousQueue$TransferStack.transfer(java.base@9-ea/SynchronousQueue.java:362)         at java.util.concurrent.SynchronousQueue.poll(java.base@9-ea/SynchronousQueue.java:937)         at java.util.concurrent.ThreadPoolExecutor.getTask(java.base@9-ea/ThreadPoolExecutor.java:1082)         at java.util.concurrent.ThreadPoolExecutor.runWorker(java.base@9-ea/ThreadPoolExecutor.java:1143)         at java.util.concurrent.ThreadPoolExecutor$Worker.run(java.base@9-ea/ThreadPoolExecutor.java:632)         at java.lang.Thread.run(java.base@9-ea/Thread.java:843)

Stack Trace:
com.carrotsearch.randomizedtesting.ThreadLeakError: 5 threads leaked from SUITE scope at org.apache.solr.cloud.CollectionsAPIDistributedZkTest: 
   1) Thread[id=3933, name=zkCallback-504-thread-2, state=TIMED_WAITING, group=TGRP-CollectionsAPIDistributedZkTest]
        at jdk.internal.misc.Unsafe.park(java.base@9-ea/Native Method)
        at java.util.concurrent.locks.LockSupport.parkNanos(java.base@9-ea/LockSupport.java:230)
        at java.util.concurrent.SynchronousQueue$TransferStack.awaitFulfill(java.base@9-ea/SynchronousQueue.java:461)
        at java.util.concurrent.SynchronousQueue$TransferStack.transfer(java.base@9-ea/SynchronousQueue.java:362)
        at java.util.concurrent.SynchronousQueue.poll(java.base@9-ea/SynchronousQueue.java:937)
        at java.util.concurrent.ThreadPoolExecutor.getTask(java.base@9-ea/ThreadPoolExecutor.java:1082)
        at java.util.concurrent.ThreadPoolExecutor.runWorker(java.base@9-ea/ThreadPoolExecutor.java:1143)
        at java.util.concurrent.ThreadPoolExecutor$Worker.run(java.base@9-ea/ThreadPoolExecutor.java:632)
        at java.lang.Thread.run(java.base@9-ea/Thread.java:843)
   2) Thread[id=3863, name=TEST-CollectionsAPIDistributedZkTest.test-seed#[6253143A87F2A51]-EventThread, state=WAITING, group=TGRP-CollectionsAPIDistributedZkTest]
        at jdk.internal.misc.Unsafe.park(java.base@9-ea/Native Method)
        at java.util.concurrent.locks.LockSupport.park(java.base@9-ea/LockSupport.java:190)
        at java.util.concurrent.locks.AbstractQueuedSynchronizer$ConditionObject.await(java.base@9-ea/AbstractQueuedSynchronizer.java:2064)
        at java.util.concurrent.LinkedBlockingQueue.take(java.base@9-ea/LinkedBlockingQueue.java:442)
        at org.apache.zookeeper.ClientCnxn$EventThread.run(ClientCnxn.java:494)
   3) Thread[id=3864, name=zkCallback-504-thread-1, state=TIMED_WAITING, group=TGRP-CollectionsAPIDistributedZkTest]
        at jdk.internal.misc.Unsafe.park(java.base@9-ea/Native Method)
        at java.util.concurrent.locks.LockSupport.parkNanos(java.base@9-ea/LockSupport.java:230)
        at java.util.concurrent.SynchronousQueue$TransferStack.awaitFulfill(java.base@9-ea/SynchronousQueue.java:461)
        at java.util.concurrent.SynchronousQueue$TransferStack.transfer(java.base@9-ea/SynchronousQueue.java:362)
        at java.util.concurrent.SynchronousQueue.poll(java.base@9-ea/SynchronousQueue.java:937)
        at java.util.concurrent.ThreadPoolExecutor.getTask(java.base@9-ea/ThreadPoolExecutor.java:1082)
        at java.util.concurrent.ThreadPoolExecutor.runWorker(java.base@9-ea/ThreadPoolExecutor.java:1143)
        at java.util.concurrent.ThreadPoolExecutor$Worker.run(java.base@9-ea/ThreadPoolExecutor.java:632)
        at java.lang.Thread.run(java.base@9-ea/Thread.java:843)
   4) Thread[id=3862, name=TEST-CollectionsAPIDistributedZkTest.test-seed#[6253143A87F2A51]-SendThread(127.0.0.1:41826), state=TIMED_WAITING, group=TGRP-CollectionsAPIDistributedZkTest]
        at java.lang.Thread.sleep(java.base@9-ea/Native Method)
        at org.apache.zookeeper.ClientCnxn$SendThread.run(ClientCnxn.java:994)
   5) Thread[id=3934, name=zkCallback-504-thread-3, state=TIMED_WAITING, group=TGRP-CollectionsAPIDistributedZkTest]
        at jdk.internal.misc.Unsafe.park(java.base@9-ea/Native Method)
        at java.util.concurrent.locks.LockSupport.parkNanos(java.base@9-ea/LockSupport.java:230)
        at java.util.concurrent.SynchronousQueue$TransferStack.awaitFulfill(java.base@9-ea/SynchronousQueue.java:461)
        at java.util.concurrent.SynchronousQueue$TransferStack.transfer(java.base@9-ea/SynchronousQueue.java:362)
        at java.util.concurrent.SynchronousQueue.poll(java.base@9-ea/SynchronousQueue.java:937)
        at java.util.concurrent.ThreadPoolExecutor.getTask(java.base@9-ea/ThreadPoolExecutor.java:1082)
        at java.util.concurrent.ThreadPoolExecutor.runWorker(java.base@9-ea/ThreadPoolExecutor.java:1143)
        at java.util.concurrent.ThreadPoolExecutor$Worker.run(java.base@9-ea/ThreadPoolExecutor.java:632)
        at java.lang.Thread.run(java.base@9-ea/Thread.java:843)
	at __randomizedtesting.SeedInfo.seed([6253143A87F2A51]:0)


FAILED:  junit.framework.TestSuite.org.apache.solr.cloud.CollectionsAPIDistributedZkTest

Error Message:
There are still zombie threads that couldn't be terminated:    1) Thread[id=3933, name=zkCallback-504-thread-2, state=TIMED_WAITING, group=TGRP-CollectionsAPIDistributedZkTest]         at jdk.internal.misc.Unsafe.park(java.base@9-ea/Native Method)         at java.util.concurrent.locks.LockSupport.parkNanos(java.base@9-ea/LockSupport.java:230)         at java.util.concurrent.SynchronousQueue$TransferStack.awaitFulfill(java.base@9-ea/SynchronousQueue.java:461)         at java.util.concurrent.SynchronousQueue$TransferStack.transfer(java.base@9-ea/SynchronousQueue.java:362)         at java.util.concurrent.SynchronousQueue.poll(java.base@9-ea/SynchronousQueue.java:937)         at java.util.concurrent.ThreadPoolExecutor.getTask(java.base@9-ea/ThreadPoolExecutor.java:1082)         at java.util.concurrent.ThreadPoolExecutor.runWorker(java.base@9-ea/ThreadPoolExecutor.java:1143)         at java.util.concurrent.ThreadPoolExecutor$Worker.run(java.base@9-ea/ThreadPoolExecutor.java:632)         at java.lang.Thread.run(java.base@9-ea/Thread.java:843)    2) Thread[id=3864, name=zkCallback-504-thread-1, state=TIMED_WAITING, group=TGRP-CollectionsAPIDistributedZkTest]         at jdk.internal.misc.Unsafe.park(java.base@9-ea/Native Method)         at java.util.concurrent.locks.LockSupport.parkNanos(java.base@9-ea/LockSupport.java:230)         at java.util.concurrent.SynchronousQueue$TransferStack.awaitFulfill(java.base@9-ea/SynchronousQueue.java:461)         at java.util.concurrent.SynchronousQueue$TransferStack.transfer(java.base@9-ea/SynchronousQueue.java:362)         at java.util.concurrent.SynchronousQueue.poll(java.base@9-ea/SynchronousQueue.java:937)         at java.util.concurrent.ThreadPoolExecutor.getTask(java.base@9-ea/ThreadPoolExecutor.java:1082)         at java.util.concurrent.ThreadPoolExecutor.runWorker(java.base@9-ea/ThreadPoolExecutor.java:1143)         at java.util.concurrent.ThreadPoolExecutor$Worker.run(java.base@9-ea/ThreadPoolExecutor.java:632)         at java.lang.Thread.run(java.base@9-ea/Thread.java:843)    3) Thread[id=3862, name=TEST-CollectionsAPIDistributedZkTest.test-seed#[6253143A87F2A51]-SendThread(127.0.0.1:41826), state=TIMED_WAITING, group=TGRP-CollectionsAPIDistributedZkTest]         at java.lang.Thread.sleep(java.base@9-ea/Native Method)         at org.apache.zookeeper.ClientCnxn$SendThread.run(ClientCnxn.java:994)    4) Thread[id=3934, name=zkCallback-504-thread-3, state=TIMED_WAITING, group=TGRP-CollectionsAPIDistributedZkTest]         at jdk.internal.misc.Unsafe.park(java.base@9-ea/Native Method)         at java.util.concurrent.locks.LockSupport.parkNanos(java.base@9-ea/LockSupport.java:230)         at java.util.concurrent.SynchronousQueue$TransferStack.awaitFulfill(java.base@9-ea/SynchronousQueue.java:461)         at java.util.concurrent.SynchronousQueue$TransferStack.transfer(java.base@9-ea/SynchronousQueue.java:362)         at java.util.concurrent.SynchronousQueue.poll(java.base@9-ea/SynchronousQueue.java:937)         at java.util.concurrent.ThreadPoolExecutor.getTask(java.base@9-ea/ThreadPoolExecutor.java:1082)         at java.util.concurrent.ThreadPoolExecutor.runWorker(java.base@9-ea/ThreadPoolExecutor.java:1143)         at java.util.concurrent.ThreadPoolExecutor$Worker.run(java.base@9-ea/ThreadPoolExecutor.java:632)         at java.lang.Thread.run(java.base@9-ea/Thread.java:843)

Stack Trace:
com.carrotsearch.randomizedtesting.ThreadLeakError: There are still zombie threads that couldn't be terminated:
   1) Thread[id=3933, name=zkCallback-504-thread-2, state=TIMED_WAITING, group=TGRP-CollectionsAPIDistributedZkTest]
        at jdk.internal.misc.Unsafe.park(java.base@9-ea/Native Method)
        at java.util.concurrent.locks.LockSupport.parkNanos(java.base@9-ea/LockSupport.java:230)
        at java.util.concurrent.SynchronousQueue$TransferStack.awaitFulfill(java.base@9-ea/SynchronousQueue.java:461)
        at java.util.concurrent.SynchronousQueue$TransferStack.transfer(java.base@9-ea/SynchronousQueue.java:362)
        at java.util.concurrent.SynchronousQueue.poll(java.base@9-ea/SynchronousQueue.java:937)
        at java.util.concurrent.ThreadPoolExecutor.getTask(java.base@9-ea/ThreadPoolExecutor.java:1082)
        at java.util.concurrent.ThreadPoolExecutor.runWorker(java.base@9-ea/ThreadPoolExecutor.java:1143)
        at java.util.concurrent.ThreadPoolExecutor$Worker.run(java.base@9-ea/ThreadPoolExecutor.java:632)
        at java.lang.Thread.run(java.base@9-ea/Thread.java:843)
   2) Thread[id=3864, name=zkCallback-504-thread-1, state=TIMED_WAITING, group=TGRP-CollectionsAPIDistributedZkTest]
        at jdk.internal.misc.Unsafe.park(java.base@9-ea/Native Method)
        at java.util.concurrent.locks.LockSupport.parkNanos(java.base@9-ea/LockSupport.java:230)
        at java.util.concurrent.SynchronousQueue$TransferStack.awaitFulfill(java.base@9-ea/SynchronousQueue.java:461)
        at java.util.concurrent.SynchronousQueue$TransferStack.transfer(java.base@9-ea/SynchronousQueue.java:362)
        at java.util.concurrent.SynchronousQueue.poll(java.base@9-ea/SynchronousQueue.java:937)
        at java.util.concurrent.ThreadPoolExecutor.getTask(java.base@9-ea/ThreadPoolExecutor.java:1082)
        at java.util.concurrent.ThreadPoolExecutor.runWorker(java.base@9-ea/ThreadPoolExecutor.java:1143)
        at java.util.concurrent.ThreadPoolExecutor$Worker.run(java.base@9-ea/ThreadPoolExecutor.java:632)
        at java.lang.Thread.run(java.base@9-ea/Thread.java:843)
   3) Thread[id=3862, name=TEST-CollectionsAPIDistributedZkTest.test-seed#[6253143A87F2A51]-SendThread(127.0.0.1:41826), state=TIMED_WAITING, group=TGRP-CollectionsAPIDistributedZkTest]
        at java.lang.Thread.sleep(java.base@9-ea/Native Method)
        at org.apache.zookeeper.ClientCnxn$SendThread.run(ClientCnxn.java:994)
   4) Thread[id=3934, name=zkCallback-504-thread-3, state=TIMED_WAITING, group=TGRP-CollectionsAPIDistributedZkTest]
        at jdk.internal.misc.Unsafe.park(java.base@9-ea/Native Method)
        at java.util.concurrent.locks.LockSupport.parkNanos(java.base@9-ea/LockSupport.java:230)
        at java.util.concurrent.SynchronousQueue$TransferStack.awaitFulfill(java.base@9-ea/SynchronousQueue.java:461)
        at java.util.concurrent.SynchronousQueue$TransferStack.transfer(java.base@9-ea/SynchronousQueue.java:362)
        at java.util.concurrent.SynchronousQueue.poll(java.base@9-ea/SynchronousQueue.java:937)
        at java.util.concurrent.ThreadPoolExecutor.getTask(java.base@9-ea/ThreadPoolExecutor.java:1082)
        at java.util.concurrent.ThreadPoolExecutor.runWorker(java.base@9-ea/ThreadPoolExecutor.java:1143)
        at java.util.concurrent.ThreadPoolExecutor$Worker.run(java.base@9-ea/ThreadPoolExecutor.java:632)
        at java.lang.Thread.run(java.base@9-ea/Thread.java:843)
	at __randomizedtesting.SeedInfo.seed([6253143A87F2A51]:0)


FAILED:  org.apache.solr.cloud.CollectionsAPIDistributedZkTest.test

Error Message:
Timeout occured while waiting response from server at: https://127.0.0.1:44264

Stack Trace:
org.apache.solr.client.solrj.SolrServerException: Timeout occured while waiting response from server at: https://127.0.0.1:44264
	at __randomizedtesting.SeedInfo.seed([6253143A87F2A51:8E710E99068347A9]:0)
	at org.apache.solr.client.solrj.impl.HttpSolrClient.executeMethod(HttpSolrClient.java:601)
	at org.apache.solr.client.solrj.impl.HttpSolrClient.request(HttpSolrClient.java:259)
	at org.apache.solr.client.solrj.impl.HttpSolrClient.request(HttpSolrClient.java:248)
	at org.apache.solr.client.solrj.SolrClient.request(SolrClient.java:1219)
	at org.apache.solr.cloud.CollectionsAPIDistributedZkTest.makeRequest(CollectionsAPIDistributedZkTest.java:399)
	at org.apache.solr.cloud.CollectionsAPIDistributedZkTest.testCollectionsAPI(CollectionsAPIDistributedZkTest.java:897)
	at org.apache.solr.cloud.CollectionsAPIDistributedZkTest.test(CollectionsAPIDistributedZkTest.java:177)
	at jdk.internal.reflect.NativeMethodAccessorImpl.invoke0(java.base@9-ea/Native Method)
	at jdk.internal.reflect.NativeMethodAccessorImpl.invoke(java.base@9-ea/NativeMethodAccessorImpl.java:62)
	at jdk.internal.reflect.DelegatingMethodAccessorImpl.invoke(java.base@9-ea/DelegatingMethodAccessorImpl.java:43)
	at java.lang.reflect.Method.invoke(java.base@9-ea/Method.java:533)
	at com.carrotsearch.randomizedtesting.RandomizedRunner.invoke(RandomizedRunner.java:1764)
	at com.carrotsearch.randomizedtesting.RandomizedRunner$8.evaluate(RandomizedRunner.java:871)
	at com.carrotsearch.randomizedtesting.RandomizedRunner$9.evaluate(RandomizedRunner.java:907)
	at com.carrotsearch.randomizedtesting.RandomizedRunner$10.evaluate(RandomizedRunner.java:921)
	at org.apache.solr.BaseDistributedSearchTestCase$ShardsRepeatRule$ShardsFixedStatement.callStatement(BaseDistributedSearchTestCase.java:992)
	at org.apache.solr.BaseDistributedSearchTestCase$ShardsRepeatRule$ShardsStatement.evaluate(BaseDistributedSearchTestCase.java:967)
	at com.carrotsearch.randomizedtesting.rules.SystemPropertiesRestoreRule$1.evaluate(SystemPropertiesRestoreRule.java:57)
	at org.apache.lucene.util.TestRuleSetupTeardownChained$1.evaluate(TestRuleSetupTeardownChained.java:49)
	at org.apache.lucene.util.AbstractBeforeAfterRule$1.evaluate(AbstractBeforeAfterRule.java:45)
	at org.apache.lucene.util.TestRuleThreadAndTestName$1.evaluate(TestRuleThreadAndTestName.java:48)
	at org.apache.lucene.util.TestRuleIgnoreAfterMaxFailures$1.evaluate(TestRuleIgnoreAfterMaxFailures.java:64)
	at org.apache.lucene.util.TestRuleMarkFailure$1.evaluate(TestRuleMarkFailure.java:47)
	at com.carrotsearch.randomizedtesting.rules.StatementAdapter.evaluate(StatementAdapter.java:36)
	at com.carrotsearch.randomizedtesting.ThreadLeakControl$StatementRunner.run(ThreadLeakControl.java:367)
	at com.carrotsearch.randomizedtesting.ThreadLeakControl.forkTimeoutingTask(ThreadLeakControl.java:809)
	at com.carrotsearch.randomizedtesting.ThreadLeakControl$3.evaluate(ThreadLeakControl.java:460)
	at com.carrotsearch.randomizedtesting.RandomizedRunner.runSingleTest(RandomizedRunner.java:880)
	at com.carrotsearch.randomizedtesting.RandomizedRunner$5.evaluate(RandomizedRunner.java:781)
	at com.carrotsearch.randomizedtesting.RandomizedRunner$6.evaluate(RandomizedRunner.java:816)
	at com.carrotsearch.randomizedtesting.RandomizedRunner$7.evaluate(RandomizedRunner.java:827)
	at com.carrotsearch.randomizedtesting.rules.StatementAdapter.evaluate(StatementAdapter.java:36)
	at com.carrotsearch.randomizedtesting.rules.SystemPropertiesRestoreRule$1.evaluate(SystemPropertiesRestoreRule.java:57)
	at org.apache.lucene.util.AbstractBeforeAfterRule$1.evaluate(AbstractBeforeAfterRule.java:45)
	at com.carrotsearch.randomizedtesting.rules.StatementAdapter.evaluate(StatementAdapter.java:36)
	at org.apache.lucene.util.TestRuleStoreClassName$1.evaluate(TestRuleStoreClassName.java:41)
	at com.carrotsearch.randomizedtesting.rules.NoShadowingOrOverridesOnMethodsRule$1.evaluate(NoShadowingOrOverridesOnMethodsRule.java:40)
	at com.carrotsearch.randomizedtesting.rules.NoShadowingOrOverridesOnMethodsRule$1.evaluate(NoShadowingOrOverridesOnMethodsRule.java:40)
	at com.carrotsearch.randomizedtesting.rules.StatementAdapter.evaluate(StatementAdapter.java:36)
	at com.carrotsearch.randomizedtesting.rules.StatementAdapter.evaluate(StatementAdapter.java:36)
	at com.carrotsearch.randomizedtesting.rules.StatementAdapter.evaluate(StatementAdapter.java:36)
	at org.apache.lucene.util.TestRuleAssertionsRequired$1.evaluate(TestRuleAssertionsRequired.java:53)
	at org.apache.lucene.util.TestRuleMarkFailure$1.evaluate(TestRuleMarkFailure.java:47)
	at org.apache.lucene.util.TestRuleIgnoreAfterMaxFailures$1.evaluate(TestRuleIgnoreAfterMaxFailures.java:64)
	at org.apache.lucene.util.TestRuleIgnoreTestSuites$1.evaluate(TestRuleIgnoreTestSuites.java:54)
	at com.carrotsearch.randomizedtesting.rules.StatementAdapter.evaluate(StatementAdapter.java:36)
	at com.carrotsearch.randomizedtesting.ThreadLeakControl$StatementRunner.run(ThreadLeakControl.java:367)
	at java.lang.Thread.run(java.base@9-ea/Thread.java:843)
Caused by: java.net.SocketTimeoutException: Read timed out
	at java.net.SocketInputStream.socketRead0(java.base@9-ea/Native Method)
	at java.net.SocketInputStream.socketRead(java.base@9-ea/SocketInputStream.java:116)
	at java.net.SocketInputStream.read(java.base@9-ea/SocketInputStream.java:170)
	at java.net.SocketInputStream.read(java.base@9-ea/SocketInputStream.java:141)
	at sun.security.ssl.SSLSocketInputRecord.read(java.base@9-ea/SSLSocketInputRecord.java:425)
	at sun.security.ssl.SSLSocketInputRecord.bytesInCompletePacket(java.base@9-ea/SSLSocketInputRecord.java:65)
	at sun.security.ssl.SSLSocketImpl.bytesInCompletePacket(java.base@9-ea/SSLSocketImpl.java:913)
	at sun.security.ssl.AppInputStream.read(java.base@9-ea/AppInputStream.java:144)
	at org.apache.http.impl.io.AbstractSessionInputBuffer.fillBuffer(AbstractSessionInputBuffer.java:160)
	at org.apache.http.impl.io.SocketInputBuffer.fillBuffer(SocketInputBuffer.java:84)
	at org.apache.http.impl.io.AbstractSessionInputBuffer.readLine(AbstractSessionInputBuffer.java:273)
	at org.apache.http.impl.conn.DefaultHttpResponseParser.parseHead(DefaultHttpResponseParser.java:140)
	at org.apache.http.impl.conn.DefaultHttpResponseParser.parseHead(DefaultHttpResponseParser.java:57)
	at org.apache.http.impl.io.AbstractMessageParser.parse(AbstractMessageParser.java:261)
	at org.apache.http.impl.AbstractHttpClientConnection.receiveResponseHeader(AbstractHttpClientConnection.java:283)
	at org.apache.http.impl.conn.DefaultClientConnection.receiveResponseHeader(DefaultClientConnection.java:251)
	at org.apache.http.impl.conn.ManagedClientConnectionImpl.receiveResponseHeader(ManagedClientConnectionImpl.java:197)
	at org.apache.http.protocol.HttpRequestExecutor.doReceiveResponse(HttpRequestExecutor.java:272)
	at org.apache.http.protocol.HttpRequestExecutor.execute(HttpRequestExecutor.java:124)
	at org.apache.http.impl.client.DefaultRequestDirector.tryExecute(DefaultRequestDirector.java:685)
	at org.apache.http.impl.client.DefaultRequestDirector.execute(DefaultRequestDirector.java:487)
	at org.apache.http.impl.client.AbstractHttpClient.doExecute(AbstractHttpClient.java:882)
	at org.apache.http.impl.client.CloseableHttpClient.execute(CloseableHttpClient.java:82)
	at org.apache.http.impl.client.CloseableHttpClient.execute(CloseableHttpClient.java:107)
	at org.apache.http.impl.client.CloseableHttpClient.execute(CloseableHttpClient.java:55)
	at org.apache.solr.client.solrj.impl.HttpSolrClient.executeMethod(HttpSolrClient.java:495)
	... 47 more


FAILED:  org.apache.solr.cloud.overseer.ZkStateReaderTest.testStateFormatUpdateWithExplicitRefresh

Error Message:
Could not find collection : c1

Stack Trace:
org.apache.solr.common.SolrException: Could not find collection : c1
	at __randomizedtesting.SeedInfo.seed([6253143A87F2A51:199F40B4781FEC94]:0)
	at org.apache.solr.common.cloud.ClusterState.getCollection(ClusterState.java:192)
	at org.apache.solr.cloud.overseer.ZkStateReaderTest.testStateFormatUpdate(ZkStateReaderTest.java:129)
	at org.apache.solr.cloud.overseer.ZkStateReaderTest.testStateFormatUpdateWithExplicitRefresh(ZkStateReaderTest.java:43)
	at jdk.internal.reflect.NativeMethodAccessorImpl.invoke0(java.base@9-ea/Native Method)
	at jdk.internal.reflect.NativeMethodAccessorImpl.invoke(java.base@9-ea/NativeMethodAccessorImpl.java:62)
	at jdk.internal.reflect.DelegatingMethodAccessorImpl.invoke(java.base@9-ea/DelegatingMethodAccessorImpl.java:43)
	at java.lang.reflect.Method.invoke(java.base@9-ea/Method.java:533)
	at com.carrotsearch.randomizedtesting.RandomizedRunner.invoke(RandomizedRunner.java:1764)
	at com.carrotsearch.randomizedtesting.RandomizedRunner$8.evaluate(RandomizedRunner.java:871)
	at com.carrotsearch.randomizedtesting.RandomizedRunner$9.evaluate(RandomizedRunner.java:907)
	at com.carrotsearch.randomizedtesting.RandomizedRunner$10.evaluate(RandomizedRunner.java:921)
	at com.carrotsearch.randomizedtesting.rules.SystemPropertiesRestoreRule$1.evaluate(SystemPropertiesRestoreRule.java:57)
	at org.apache.lucene.util.TestRuleSetupTeardownChained$1.evaluate(TestRuleSetupTeardownChained.java:49)
	at org.apache.lucene.util.AbstractBeforeAfterRule$1.evaluate(AbstractBeforeAfterRule.java:45)
	at org.apache.lucene.util.TestRuleThreadAndTestName$1.evaluate(TestRuleThreadAndTestName.java:48)
	at org.apache.lucene.util.TestRuleIgnoreAfterMaxFailures$1.evaluate(TestRuleIgnoreAfterMaxFailures.java:64)
	at org.apache.lucene.util.TestRuleMarkFailure$1.evaluate(TestRuleMarkFailure.java:47)
	at com.carrotsearch.randomizedtesting.rules.StatementAdapter.evaluate(StatementAdapter.java:36)
	at com.carrotsearch.randomizedtesting.ThreadLeakControl$StatementRunner.run(ThreadLeakControl.java:367)
	at com.carrotsearch.randomizedtesting.ThreadLeakControl.forkTimeoutingTask(ThreadLeakControl.java:809)
	at com.carrotsearch.randomizedtesting.ThreadLeakControl$3.evaluate(ThreadLeakControl.java:460)
	at com.carrotsearch.randomizedtesting.RandomizedRunner.runSingleTest(RandomizedRunner.java:880)
	at com.carrotsearch.randomizedtesting.RandomizedRunner$5.evaluate(RandomizedRunner.java:781)
	at com.carrotsearch.randomizedtesting.RandomizedRunner$6.evaluate(RandomizedRunner.java:816)
	at com.carrotsearch.randomizedtesting.RandomizedRunner$7.evaluate(RandomizedRunner.java:827)
	at com.carrotsearch.randomizedtesting.rules.StatementAdapter.evaluate(StatementAdapter.java:36)
	at com.carrotsearch.randomizedtesting.rules.SystemPropertiesRestoreRule$1.evaluate(SystemPropertiesRestoreRule.java:57)
	at org.apache.lucene.util.AbstractBeforeAfterRule$1.evaluate(AbstractBeforeAfterRule.java:45)
	at com.carrotsearch.randomizedtesting.rules.StatementAdapter.evaluate(StatementAdapter.java:36)
	at org.apache.lucene.util.TestRuleStoreClassName$1.evaluate(TestRuleStoreClassName.java:41)
	at com.carrotsearch.randomizedtesting.rules.NoShadowingOrOverridesOnMethodsRule$1.evaluate(NoShadowingOrOverridesOnMethodsRule.java:40)
	at com.carrotsearch.randomizedtesting.rules.NoShadowingOrOverridesOnMethodsRule$1.evaluate(NoShadowingOrOverridesOnMethodsRule.java:40)
	at com.carrotsearch.randomizedtesting.rules.StatementAdapter.evaluate(StatementAdapter.java:36)
	at com.carrotsearch.randomizedtesting.rules.StatementAdapter.evaluate(StatementAdapter.java:36)
	at com.carrotsearch.randomizedtesting.rules.StatementAdapter.evaluate(StatementAdapter.java:36)
	at org.apache.lucene.util.TestRuleAssertionsRequired$1.evaluate(TestRuleAssertionsRequired.java:53)
	at org.apache.lucene.util.TestRuleMarkFailure$1.evaluate(TestRuleMarkFailure.java:47)
	at org.apache.lucene.util.TestRuleIgnoreAfterMaxFailures$1.evaluate(TestRuleIgnoreAfterMaxFailures.java:64)
	at org.apache.lucene.util.TestRuleIgnoreTestSuites$1.evaluate(TestRuleIgnoreTestSuites.java:54)
	at com.carrotsearch.randomizedtesting.rules.StatementAdapter.evaluate(StatementAdapter.java:36)
	at com.carrotsearch.randomizedtesting.ThreadLeakControl$StatementRunner.run(ThreadLeakControl.java:367)
	at java.lang.Thread.run(java.base@9-ea/Thread.java:843)




Build Log:
[...truncated 11006 lines...]
   [junit4] Suite: org.apache.solr.cloud.CollectionsAPIDistributedZkTest
   [junit4]   2> Creating dataDir: /home/jenkins/workspace/Lucene-Solr-6.x-Linux/solr/build/solr-core/test/J1/temp/solr.cloud.CollectionsAPIDistributedZkTest_6253143A87F2A51-001/init-core-data-001
   [junit4]   2> 641278 INFO  (SUITE-CollectionsAPIDistributedZkTest-seed#[6253143A87F2A51]-worker) [    ] o.a.s.SolrTestCaseJ4 Randomized ssl (true) and clientAuth (true) via: @org.apache.solr.util.RandomizeSSL(reason=, ssl=NaN, value=NaN, clientAuth=NaN)
   [junit4]   2> 641280 INFO  (SUITE-CollectionsAPIDistributedZkTest-seed#[6253143A87F2A51]-worker) [    ] o.a.s.BaseDistributedSearchTestCase Setting hostContext system property: /
   [junit4]   2> 641281 INFO  (TEST-CollectionsAPIDistributedZkTest.test-seed#[6253143A87F2A51]) [    ] o.a.s.c.ZkTestServer STARTING ZK TEST SERVER
   [junit4]   2> 641282 INFO  (Thread-1177) [    ] o.a.s.c.ZkTestServer client port:0.0.0.0/0.0.0.0:0
   [junit4]   2> 641282 INFO  (Thread-1177) [    ] o.a.s.c.ZkTestServer Starting server
   [junit4]   2> 641383 INFO  (TEST-CollectionsAPIDistributedZkTest.test-seed#[6253143A87F2A51]) [    ] o.a.s.c.ZkTestServer start zk server on port:41826
   [junit4]   2> 641383 INFO  (TEST-CollectionsAPIDistributedZkTest.test-seed#[6253143A87F2A51]) [    ] o.a.s.c.c.SolrZkClient Using default ZkCredentialsProvider
   [junit4]   2> 641383 INFO  (TEST-CollectionsAPIDistributedZkTest.test-seed#[6253143A87F2A51]) [    ] o.a.s.c.c.ConnectionManager Waiting for client to connect to ZooKeeper
   [junit4]   2> 641385 INFO  (zkCallback-455-thread-1) [    ] o.a.s.c.c.ConnectionManager Watcher org.apache.solr.common.cloud.ConnectionManager@fadadc name:ZooKeeperConnection Watcher:127.0.0.1:41826 got event WatchedEvent state:SyncConnected type:None path:null path:null type:None
   [junit4]   2> 641385 INFO  (TEST-CollectionsAPIDistributedZkTest.test-seed#[6253143A87F2A51]) [    ] o.a.s.c.c.ConnectionManager Client is connected to ZooKeeper
   [junit4]   2> 641386 INFO  (TEST-CollectionsAPIDistributedZkTest.test-seed#[6253143A87F2A51]) [    ] o.a.s.c.c.SolrZkClient Using default ZkACLProvider
   [junit4]   2> 641386 INFO  (TEST-CollectionsAPIDistributedZkTest.test-seed#[6253143A87F2A51]) [    ] o.a.s.c.c.SolrZkClient makePath: /solr
   [junit4]   2> 641387 INFO  (TEST-CollectionsAPIDistributedZkTest.test-seed#[6253143A87F2A51]) [    ] o.a.s.c.c.SolrZkClient Using default ZkCredentialsProvider
   [junit4]   2> 641387 INFO  (TEST-CollectionsAPIDistributedZkTest.test-seed#[6253143A87F2A51]) [    ] o.a.s.c.c.ConnectionManager Waiting for client to connect to ZooKeeper
   [junit4]   2> 641388 INFO  (zkCallback-456-thread-1) [    ] o.a.s.c.c.ConnectionManager Watcher org.apache.solr.common.cloud.ConnectionManager@ff81e3 name:ZooKeeperConnection Watcher:127.0.0.1:41826/solr got event WatchedEvent state:SyncConnected type:None path:null path:null type:None
   [junit4]   2> 641388 INFO  (TEST-CollectionsAPIDistributedZkTest.test-seed#[6253143A87F2A51]) [    ] o.a.s.c.c.ConnectionManager Client is connected to ZooKeeper
   [junit4]   2> 641388 INFO  (TEST-CollectionsAPIDistributedZkTest.test-seed#[6253143A87F2A51]) [    ] o.a.s.c.c.SolrZkClient Using default ZkACLProvider
   [junit4]   2> 641388 INFO  (TEST-CollectionsAPIDistributedZkTest.test-seed#[6253143A87F2A51]) [    ] o.a.s.c.c.SolrZkClient makePath: /collections/collection1
   [junit4]   2> 641391 INFO  (TEST-CollectionsAPIDistributedZkTest.test-seed#[6253143A87F2A51]) [    ] o.a.s.c.c.SolrZkClient makePath: /collections/collection1/shards
   [junit4]   2> 641392 INFO  (TEST-CollectionsAPIDistributedZkTest.test-seed#[6253143A87F2A51]) [    ] o.a.s.c.c.SolrZkClient makePath: /collections/control_collection
   [junit4]   2> 641393 INFO  (TEST-CollectionsAPIDistributedZkTest.test-seed#[6253143A87F2A51]) [    ] o.a.s.c.c.SolrZkClient makePath: /collections/control_collection/shards
   [junit4]   2> 641396 INFO  (TEST-CollectionsAPIDistributedZkTest.test-seed#[6253143A87F2A51]) [    ] o.a.s.c.AbstractZkTestCase put /home/jenkins/workspace/Lucene-Solr-6.x-Linux/solr/core/src/test-files/solr/collection1/conf/solrconfig-tlog.xml to /configs/conf1/solrconfig.xml
   [junit4]   2> 641396 INFO  (TEST-CollectionsAPIDistributedZkTest.test-seed#[6253143A87F2A51]) [    ] o.a.s.c.c.SolrZkClient makePath: /configs/conf1/solrconfig.xml
   [junit4]   2> 641398 INFO  (TEST-CollectionsAPIDistributedZkTest.test-seed#[6253143A87F2A51]) [    ] o.a.s.c.AbstractZkTestCase put /home/jenkins/workspace/Lucene-Solr-6.x-Linux/solr/core/src/test-files/solr/collection1/conf/schema.xml to /configs/conf1/schema.xml
   [junit4]   2> 641398 INFO  (TEST-CollectionsAPIDistributedZkTest.test-seed#[6253143A87F2A51]) [    ] o.a.s.c.c.SolrZkClient makePath: /configs/conf1/schema.xml
   [junit4]   2> 641400 INFO  (TEST-CollectionsAPIDistributedZkTest.test-seed#[6253143A87F2A51]) [    ] o.a.s.c.AbstractZkTestCase put /home/jenkins/workspace/Lucene-Solr-6.x-Linux/solr/core/src/test-files/solr/collection1/conf/solrconfig.snippet.randomindexconfig.xml to /configs/conf1/solrconfig.snippet.randomindexconfig.xml
   [junit4]   2> 641400 INFO  (TEST-CollectionsAPIDistributedZkTest.test-seed#[6253143A87F2A51]) [    ] o.a.s.c.c.SolrZkClient makePath: /configs/conf1/solrconfig.snippet.randomindexconfig.xml
   [junit4]   2> 641403 INFO  (TEST-CollectionsAPIDistributedZkTest.test-seed#[6253143A87F2A51]) [    ] o.a.s.c.AbstractZkTestCase put /home/jenkins/workspace/Lucene-Solr-6.x-Linux/solr/core/src/test-files/solr/collection1/conf/stopwords.txt to /configs/conf1/stopwords.txt
   [junit4]   2> 641403 INFO  (TEST-CollectionsAPIDistributedZkTest.test-seed#[6253143A87F2A51]) [    ] o.a.s.c.c.SolrZkClient makePath: /configs/conf1/stopwords.txt
   [junit4]   2> 641404 INFO  (TEST-CollectionsAPIDistributedZkTest.test-seed#[6253143A87F2A51]) [    ] o.a.s.c.AbstractZkTestCase put /home/jenkins/workspace/Lucene-Solr-6.x-Linux/solr/core/src/test-files/solr/collection1/conf/protwords.txt to /configs/conf1/protwords.txt
   [junit4]   2> 641404 INFO  (TEST-CollectionsAPIDistributedZkTest.test-seed#[6253143A87F2A51]) [    ] o.a.s.c.c.SolrZkClient makePath: /configs/conf1/protwords.txt
   [junit4]   2> 641406 INFO  (TEST-CollectionsAPIDistributedZkTest.test-seed#[6253143A87F2A51]) [    ] o.a.s.c.AbstractZkTestCase put /home/jenkins/workspace/Lucene-Solr-6.x-Linux/solr/core/src/test-files/solr/collection1/conf/currency.xml to /configs/conf1/currency.xml
   [junit4]   2> 641407 INFO  (TEST-CollectionsAPIDistributedZkTest.test-seed#[6253143A87F2A51]) [    ] o.a.s.c.c.SolrZkClient makePath: /configs/conf1/currency.xml
   [junit4]   2> 641408 INFO  (TEST-CollectionsAPIDistributedZkTest.test-seed#[6253143A87F2A51]) [    ] o.a.s.c.AbstractZkTestCase put /home/jenkins/workspace/Lucene-Solr-6.x-Linux/solr/core/src/test-files/solr/collection1/conf/enumsConfig.xml to /configs/conf1/enumsConfig.xml
   [junit4]   2> 641408 INFO  (TEST-CollectionsAPIDistributedZkTest.test-seed#[6253143A87F2A51]) [    ] o.a.s.c.c.SolrZkClient makePath: /configs/conf1/enumsConfig.xml
   [junit4]   2> 641409 INFO  (TEST-CollectionsAPIDistributedZkTest.test-seed#[6253143A87F2A51]) [    ] o.a.s.c.AbstractZkTestCase put /home/jenkins/workspace/Lucene-Solr-6.x-Linux/solr/core/src/test-files/solr/collection1/conf/open-exchange-rates.json to /configs/conf1/open-exchange-rates.json
   [junit4]   2> 641409 INFO  (TEST-CollectionsAPIDistributedZkTest.test-seed#[6253143A87F2A51]) [    ] o.a.s.c.c.SolrZkClient makePath: /configs/conf1/open-exchange-rates.json
   [junit4]   2> 641410 INFO  (TEST-CollectionsAPIDistributedZkTest.test-seed#[6253143A87F2A51]) [    ] o.a.s.c.AbstractZkTestCase put /home/jenkins/workspace/Lucene-Solr-6.x-Linux/solr/core/src/test-files/solr/collection1/conf/mapping-ISOLatin1Accent.txt to /configs/conf1/mapping-ISOLatin1Accent.txt
   [junit4]   2> 641411 INFO  (TEST-CollectionsAPIDistributedZkTest.test-seed#[6253143A87F2A51]) [    ] o.a.s.c.c.SolrZkClient makePath: /configs/conf1/mapping-ISOLatin1Accent.txt
   [junit4]   2> 641412 INFO  (TEST-CollectionsAPIDistributedZkTest.test-seed#[6253143A87F2A51]) [    ] o.a.s.c.AbstractZkTestCase put /home/jenkins/workspace/Lucene-Solr-6.x-Linux/solr/core/src/test-files/solr/collection1/conf/old_synonyms.txt to /configs/conf1/old_synonyms.txt
   [junit4]   2> 641412 INFO  (TEST-CollectionsAPIDistributedZkTest.test-seed#[6253143A87F2A51]) [    ] o.a.s.c.c.SolrZkClient makePath: /configs/conf1/old_synonyms.txt
   [junit4]   2> 641421 INFO  (TEST-CollectionsAPIDistributedZkTest.test-seed#[6253143A87F2A51]) [    ] o.a.s.c.AbstractZkTestCase put /home/jenkins/workspace/Lucene-Solr-6.x-Linux/solr/core/src/test-files/solr/collection1/conf/synonyms.txt to /configs/conf1/synonyms.txt
   [junit4]   2> 641421 INFO  (TEST-CollectionsAPIDistributedZkTest.test-seed#[6253143A87F2A51]) [    ] o.a.s.c.c.SolrZkClient makePath: /configs/conf1/synonyms.txt
   [junit4]   2> 641423 INFO  (TEST-CollectionsAPIDistributedZkTest.test-seed#[6253143A87F2A51]) [    ] o.a.s.c.c.SolrZkClient Using default ZkCredentialsProvider
   [junit4]   2> 641423 INFO  (TEST-CollectionsAPIDistributedZkTest.test-seed#[6253143A87F2A51]) [    ] o.a.s.c.c.ConnectionManager Waiting for client to connect to ZooKeeper
   [junit4]   2> 641426 INFO  (zkCallback-458-thread-1) [    ] o.a.s.c.c.ConnectionManager Watcher org.apache.solr.common.cloud.ConnectionManager@5ea08f name:ZooKeeperConnection Watcher:127.0.0.1:41826/solr got event WatchedEvent state:SyncConnected type:None path:null path:null type:None
   [junit4]   2> 641426 INFO  (TEST-CollectionsAPIDistributedZkTest.test-seed#[6253143A87F2A51]) [    ] o.a.s.c.c.ConnectionManager Client is connected to ZooKeeper
   [junit4]   2> 641426 INFO  (TEST-CollectionsAPIDistributedZkTest.test-seed#[6253143A87F2A51]) [    ] o.a.s.c.c.SolrZkClient Using default ZkACLProvider
   [junit4]   2> 641427 INFO  (TEST-CollectionsAPIDistributedZkTest.test-seed#[6253143A87F2A51]) [    ] o.a.s.c.c.SolrZkClient Using default ZkCredentialsProvider
   [junit4]   2> 641432 INFO  (TEST-CollectionsAPIDistributedZkTest.test-seed#[6253143A87F2A51]) [    ] o.a.s.c.c.ConnectionManager Waiting for client to connect to ZooKeeper
   [junit4]   2> 641432 INFO  (zkCallback-459-thread-1) [    ] o.a.s.c.c.ConnectionManager Watcher org.apache.solr.common.cloud.ConnectionManager@174fd47 name:ZooKeeperConnection Watcher:127.0.0.1:41826 got event WatchedEvent state:SyncConnected type:None path:null path:null type:None
   [junit4]   2> 641433 INFO  (TEST-CollectionsAPIDistributedZkTest.test-seed#[6253143A87F2A51]) [    ] o.a.s.c.c.ConnectionManager Client is connected to ZooKeeper
   [junit4]   2> 641433 INFO  (TEST-CollectionsAPIDistributedZkTest.test-seed#[6253143A87F2A51]) [    ] o.a.s.c.c.SolrZkClient Using default ZkACLProvider
   [junit4]   2> 641433 INFO  (TEST-CollectionsAPIDistributedZkTest.test-seed#[6253143A87F2A51]) [    ] o.a.s.c.c.SolrZkClient makePath: /solr
   [junit4]   2> 641434 INFO  (TEST-CollectionsAPIDistributedZkTest.test-seed#[6253143A87F2A51]) [    ] o.a.s.c.c.SolrZkClient Using default ZkCredentialsProvider
   [junit4]   2> 641434 INFO  (TEST-CollectionsAPIDistributedZkTest.test-seed#[6253143A87F2A51]) [    ] o.a.s.c.c.ConnectionManager Waiting for client to connect to ZooKeeper
   [junit4]   2> 641435 INFO  (zkCallback-460-thread-1) [    ] o.a.s.c.c.ConnectionManager Watcher org.apache.solr.common.cloud.ConnectionManager@17a9640 name:ZooKeeperConnection Watcher:127.0.0.1:41826/solr got event WatchedEvent state:SyncConnected type:None path:null path:null type:None
   [junit4]   2> 641436 INFO  (TEST-CollectionsAPIDistributedZkTest.test-seed#[6253143A87F2A51]) [    ] o.a.s.c.c.ConnectionManager Client is connected to ZooKeeper
   [junit4]   2> 641436 INFO  (TEST-CollectionsAPIDistributedZkTest.test-seed#[6253143A87F2A51]) [    ] o.a.s.c.c.SolrZkClient Using default ZkACLProvider
   [junit4]   2> 641437 INFO  (TEST-CollectionsAPIDistributedZkTest.test-seed#[6253143A87F2A51]) [    ] o.a.s.c.AbstractZkTestCase put /home/jenkins/workspace/Lucene-Solr-6.x-Linux/solr/core/src/test-files/solr/collection1/conf/solrconfig-tlog.xml to /configs/conf2/solrconfig.xml
   [junit4]   2> 641437 INFO  (TEST-CollectionsAPIDistributedZkTest.test-seed#[6253143A87F2A51]) [    ] o.a.s.c.c.SolrZkClient makePath: /configs/conf2/solrconfig.xml
   [junit4]   2> 641438 INFO  (TEST-CollectionsAPIDistributedZkTest.test-seed#[6253143A87F2A51]) [    ] o.a.s.c.AbstractZkTestCase put /home/jenkins/workspace/Lucene-Solr-6.x-Linux/solr/core/src/test-files/solr/collection1/conf/schema.xml to /configs/conf2/schema.xml
   [junit4]   2> 641438 INFO  (TEST-CollectionsAPIDistributedZkTest.test-seed#[6253143A87F2A51]) [    ] o.a.s.c.c.SolrZkClient makePath: /configs/conf2/schema.xml
   [junit4]   2> 641439 INFO  (TEST-CollectionsAPIDistributedZkTest.test-seed#[6253143A87F2A51]) [    ] o.a.s.c.AbstractZkTestCase put /home/jenkins/workspace/Lucene-Solr-6.x-Linux/solr/core/src/test-files/solr/collection1/conf/enumsConfig.xml to /configs/conf2/enumsConfig.xml
   [junit4]   2> 641440 INFO  (TEST-CollectionsAPIDistributedZkTest.test-seed#[6253143A87F2A51]) [    ] o.a.s.c.c.SolrZkClient makePath: /configs/conf2/enumsConfig.xml
   [junit4]   2> 641441 INFO  (TEST-CollectionsAPIDistributedZkTest.test-seed#[6253143A87F2A51]) [    ] o.a.s.c.AbstractZkTestCase put /home/jenkins/workspace/Lucene-Solr-6.x-Linux/solr/core/src/test-files/solr/collection1/conf/solrconfig.snippet.randomindexconfig.xml to /configs/conf2/solrconfig.snippet.randomindexconfig.xml
   [junit4]   2> 641441 INFO  (TEST-CollectionsAPIDistributedZkTest.test-seed#[6253143A87F2A51]) [    ] o.a.s.c.c.SolrZkClient makePath: /configs/conf2/solrconfig.snippet.randomindexconfig.xml
   [junit4]   2> 641443 INFO  (TEST-CollectionsAPIDistributedZkTest.test-seed#[6253143A87F2A51]) [    ] o.a.s.c.AbstractZkTestCase put /home/jenkins/workspace/Lucene-Solr-6.x-Linux/solr/core/src/test-files/solr/collection1/conf/stopwords.txt to /configs/conf2/stopwords.txt
   [junit4]   2> 641443 INFO  (TEST-CollectionsAPIDistributedZkTest.test-seed#[6253143A87F2A51]) [    ] o.a.s.c.c.SolrZkClient makePath: /configs/conf2/stopwords.txt
   [junit4]   2> 641444 INFO  (TEST-CollectionsAPIDistributedZkTest.test-seed#[6253143A87F2A51]) [    ] o.a.s.c.AbstractZkTestCase put /home/jenkins/workspace/Lucene-Solr-6.x-Linux/solr/core/src/test-files/solr/collection1/conf/protwords.txt to /configs/conf2/protwords.txt
   [junit4]   2> 641445 INFO  (TEST-CollectionsAPIDistributedZkTest.test-seed#[6253143A87F2A51]) [    ] o.a.s.c.c.SolrZkClient makePath: /configs/conf2/protwords.txt
   [junit4]   2> 641447 INFO  (TEST-CollectionsAPIDistributedZkTest.test-seed#[6253143A87F2A51]) [    ] o.a.s.c.AbstractZkTestCase put /home/jenkins/workspace/Lucene-Solr-6.x-Linux/solr/core/src/test-files/solr/collection1/conf/currency.xml to /configs/conf2/currency.xml
   [junit4]   2> 641447 INFO  (TEST-CollectionsAPIDistributedZkTest.test-seed#[6253143A87F2A51]) [    ] o.a.s.c.c.SolrZkClient makePath: /configs/conf2/currency.xml
   [junit4]   2> 641449 INFO  (TEST-CollectionsAPIDistributedZkTest.test-seed#[6253143A87F2A51]) [    ] o.a.s.c.AbstractZkTestCase put /home/jenkins/workspace/Lucene-Solr-6.x-Linux/solr/core/src/test-files/solr/collection1/conf/open-exchange-rates.json to /configs/conf2/open-exchange-rates.json
   [junit4]   2> 641449 INFO  (TEST-CollectionsAPIDistributedZkTest.test-seed#[6253143A87F2A51]) [    ] o.a.s.c.c.SolrZkClient makePath: /configs/conf2/open-exchange-rates.json
   [junit4]   2> 641451 INFO  (TEST-CollectionsAPIDistributedZkTest.test-seed#[6253143A87F2A51]) [    ] o.a.s.c.AbstractZkTestCase put /home/jenkins/workspace/Lucene-Solr-6.x-Linux/solr/core/src/test-files/solr/collection1/conf/mapping-ISOLatin1Accent.txt to /configs/conf2/mapping-ISOLatin1Accent.txt
   [junit4]   2> 641451 INFO  (TEST-CollectionsAPIDistributedZkTest.test-seed#[6253143A87F2A51]) [    ] o.a.s.c.c.SolrZkClient makePath: /configs/conf2/mapping-ISOLatin1Accent.txt
   [junit4]   2> 641452 INFO  (TEST-CollectionsAPIDistributedZkTest.test-seed#[6253143A87F2A51]) [    ] o.a.s.c.AbstractZkTestCase put /home/jenkins/workspace/Lucene-Solr-6.x-Linux/solr/core/src/test-files/solr/collection1/conf/old_synonyms.txt to /configs/conf2/old_synonyms.txt
   [junit4]   2> 641452 INFO  (TEST-CollectionsAPIDistributedZkTest.test-seed#[6253143A87F2A51]) [    ] o.a.s.c.c.SolrZkClient makePath: /configs/conf2/old_synonyms.txt
   [junit4]   2> 641455 INFO  (TEST-CollectionsAPIDistributedZkTest.test-seed#[6253143A87F2A51]) [    ] o.a.s.c.AbstractZkTestCase put /home/jenkins/workspace/Lucene-Solr-6.x-Linux/solr/core/src/test-files/solr/collection1/conf/synonyms.txt to /configs/conf2/synonyms.txt
   [junit4]   2> 641455 INFO  (TEST-CollectionsAPIDistributedZkTest.test-seed#[6253143A87F2A51]) [    ] o.a.s.c.c.SolrZkClient makePath: /configs/conf2/synonyms.txt
   [junit4]   2> 641456 INFO  (TEST-CollectionsAPIDistributedZkTest.test-seed#[6253143A87F2A51]) [    ] o.a.s.c.AbstractZkTestCase put /home/jenkins/workspace/Lucene-Solr-6.x-Linux/solr/core/src/test-files/solr/collection1/conf/elevate.xml to /configs/conf2/elevate.xml
   [junit4]   2> 641456 INFO  (TEST-CollectionsAPIDistributedZkTest.test-seed#[6253143A87F2A51]) [    ] o.a.s.c.c.SolrZkClient makePath: /configs/conf2/elevate.xml
   [junit4]   2> 641549 INFO  (TEST-CollectionsAPIDistributedZkTest.test-seed#[6253143A87F2A51]) [    ] o.a.s.SolrTestCaseJ4 Writing core.properties file to /home/jenkins/workspace/Lucene-Solr-6.x-Linux/solr/build/solr-core/test/J1/temp/solr.cloud.CollectionsAPIDistributedZkTest_6253143A87F2A51-001/control-001/cores/collection1
   [junit4]   2> 641552 INFO  (TEST-CollectionsAPIDistributedZkTest.test-seed#[6253143A87F2A51]) [    ] o.e.j.s.Server jetty-9.3.8.v20160314
   [junit4]   2> 641553 INFO  (TEST-CollectionsAPIDistributedZkTest.test-seed#[6253143A87F2A51]) [    ] o.e.j.s.h.ContextHandler Started o.e.j.s.ServletContextHandler@7e3016{/,null,AVAILABLE}
   [junit4]   2> 641555 INFO  (TEST-CollectionsAPIDistributedZkTest.test-seed#[6253143A87F2A51]) [    ] o.e.j.s.ServerConnector Started ServerConnector@144a3cd{SSL,[ssl, http/1.1]}{127.0.0.1:33401}
   [junit4]   2> 641555 INFO  (TEST-CollectionsAPIDistributedZkTest.test-seed#[6253143A87F2A51]) [    ] o.e.j.s.Server Started @643266ms
   [junit4]   2> 641556 INFO  (TEST-CollectionsAPIDistributedZkTest.test-seed#[6253143A87F2A51]) [    ] o.a.s.c.s.e.JettySolrRunner Jetty properties: {hostContext=/, solr.data.dir=/home/jenkins/workspace/Lucene-Solr-6.x-Linux/solr/build/solr-core/test/J1/temp/solr.cloud.CollectionsAPIDistributedZkTest_6253143A87F2A51-001/tempDir-001/control/data, hostPort=33401, coreRootDirectory=/home/jenkins/workspace/Lucene-Solr-6.x-Linux/solr/build/solr-core/test/J1/temp/solr.cloud.CollectionsAPIDistributedZkTest_6253143A87F2A51-001/control-001/cores}
   [junit4]   2> 641556 INFO  (TEST-CollectionsAPIDistributedZkTest.test-seed#[6253143A87F2A51]) [    ] o.a.s.s.SolrDispatchFilter SolrDispatchFilter.init(): jdk.internal.loader.ClassLoaders$AppClassLoader@340fab
   [junit4]   2> 641556 INFO  (TEST-CollectionsAPIDistributedZkTest.test-seed#[6253143A87F2A51]) [    ] o.a.s.c.SolrResourceLoader new SolrResourceLoader for directory: '/home/jenkins/workspace/Lucene-Solr-6.x-Linux/solr/build/solr-core/test/J1/temp/solr.cloud.CollectionsAPIDistributedZkTest_6253143A87F2A51-001/control-001'
   [junit4]   2> 641556 INFO  (TEST-CollectionsAPIDistributedZkTest.test-seed#[6253143A87F2A51]) [    ] o.a.s.c.SolrResourceLoader JNDI not configured for solr (NoInitialContextEx)
   [junit4]   2> 641556 INFO  (TEST-CollectionsAPIDistributedZkTest.test-seed#[6253143A87F2A51]) [    ] o.a.s.c.SolrResourceLoader solr home defaulted to 'solr/' (could not find system property or JNDI)
   [junit4]   2> 641556 INFO  (TEST-CollectionsAPIDistributedZkTest.test-seed#[6253143A87F2A51]) [    ] o.a.s.c.c.SolrZkClient Using default ZkCredentialsProvider
   [junit4]   2> 641556 INFO  (TEST-CollectionsAPIDistributedZkTest.test-seed#[6253143A87F2A51]) [    ] o.a.s.c.c.ConnectionManager Waiting for client to connect to ZooKeeper
   [junit4]   2> 641558 INFO  (zkCallback-461-thread-1) [    ] o.a.s.c.c.ConnectionManager Watcher org.apache.solr.common.cloud.ConnectionManager@1eb169e name:ZooKeeperConnection Watcher:127.0.0.1:41826/solr got event WatchedEvent state:SyncConnected type:None path:null path:null type:None
   [junit4]   2> 641558 INFO  (TEST-CollectionsAPIDistributedZkTest.test-seed#[6253143A87F2A51]) [    ] o.a.s.c.c.ConnectionManager Client is connected to ZooKeeper
   [junit4]   2> 641558 INFO  (TEST-CollectionsAPIDistributedZkTest.test-seed#[6253143A87F2A51]) [    ] o.a.s.c.c.SolrZkClient Using default ZkACLProvider
   [junit4]   2> 641559 INFO  (TEST-CollectionsAPIDistributedZkTest.test-seed#[6253143A87F2A51]) [    ] o.a.s.s.SolrDispatchFilter Loading solr.xml from SolrHome (not found in ZooKeeper)
   [junit4]   2> 641559 INFO  (TEST-CollectionsAPIDistributedZkTest.test-seed#[6253143A87F2A51]) [    ] o.a.s.c.SolrXmlConfig Loading container configuration from /home/jenkins/workspace/Lucene-Solr-6.x-Linux/solr/build/solr-core/test/J1/temp/solr.cloud.CollectionsAPIDistributedZkTest_6253143A87F2A51-001/control-001/solr.xml
   [junit4]   2> 641581 INFO  (TEST-CollectionsAPIDistributedZkTest.test-seed#[6253143A87F2A51]) [    ] o.a.s.c.CorePropertiesLocator Config-defined core root directory: /home/jenkins/workspace/Lucene-Solr-6.x-Linux/solr/build/solr-core/test/J1/temp/solr.cloud.CollectionsAPIDistributedZkTest_6253143A87F2A51-001/control-001/cores
   [junit4]   2> 641581 INFO  (TEST-CollectionsAPIDistributedZkTest.test-seed#[6253143A87F2A51]) [    ] o.a.s.c.CoreContainer New CoreContainer 21874657
   [junit4]   2> 641581 INFO  (TEST-CollectionsAPIDistributedZkTest.test-seed#[6253143A87F2A51]) [    ] o.a.s.c.CoreContainer Loading cores into CoreContainer [instanceDir=/home/jenkins/workspace/Lucene-Solr-6.x-Linux/solr/build/solr-core/test/J1/temp/solr.cloud.CollectionsAPIDistributedZkTest_6253143A87F2A51-001/control-001]
   [junit4]   2> 641582 WARN  (TEST-CollectionsAPIDistributedZkTest.test-seed#[6253143A87F2A51]) [    ] o.a.s.c.CoreContainer Couldn't add files from /home/jenkins/workspace/Lucene-Solr-6.x-Linux/solr/build/solr-core/test/J1/temp/solr.cloud.CollectionsAPIDistributedZkTest_6253143A87F2A51-001/control-001/lib to classpath: /home/jenkins/workspace/Lucene-Solr-6.x-Linux/solr/build/solr-core/test/J1/temp/solr.cloud.CollectionsAPIDistributedZkTest_6253143A87F2A51-001/control-001/lib
   [junit4]   2> 641582 INFO  (TEST-CollectionsAPIDistributedZkTest.test-seed#[6253143A87F2A51]) [    ] o.a.s.h.c.HttpShardHandlerFactory created with socketTimeout : 90000,urlScheme : ,connTimeout : 15000,maxConnectionsPerHost : 20,maxConnections : 10000,corePoolSize : 0,maximumPoolSize : 2147483647,maxThreadIdleTime : 5,sizeOfQueue : -1,fairnessPolicy : false,useRetries : false,
   [junit4]   2> 641583 INFO  (TEST-CollectionsAPIDistributedZkTest.test-seed#[6253143A87F2A51]) [    ] o.a.s.u.UpdateShardHandler Creating UpdateShardHandler HTTP client with params: socketTimeout=340000&connTimeout=45000&retry=true
   [junit4]   2> 641583 INFO  (TEST-CollectionsAPIDistributedZkTest.test-seed#[6253143A87F2A51]) [    ] o.a.s.l.LogWatcher SLF4J impl is org.slf4j.impl.Log4jLoggerFactory
   [junit4]   2> 641583 INFO  (TEST-CollectionsAPIDistributedZkTest.test-seed#[6253143A87F2A51]) [    ] o.a.s.l.LogWatcher Registering Log Listener [Log4j (org.slf4j.impl.Log4jLoggerFactory)]
   [junit4]   2> 641583 INFO  (TEST-CollectionsAPIDistributedZkTest.test-seed#[6253143A87F2A51]) [    ] o.a.s.c.ZkContainer Zookeeper client=127.0.0.1:41826/solr
   [junit4]   2> 641584 INFO  (TEST-CollectionsAPIDistributedZkTest.test-seed#[6253143A87F2A51]) [    ] o.a.s.c.ZkController zkHost includes chroot
   [junit4]   2> 641584 INFO  (TEST-CollectionsAPIDistributedZkTest.test-seed#[6253143A87F2A51]) [    ] o.a.s.c.c.SolrZkClient Using default ZkCredentialsProvider
   [junit4]   2> 641584 INFO  (TEST-CollectionsAPIDistributedZkTest.test-seed#[6253143A87F2A51]) [    ] o.a.s.c.c.ConnectionManager Waiting for client to connect to ZooKeeper
   [junit4]   2> 641585 INFO  (zkCallback-464-thread-1) [    ] o.a.s.c.c.ConnectionManager Watcher org.apache.solr.common.cloud.ConnectionManager@141d172 name:ZooKeeperConnection Watcher:127.0.0.1:41826 got event WatchedEvent state:SyncConnected type:None path:null path:null type:None
   [junit4]   2> 641585 INFO  (TEST-CollectionsAPIDistributedZkTest.test-seed#[6253143A87F2A51]) [    ] o.a.s.c.c.ConnectionManager Client is connected to ZooKeeper
   [junit4]   2> 641586 INFO  (TEST-CollectionsAPIDistributedZkTest.test-seed#[6253143A87F2A51]) [    ] o.a.s.c.c.SolrZkClient Using default ZkACLProvider
   [junit4]   2> 641588 INFO  (TEST-CollectionsAPIDistributedZkTest.test-seed#[6253143A87F2A51]) [    ] o.a.s.c.ZkController Added new OnReconnect listener org.apache.solr.cloud.ZkController$$Lambda$143/21862624@7fd6ba
   [junit4]   2> 641589 INFO  (TEST-CollectionsAPIDistributedZkTest.test-seed#[6253143A87F2A51]) [    ] o.a.s.c.c.ConnectionManager Waiting for client to connect to ZooKeeper
   [junit4]   2> 641590 INFO  (zkCallback-465-thread-1) [    ] o.a.s.c.c.ConnectionManager Watcher org.apache.solr.common.cloud.ConnectionManager@bb733e name:ZooKeeperConnection Watcher:127.0.0.1:41826/solr got event WatchedEvent state:SyncConnected type:None path:null path:null type:None
   [junit4]   2> 641590 INFO  (TEST-CollectionsAPIDistributedZkTest.test-seed#[6253143A87F2A51]) [    ] o.a.s.c.c.ConnectionManager Client is connected to ZooKeeper
   [junit4]   2> 641591 INFO  (TEST-CollectionsAPIDistributedZkTest.test-seed#[6253143A87F2A51]) [    ] o.a.s.c.c.SolrZkClient makePath: /overseer/queue
   [junit4]   2> 641592 INFO  (TEST-CollectionsAPIDistributedZkTest.test-seed#[6253143A87F2A51]) [    ] o.a.s.c.c.SolrZkClient makePath: /overseer/collection-queue-work
   [junit4]   2> 641594 INFO  (TEST-CollectionsAPIDistributedZkTest.test-seed#[6253143A87F2A51]) [    ] o.a.s.c.c.SolrZkClient makePath: /overseer/collection-map-running
   [junit4]   2> 641596 INFO  (TEST-CollectionsAPIDistributedZkTest.test-seed#[6253143A87F2A51]) [    ] o.a.s.c.c.SolrZkClient makePath: /overseer/collection-map-completed
   [junit4]   2> 641597 INFO  (TEST-CollectionsAPIDistributedZkTest.test-seed#[6253143A87F2A51]) [    ] o.a.s.c.c.SolrZkClient makePath: /overseer/collection-map-failure
   [junit4]   2> 641598 INFO  (TEST-CollectionsAPIDistributedZkTest.test-seed#[6253143A87F2A51]) [    ] o.a.s.c.c.SolrZkClient makePath: /live_nodes
   [junit4]   2> 641599 INFO  (TEST-CollectionsAPIDistributedZkTest.test-seed#[6253143A87F2A51]) [    ] o.a.s.c.c.SolrZkClient makePath: /aliases.json
   [junit4]   2> 641600 INFO  (TEST-CollectionsAPIDistributedZkTest.test-seed#[6253143A87F2A51]) [    ] o.a.s.c.c.SolrZkClient makePath: /clusterstate.json
   [junit4]   2> 641600 INFO  (TEST-CollectionsAPIDistributedZkTest.test-seed#[6253143A87F2A51]) [    ] o.a.s.c.c.SolrZkClient makePath: /security.json
   [junit4]   2> 641601 INFO  (TEST-CollectionsAPIDistributedZkTest.test-seed#[6253143A87F2A51]) [    ] o.a.s.c.c.ZkStateReader Updating cluster state from ZooKeeper... 
   [junit4]   2> 641601 INFO  (TEST-CollectionsAPIDistributedZkTest.test-seed#[6253143A87F2A51]) [    ] o.a.s.c.c.ZkStateReader Loaded cluster properties: {urlScheme=https}
   [junit4]   2> 641601 INFO  (TEST-CollectionsAPIDistributedZkTest.test-seed#[6253143A87F2A51]) [    ] o.a.s.c.c.ZkStateReader Updated live nodes from ZooKeeper... (0) -> (0)
   [junit4]   2> 641603 INFO  (TEST-CollectionsAPIDistributedZkTest.test-seed#[6253143A87F2A51]) [    ] o.a.s.c.c.SolrZkClient makePath: /overseer_elect
   [junit4]   2> 641604 INFO  (TEST-CollectionsAPIDistributedZkTest.test-seed#[6253143A87F2A51]) [    ] o.a.s.c.c.SolrZkClient makePath: /overseer_elect/election
   [junit4]   2> 641604 INFO  (TEST-CollectionsAPIDistributedZkTest.test-seed#[6253143A87F2A51]) [    ] o.a.s.c.Overseer Overseer (id=null) closing
   [junit4]   2> 641605 INFO  (TEST-CollectionsAPIDistributedZkTest.test-seed#[6253143A87F2A51]) [    ] o.a.s.c.LeaderElector Joined leadership election with path: /overseer_elect/election/96184310772989959-127.0.0.1:33401_-n_0000000000
   [junit4]   2> 641605 INFO  (TEST-CollectionsAPIDistributedZkTest.test-seed#[6253143A87F2A51]) [    ] o.a.s.c.OverseerElectionContext I am going to be the leader 127.0.0.1:33401_
   [junit4]   2> 641605 INFO  (TEST-CollectionsAPIDistributedZkTest.test-seed#[6253143A87F2A51]) [    ] o.a.s.c.c.SolrZkClient makePath: /overseer_elect/leader
   [junit4]   2> 641606 INFO  (TEST-CollectionsAPIDistributedZkTest.test-seed#[6253143A87F2A51]) [    ] o.a.s.c.Overseer Overseer (id=96184310772989959-127.0.0.1:33401_-n_0000000000) starting
   [junit4]   2> 641608 INFO  (TEST-CollectionsAPIDistributedZkTest.test-seed#[6253143A87F2A51]) [    ] o.a.s.c.c.SolrZkClient makePath: /overseer/queue-work
   [junit4]   2> 641613 INFO  (TEST-CollectionsAPIDistributedZkTest.test-seed#[6253143A87F2A51]) [    ] o.a.s.c.OverseerAutoReplicaFailoverThread Starting OverseerAutoReplicaFailoverThread autoReplicaFailoverWorkLoopDelay=10000 autoReplicaFailoverWaitAfterExpiration=10000 autoReplicaFailoverBadNodeExpiration=60000
   [junit4]   2> 641613 INFO  (OverseerCollectionConfigSetProcessor-96184310772989959-127.0.0.1:33401_-n_0000000000) [    ] o.a.s.c.OverseerTaskProcessor Process current queue of overseer operations
   [junit4]   2> 641613 INFO  (TEST-CollectionsAPIDistributedZkTest.test-seed#[6253143A87F2A51]) [    ] o.a.s.c.ZkController Register node as live in ZooKeeper:/live_nodes/127.0.0.1:33401_
   [junit4]   2> 641613 INFO  (OverseerStateUpdate-96184310772989959-127.0.0.1:33401_-n_0000000000) [    ] o.a.s.c.Overseer Starting to work on the main queue
   [junit4]   2> 641613 INFO  (TEST-CollectionsAPIDistributedZkTest.test-seed#[6253143A87F2A51]) [    ] o.a.s.c.c.SolrZkClient makePath: /live_nodes/127.0.0.1:33401_
   [junit4]   2> 641614 INFO  (OverseerStateUpdate-96184310772989959-127.0.0.1:33401_-n_0000000000) [    ] o.a.s.c.c.ZkStateReader Updated live nodes from ZooKeeper... (0) -> (0)
   [junit4]   2> 641614 INFO  (zkCallback-465-thread-1) [    ] o.a.s.c.c.ZkStateReader A live node change: [WatchedEvent state:SyncConnected type:NodeChildrenChanged path:/live_nodes], has occurred - updating... (live nodes size: [0])
   [junit4]   2> 641615 INFO  (zkCallback-465-thread-1) [    ] o.a.s.c.c.ZkStateReader Updated live nodes from ZooKeeper... (0) -> (1)
   [junit4]   2> 641702 INFO  (TEST-CollectionsAPIDistributedZkTest.test-seed#[6253143A87F2A51]) [    ] o.a.s.c.CoreContainer Security conf doesn't exist. Skipping setup for authorization module.
   [junit4]   2> 641702 INFO  (TEST-CollectionsAPIDistributedZkTest.test-seed#[6253143A87F2A51]) [    ] o.a.s.c.CoreContainer No authentication plugin used.
   [junit4]   2> 641703 INFO  (TEST-CollectionsAPIDistributedZkTest.test-seed#[6253143A87F2A51]) [    ] o.a.s.c.CorePropertiesLocator Looking for core definitions underneath /home/jenkins/workspace/Lucene-Solr-6.x-Linux/solr/build/solr-core/test/J1/temp/solr.cloud.CollectionsAPIDistributedZkTest_6253143A87F2A51-001/control-001/cores
   [junit4]   2> 641703 INFO  (TEST-CollectionsAPIDistributedZkTest.test-seed#[6253143A87F2A51]) [    ] o.a.s.c.CoreDescriptor Created CoreDescriptor: {schema=schema.xml, dataDir=data/, collection=control_collection, loadOnStartup=true, coreNodeName=, transient=false, name=collection1, shard=, config=solrconfig.xml, configSetProperties=configsetprops.json}
   [junit4]   2> 641704 INFO  (TEST-CollectionsAPIDistributedZkTest.test-seed#[6253143A87F2A51]) [    ] o.a.s.c.CorePropertiesLocator Found core collection1 in /home/jenkins/workspace/Lucene-Solr-6.x-Linux/solr/build/solr-core/test/J1/temp/solr.cloud.CollectionsAPIDistributedZkTest_6253143A87F2A51-001/control-001/cores/collection1
   [junit4]   2> 641704 INFO  (TEST-CollectionsAPIDistributedZkTest.test-seed#[6253143A87F2A51]) [    ] o.a.s.c.CorePropertiesLocator Found 1 core definitions
   [junit4]   2> 641709 INFO  (coreLoadExecutor-1344-thread-1) [    ] o.a.s.c.ZkController publishing state=down
   [junit4]   2> 641710 INFO  (coreLoadExecutor-1344-thread-1) [    ] o.a.s.c.ZkController numShards not found on descriptor - reading it from system property
   [junit4]   2> 641710 INFO  (TEST-CollectionsAPIDistributedZkTest.test-seed#[6253143A87F2A51]) [    ] o.a.s.s.SolrDispatchFilter user.dir=/home/jenkins/workspace/Lucene-Solr-6.x-Linux/solr/build/solr-core/test/J1
   [junit4]   2> 641710 INFO  (TEST-CollectionsAPIDistributedZkTest.test-seed#[6253143A87F2A51]) [    ] o.a.s.s.SolrDispatchFilter SolrDispatchFilter.init() done
   [junit4]   2> 641710 INFO  (coreLoadExecutor-1344-thread-1) [    ] o.a.s.c.ZkController Collection control_collection not visible yet, but flagging it so a watch is registered when it becomes visible
   [junit4]   2> 641711 INFO  (OverseerStateUpdate-96184310772989959-127.0.0.1:33401_-n_0000000000) [    ] o.a.s.c.Overseer processMessage: queueSize: 1, message = {
   [junit4]   2>   "core":"collection1",
   [junit4]   2>   "roles":null,
   [junit4]   2>   "base_url":"https://127.0.0.1:33401",
   [junit4]   2>   "node_name":"127.0.0.1:33401_",
   [junit4]   2>   "numShards":"1",
   [junit4]   2>   "state":"down",
   [junit4]   2>   "shard":null,
   [junit4]   2>   "collection":"control_collection",
   [junit4]   2>   "operation":"state"} current state version: 0
   [junit4]   2> 641711 INFO  (OverseerStateUpdate-96184310772989959-127.0.0.1:33401_-n_0000000000) [    ] o.a.s.c.o.ReplicaMutator Update state numShards=1 message={
   [junit4]   2>   "core":"collection1",
   [junit4]   2>   "roles":null,
   [junit4]   2>   "base_url":"https://127.0.0.1:33401",
   [junit4]   2>   "node_name":"127.0.0.1:33401_",
   [junit4]   2>   "numShards":"1",
   [junit4]   2>   "state":"down",
   [junit4]   2>   "shard":null,
   [junit4]   2>   "collection":"control_collection",
   [junit4]   2>   "operation":"state"}
   [junit4]   2> 641711 INFO  (coreLoadExecutor-1344-thread-1) [    ] o.a.s.c.c.ZkStateReader Deleting data for [control_collection]
   [junit4]   2> 641711 INFO  (OverseerStateUpdate-96184310772989959-127.0.0.1:33401_-n_0000000000) [    ] o.a.s.c.o.ClusterStateMutator building a new cName: control_collection
   [junit4]   2> 641711 INFO  (coreLoadExecutor-1344-thread-1) [    ] o.a.s.c.ZkController look for our core node name
   [junit4]   2> 641711 INFO  (OverseerStateUpdate-96184310772989959-127.0.0.1:33401_-n_0000000000) [    ] o.a.s.c.o.ReplicaMutator Assigning new node to shard shard=shard1
   [junit4]   2> 641712 INFO  (zkCallback-465-thread-1) [    ] o.a.s.c.c.ZkStateReader A cluster state change: [WatchedEvent state:SyncConnected type:NodeDataChanged path:/clusterstate.json], has occurred - updating... (live nodes size: [1])
   [junit4]   2> 642712 INFO  (coreLoadExecutor-1344-thread-1) [    ] o.a.s.c.ZkController waiting to find shard id in clusterstate for collection1
   [junit4]   2> 642712 INFO  (coreLoadExecutor-1344-thread-1) [    ] o.a.s.c.ZkController Check for collection zkNode:control_collection
   [junit4]   2> 642712 INFO  (coreLoadExecutor-1344-thread-1) [    ] o.a.s.c.ZkController Collection zkNode exists
   [junit4]   2> 642712 INFO  (coreLoadExecutor-1344-thread-1) [    ] o.a.s.c.c.ZkStateReader Load collection config from: [/collections/control_collection]
   [junit4]   2> 642713 INFO  (coreLoadExecutor-1344-thread-1) [    ] o.a.s.c.c.ZkStateReader path=[/collections/control_collection] [configName]=[conf1] specified config exists in ZooKeeper
   [junit4]   2> 642713 INFO  (coreLoadExecutor-1344-thread-1) [    ] o.a.s.c.SolrResourceLoader new SolrResourceLoader for directory: '/home/jenkins/workspace/Lucene-Solr-6.x-Linux/solr/build/solr-core/test/J1/temp/solr.cloud.CollectionsAPIDistributedZkTest_6253143A87F2A51-001/control-001/cores/collection1'
   [junit4]   2> 642713 INFO  (coreLoadExecutor-1344-thread-1) [    ] o.a.s.c.SolrResourceLoader JNDI not configured for solr (NoInitialContextEx)
   [junit4]   2> 642713 INFO  (coreLoadExecutor-1344-thread-1) [    ] o.a.s.c.SolrResourceLoader solr home defaulted to 'solr/' (could not find system property or JNDI)
   [junit4]   2> 642714 INFO  (coreLoadExecutor-1344-thread-1) [    ] o.a.s.c.Config loaded config solrconfig.xml with version 0 
   [junit4]   2> 642724 INFO  (coreLoadExecutor-1344-thread-1) [    ] o.a.s.c.SolrConfig current version of requestparams : -1
   [junit4]   2> 642734 INFO  (coreLoadExecutor-1344-thread-1) [    ] o.a.s.c.SolrConfig Using Lucene MatchVersion: 6.2.0
   [junit4]   2> 642746 INFO  (coreLoadExecutor-1344-thread-1) [    ] o.a.s.c.SolrConfig Loaded SolrConfig: solrconfig.xml
   [junit4]   2> 642770 INFO  (coreLoadExecutor-1344-thread-1) [    ] o.a.s.s.IndexSchema [collection1] Schema name=test
   [junit4]   2> 642888 INFO  (coreLoadExecutor-1344-thread-1) [    ] o.a.s.s.OpenExchangeRatesOrgProvider Initialized with rates=open-exchange-rates.json, refreshInterval=1440.
   [junit4]   2> 642896 INFO  (coreLoadExecutor-1344-thread-1) [    ] o.a.s.s.IndexSchema default search field in schema is text
   [junit4]   2> 642897 INFO  (coreLoadExecutor-1344-thread-1) [    ] o.a.s.s.IndexSchema unique key field: id
   [junit4]   2> 642907 INFO  (coreLoadExecutor-1344-thread-1) [    ] o.a.s.s.FileExchangeRateProvider Reloading exchange rates from file currency.xml
   [junit4]   2> 642909 INFO  (coreLoadExecutor-1344-thread-1) [    ] o.a.s.s.FileExchangeRateProvider Reloading exchange rates from file currency.xml
   [junit4]   2> 642911 INFO  (coreLoadExecutor-1344-thread-1) [    ] o.a.s.s.OpenExchangeRatesOrgProvider Reloading exchange rates from open-exchange-rates.json
   [junit4]   2> 642911 INFO  (coreLoadExecutor-1344-thread-1) [    ] o.a.s.s.OpenExchangeRatesOrgProvider Reloading exchange rates from open-exchange-rates.json
   [junit4]   2> 642912 INFO  (coreLoadExecutor-1344-thread-1) [    ] o.a.s.c.ConfigSetProperties Did not find ConfigSet properties, assuming default properties: Can't find resource 'configsetprops.json' in classpath or '/configs/conf1', cwd=/home/jenkins/workspace/Lucene-Solr-6.x-Linux/solr/build/solr-core/test/J1
   [junit4]   2> 642912 INFO  (coreLoadExecutor-1344-thread-1) [    ] o.a.s.c.CoreContainer Creating SolrCore 'collection1' using configuration from collection control_collection
   [junit4]   2> 642912 INFO  (coreLoadExecutor-1344-thread-1) [    ] o.a.s.c.SolrCore org.apache.solr.core.MockDirectoryFactory
   [junit4]   2> 642912 INFO  (coreLoadExecutor-1344-thread-1) [    ] o.a.s.c.SolrCore [[collection1] ] Opening new SolrCore at [/home/jenkins/workspace/Lucene-Solr-6.x-Linux/solr/build/solr-core/test/J1/temp/solr.cloud.CollectionsAPIDistributedZkTest_6253143A87F2A51-001/control-001/cores/collection1], dataDir=[/home/jenkins/workspace/Lucene-Solr-6.x-Linux/solr/build/solr-core/test/J1/temp/solr.cloud.CollectionsAPIDistributedZkTest_6253143A87F2A51-001/control-001/cores/collection1/data/]
   [junit4]   2> 642912 INFO  (coreLoadExecutor-1344-thread-1) [    ] o.a.s.c.JmxMonitoredMap JMX monitoring is enabled. Adding Solr mbeans to JMX Server: com.sun.jmx.mbeanserver.JmxMBeanServer@1285b1c
   [junit4]   2> 642913 INFO  (coreLoadExecutor-1344-thread-1) [    ] o.a.s.c.CachingDirectoryFactory return new directory for /home/jenkins/workspace/Lucene-Solr-6.x-Linux/solr/build/solr-core/test/J1/temp/solr.cloud.CollectionsAPIDistributedZkTest_6253143A87F2A51-001/control-001/cores/collection1/data
   [junit4]   2> 642913 INFO  (coreLoadExecutor-1344-thread-1) [    ] o.a.s.c.SolrCore New index directory detected: old=null new=/home/jenkins/workspace/Lucene-Solr-6.x-Linux/solr/build/solr-core/test/J1/temp/solr.cloud.CollectionsAPIDistributedZkTest_6253143A87F2A51-001/control-001/cores/collection1/data/index/
   [junit4]   2> 642913 WARN  (coreLoadExecutor-1344-thread-1) [    ] o.a.s.c.SolrCore [collection1] Solr index directory '/home/jenkins/workspace/Lucene-Solr-6.x-Linux/solr/build/solr-core/test/J1/temp/solr.cloud.CollectionsAPIDistributedZkTest_6253143A87F2A51-001/control-001/cores/collection1/data/index' doesn't exist. Creating new index...
   [junit4]   2> 642913 INFO  (coreLoadExecutor-1344-thread-1) [    ] o.a.s.c.CachingDirectoryFactory return new directory for /home/jenkins/workspace/Lucene-Solr-6.x-Linux/solr/build/solr-core/test/J1/temp/solr.cloud.CollectionsAPIDistributedZkTest_6253143A87F2A51-001/control-001/cores/collection1/data/index
   [junit4]   2> 642914 INFO  (coreLoadExecutor-1344-thread-1) [    ] o.a.s.u.RandomMergePolicy RandomMergePolicy wrapping class org.apache.lucene.index.TieredMergePolicy: [TieredMergePolicy: maxMergeAtOnce=11, maxMergeAtOnceExplicit=25, maxMergedSegmentMB=87.0029296875, floorSegmentMB=2.0009765625, forceMergeDeletesPctAllowed=1.9193745512531946, segmentsPerTier=16.0, maxCFSSegmentSizeMB=8.796093022207999E12, noCFSRatio=0.4411398214043839
   [junit4]   2> 642914 INFO  (coreLoadExecutor-1344-thread-1) [    ] o.a.s.c.SolrDeletionPolicy SolrDeletionPolicy.onCommit: commits: num=1
   [junit4]   2> 	commit{dir=MockDirectoryWrapper(RAMDirectory@1f2dfad lockFactory=org.apache.lucene.store.SingleInstanceLockFactory@8b8391),segFN=segments_1,generation=1}
   [junit4]   2> 642914 INFO  (coreLoadExecutor-1344-thread-1) [    ] o.a.s.c.SolrDeletionPolicy newest commit generation = 1
   [junit4]   2> 642914 INFO  (OldIndexDirectoryCleanupThreadForCore-collection1) [    ] o.a.s.c.SolrCore Looking for old index directories to cleanup for core collection1 in /home/jenkins/workspace/Lucene-Solr-6.x-Linux/solr/build/solr-core/test/J1/temp/solr.cloud.CollectionsAPIDistributedZkTest_6253143A87F2A51-001/control-001/cores/collection1/data/
   [junit4]   2> 642914 WARN  (OldIndexDirectoryCleanupThreadForCore-collection1) [    ] o.a.s.c.DirectoryFactory /home/jenkins/workspace/Lucene-Solr-6.x-Linux/solr/build/solr-core/test/J1/temp/solr.cloud.CollectionsAPIDistributedZkTest_6253143A87F2A51-001/control-001/cores/collection1/data/ does not point to a valid data directory; skipping clean-up of old index directories.
   [junit4]   2> 642917 INFO  (coreLoadExecutor-1344-thread-1) [    ] o.a.s.u.p.UpdateRequestProcessorChain creating updateRequestProcessorChain "nodistrib"
   [junit4]   2> 642917 INFO  (coreLoadExecutor-1344-thread-1) [    ] o.a.s.u.p.UpdateRequestProcessorChain creating updateRequestProcessorChain "dedupe"
   [junit4]   2> 642917 INFO  (coreLoadExecutor-1344-thread-1) [    ] o.a.s.u.p.UpdateRequestProcessorChain inserting DistributedUpdateProcessorFactory into updateRequestProcessorChain "dedupe"
   [junit4]   2> 642917 INFO  (coreLoadExecutor-1344-thread-1) [    ] o.a.s.u.p.UpdateRequestProcessorChain creating updateRequestProcessorChain "stored_sig"
   [junit4]   2> 642917 INFO  (coreLoadExecutor-1344-thread-1) [    ] o.a.s.u.p.UpdateRequestProcessorChain inserting DistributedUpdateProcessorFactory into updateRequestProcessorChain "stored_sig"
   [junit4]   2> 642917 INFO  (coreLoadExecutor-1344-thread-1) [    ] o.a.s.u.p.UpdateRequestProcessorChain creating updateRequestProcessorChain "distrib-dup-test-chain-explicit"
   [junit4]   2> 642918 INFO  (coreLoadExecutor-1344-thread-1) [    ] o.a.s.u.p.UpdateRequestProcessorChain creating updateRequestProcessorChain "distrib-dup-test-chain-implicit"
   [junit4]   2> 642918 INFO  (coreLoadExecutor-1344-thread-1) [    ] o.a.s.u.p.UpdateRequestProcessorChain inserting DistributedUpdateProcessorFactory into updateRequestProcessorChain "distrib-dup-test-chain-implicit"
   [junit4]   2> 642918 INFO  (coreLoadExecutor-1344-thread-1) [    ] o.a.s.c.SolrCore no updateRequestProcessorChain defined as default, creating implicit default
   [junit4]   2> 642919 WARN  (coreLoadExecutor-1344-thread-1) [    ] o.a.s.c.RequestHandlers INVALID paramSet a in requestHandler {type = requestHandler,name = /dump,class = DumpRequestHandler,args = {defaults={a=A,b=B}}}
   [junit4]   2> 642920 INFO  (coreLoadExecutor-1344-thread-1) [    ] o.a.s.h.l.XMLLoader xsltCacheLifetimeSeconds=60
   [junit4]   2> 642921 INFO  (coreLoadExecutor-1344-thread-1) [    ] o.a.s.h.l.XMLLoader xsltCacheLifetimeSeconds=60
   [junit4]   2> 642922 INFO  (coreLoadExecutor-1344-thread-1) [    ] o.a.s.h.l.XMLLoader xsltCacheLifetimeSeconds=60
   [junit4]   2> 642923 INFO  (coreLoadExecutor-1344-thread-1) [    ] o.a.s.h.l.XMLLoader xsltCacheLifetimeSeconds=60
   [junit4]   2> 642927 INFO  (coreLoadExecutor-1344-thread-1) [    ] o.a.s.c.RequestHandlers Registered paths: /admin/mbeans,standard,/update/json/docs,/admin/luke,/export,/get,/admin/properties,/update/json,/admin/threads,/dump,/update/csv,/sql,/graph,/admin/segments,/admin/system,/replication,/config,/stream,/schema,/admin/plugins,/admin/logging,/admin/ping,/update,/admin/file
   [junit4]   2> 642927 INFO  (coreLoadExecutor-1344-thread-1) [    ] o.a.s.c.SolrCore Using default statsCache cache: org.apache.solr.search.stats.LocalStatsCache
   [junit4]   2> 642927 INFO  (coreLoadExecutor-1344-thread-1) [    ] o.a.s.u.UpdateHandler Using UpdateLog implementation: org.apache.solr.update.UpdateLog
   [junit4]   2> 642927 INFO  (coreLoadExecutor-1344-thread-1) [    ] o.a.s.u.UpdateLog Initializing UpdateLog: dataDir= defaultSyncLevel=FLUSH numRecordsToKeep=100 maxNumLogsToKeep=10 numVersionBuckets=65536
   [junit4]   2> 642928 INFO  (coreLoadExecutor-1344-thread-1) [    ] o.a.s.u.CommitTracker Hard AutoCommit: disabled
   [junit4]   2> 642928 INFO  (coreLoadExecutor-1344-thread-1) [    ] o.a.s.u.CommitTracker Soft AutoCommit: disabled
   [junit4]   2> 642929 INFO  (coreLoadExecutor-1344-thread-1) [    ] o.a.s.u.RandomMergePolicy RandomMergePolicy wrapping class org.apache.lucene.index.TieredMergePolicy: [TieredMergePolicy: maxMergeAtOnce=25, maxMergeAtOnceExplicit=12, maxMergedSegmentMB=97.6015625, floorSegmentMB=1.2734375, forceMergeDeletesPctAllowed=1.1081235488926378, segmentsPerTier=41.0, maxCFSSegmentSizeMB=8.796093022207999E12, noCFSRatio=1.0
   [junit4]   2> 642929 INFO  (coreLoadExecutor-1344-thread-1) [    ] o.a.s.c.SolrDeletionPolicy SolrDeletionPolicy.onInit: commits: num=1
   [junit4]   2> 	commit{dir=MockDirectoryWrapper(RAMDirectory@1f2dfad lockFactory=org.apache.lucene.store.SingleInstanceLockFactory@8b8391),segFN=segments_1,generation=1}
   [junit4]   2> 642929 INFO  (coreLoadExecutor-1344-thread-1) [    ] o.a.s.c.SolrDeletionPolicy newest commit generation = 1
   [junit4]   2> 642929 INFO  (coreLoadExecutor-1344-thread-1) [    ] o.a.s.s.SolrIndexSearcher Opening [Searcher@169759d[collection1] main]
   [junit4]   2> 642929 INFO  (coreLoadExecutor-1344-thread-1) [    ] o.a.s.c.c.ZkStateReader Load collection config from: [/collections/control_collection]
   [junit4]   2> 642930 INFO  (coreLoadExecutor-1344-thread-1) [    ] o.a.s.c.c.ZkStateReader path=[/collections/control_collection] [configName]=[conf1] specified config exists in ZooKeeper
   [junit4]   2> 642930 INFO  (coreLoadExecutor-1344-thread-1) [    ] o.a.s.r.ManagedResourceStorage Setting up ZooKeeper-based storage for the RestManager with znodeBase: /configs/conf1
   [junit4]   2> 642930 INFO  (coreLoadExecutor-1344-thread-1) [    ] o.a.s.r.ManagedResourceStorage Configured ZooKeeperStorageIO with znodeBase: /configs/conf1
   [junit4]   2> 642930 INFO  (coreLoadExecutor-1344-thread-1) [    ] o.a.s.r.RestManager Initializing RestManager with initArgs: {}
   [junit4]   2> 642930 INFO  (coreLoadExecutor-1344-thread-1) [    ] o.a.s.r.ManagedResourceStorage Reading _rest_managed.json using ZooKeeperStorageIO:path=/configs/conf1
   [junit4]   2> 642930 INFO  (coreLoadExecutor-1344-thread-1) [    ] o.a.s.r.ManagedResourceStorage No data found for znode /configs/conf1/_rest_managed.json
   [junit4]   2> 642931 INFO  (coreLoadExecutor-1344-thread-1) [    ] o.a.s.r.ManagedResourceStorage Loaded null at path _rest_managed.json using ZooKeeperStorageIO:path=/configs/conf1
   [junit4]   2> 642931 INFO  (coreLoadExecutor-1344-thread-1) [    ] o.a.s.r.RestManager Initializing 0 registered ManagedResources
   [junit4]   2> 642931 INFO  (coreLoadExecutor-1344-thread-1) [    ] o.a.s.h.ReplicationHandler Commits will be reserved for  10000
   [junit4]   2> 642932 INFO  (searcherExecutor-1345-thread-1) [    ] o.a.s.c.SolrCore [collection1] Registered new searcher Searcher@169759d[collection1] main{ExitableDirectoryReader(UninvertingDirectoryReader())}
   [junit4]   2> 642932 INFO  (coreLoadExecutor-1344-thread-1) [    ] o.a.s.u.UpdateLog Looking up max value of version field to seed version buckets
   [junit4]   2> 642932 INFO  (coreLoadExecutor-1344-thread-1) [    ] o.a.s.u.VersionInfo Refreshing highest value of _version_ for 65536 version buckets from index
   [junit4]   2> 642932 INFO  (coreLoadExecutor-1344-thread-1) [    ] o.a.s.u.VersionInfo No terms found for _version_, cannot seed version bucket highest value from index
   [junit4]   2> 642932 INFO  (coreLoadExecutor-1344-thread-1) [    ] o.a.s.u.UpdateLog Could not find max version in index or recent updates, using new clock 1538948974092746752
   [junit4]   2> 642934 INFO  (coreLoadExecutor-1344-thread-1) [    ] o.a.s.u.UpdateLog Took 1.0ms to seed version buckets with highest version 1538948974092746752
   [junit4]   2> 642934 INFO  (coreLoadExecutor-1344-thread-1) [    ] o.a.s.c.ZkController watch zkdir /configs/conf1
   [junit4]   2> 642934 INFO  (coreLoadExecutor-1344-thread-1) [    ] o.a.s.c.CoreContainer registering core: collection1
   [junit4]   2> 642935 INFO  (coreZkRegister-1338-thread-1) [    ] o.a.s.c.ZkController Register replica - core:collection1 address:https://127.0.0.1:33401 collection:control_collection shard:shard1
   [junit4]   2> 642935 INFO  (coreZkRegister-1338-thread-1) [    ] o.a.s.c.c.SolrZkClient makePath: /collections/control_collection/leader_elect/shard1/election
   [junit4]   2> 642937 INFO  (coreZkRegister-1338-thread-1) [    ] o.a.s.c.LeaderElector Joined leadership election with path: /collections/control_collection/leader_elect/shard1/election/96184310772989959-core_node1-n_0000000000
   [junit4]   2> 642937 INFO  (coreZkRegister-1338-thread-1) [    ] o.a.s.c.ShardLeaderElectionContext Running the leader process for shard=shard1 and weAreReplacement=false and leaderVoteWait=180000
   [junit4]   2> 642938 INFO  (coreZkRegister-1338-thread-1) [    ] o.a.s.c.ShardLeaderElectionContext Enough replicas found to continue.
   [junit4]   2> 642938 INFO  (coreZkRegister-1338-thread-1) [    ] o.a.s.c.ShardLeaderElectionContext I may be the new leader - try and sync
   [junit4]   2> 642938 INFO  (coreZkRegister-1338-thread-1) [    ] o.a.s.c.SyncStrategy Sync replicas to https://127.0.0.1:33401/collection1/
   [junit4]   2> 642938 INFO  (OverseerStateUpdate-96184310772989959-127.0.0.1:33401_-n_0000000000) [    ] o.a.s.c.Overseer processMessage: queueSize: 1, message = {
   [junit4]   2>   "operation":"leader",
   [junit4]   2>   "shard":"shard1",
   [junit4]   2>   "collection":"control_collection"} current state version: 1
   [junit4]   2> 642938 INFO  (coreZkRegister-1338-thread-1) [    ] o.a.s.c.SyncStrategy Sync Success - now sync replicas to me
   [junit4]   2> 642939 INFO  (coreZkRegister-1338-thread-1) [    ] o.a.s.c.SyncStrategy https://127.0.0.1:33401/collection1/ has no replicas
   [junit4]   2> 642939 INFO  (coreZkRegister-1338-thread-1) [    ] o.a.s.c.c.SolrZkClient makePath: /collections/control_collection/leaders/shard1
   [junit4]   2> 642940 INFO  (coreZkRegister-1338-thread-1) [    ] o.a.s.c.ShardLeaderElectionContextBase Creating leader registration node /collections/control_collection/leaders/shard1/leader after winning as /collections/control_collection/leader_elect/shard1/election/96184310772989959-core_node1-n_0000000000
   [junit4]   2> 642942 INFO  (coreZkRegister-1338-thread-1) [    ] o.a.s.c.ShardLeaderElectionContext I am the new leader: https://127.0.0.1:33401/collection1/ shard1
   [junit4]   2> 642943 INFO  (OverseerStateUpdate-96184310772989959-127.0.0.1:33401_-n_0000000000) [    ] o.a.s.c.Overseer processMessage: queueSize: 1, message = {
   [junit4]   2>   "operation":"leader",
   [junit4]   2>   "shard":"shard1",
   [junit4]   2>   "collection":"control_collection",
   [junit4]   2>   "base_url":"https://127.0.0.1:33401",
   [junit4]   2>   "core":"collection1",
   [junit4]   2>   "state":"active"} current state version: 1
   [junit4]   2> 643044 INFO  (zkCallback-465-thread-1) [    ] o.a.s.c.c.ZkStateReader A cluster state change: [WatchedEvent state:SyncConnected type:NodeDataChanged path:/clusterstate.json], has occurred - updating... (live nodes size: [1])
   [junit4]   2> 643093 INFO  (coreZkRegister-1338-thread-1) [    ] o.a.s.c.ZkController We are https://127.0.0.1:33401/collection1/ and leader is https://127.0.0.1:33401/collection1/
   [junit4]   2> 643093 INFO  (coreZkRegister-1338-thread-1) [    ] o.a.s.c.ZkController No LogReplay needed for core=collection1 baseURL=https://127.0.0.1:33401
   [junit4]   2> 643093 INFO  (coreZkRegister-1338-thread-1) [    ] o.a.s.c.ZkController I am the leader, no recovery necessary
   [junit4]   2> 643093 INFO  (coreZkRegister-1338-thread-1) [    ] o.a.s.c.ZkController publishing state=active
   [junit4]   2> 643093 INFO  (coreZkRegister-1338-thread-1) [    ] o.a.s.c.ZkController numShards not found on descriptor - reading it from system property
   [junit4]   2> 643094 INFO  (OverseerStateUpdate-96184310772989959-127.0.0.1:33401_-n_0000000000) [    ] o.a.s.c.Overseer processMessage: queueSize: 1, message = {
   [junit4]   2>   "core":"collection1",
   [junit4]   2>   "core_node_name":"core_node1",
   [junit4]   2>   "roles":null,
   [junit4]   2>   "base_url":"https://127.0.0.1:33401",
   [junit4]   2>   "node_name":"127.0.0.1:33401_",
   [junit4]   2>   "numShards":"1",
   [junit4]   2>   "state":"active",
   [junit4]   2>   "shard":"shard1",
   [junit4]   2>   "collection":"control_collection",
   [junit4]   2>   "operation":"state"} current state version: 2
   [junit4]   2> 643094 INFO  (OverseerStateUpdate-96184310772989959-127.0.0.1:33401_-n_0000000000) [    ] o.a.s.c.o.ReplicaMutator Update state numShards=1 message={
   [junit4]   2>   "core":"collection1",
   [junit4]   2>   "core_node_name":"core_node1",
   [junit4]   2>   "roles":null,
   [junit4]   2>   "base_url":"https://127.0.0.1:33401",
   [junit4]   2>   "node_name":"127.0.0.1:33401_",
   [junit4]   2>   "numShards":"1",
   [junit4]   2>   "state":"active",
   [junit4]   2>   "shard":"shard1",
   [junit4]   2>   "collection":"control_collection",
   [junit4]   2>   "operation":"state"}
   [junit4]   2> 643196 INFO  (zkCallback-465-thread-2) [    ] o.a.s.c.c.ZkStateReader A cluster state change: [WatchedEvent state:SyncConnected type:NodeDataChanged path:/clusterstate.json], has occurred - updating... (live nodes size: [1])
   [junit4]   2> 643211 INFO  (TEST-CollectionsAPIDistributedZkTest.test-seed#[6253143A87F2A51]) [    ] o.a.s.c.c.SolrZkClient Using default ZkCredentialsProvider
   [junit4]   2> 643212 INFO  (TEST-CollectionsAPIDistributedZkTest.test-seed#[6253143A87F2A51]) [    ] o.a.s.c.c.ConnectionManager Waiting for client to connect to ZooKeeper
   [junit4]   2> 643213 INFO  (zkCallback-469-thread-1) [    ] o.a.s.c.c.ConnectionManager Watcher org.apache.solr.common.cloud.ConnectionManager@13189e9 name:ZooKeeperConnection Watcher:127.0.0.1:41826/solr got event WatchedEvent state:SyncConnected type:None path:null path:null type:None
   [junit4]   2> 643213 INFO  (TEST-CollectionsAPIDistributedZkTest.test-seed#[6253143A87F2A51]) [    ] o.a.s.c.c.ConnectionManager Client is connected to ZooKeeper
   [junit4]   2> 643213 INFO  (TEST-CollectionsAPIDistributedZkTest.test-seed#[6253143A87F2A51]) [    ] o.a.s.c.c.SolrZkClient Using default ZkACLProvider
   [junit4]   2> 643214 INFO  (TEST-CollectionsAPIDistributedZkTest.test-seed#[6253143A87F2A51]) [    ] o.a.s.c.c.ZkStateReader Updating cluster state from ZooKeeper... 
   [junit4]   2> 643214 INFO  (TEST-CollectionsAPIDistributedZkTest.test-seed#[6253143A87F2A51]) [    ] o.a.s.c.c.ZkStateReader Loaded cluster properties: {urlScheme=https}
   [junit4]   2> 643214 INFO  (TEST-CollectionsAPIDistributedZkTest.test-seed#[6253143A87F2A51]) [    ] o.a.s.c.c.ZkStateReader Updated live nodes from ZooKeeper... (0) -> (1)
   [junit4]   2> 643215 INFO  (TEST-CollectionsAPIDistributedZkTest.test-seed#[6253143A87F2A51]) [    ] o.a.s.c.ChaosMonkey monkey: init - expire sessions:false cause connection loss:false
   [junit4]   2> 643215 INFO  (TEST-CollectionsAPIDistributedZkTest.test-seed#[6253143A87F2A51]) [    ] o.a.s.c.AbstractFullDistribZkTestBase Creating collection1 with stateFormat=2
   [junit4]   2> 643215 INFO  (TEST-CollectionsAPIDistributedZkTest.test-seed#[6253143A87F2A51]) [    ] o.a.s.c.c.SolrZkClient Using default ZkCredentialsProvider
   [junit4]   2> 643215 INFO  (TEST-CollectionsAPIDistributedZkTest.test-seed#[6253143A87F2A51]) [    ] o.a.s.c.c.ConnectionManager Waiting for client to connect to ZooKeeper
   [junit4]   2> 643217 INFO  (zkCallback-470-thread-1) [    ] o.a.s.c.c.ConnectionManager Watcher org.apache.solr.common.cloud.ConnectionManager@15030f2 name:ZooKeeperConnection Watcher:127.0.0.1:41826/solr got event WatchedEvent state:SyncConnected type:None path:null path:null type:None
   [junit4]   2> 643219 INFO  (TEST-CollectionsAPIDistributedZkTest.test-seed#[6253143A87F2A51]) [    ] o.a.s.c.c.ConnectionManager Client is connected to ZooKeeper
   [junit4]   2> 643219 INFO  (TEST-CollectionsAPIDistributedZkTest.test-seed#[6253143A87F2A51]) [    ] o.a.s.c.c.SolrZkClient Using default ZkACLProvider
   [junit4]   2> 643221 INFO  (OverseerStateUpdate-96184310772989959-127.0.0.1:33401_-n_0000000000) [    ] o.a.s.c.Overseer processMessage: queueSize: 1, message = {
   [junit4]   2>   "operation":"create",
   [junit4]   2>   "name":"collection1",
   [junit4]   2>   "numShards":"2",
   [junit4]   2>   "stateFormat":"2"} current state version: 3
   [junit4]   2> 643221 INFO  (OverseerStateUpdate-96184310772989959-127.0.0.1:33401_-n_0000000000) [    ] o.a.s.c.o.ClusterStateMutator building a new cName: collection1
   [junit4]   2> 643308 INFO  (TEST-CollectionsAPIDistributedZkTest.test-seed#[6253143A87F2A51]) [    ] o.a.s.SolrTestCaseJ4 Writing core.properties file to /home/jenkins/workspace/Lucene-Solr-6.x-Linux/solr/build/solr-core/test/J1/temp/solr.cloud.CollectionsAPIDistributedZkTest_6253143A87F2A51-001/shard-1-001/cores/collection1
   [junit4]   2> 643309 INFO  (TEST-CollectionsAPIDistributedZkTest.test-seed#[6253143A87F2A51]) [    ] o.a.s.c.AbstractFullDistribZkTestBase create jetty 1 in directory /home/jenkins/workspace/Lucene-Solr-6.x-Linux/solr/build/solr-core/test/J1/temp/solr.cloud.CollectionsAPIDistributedZkTest_6253143A87F2A51-001/shard-1-001
   [junit4]   2> 643310 INFO  (TEST-CollectionsAPIDistributedZkTest.test-seed#[6253143A87F2A51]) [    ] o.e.j.s.Server jetty-9.3.8.v20160314
   [junit4]   2> 643311 INFO  (TEST-CollectionsAPIDistributedZkTest.test-seed#[6253143A87F2A51]) [    ] o.e.j.s.h.ContextHandler Started o.e.j.s.ServletContextHandler@f2d1af{/,null,AVAILABLE}
   [junit4]   2> 643312 INFO  (TEST-CollectionsAPIDistributedZkTest.test-seed#[6253143A87F2A51]) [    ] o.e.j.s.ServerConnector Started ServerConnector@1a7d123{SSL,[ssl, http/1.1]}{127.0.0.1:44264}
   [junit4]   2> 643312 INFO  (TEST-CollectionsAPIDistributedZkTest.test-seed#[6253143A87F2A51]) [    ] o.e.j.s.Server Started @645023ms
   [junit4]   2> 643312 INFO  (TEST-CollectionsAPIDistributedZkTest.test-seed#[6253143A87F2A51]) [    ] o.a.s.c.s.e.JettySolrRunner Jetty properties: {hostContext=/, solrconfig=solrconfig.xml, solr.data.dir=/home/jenkins/workspace/Lucene-Solr-6.x-Linux/solr/build/solr-core/test/J1/temp/solr.cloud.CollectionsAPIDistributedZkTest_6253143A87F2A51-001/tempDir-001/jetty1, hostPort=44264, coreRootDirectory=/home/jenkins/workspace/Lucene-Solr-6.x-Linux/solr/build/solr-core/test/J1/temp/solr.cloud.CollectionsAPIDistributedZkTest_6253143A87F2A51-001/shard-1-001/cores}
   [junit4]   2> 643312 INFO  (TEST-CollectionsAPIDistributedZkTest.test-seed#[6253143A87F2A51]) [    ] o.a.s.s.SolrDispatchFilter SolrDispatchFilter.init(): jdk.internal.loader.ClassLoaders$AppClassLoader@340fab
   [junit4]   2> 643313 INFO  (TEST-CollectionsAPIDistributedZkTest.test-seed#[6253143A87F2A51]) [    ] o.a.s.c.SolrResourceLoader new SolrResourceLoader for directory: '/home/jenkins/workspace/Lucene-Solr-6.x-Linux/solr/build/solr-core/test/J1/temp/solr.cloud.CollectionsAPIDistributedZkTest_6253143A87F2A51-001/shard-1-001'
   [junit4]   2> 643313 INFO  (TEST-CollectionsAPIDistributedZkTest.test-seed#[6253143A87F2A51]) [    ] o.a.s.c.SolrResourceLoader JNDI not configured for solr (NoInitialContextEx)
   [junit4]   2> 643313 INFO  (TEST-CollectionsAPIDistributedZkTest.test-seed#[6253143A87F2A51]) [    ] o.a.s.c.SolrResourceLoader solr home defaulted to 'solr/' (could not find system property or JNDI)
   [junit4]   2> 643313 INFO  (TEST-CollectionsAPIDistributedZkTest.test-seed#[6253143A87F2A51]) [    ] o.a.s.c.c.SolrZkClient Using default ZkCredentialsProvider
   [junit4]   2> 643313 INFO  (TEST-CollectionsAPIDistributedZkTest.test-seed#[6253143A87F2A51]) [    ] o.a.s.c.c.ConnectionManager Waiting for client to connect to ZooKeeper
   [junit4]   2> 643315 INFO  (zkCallback-471-thread-1) [    ] o.a.s.c.c.ConnectionManager Watcher org.apache.solr.common.cloud.ConnectionManager@8184a5 name:ZooKeeperConnection Watcher:127.0.0.1:41826/solr got event WatchedEvent state:SyncConnected type:None path:null path:null type:None
   [junit4]   2> 643315 INFO  (TEST-CollectionsAPIDistributedZkTest.test-seed#[6253143A87F2A51]) [    ] o.a.s.c.c.ConnectionManager Client is connected to ZooKeeper
   [junit4]   2> 643316 INFO  (TEST-CollectionsAPIDistributedZkTest.test-seed#[6253143A87F2A51]) [    ] o.a.s.c.c.SolrZkClient Using default ZkACLProvider
   [junit4]   2> 643317 INFO  (TEST-CollectionsAPIDistributedZkTest.test-seed#[6253143A87F2A51]) [    ] o.a.s.s.SolrDispatchFilter Loading solr.xml from SolrHome (not found in ZooKeeper)
   [junit4]   2> 643317 INFO  (TEST-CollectionsAPIDistributedZkTest.test-seed#[6253143A87F2A51]) [    ] o.a.s.c.SolrXmlConfig Loading container configuration from /home/jenki

[...truncated too long message...]

ING ZK TEST SERVER
   [junit4]   2> 788270 INFO  (Thread-941) [    ] o.a.s.c.ZkTestServer client port:0.0.0.0/0.0.0.0:0
   [junit4]   2> 788270 INFO  (Thread-941) [    ] o.a.s.c.ZkTestServer Starting server
   [junit4]   2> 788371 INFO  (TEST-ZkStateReaderTest.testStateFormatUpdateWithTimeDelay-seed#[6253143A87F2A51]) [    ] o.a.s.c.ZkTestServer start zk server on port:38623
   [junit4]   2> 788371 INFO  (TEST-ZkStateReaderTest.testStateFormatUpdateWithTimeDelay-seed#[6253143A87F2A51]) [    ] o.a.s.c.c.SolrZkClient Using default ZkCredentialsProvider
   [junit4]   2> 788371 INFO  (TEST-ZkStateReaderTest.testStateFormatUpdateWithTimeDelay-seed#[6253143A87F2A51]) [    ] o.a.s.c.c.ConnectionManager Waiting for client to connect to ZooKeeper
   [junit4]   2> 788373 INFO  (zkCallback-482-thread-1) [    ] o.a.s.c.c.ConnectionManager Watcher org.apache.solr.common.cloud.ConnectionManager@212c00 name:ZooKeeperConnection Watcher:127.0.0.1:38623 got event WatchedEvent state:SyncConnected type:None path:null path:null type:None
   [junit4]   2> 788373 INFO  (TEST-ZkStateReaderTest.testStateFormatUpdateWithTimeDelay-seed#[6253143A87F2A51]) [    ] o.a.s.c.c.ConnectionManager Client is connected to ZooKeeper
   [junit4]   2> 788373 INFO  (TEST-ZkStateReaderTest.testStateFormatUpdateWithTimeDelay-seed#[6253143A87F2A51]) [    ] o.a.s.c.c.SolrZkClient Using default ZkACLProvider
   [junit4]   2> 788374 INFO  (TEST-ZkStateReaderTest.testStateFormatUpdateWithTimeDelay-seed#[6253143A87F2A51]) [    ] o.a.s.c.c.SolrZkClient Using default ZkCredentialsProvider
   [junit4]   2> 788375 INFO  (TEST-ZkStateReaderTest.testStateFormatUpdateWithTimeDelay-seed#[6253143A87F2A51]) [    ] o.a.s.c.c.ConnectionManager Waiting for client to connect to ZooKeeper
   [junit4]   2> 788376 INFO  (zkCallback-483-thread-1) [    ] o.a.s.c.c.ConnectionManager Watcher org.apache.solr.common.cloud.ConnectionManager@17ef4e7 name:ZooKeeperConnection Watcher:127.0.0.1:38623 got event WatchedEvent state:SyncConnected type:None path:null path:null type:None
   [junit4]   2> 788376 INFO  (TEST-ZkStateReaderTest.testStateFormatUpdateWithTimeDelay-seed#[6253143A87F2A51]) [    ] o.a.s.c.c.ConnectionManager Client is connected to ZooKeeper
   [junit4]   2> 788376 INFO  (TEST-ZkStateReaderTest.testStateFormatUpdateWithTimeDelay-seed#[6253143A87F2A51]) [    ] o.a.s.c.c.SolrZkClient Using default ZkACLProvider
   [junit4]   2> 788376 INFO  (TEST-ZkStateReaderTest.testStateFormatUpdateWithTimeDelay-seed#[6253143A87F2A51]) [    ] o.a.s.c.c.SolrZkClient makePath: /solr
   [junit4]   2> 788378 INFO  (TEST-ZkStateReaderTest.testStateFormatUpdateWithTimeDelay-seed#[6253143A87F2A51]) [    ] o.a.s.c.c.SolrZkClient Using default ZkCredentialsProvider
   [junit4]   2> 788378 INFO  (TEST-ZkStateReaderTest.testStateFormatUpdateWithTimeDelay-seed#[6253143A87F2A51]) [    ] o.a.s.c.c.ConnectionManager Waiting for client to connect to ZooKeeper
   [junit4]   2> 788380 INFO  (zkCallback-484-thread-1) [    ] o.a.s.c.c.ConnectionManager Watcher org.apache.solr.common.cloud.ConnectionManager@5c4c9c name:ZooKeeperConnection Watcher:127.0.0.1:38623/solr got event WatchedEvent state:SyncConnected type:None path:null path:null type:None
   [junit4]   2> 788381 INFO  (TEST-ZkStateReaderTest.testStateFormatUpdateWithTimeDelay-seed#[6253143A87F2A51]) [    ] o.a.s.c.c.ConnectionManager Client is connected to ZooKeeper
   [junit4]   2> 788383 INFO  (TEST-ZkStateReaderTest.testStateFormatUpdateWithTimeDelay-seed#[6253143A87F2A51]) [    ] o.a.s.c.c.SolrZkClient Using default ZkACLProvider
   [junit4]   2> 788383 INFO  (TEST-ZkStateReaderTest.testStateFormatUpdateWithTimeDelay-seed#[6253143A87F2A51]) [    ] o.a.s.c.c.SolrZkClient makePath: /live_nodes
   [junit4]   2> 788385 INFO  (TEST-ZkStateReaderTest.testStateFormatUpdateWithTimeDelay-seed#[6253143A87F2A51]) [    ] o.a.s.c.c.SolrZkClient makePath: /collections
   [junit4]   2> 788386 INFO  (TEST-ZkStateReaderTest.testStateFormatUpdateWithTimeDelay-seed#[6253143A87F2A51]) [    ] o.a.s.c.c.SolrZkClient makePath: /aliases.json
   [junit4]   2> 788387 INFO  (TEST-ZkStateReaderTest.testStateFormatUpdateWithTimeDelay-seed#[6253143A87F2A51]) [    ] o.a.s.c.c.SolrZkClient makePath: /clusterstate.json
   [junit4]   2> 788388 INFO  (TEST-ZkStateReaderTest.testStateFormatUpdateWithTimeDelay-seed#[6253143A87F2A51]) [    ] o.a.s.c.c.SolrZkClient makePath: /security.json
   [junit4]   2> 788389 INFO  (TEST-ZkStateReaderTest.testStateFormatUpdateWithTimeDelay-seed#[6253143A87F2A51]) [    ] o.a.s.c.c.ZkStateReader Updating cluster state from ZooKeeper... 
   [junit4]   2> 788390 INFO  (TEST-ZkStateReaderTest.testStateFormatUpdateWithTimeDelay-seed#[6253143A87F2A51]) [    ] o.a.s.c.c.ZkStateReader Loaded empty cluster properties
   [junit4]   2> 788390 INFO  (TEST-ZkStateReaderTest.testStateFormatUpdateWithTimeDelay-seed#[6253143A87F2A51]) [    ] o.a.s.c.c.ZkStateReader Updated live nodes from ZooKeeper... (0) -> (0)
   [junit4]   2> 788393 INFO  (TEST-ZkStateReaderTest.testStateFormatUpdateWithTimeDelay-seed#[6253143A87F2A51]) [    ] o.a.s.c.c.ZkStateReader Deleting data for [c1]
   [junit4]   2> 788393 INFO  (TEST-ZkStateReaderTest.testStateFormatUpdateWithTimeDelay-seed#[6253143A87F2A51]) [    ] o.a.s.c.c.SolrZkClient makePath: /collections/c1
   [junit4]   2> 788395 INFO  (zkCallback-484-thread-1) [    ] o.a.s.c.c.ZkStateReader A collections change: [WatchedEvent state:SyncConnected type:NodeChildrenChanged path:/collections], has occurred - updating...
   [junit4]   2> 788396 INFO  (zkCallback-484-thread-1) [    ] o.a.s.c.c.ZkStateReader A cluster state change: [WatchedEvent state:SyncConnected type:NodeDataChanged path:/clusterstate.json], has occurred - updating... (live nodes size: [0])
   [junit4]   2> 788397 INFO  (TEST-ZkStateReaderTest.testStateFormatUpdateWithTimeDelay-seed#[6253143A87F2A51]) [    ] o.a.s.c.o.ZkStateWriter going to create_collection /collections/c1/state.json
   [junit4]   2> 788397 INFO  (zkCallback-484-thread-1) [    ] o.a.s.c.c.ZkStateReader A cluster state change: [WatchedEvent state:SyncConnected type:NodeCreated path:/collections/c1/state.json] for collection [c1] has occurred - updating... (live nodes size: [0])
   [junit4]   2> 788398 INFO  (zkCallback-484-thread-1) [    ] o.a.s.c.c.ZkStateReader Add data for [c1] ver [0]
   [junit4]   2> 788398 INFO  (zkCallback-484-thread-1) [    ] o.a.s.c.c.ZkStateReader A cluster state change: [WatchedEvent state:SyncConnected type:NodeDataChanged path:/clusterstate.json], has occurred - updating... (live nodes size: [0])
   [junit4]   2> 788399 INFO  (TEST-ZkStateReaderTest.testStateFormatUpdateWithTimeDelay-seed#[6253143A87F2A51]) [    ] o.a.s.c.ZkTestServer connecting to 127.0.0.1:38623 38623
   [junit4]   2> 803410 INFO  (Thread-941) [    ] o.a.s.c.ZkTestServer connecting to 127.0.0.1:38623 38623
   [junit4]   2> 803411 INFO  (TEST-ZkStateReaderTest.testStateFormatUpdateWithTimeDelay-seed#[6253143A87F2A51]) [    ] o.a.s.SolrTestCaseJ4 ###Ending testStateFormatUpdateWithTimeDelay
   [junit4]   2> 803412 INFO  (SUITE-ZkStateReaderTest-seed#[6253143A87F2A51]-worker) [    ] o.a.s.SolrTestCaseJ4 ###deleteCore
   [junit4]   2> NOTE: leaving temporary files on disk at: /home/jenkins/workspace/Lucene-Solr-6.x-Linux/solr/build/solr-core/test/J0/temp/solr.cloud.overseer.ZkStateReaderTest_6253143A87F2A51-001
   [junit4]   2> NOTE: test params are: codec=FastDecompressionCompressingStoredFields(storedFieldsFormat=CompressingStoredFieldsFormat(compressionMode=FAST_DECOMPRESSION, chunkSize=1, maxDocsPerChunk=9, blockSize=283), termVectorsFormat=CompressingTermVectorsFormat(compressionMode=FAST_DECOMPRESSION, chunkSize=1, blockSize=283)), sim=RandomSimilarity(queryNorm=false,coord=crazy): {}, locale=ro-MD, timezone=Asia/Almaty
   [junit4]   2> NOTE: Linux 4.4.0-28-generic i386/Oracle Corporation 9-ea (32-bit)/cpus=12,threads=1,free=123556632,total=363003904
   [junit4]   2> NOTE: All tests run in this JVM: [TestJoin, TestAtomicUpdateErrorCases, SOLR749Test, LeaderElectionIntegrationTest, GraphQueryTest, SimpleCollectionCreateDeleteTest, ForceLeaderTest, ReturnFieldsTest, IndexSchemaRuntimeFieldTest, SolrCoreTest, AnalyticsQueryTest, TestOmitPositions, TestHdfsBackupRestoreCore, URLClassifyProcessorTest, AsyncCallRequestStatusResponseTest, DistributedSpellCheckComponentTest, ShardSplitTest, TestOrdValues, PingRequestHandlerTest, BadCopyFieldTest, TestFaceting, TestSerializedLuceneMatchVersion, SolrXmlInZkTest, JSONWriterTest, DistributedQueryComponentOptimizationTest, SynonymTokenizerTest, HdfsBasicDistributedZkTest, PeerSyncTest, TestUseDocValuesAsStored, ZkStateReaderTest]
   [junit4] Completed [323/619 (2!)] on J0 in 56.22s, 6 tests, 1 error <<< FAILURES!

[...truncated 911 lines...]
BUILD FAILED
/home/jenkins/workspace/Lucene-Solr-6.x-Linux/build.xml:740: The following error occurred while executing this line:
/home/jenkins/workspace/Lucene-Solr-6.x-Linux/build.xml:684: The following error occurred while executing this line:
/home/jenkins/workspace/Lucene-Solr-6.x-Linux/build.xml:59: The following error occurred while executing this line:
/home/jenkins/workspace/Lucene-Solr-6.x-Linux/solr/build.xml:233: The following error occurred while executing this line:
/home/jenkins/workspace/Lucene-Solr-6.x-Linux/solr/common-build.xml:530: The following error occurred while executing this line:
/home/jenkins/workspace/Lucene-Solr-6.x-Linux/lucene/common-build.xml:1427: The following error occurred while executing this line:
/home/jenkins/workspace/Lucene-Solr-6.x-Linux/lucene/common-build.xml:984: There were test failures: 619 suites (10 ignored), 2597 tests, 2 suite-level errors, 2 errors, 1578 ignored (58 assumptions) [seed: 6253143A87F2A51]

Total time: 58 minutes 59 seconds
Build step 'Invoke Ant' marked build as failure
Archiving artifacts
[WARNINGS] Skipping publisher since build result is FAILURE
Recording test results
Email was triggered for: Failure - Any
Sending email for trigger: Failure - Any



Mime
View raw message