lucene-dev mailing list archives

Site index · List index
Message view « Date » · « Thread »
Top « Date » · « Thread »
From Policeman Jenkins Server <jenk...@thetaphi.de>
Subject [JENKINS] Lucene-Solr-6.x-Linux (64bit/jdk1.8.0_92) - Build # 1022 - Still Failing!
Date Fri, 01 Jul 2016 20:28:06 GMT
Build: http://jenkins.thetaphi.de/job/Lucene-Solr-6.x-Linux/1022/
Java: 64bit/jdk1.8.0_92 -XX:-UseCompressedOops -XX:+UseParallelGC

1 tests failed.
FAILED:  org.apache.solr.schema.TestManagedSchemaAPI.test

Error Message:
Error from server at http://127.0.0.1:46673/solr/testschemaapi_shard1_replica1: ERROR: [doc=2] unknown field 'myNewField1'

Stack Trace:
org.apache.solr.client.solrj.impl.CloudSolrClient$RouteException: Error from server at http://127.0.0.1:46673/solr/testschemaapi_shard1_replica1: ERROR: [doc=2] unknown field 'myNewField1'
	at __randomizedtesting.SeedInfo.seed([E53AD2C930CED3B1:6D6EED139E32BE49]:0)
	at org.apache.solr.client.solrj.impl.CloudSolrClient.directUpdate(CloudSolrClient.java:697)
	at org.apache.solr.client.solrj.impl.CloudSolrClient.sendRequest(CloudSolrClient.java:1109)
	at org.apache.solr.client.solrj.impl.CloudSolrClient.requestWithRetryOnStaleState(CloudSolrClient.java:998)
	at org.apache.solr.client.solrj.impl.CloudSolrClient.request(CloudSolrClient.java:934)
	at org.apache.solr.schema.TestManagedSchemaAPI.testAddFieldAndDocument(TestManagedSchemaAPI.java:86)
	at org.apache.solr.schema.TestManagedSchemaAPI.test(TestManagedSchemaAPI.java:55)
	at sun.reflect.NativeMethodAccessorImpl.invoke0(Native Method)
	at sun.reflect.NativeMethodAccessorImpl.invoke(NativeMethodAccessorImpl.java:62)
	at sun.reflect.DelegatingMethodAccessorImpl.invoke(DelegatingMethodAccessorImpl.java:43)
	at java.lang.reflect.Method.invoke(Method.java:498)
	at com.carrotsearch.randomizedtesting.RandomizedRunner.invoke(RandomizedRunner.java:1764)
	at com.carrotsearch.randomizedtesting.RandomizedRunner$8.evaluate(RandomizedRunner.java:871)
	at com.carrotsearch.randomizedtesting.RandomizedRunner$9.evaluate(RandomizedRunner.java:907)
	at com.carrotsearch.randomizedtesting.RandomizedRunner$10.evaluate(RandomizedRunner.java:921)
	at com.carrotsearch.randomizedtesting.rules.SystemPropertiesRestoreRule$1.evaluate(SystemPropertiesRestoreRule.java:57)
	at org.apache.lucene.util.TestRuleSetupTeardownChained$1.evaluate(TestRuleSetupTeardownChained.java:49)
	at org.apache.lucene.util.AbstractBeforeAfterRule$1.evaluate(AbstractBeforeAfterRule.java:45)
	at org.apache.lucene.util.TestRuleThreadAndTestName$1.evaluate(TestRuleThreadAndTestName.java:48)
	at org.apache.lucene.util.TestRuleIgnoreAfterMaxFailures$1.evaluate(TestRuleIgnoreAfterMaxFailures.java:64)
	at org.apache.lucene.util.TestRuleMarkFailure$1.evaluate(TestRuleMarkFailure.java:47)
	at com.carrotsearch.randomizedtesting.rules.StatementAdapter.evaluate(StatementAdapter.java:36)
	at com.carrotsearch.randomizedtesting.ThreadLeakControl$StatementRunner.run(ThreadLeakControl.java:367)
	at com.carrotsearch.randomizedtesting.ThreadLeakControl.forkTimeoutingTask(ThreadLeakControl.java:809)
	at com.carrotsearch.randomizedtesting.ThreadLeakControl$3.evaluate(ThreadLeakControl.java:460)
	at com.carrotsearch.randomizedtesting.RandomizedRunner.runSingleTest(RandomizedRunner.java:880)
	at com.carrotsearch.randomizedtesting.RandomizedRunner$5.evaluate(RandomizedRunner.java:781)
	at com.carrotsearch.randomizedtesting.RandomizedRunner$6.evaluate(RandomizedRunner.java:816)
	at com.carrotsearch.randomizedtesting.RandomizedRunner$7.evaluate(RandomizedRunner.java:827)
	at com.carrotsearch.randomizedtesting.rules.StatementAdapter.evaluate(StatementAdapter.java:36)
	at com.carrotsearch.randomizedtesting.rules.SystemPropertiesRestoreRule$1.evaluate(SystemPropertiesRestoreRule.java:57)
	at org.apache.lucene.util.AbstractBeforeAfterRule$1.evaluate(AbstractBeforeAfterRule.java:45)
	at com.carrotsearch.randomizedtesting.rules.StatementAdapter.evaluate(StatementAdapter.java:36)
	at org.apache.lucene.util.TestRuleStoreClassName$1.evaluate(TestRuleStoreClassName.java:41)
	at com.carrotsearch.randomizedtesting.rules.NoShadowingOrOverridesOnMethodsRule$1.evaluate(NoShadowingOrOverridesOnMethodsRule.java:40)
	at com.carrotsearch.randomizedtesting.rules.NoShadowingOrOverridesOnMethodsRule$1.evaluate(NoShadowingOrOverridesOnMethodsRule.java:40)
	at com.carrotsearch.randomizedtesting.rules.StatementAdapter.evaluate(StatementAdapter.java:36)
	at com.carrotsearch.randomizedtesting.rules.StatementAdapter.evaluate(StatementAdapter.java:36)
	at com.carrotsearch.randomizedtesting.rules.StatementAdapter.evaluate(StatementAdapter.java:36)
	at org.apache.lucene.util.TestRuleAssertionsRequired$1.evaluate(TestRuleAssertionsRequired.java:53)
	at org.apache.lucene.util.TestRuleMarkFailure$1.evaluate(TestRuleMarkFailure.java:47)
	at org.apache.lucene.util.TestRuleIgnoreAfterMaxFailures$1.evaluate(TestRuleIgnoreAfterMaxFailures.java:64)
	at org.apache.lucene.util.TestRuleIgnoreTestSuites$1.evaluate(TestRuleIgnoreTestSuites.java:54)
	at com.carrotsearch.randomizedtesting.rules.StatementAdapter.evaluate(StatementAdapter.java:36)
	at com.carrotsearch.randomizedtesting.ThreadLeakControl$StatementRunner.run(ThreadLeakControl.java:367)
	at java.lang.Thread.run(Thread.java:745)
Caused by: org.apache.solr.client.solrj.impl.HttpSolrClient$RemoteSolrException: Error from server at http://127.0.0.1:46673/solr/testschemaapi_shard1_replica1: ERROR: [doc=2] unknown field 'myNewField1'
	at org.apache.solr.client.solrj.impl.HttpSolrClient.executeMethod(HttpSolrClient.java:590)
	at org.apache.solr.client.solrj.impl.HttpSolrClient.request(HttpSolrClient.java:259)
	at org.apache.solr.client.solrj.impl.HttpSolrClient.request(HttpSolrClient.java:248)
	at org.apache.solr.client.solrj.impl.LBHttpSolrClient.doRequest(LBHttpSolrClient.java:403)
	at org.apache.solr.client.solrj.impl.LBHttpSolrClient.request(LBHttpSolrClient.java:356)
	at org.apache.solr.client.solrj.impl.CloudSolrClient.lambda$directUpdate$0(CloudSolrClient.java:674)
	at java.util.concurrent.FutureTask.run(FutureTask.java:266)
	at org.apache.solr.common.util.ExecutorUtil$MDCAwareThreadPoolExecutor.lambda$execute$0(ExecutorUtil.java:229)
	at java.util.concurrent.ThreadPoolExecutor.runWorker(ThreadPoolExecutor.java:1142)
	at java.util.concurrent.ThreadPoolExecutor$Worker.run(ThreadPoolExecutor.java:617)
	... 1 more




Build Log:
[...truncated 12365 lines...]
   [junit4] Suite: org.apache.solr.schema.TestManagedSchemaAPI
   [junit4]   2> Creating dataDir: /home/jenkins/workspace/Lucene-Solr-6.x-Linux/solr/build/solr-core/test/J2/temp/solr.schema.TestManagedSchemaAPI_E53AD2C930CED3B1-001/init-core-data-001
   [junit4]   2> 1753518 INFO  (SUITE-TestManagedSchemaAPI-seed#[E53AD2C930CED3B1]-worker) [    ] o.a.s.SolrTestCaseJ4 Randomized ssl (false) and clientAuth (false) via: @org.apache.solr.util.RandomizeSSL(reason=, ssl=NaN, value=NaN, clientAuth=NaN)
   [junit4]   2> 1753519 INFO  (SUITE-TestManagedSchemaAPI-seed#[E53AD2C930CED3B1]-worker) [    ] o.a.s.c.ZkTestServer STARTING ZK TEST SERVER
   [junit4]   2> 1753519 INFO  (Thread-5100) [    ] o.a.s.c.ZkTestServer client port:0.0.0.0/0.0.0.0:0
   [junit4]   2> 1753519 INFO  (Thread-5100) [    ] o.a.s.c.ZkTestServer Starting server
   [junit4]   2> 1753619 INFO  (SUITE-TestManagedSchemaAPI-seed#[E53AD2C930CED3B1]-worker) [    ] o.a.s.c.ZkTestServer start zk server on port:35631
   [junit4]   2> 1753619 INFO  (SUITE-TestManagedSchemaAPI-seed#[E53AD2C930CED3B1]-worker) [    ] o.a.s.c.c.SolrZkClient Using default ZkCredentialsProvider
   [junit4]   2> 1753619 INFO  (SUITE-TestManagedSchemaAPI-seed#[E53AD2C930CED3B1]-worker) [    ] o.a.s.c.c.ConnectionManager Waiting for client to connect to ZooKeeper
   [junit4]   2> 1753623 INFO  (zkCallback-2756-thread-1) [    ] o.a.s.c.c.ConnectionManager Watcher org.apache.solr.common.cloud.ConnectionManager@1f547876 name:ZooKeeperConnection Watcher:127.0.0.1:35631 got event WatchedEvent state:SyncConnected type:None path:null path:null type:None
   [junit4]   2> 1753623 INFO  (SUITE-TestManagedSchemaAPI-seed#[E53AD2C930CED3B1]-worker) [    ] o.a.s.c.c.ConnectionManager Client is connected to ZooKeeper
   [junit4]   2> 1753623 INFO  (SUITE-TestManagedSchemaAPI-seed#[E53AD2C930CED3B1]-worker) [    ] o.a.s.c.c.SolrZkClient Using default ZkACLProvider
   [junit4]   2> 1753623 INFO  (SUITE-TestManagedSchemaAPI-seed#[E53AD2C930CED3B1]-worker) [    ] o.a.s.c.c.SolrZkClient makePath: /solr/solr.xml
   [junit4]   2> 1753626 INFO  (jetty-launcher-2755-thread-1) [    ] o.e.j.s.Server jetty-9.3.8.v20160314
   [junit4]   2> 1753626 INFO  (jetty-launcher-2755-thread-2) [    ] o.e.j.s.Server jetty-9.3.8.v20160314
   [junit4]   2> 1753648 INFO  (jetty-launcher-2755-thread-2) [    ] o.e.j.s.h.ContextHandler Started o.e.j.s.ServletContextHandler@109e1dae{/solr,null,AVAILABLE}
   [junit4]   2> 1753648 INFO  (jetty-launcher-2755-thread-1) [    ] o.e.j.s.h.ContextHandler Started o.e.j.s.ServletContextHandler@5ee2548d{/solr,null,AVAILABLE}
   [junit4]   2> 1753651 INFO  (jetty-launcher-2755-thread-2) [    ] o.e.j.s.ServerConnector Started ServerConnector@1152fe8c{HTTP/1.1,[http/1.1]}{127.0.0.1:34347}
   [junit4]   2> 1753651 INFO  (jetty-launcher-2755-thread-1) [    ] o.e.j.s.ServerConnector Started ServerConnector@1ca86439{HTTP/1.1,[http/1.1]}{127.0.0.1:46673}
   [junit4]   2> 1753651 INFO  (jetty-launcher-2755-thread-2) [    ] o.e.j.s.Server Started @1756540ms
   [junit4]   2> 1753651 INFO  (jetty-launcher-2755-thread-1) [    ] o.e.j.s.Server Started @1756540ms
   [junit4]   2> 1753651 INFO  (jetty-launcher-2755-thread-2) [    ] o.a.s.c.s.e.JettySolrRunner Jetty properties: {hostContext=/solr, hostPort=34347}
   [junit4]   2> 1753651 INFO  (jetty-launcher-2755-thread-1) [    ] o.a.s.c.s.e.JettySolrRunner Jetty properties: {hostContext=/solr, hostPort=46673}
   [junit4]   2> 1753651 INFO  (jetty-launcher-2755-thread-2) [    ] o.a.s.s.SolrDispatchFilter SolrDispatchFilter.init(): sun.misc.Launcher$AppClassLoader@73d16e93
   [junit4]   2> 1753651 INFO  (jetty-launcher-2755-thread-1) [    ] o.a.s.s.SolrDispatchFilter SolrDispatchFilter.init(): sun.misc.Launcher$AppClassLoader@73d16e93
   [junit4]   2> 1753651 INFO  (jetty-launcher-2755-thread-2) [    ] o.a.s.c.SolrResourceLoader new SolrResourceLoader for directory: '/home/jenkins/workspace/Lucene-Solr-6.x-Linux/solr/build/solr-core/test/J2/temp/solr.schema.TestManagedSchemaAPI_E53AD2C930CED3B1-001/tempDir-001/node2'
   [junit4]   2> 1753651 INFO  (jetty-launcher-2755-thread-1) [    ] o.a.s.c.SolrResourceLoader new SolrResourceLoader for directory: '/home/jenkins/workspace/Lucene-Solr-6.x-Linux/solr/build/solr-core/test/J2/temp/solr.schema.TestManagedSchemaAPI_E53AD2C930CED3B1-001/tempDir-001/node1'
   [junit4]   2> 1753651 INFO  (jetty-launcher-2755-thread-2) [    ] o.a.s.c.SolrResourceLoader JNDI not configured for solr (NoInitialContextEx)
   [junit4]   2> 1753651 INFO  (jetty-launcher-2755-thread-1) [    ] o.a.s.c.SolrResourceLoader JNDI not configured for solr (NoInitialContextEx)
   [junit4]   2> 1753651 INFO  (jetty-launcher-2755-thread-2) [    ] o.a.s.c.SolrResourceLoader solr home defaulted to 'solr/' (could not find system property or JNDI)
   [junit4]   2> 1753651 INFO  (jetty-launcher-2755-thread-1) [    ] o.a.s.c.SolrResourceLoader solr home defaulted to 'solr/' (could not find system property or JNDI)
   [junit4]   2> 1753652 INFO  (jetty-launcher-2755-thread-2) [    ] o.a.s.c.c.SolrZkClient Using default ZkCredentialsProvider
   [junit4]   2> 1753652 INFO  (jetty-launcher-2755-thread-1) [    ] o.a.s.c.c.SolrZkClient Using default ZkCredentialsProvider
   [junit4]   2> 1753652 INFO  (jetty-launcher-2755-thread-2) [    ] o.a.s.c.c.ConnectionManager Waiting for client to connect to ZooKeeper
   [junit4]   2> 1753652 INFO  (jetty-launcher-2755-thread-1) [    ] o.a.s.c.c.ConnectionManager Waiting for client to connect to ZooKeeper
   [junit4]   2> 1753654 INFO  (zkCallback-2757-thread-1) [    ] o.a.s.c.c.ConnectionManager Watcher org.apache.solr.common.cloud.ConnectionManager@41996e35 name:ZooKeeperConnection Watcher:127.0.0.1:35631/solr got event WatchedEvent state:SyncConnected type:None path:null path:null type:None
   [junit4]   2> 1753655 INFO  (jetty-launcher-2755-thread-2) [    ] o.a.s.c.c.ConnectionManager Client is connected to ZooKeeper
   [junit4]   2> 1753655 INFO  (jetty-launcher-2755-thread-2) [    ] o.a.s.c.c.SolrZkClient Using default ZkACLProvider
   [junit4]   2> 1753655 INFO  (jetty-launcher-2755-thread-2) [    ] o.a.s.s.SolrDispatchFilter solr.xml found in ZooKeeper. Loading...
   [junit4]   2> 1753657 INFO  (zkCallback-2758-thread-1) [    ] o.a.s.c.c.ConnectionManager Watcher org.apache.solr.common.cloud.ConnectionManager@4bf14eaf name:ZooKeeperConnection Watcher:127.0.0.1:35631/solr got event WatchedEvent state:SyncConnected type:None path:null path:null type:None
   [junit4]   2> 1753658 INFO  (jetty-launcher-2755-thread-1) [    ] o.a.s.c.c.ConnectionManager Client is connected to ZooKeeper
   [junit4]   2> 1753661 INFO  (jetty-launcher-2755-thread-1) [    ] o.a.s.c.c.SolrZkClient Using default ZkACLProvider
   [junit4]   2> 1753666 INFO  (jetty-launcher-2755-thread-2) [    ] o.a.s.c.CorePropertiesLocator Config-defined core root directory: /home/jenkins/workspace/Lucene-Solr-6.x-Linux/solr/build/solr-core/test/J2/temp/solr.schema.TestManagedSchemaAPI_E53AD2C930CED3B1-001/tempDir-001/node2/.
   [junit4]   2> 1753667 INFO  (jetty-launcher-2755-thread-2) [    ] o.a.s.c.CoreContainer New CoreContainer 1652556405
   [junit4]   2> 1753667 INFO  (jetty-launcher-2755-thread-2) [    ] o.a.s.c.CoreContainer Loading cores into CoreContainer [instanceDir=/home/jenkins/workspace/Lucene-Solr-6.x-Linux/solr/build/solr-core/test/J2/temp/solr.schema.TestManagedSchemaAPI_E53AD2C930CED3B1-001/tempDir-001/node2]
   [junit4]   2> 1753667 WARN  (jetty-launcher-2755-thread-2) [    ] o.a.s.c.CoreContainer Couldn't add files from /home/jenkins/workspace/Lucene-Solr-6.x-Linux/solr/build/solr-core/test/J2/temp/solr.schema.TestManagedSchemaAPI_E53AD2C930CED3B1-001/tempDir-001/node2/lib to classpath: /home/jenkins/workspace/Lucene-Solr-6.x-Linux/solr/build/solr-core/test/J2/temp/solr.schema.TestManagedSchemaAPI_E53AD2C930CED3B1-001/tempDir-001/node2/lib
   [junit4]   2> 1753667 INFO  (jetty-launcher-2755-thread-2) [    ] o.a.s.h.c.HttpShardHandlerFactory created with socketTimeout : 90000,urlScheme : ,connTimeout : 15000,maxConnectionsPerHost : 20,maxConnections : 10000,corePoolSize : 0,maximumPoolSize : 2147483647,maxThreadIdleTime : 5,sizeOfQueue : -1,fairnessPolicy : false,useRetries : false,
   [junit4]   2> 1753668 INFO  (jetty-launcher-2755-thread-1) [    ] o.a.s.s.SolrDispatchFilter solr.xml found in ZooKeeper. Loading...
   [junit4]   2> 1753668 INFO  (jetty-launcher-2755-thread-2) [    ] o.a.s.u.UpdateShardHandler Creating UpdateShardHandler HTTP client with params: socketTimeout=340000&connTimeout=45000&retry=true
   [junit4]   2> 1753669 INFO  (jetty-launcher-2755-thread-2) [    ] o.a.s.l.LogWatcher SLF4J impl is org.slf4j.impl.Log4jLoggerFactory
   [junit4]   2> 1753669 INFO  (jetty-launcher-2755-thread-2) [    ] o.a.s.l.LogWatcher Registering Log Listener [Log4j (org.slf4j.impl.Log4jLoggerFactory)]
   [junit4]   2> 1753669 INFO  (jetty-launcher-2755-thread-2) [    ] o.a.s.c.ZkContainer Zookeeper client=127.0.0.1:35631/solr
   [junit4]   2> 1753669 INFO  (jetty-launcher-2755-thread-2) [    ] o.a.s.c.ZkController zkHost includes chroot
   [junit4]   2> 1753669 INFO  (jetty-launcher-2755-thread-2) [    ] o.a.s.c.c.SolrZkClient Using default ZkCredentialsProvider
   [junit4]   2> 1753669 INFO  (jetty-launcher-2755-thread-2) [    ] o.a.s.c.c.ConnectionManager Waiting for client to connect to ZooKeeper
   [junit4]   2> 1753672 INFO  (jetty-launcher-2755-thread-1) [    ] o.a.s.c.CorePropertiesLocator Config-defined core root directory: /home/jenkins/workspace/Lucene-Solr-6.x-Linux/solr/build/solr-core/test/J2/temp/solr.schema.TestManagedSchemaAPI_E53AD2C930CED3B1-001/tempDir-001/node1/.
   [junit4]   2> 1753672 INFO  (jetty-launcher-2755-thread-1) [    ] o.a.s.c.CoreContainer New CoreContainer 1765508835
   [junit4]   2> 1753672 INFO  (jetty-launcher-2755-thread-1) [    ] o.a.s.c.CoreContainer Loading cores into CoreContainer [instanceDir=/home/jenkins/workspace/Lucene-Solr-6.x-Linux/solr/build/solr-core/test/J2/temp/solr.schema.TestManagedSchemaAPI_E53AD2C930CED3B1-001/tempDir-001/node1]
   [junit4]   2> 1753672 WARN  (jetty-launcher-2755-thread-1) [    ] o.a.s.c.CoreContainer Couldn't add files from /home/jenkins/workspace/Lucene-Solr-6.x-Linux/solr/build/solr-core/test/J2/temp/solr.schema.TestManagedSchemaAPI_E53AD2C930CED3B1-001/tempDir-001/node1/lib to classpath: /home/jenkins/workspace/Lucene-Solr-6.x-Linux/solr/build/solr-core/test/J2/temp/solr.schema.TestManagedSchemaAPI_E53AD2C930CED3B1-001/tempDir-001/node1/lib
   [junit4]   2> 1753673 INFO  (jetty-launcher-2755-thread-1) [    ] o.a.s.h.c.HttpShardHandlerFactory created with socketTimeout : 90000,urlScheme : ,connTimeout : 15000,maxConnectionsPerHost : 20,maxConnections : 10000,corePoolSize : 0,maximumPoolSize : 2147483647,maxThreadIdleTime : 5,sizeOfQueue : -1,fairnessPolicy : false,useRetries : false,
   [junit4]   2> 1753673 INFO  (zkCallback-2761-thread-1) [    ] o.a.s.c.c.ConnectionManager Watcher org.apache.solr.common.cloud.ConnectionManager@166b066f name:ZooKeeperConnection Watcher:127.0.0.1:35631 got event WatchedEvent state:SyncConnected type:None path:null path:null type:None
   [junit4]   2> 1753673 INFO  (jetty-launcher-2755-thread-2) [    ] o.a.s.c.c.ConnectionManager Client is connected to ZooKeeper
   [junit4]   2> 1753673 INFO  (jetty-launcher-2755-thread-2) [    ] o.a.s.c.c.SolrZkClient Using default ZkACLProvider
   [junit4]   2> 1753673 INFO  (jetty-launcher-2755-thread-1) [    ] o.a.s.u.UpdateShardHandler Creating UpdateShardHandler HTTP client with params: socketTimeout=340000&connTimeout=45000&retry=true
   [junit4]   2> 1753673 INFO  (jetty-launcher-2755-thread-1) [    ] o.a.s.l.LogWatcher SLF4J impl is org.slf4j.impl.Log4jLoggerFactory
   [junit4]   2> 1753673 INFO  (jetty-launcher-2755-thread-1) [    ] o.a.s.l.LogWatcher Registering Log Listener [Log4j (org.slf4j.impl.Log4jLoggerFactory)]
   [junit4]   2> 1753673 INFO  (jetty-launcher-2755-thread-1) [    ] o.a.s.c.ZkContainer Zookeeper client=127.0.0.1:35631/solr
   [junit4]   2> 1753673 INFO  (jetty-launcher-2755-thread-2) [n:127.0.0.1:34347_solr    ] o.a.s.c.ZkController Added new OnReconnect listener org.apache.solr.cloud.ZkController$$Lambda$76/1031306167@21ccc464
   [junit4]   2> 1753673 INFO  (jetty-launcher-2755-thread-1) [    ] o.a.s.c.ZkController zkHost includes chroot
   [junit4]   2> 1753674 INFO  (jetty-launcher-2755-thread-1) [    ] o.a.s.c.c.SolrZkClient Using default ZkCredentialsProvider
   [junit4]   2> 1753674 INFO  (jetty-launcher-2755-thread-2) [n:127.0.0.1:34347_solr    ] o.a.s.c.c.ConnectionManager Waiting for client to connect to ZooKeeper
   [junit4]   2> 1753674 INFO  (jetty-launcher-2755-thread-1) [    ] o.a.s.c.c.ConnectionManager Waiting for client to connect to ZooKeeper
   [junit4]   2> 1753674 INFO  (zkCallback-2764-thread-1-processing-n:127.0.0.1:34347_solr) [n:127.0.0.1:34347_solr    ] o.a.s.c.c.ConnectionManager Watcher org.apache.solr.common.cloud.ConnectionManager@478120a name:ZooKeeperConnection Watcher:127.0.0.1:35631/solr got event WatchedEvent state:SyncConnected type:None path:null path:null type:None
   [junit4]   2> 1753674 INFO  (jetty-launcher-2755-thread-2) [n:127.0.0.1:34347_solr    ] o.a.s.c.c.ConnectionManager Client is connected to ZooKeeper
   [junit4]   2> 1753674 INFO  (zkCallback-2765-thread-1) [    ] o.a.s.c.c.ConnectionManager Watcher org.apache.solr.common.cloud.ConnectionManager@2dcc18f6 name:ZooKeeperConnection Watcher:127.0.0.1:35631 got event WatchedEvent state:SyncConnected type:None path:null path:null type:None
   [junit4]   2> 1753674 INFO  (jetty-launcher-2755-thread-1) [    ] o.a.s.c.c.ConnectionManager Client is connected to ZooKeeper
   [junit4]   2> 1753675 INFO  (jetty-launcher-2755-thread-1) [    ] o.a.s.c.c.SolrZkClient Using default ZkACLProvider
   [junit4]   2> 1753676 INFO  (jetty-launcher-2755-thread-1) [n:127.0.0.1:46673_solr    ] o.a.s.c.ZkController Added new OnReconnect listener org.apache.solr.cloud.ZkController$$Lambda$76/1031306167@71574eef
   [junit4]   2> 1753676 INFO  (jetty-launcher-2755-thread-1) [n:127.0.0.1:46673_solr    ] o.a.s.c.c.ConnectionManager Waiting for client to connect to ZooKeeper
   [junit4]   2> 1753688 INFO  (jetty-launcher-2755-thread-2) [n:127.0.0.1:34347_solr    ] o.a.s.c.c.SolrZkClient makePath: /overseer/queue
   [junit4]   2> 1753688 INFO  (zkCallback-2766-thread-1-processing-n:127.0.0.1:46673_solr) [n:127.0.0.1:46673_solr    ] o.a.s.c.c.ConnectionManager Watcher org.apache.solr.common.cloud.ConnectionManager@12ca2797 name:ZooKeeperConnection Watcher:127.0.0.1:35631/solr got event WatchedEvent state:SyncConnected type:None path:null path:null type:None
   [junit4]   2> 1753690 INFO  (jetty-launcher-2755-thread-1) [n:127.0.0.1:46673_solr    ] o.a.s.c.c.ConnectionManager Client is connected to ZooKeeper
   [junit4]   2> 1753691 INFO  (jetty-launcher-2755-thread-1) [n:127.0.0.1:46673_solr    ] o.a.s.c.c.SolrZkClient makePath: /overseer/collection-queue-work
   [junit4]   2> 1753691 INFO  (jetty-launcher-2755-thread-2) [n:127.0.0.1:34347_solr    ] o.a.s.c.c.SolrZkClient makePath: /overseer/collection-queue-work
   [junit4]   2> 1753693 INFO  (jetty-launcher-2755-thread-2) [n:127.0.0.1:34347_solr    ] o.a.s.c.c.SolrZkClient makePath: /overseer/collection-map-running
   [junit4]   2> 1753693 INFO  (jetty-launcher-2755-thread-1) [n:127.0.0.1:46673_solr    ] o.a.s.c.c.SolrZkClient makePath: /overseer/collection-map-running
   [junit4]   2> 1753695 INFO  (jetty-launcher-2755-thread-1) [n:127.0.0.1:46673_solr    ] o.a.s.c.c.SolrZkClient makePath: /overseer/collection-map-completed
   [junit4]   2> 1753696 INFO  (jetty-launcher-2755-thread-2) [n:127.0.0.1:34347_solr    ] o.a.s.c.c.SolrZkClient makePath: /overseer/collection-map-completed
   [junit4]   2> 1753696 INFO  (jetty-launcher-2755-thread-1) [n:127.0.0.1:46673_solr    ] o.a.s.c.c.SolrZkClient makePath: /overseer/collection-map-failure
   [junit4]   2> 1753697 INFO  (jetty-launcher-2755-thread-2) [n:127.0.0.1:34347_solr    ] o.a.s.c.c.SolrZkClient makePath: /overseer/collection-map-failure
   [junit4]   2> 1753697 INFO  (jetty-launcher-2755-thread-1) [n:127.0.0.1:46673_solr    ] o.a.s.c.c.SolrZkClient makePath: /live_nodes
   [junit4]   2> 1753697 INFO  (jetty-launcher-2755-thread-2) [n:127.0.0.1:34347_solr    ] o.a.s.c.c.SolrZkClient makePath: /live_nodes
   [junit4]   2> 1753697 INFO  (jetty-launcher-2755-thread-1) [n:127.0.0.1:46673_solr    ] o.a.s.c.c.SolrZkClient makePath: /collections
   [junit4]   2> 1753697 INFO  (jetty-launcher-2755-thread-2) [n:127.0.0.1:34347_solr    ] o.a.s.c.c.SolrZkClient makePath: /collections
   [junit4]   2> 1753698 INFO  (jetty-launcher-2755-thread-1) [n:127.0.0.1:46673_solr    ] o.a.s.c.c.SolrZkClient makePath: /aliases.json
   [junit4]   2> 1753698 INFO  (jetty-launcher-2755-thread-2) [n:127.0.0.1:34347_solr    ] o.a.s.c.c.SolrZkClient makePath: /aliases.json
   [junit4]   2> 1753698 INFO  (jetty-launcher-2755-thread-1) [n:127.0.0.1:46673_solr    ] o.a.s.c.c.SolrZkClient makePath: /clusterstate.json
   [junit4]   2> 1753698 INFO  (jetty-launcher-2755-thread-2) [n:127.0.0.1:34347_solr    ] o.a.s.c.c.SolrZkClient makePath: /clusterstate.json
   [junit4]   2> 1753699 INFO  (jetty-launcher-2755-thread-1) [n:127.0.0.1:46673_solr    ] o.a.s.c.c.SolrZkClient makePath: /security.json
   [junit4]   2> 1753699 INFO  (jetty-launcher-2755-thread-2) [n:127.0.0.1:34347_solr    ] o.a.s.c.c.SolrZkClient makePath: /security.json
   [junit4]   2> 1753699 INFO  (jetty-launcher-2755-thread-1) [n:127.0.0.1:46673_solr    ] o.a.s.c.c.ZkStateReader Updating cluster state from ZooKeeper... 
   [junit4]   2> 1753699 INFO  (jetty-launcher-2755-thread-2) [n:127.0.0.1:34347_solr    ] o.a.s.c.c.ZkStateReader Updating cluster state from ZooKeeper... 
   [junit4]   2> 1753699 INFO  (jetty-launcher-2755-thread-1) [n:127.0.0.1:46673_solr    ] o.a.s.c.c.ZkStateReader Loaded empty cluster properties
   [junit4]   2> 1753699 INFO  (jetty-launcher-2755-thread-2) [n:127.0.0.1:34347_solr    ] o.a.s.c.c.ZkStateReader Loaded empty cluster properties
   [junit4]   2> 1753700 INFO  (jetty-launcher-2755-thread-1) [n:127.0.0.1:46673_solr    ] o.a.s.c.c.ZkStateReader Updated live nodes from ZooKeeper... (0) -> (0)
   [junit4]   2> 1753700 INFO  (jetty-launcher-2755-thread-2) [n:127.0.0.1:34347_solr    ] o.a.s.c.c.ZkStateReader Updated live nodes from ZooKeeper... (0) -> (0)
   [junit4]   2> 1753700 INFO  (jetty-launcher-2755-thread-1) [n:127.0.0.1:46673_solr    ] o.a.s.c.c.SolrZkClient makePath: /overseer_elect
   [junit4]   2> 1753701 INFO  (jetty-launcher-2755-thread-2) [n:127.0.0.1:34347_solr    ] o.a.s.c.c.SolrZkClient makePath: /overseer_elect
   [junit4]   2> 1753702 INFO  (jetty-launcher-2755-thread-2) [n:127.0.0.1:34347_solr    ] o.a.s.c.c.SolrZkClient makePath: /overseer_elect/election
   [junit4]   2> 1753703 INFO  (jetty-launcher-2755-thread-2) [n:127.0.0.1:34347_solr    ] o.a.s.c.Overseer Overseer (id=null) closing
   [junit4]   2> 1753703 INFO  (jetty-launcher-2755-thread-2) [n:127.0.0.1:34347_solr    ] o.a.s.c.LeaderElector Joined leadership election with path: /overseer_elect/election/96167839020285956-127.0.0.1:34347_solr-n_0000000000
   [junit4]   2> 1753704 INFO  (jetty-launcher-2755-thread-2) [n:127.0.0.1:34347_solr    ] o.a.s.c.OverseerElectionContext I am going to be the leader 127.0.0.1:34347_solr
   [junit4]   2> 1753704 INFO  (jetty-launcher-2755-thread-2) [n:127.0.0.1:34347_solr    ] o.a.s.c.c.SolrZkClient makePath: /overseer_elect/leader
   [junit4]   2> 1753704 INFO  (jetty-launcher-2755-thread-2) [n:127.0.0.1:34347_solr    ] o.a.s.c.Overseer Overseer (id=96167839020285956-127.0.0.1:34347_solr-n_0000000000) starting
   [junit4]   2> 1753706 INFO  (jetty-launcher-2755-thread-2) [n:127.0.0.1:34347_solr    ] o.a.s.c.c.SolrZkClient makePath: /overseer/queue-work
   [junit4]   2> 1753709 INFO  (jetty-launcher-2755-thread-1) [n:127.0.0.1:46673_solr    ] o.a.s.c.Overseer Overseer (id=null) closing
   [junit4]   2> 1753710 INFO  (jetty-launcher-2755-thread-2) [n:127.0.0.1:34347_solr    ] o.a.s.c.OverseerAutoReplicaFailoverThread Starting OverseerAutoReplicaFailoverThread autoReplicaFailoverWorkLoopDelay=10000 autoReplicaFailoverWaitAfterExpiration=30000 autoReplicaFailoverBadNodeExpiration=60000
   [junit4]   2> 1753710 INFO  (OverseerStateUpdate-96167839020285956-127.0.0.1:34347_solr-n_0000000000) [n:127.0.0.1:34347_solr    ] o.a.s.c.Overseer Starting to work on the main queue
   [junit4]   2> 1753711 INFO  (jetty-launcher-2755-thread-2) [n:127.0.0.1:34347_solr    ] o.a.s.c.ZkController Register node as live in ZooKeeper:/live_nodes/127.0.0.1:34347_solr
   [junit4]   2> 1753711 INFO  (jetty-launcher-2755-thread-2) [n:127.0.0.1:34347_solr    ] o.a.s.c.c.SolrZkClient makePath: /live_nodes/127.0.0.1:34347_solr
   [junit4]   2> 1753710 INFO  (OverseerCollectionConfigSetProcessor-96167839020285956-127.0.0.1:34347_solr-n_0000000000) [n:127.0.0.1:34347_solr    ] o.a.s.c.OverseerTaskProcessor Process current queue of overseer operations
   [junit4]   2> 1753711 INFO  (OverseerStateUpdate-96167839020285956-127.0.0.1:34347_solr-n_0000000000) [n:127.0.0.1:34347_solr    ] o.a.s.c.c.ZkStateReader Updated live nodes from ZooKeeper... (0) -> (0)
   [junit4]   2> 1753712 INFO  (zkCallback-2766-thread-1-processing-n:127.0.0.1:46673_solr) [n:127.0.0.1:46673_solr    ] o.a.s.c.c.ZkStateReader A live node change: [WatchedEvent state:SyncConnected type:NodeChildrenChanged path:/live_nodes], has occurred - updating... (live nodes size: [0])
   [junit4]   2> 1753715 INFO  (zkCallback-2766-thread-1-processing-n:127.0.0.1:46673_solr) [n:127.0.0.1:46673_solr    ] o.a.s.c.c.ZkStateReader Updated live nodes from ZooKeeper... (0) -> (1)
   [junit4]   2> 1753715 INFO  (jetty-launcher-2755-thread-1) [n:127.0.0.1:46673_solr    ] o.a.s.c.LeaderElector Joined leadership election with path: /overseer_elect/election/96167839020285958-127.0.0.1:46673_solr-n_0000000001
   [junit4]   2> 1753717 INFO  (zkCallback-2764-thread-1-processing-n:127.0.0.1:34347_solr) [n:127.0.0.1:34347_solr    ] o.a.s.c.c.ZkStateReader A live node change: [WatchedEvent state:SyncConnected type:NodeChildrenChanged path:/live_nodes], has occurred - updating... (live nodes size: [0])
   [junit4]   2> 1753717 INFO  (jetty-launcher-2755-thread-1) [n:127.0.0.1:46673_solr    ] o.a.s.c.LeaderElector Watching path /overseer_elect/election/96167839020285956-127.0.0.1:34347_solr-n_0000000000 to know if I could be the leader
   [junit4]   2> 1753717 INFO  (zkCallback-2764-thread-1-processing-n:127.0.0.1:34347_solr) [n:127.0.0.1:34347_solr    ] o.a.s.c.c.ZkStateReader Updated live nodes from ZooKeeper... (0) -> (1)
   [junit4]   2> 1753718 INFO  (jetty-launcher-2755-thread-1) [n:127.0.0.1:46673_solr    ] o.a.s.c.ZkController Publish node=127.0.0.1:46673_solr as DOWN
   [junit4]   2> 1753718 INFO  (jetty-launcher-2755-thread-1) [n:127.0.0.1:46673_solr    ] o.a.s.c.ZkController Register node as live in ZooKeeper:/live_nodes/127.0.0.1:46673_solr
   [junit4]   2> 1753718 INFO  (jetty-launcher-2755-thread-1) [n:127.0.0.1:46673_solr    ] o.a.s.c.c.SolrZkClient makePath: /live_nodes/127.0.0.1:46673_solr
   [junit4]   2> 1753719 INFO  (OverseerStateUpdate-96167839020285956-127.0.0.1:34347_solr-n_0000000000) [n:127.0.0.1:34347_solr    ] o.a.s.c.Overseer processMessage: queueSize: 1, message = {
   [junit4]   2>   "operation":"downnode",
   [junit4]   2>   "node_name":"127.0.0.1:46673_solr"} current state version: 0
   [junit4]   2> 1753719 INFO  (OverseerStateUpdate-96167839020285956-127.0.0.1:34347_solr-n_0000000000) [n:127.0.0.1:34347_solr    ] o.a.s.c.o.NodeMutator DownNode state invoked for node: 127.0.0.1:46673_solr
   [junit4]   2> 1753719 INFO  (zkCallback-2764-thread-1-processing-n:127.0.0.1:34347_solr) [n:127.0.0.1:34347_solr    ] o.a.s.c.c.ZkStateReader A live node change: [WatchedEvent state:SyncConnected type:NodeChildrenChanged path:/live_nodes], has occurred - updating... (live nodes size: [1])
   [junit4]   2> 1753719 INFO  (zkCallback-2766-thread-1-processing-n:127.0.0.1:46673_solr) [n:127.0.0.1:46673_solr    ] o.a.s.c.c.ZkStateReader A live node change: [WatchedEvent state:SyncConnected type:NodeChildrenChanged path:/live_nodes], has occurred - updating... (live nodes size: [1])
   [junit4]   2> 1753719 INFO  (zkCallback-2764-thread-1-processing-n:127.0.0.1:34347_solr) [n:127.0.0.1:34347_solr    ] o.a.s.c.c.ZkStateReader Updated live nodes from ZooKeeper... (1) -> (2)
   [junit4]   2> 1753719 INFO  (zkCallback-2766-thread-1-processing-n:127.0.0.1:46673_solr) [n:127.0.0.1:46673_solr    ] o.a.s.c.c.ZkStateReader Updated live nodes from ZooKeeper... (1) -> (2)
   [junit4]   2> 1753744 INFO  (jetty-launcher-2755-thread-1) [n:127.0.0.1:46673_solr    ] o.a.s.c.CoreContainer Security conf doesn't exist. Skipping setup for authorization module.
   [junit4]   2> 1753744 INFO  (jetty-launcher-2755-thread-1) [n:127.0.0.1:46673_solr    ] o.a.s.c.CoreContainer No authentication plugin used.
   [junit4]   2> 1753745 INFO  (jetty-launcher-2755-thread-1) [n:127.0.0.1:46673_solr    ] o.a.s.c.CorePropertiesLocator Looking for core definitions underneath /home/jenkins/workspace/Lucene-Solr-6.x-Linux/solr/build/solr-core/test/J2/temp/solr.schema.TestManagedSchemaAPI_E53AD2C930CED3B1-001/tempDir-001/node1/.
   [junit4]   2> 1753745 INFO  (jetty-launcher-2755-thread-1) [n:127.0.0.1:46673_solr    ] o.a.s.c.CorePropertiesLocator Found 0 core definitions
   [junit4]   2> 1753745 INFO  (jetty-launcher-2755-thread-1) [n:127.0.0.1:46673_solr    ] o.a.s.s.SolrDispatchFilter user.dir=/home/jenkins/workspace/Lucene-Solr-6.x-Linux/solr/build/solr-core/test/J2
   [junit4]   2> 1753745 INFO  (jetty-launcher-2755-thread-1) [n:127.0.0.1:46673_solr    ] o.a.s.s.SolrDispatchFilter SolrDispatchFilter.init() done
   [junit4]   2> 1753763 INFO  (jetty-launcher-2755-thread-2) [n:127.0.0.1:34347_solr    ] o.a.s.c.CoreContainer Security conf doesn't exist. Skipping setup for authorization module.
   [junit4]   2> 1753764 INFO  (jetty-launcher-2755-thread-2) [n:127.0.0.1:34347_solr    ] o.a.s.c.CoreContainer No authentication plugin used.
   [junit4]   2> 1753765 INFO  (jetty-launcher-2755-thread-2) [n:127.0.0.1:34347_solr    ] o.a.s.c.CorePropertiesLocator Looking for core definitions underneath /home/jenkins/workspace/Lucene-Solr-6.x-Linux/solr/build/solr-core/test/J2/temp/solr.schema.TestManagedSchemaAPI_E53AD2C930CED3B1-001/tempDir-001/node2/.
   [junit4]   2> 1753765 INFO  (jetty-launcher-2755-thread-2) [n:127.0.0.1:34347_solr    ] o.a.s.c.CorePropertiesLocator Found 0 core definitions
   [junit4]   2> 1753767 INFO  (jetty-launcher-2755-thread-2) [n:127.0.0.1:34347_solr    ] o.a.s.s.SolrDispatchFilter user.dir=/home/jenkins/workspace/Lucene-Solr-6.x-Linux/solr/build/solr-core/test/J2
   [junit4]   2> 1753767 INFO  (jetty-launcher-2755-thread-2) [n:127.0.0.1:34347_solr    ] o.a.s.s.SolrDispatchFilter SolrDispatchFilter.init() done
   [junit4]   2> 1753767 INFO  (SUITE-TestManagedSchemaAPI-seed#[E53AD2C930CED3B1]-worker) [    ] o.a.s.c.c.SolrZkClient Using default ZkCredentialsProvider
   [junit4]   2> 1753768 INFO  (SUITE-TestManagedSchemaAPI-seed#[E53AD2C930CED3B1]-worker) [    ] o.a.s.c.c.ConnectionManager Waiting for client to connect to ZooKeeper
   [junit4]   2> 1753768 INFO  (zkCallback-2769-thread-1) [    ] o.a.s.c.c.ConnectionManager Watcher org.apache.solr.common.cloud.ConnectionManager@71b3d35d name:ZooKeeperConnection Watcher:127.0.0.1:35631 got event WatchedEvent state:SyncConnected type:None path:null path:null type:None
   [junit4]   2> 1753768 INFO  (SUITE-TestManagedSchemaAPI-seed#[E53AD2C930CED3B1]-worker) [    ] o.a.s.c.c.ConnectionManager Client is connected to ZooKeeper
   [junit4]   2> 1753768 INFO  (SUITE-TestManagedSchemaAPI-seed#[E53AD2C930CED3B1]-worker) [    ] o.a.s.c.c.SolrZkClient Using default ZkACLProvider
   [junit4]   2> 1753769 INFO  (SUITE-TestManagedSchemaAPI-seed#[E53AD2C930CED3B1]-worker) [    ] o.a.s.c.s.i.CloudSolrClient Final constructed zkHost string: 127.0.0.1:35631/solr
   [junit4]   2> 1753769 INFO  (SUITE-TestManagedSchemaAPI-seed#[E53AD2C930CED3B1]-worker) [    ] o.a.s.c.c.SolrZkClient Using default ZkCredentialsProvider
   [junit4]   2> 1753769 INFO  (SUITE-TestManagedSchemaAPI-seed#[E53AD2C930CED3B1]-worker) [    ] o.a.s.c.c.ConnectionManager Waiting for client to connect to ZooKeeper
   [junit4]   2> 1753770 INFO  (zkCallback-2772-thread-1) [    ] o.a.s.c.c.ConnectionManager Watcher org.apache.solr.common.cloud.ConnectionManager@18449170 name:ZooKeeperConnection Watcher:127.0.0.1:35631/solr got event WatchedEvent state:SyncConnected type:None path:null path:null type:None
   [junit4]   2> 1753770 INFO  (SUITE-TestManagedSchemaAPI-seed#[E53AD2C930CED3B1]-worker) [    ] o.a.s.c.c.ConnectionManager Client is connected to ZooKeeper
   [junit4]   2> 1753770 INFO  (SUITE-TestManagedSchemaAPI-seed#[E53AD2C930CED3B1]-worker) [    ] o.a.s.c.c.SolrZkClient Using default ZkACLProvider
   [junit4]   2> 1753770 INFO  (SUITE-TestManagedSchemaAPI-seed#[E53AD2C930CED3B1]-worker) [    ] o.a.s.c.c.ZkStateReader Updating cluster state from ZooKeeper... 
   [junit4]   2> 1753770 INFO  (SUITE-TestManagedSchemaAPI-seed#[E53AD2C930CED3B1]-worker) [    ] o.a.s.c.c.ZkStateReader Loaded empty cluster properties
   [junit4]   2> 1753771 INFO  (SUITE-TestManagedSchemaAPI-seed#[E53AD2C930CED3B1]-worker) [    ] o.a.s.c.c.ZkStateReader Updated live nodes from ZooKeeper... (0) -> (2)
   [junit4]   2> 1753772 INFO  (SUITE-TestManagedSchemaAPI-seed#[E53AD2C930CED3B1]-worker) [    ] o.a.s.c.c.SolrZkClient makePath: /configs/conf1/solrconfig.xml
   [junit4]   2> 1753774 INFO  (SUITE-TestManagedSchemaAPI-seed#[E53AD2C930CED3B1]-worker) [    ] o.a.s.c.c.SolrZkClient makePath: /configs/conf1/managed-schema
   [junit4]   2> 1753800 INFO  (TEST-TestManagedSchemaAPI.test-seed#[E53AD2C930CED3B1]) [    ] o.a.s.SolrTestCaseJ4 ###Starting test
   [junit4]   2> 1753801 INFO  (qtp1011495084-15061) [n:127.0.0.1:46673_solr    ] o.a.s.h.a.CollectionsHandler Invoked Collection Action :create with params replicationFactor=2&collection.configName=conf1&name=testschemaapi&action=CREATE&numShards=1&wt=javabin&version=2 and sendToOCPQueue=true
   [junit4]   2> 1753805 INFO  (OverseerCollectionConfigSetProcessor-96167839020285956-127.0.0.1:34347_solr-n_0000000000) [n:127.0.0.1:34347_solr    ] o.a.s.c.OverseerTaskProcessor Overseer Collection Message Handler: Get the message id:/overseer/collection-queue-work/qn-0000000000 message:{
   [junit4]   2>   "name":"testschemaapi",
   [junit4]   2>   "fromApi":"true",
   [junit4]   2>   "replicationFactor":"2",
   [junit4]   2>   "collection.configName":"conf1",
   [junit4]   2>   "numShards":"1",
   [junit4]   2>   "stateFormat":"2",
   [junit4]   2>   "operation":"create"}
   [junit4]   2> 1753806 INFO  (OverseerThreadFactory-7286-thread-1-processing-n:127.0.0.1:34347_solr) [n:127.0.0.1:34347_solr    ] o.a.s.c.OverseerCollectionMessageHandler OverseerCollectionMessageHandler.processMessage : create , {
   [junit4]   2>   "name":"testschemaapi",
   [junit4]   2>   "fromApi":"true",
   [junit4]   2>   "replicationFactor":"2",
   [junit4]   2>   "collection.configName":"conf1",
   [junit4]   2>   "numShards":"1",
   [junit4]   2>   "stateFormat":"2",
   [junit4]   2>   "operation":"create"}
   [junit4]   2> 1753806 INFO  (OverseerThreadFactory-7286-thread-1-processing-n:127.0.0.1:34347_solr) [n:127.0.0.1:34347_solr    ] o.a.s.c.OverseerCollectionMessageHandler Create collection testschemaapi
   [junit4]   2> 1753806 INFO  (OverseerThreadFactory-7286-thread-1-processing-n:127.0.0.1:34347_solr) [n:127.0.0.1:34347_solr    ] o.a.s.c.OverseerCollectionMessageHandler creating collections conf node /collections/testschemaapi 
   [junit4]   2> 1753806 INFO  (OverseerThreadFactory-7286-thread-1-processing-n:127.0.0.1:34347_solr) [n:127.0.0.1:34347_solr    ] o.a.s.c.c.SolrZkClient makePath: /collections/testschemaapi
   [junit4]   2> 1753807 INFO  (zkCallback-2764-thread-1-processing-n:127.0.0.1:34347_solr) [n:127.0.0.1:34347_solr    ] o.a.s.c.c.ZkStateReader A collections change: [WatchedEvent state:SyncConnected type:NodeChildrenChanged path:/collections], has occurred - updating...
   [junit4]   2> 1753808 INFO  (zkCallback-2766-thread-1-processing-n:127.0.0.1:46673_solr) [n:127.0.0.1:46673_solr    ] o.a.s.c.c.ZkStateReader A collections change: [WatchedEvent state:SyncConnected type:NodeChildrenChanged path:/collections], has occurred - updating...
   [junit4]   2> 1753810 INFO  (OverseerStateUpdate-96167839020285956-127.0.0.1:34347_solr-n_0000000000) [n:127.0.0.1:34347_solr    ] o.a.s.c.Overseer processMessage: queueSize: 1, message = {
   [junit4]   2>   "name":"testschemaapi",
   [junit4]   2>   "fromApi":"true",
   [junit4]   2>   "replicationFactor":"2",
   [junit4]   2>   "collection.configName":"conf1",
   [junit4]   2>   "numShards":"1",
   [junit4]   2>   "stateFormat":"2",
   [junit4]   2>   "operation":"create"} current state version: 0
   [junit4]   2> 1753810 INFO  (OverseerStateUpdate-96167839020285956-127.0.0.1:34347_solr-n_0000000000) [n:127.0.0.1:34347_solr    ] o.a.s.c.o.ClusterStateMutator building a new cName: testschemaapi
   [junit4]   2> 1753811 INFO  (OverseerStateUpdate-96167839020285956-127.0.0.1:34347_solr-n_0000000000) [n:127.0.0.1:34347_solr    ] o.a.s.c.o.ZkStateWriter going to create_collection /collections/testschemaapi/state.json
   [junit4]   2> 1753814 INFO  (zkCallback-2772-thread-1) [    ] o.a.s.c.c.ZkStateReader A collections change: [WatchedEvent state:SyncConnected type:NodeChildrenChanged path:/collections], has occurred - updating...
   [junit4]   2> 1753908 INFO  (OverseerThreadFactory-7286-thread-1-processing-n:127.0.0.1:34347_solr) [n:127.0.0.1:34347_solr    ] o.a.s.c.OverseerCollectionMessageHandler Creating SolrCores for new collection testschemaapi, shardNames [shard1] , replicationFactor : 2
   [junit4]   2> 1753908 INFO  (OverseerThreadFactory-7286-thread-1-processing-n:127.0.0.1:34347_solr) [n:127.0.0.1:34347_solr    ] o.a.s.c.OverseerCollectionMessageHandler Creating core testschemaapi_shard1_replica2 as part of shard shard1 of collection testschemaapi on 127.0.0.1:34347_solr
   [junit4]   2> 1753909 INFO  (OverseerThreadFactory-7286-thread-1-processing-n:127.0.0.1:34347_solr) [n:127.0.0.1:34347_solr    ] o.a.s.c.OverseerCollectionMessageHandler Creating core testschemaapi_shard1_replica1 as part of shard shard1 of collection testschemaapi on 127.0.0.1:46673_solr
   [junit4]   2> 1753915 INFO  (qtp1234331341-15063) [n:127.0.0.1:34347_solr    ] o.a.s.h.a.CoreAdminOperation core create command qt=/admin/cores&collection.configName=conf1&name=testschemaapi_shard1_replica2&action=CREATE&numShards=1&collection=testschemaapi&shard=shard1&wt=javabin&version=2
   [junit4]   2> 1753916 INFO  (qtp1234331341-15063) [n:127.0.0.1:34347_solr    ] o.a.s.c.CoreDescriptor Created CoreDescriptor: {name=testschemaapi_shard1_replica2, collection.configName=conf1, config=solrconfig.xml, transient=false, schema=schema.xml, loadOnStartup=true, configSetProperties=configsetprops.json, collection=testschemaapi, numShards=1, dataDir=data/, shard=shard1}
   [junit4]   2> 1753920 INFO  (qtp1011495084-15066) [n:127.0.0.1:46673_solr    ] o.a.s.h.a.CoreAdminOperation core create command qt=/admin/cores&collection.configName=conf1&name=testschemaapi_shard1_replica1&action=CREATE&numShards=1&collection=testschemaapi&shard=shard1&wt=javabin&version=2
   [junit4]   2> 1753920 INFO  (qtp1234331341-15063) [n:127.0.0.1:34347_solr c:testschemaapi s:shard1  x:testschemaapi_shard1_replica2] o.a.s.c.ZkController publishing state=down
   [junit4]   2> 1753921 INFO  (qtp1011495084-15066) [n:127.0.0.1:46673_solr    ] o.a.s.c.CoreDescriptor Created CoreDescriptor: {name=testschemaapi_shard1_replica1, collection.configName=conf1, config=solrconfig.xml, transient=false, schema=schema.xml, loadOnStartup=true, configSetProperties=configsetprops.json, collection=testschemaapi, numShards=1, dataDir=data/, shard=shard1}
   [junit4]   2> 1753921 INFO  (qtp1011495084-15066) [n:127.0.0.1:46673_solr c:testschemaapi s:shard1  x:testschemaapi_shard1_replica1] o.a.s.c.ZkController publishing state=down
   [junit4]   2> 1753921 INFO  (qtp1234331341-15063) [n:127.0.0.1:34347_solr c:testschemaapi s:shard1  x:testschemaapi_shard1_replica2] o.a.s.c.ZkController Registering watch for collection testschemaapi
   [junit4]   2> 1753921 INFO  (OverseerStateUpdate-96167839020285956-127.0.0.1:34347_solr-n_0000000000) [n:127.0.0.1:34347_solr    ] o.a.s.c.Overseer processMessage: queueSize: 1, message = {
   [junit4]   2>   "core":"testschemaapi_shard1_replica2",
   [junit4]   2>   "roles":null,
   [junit4]   2>   "base_url":"http://127.0.0.1:34347/solr",
   [junit4]   2>   "node_name":"127.0.0.1:34347_solr",
   [junit4]   2>   "numShards":"1",
   [junit4]   2>   "state":"down",
   [junit4]   2>   "shard":"shard1",
   [junit4]   2>   "collection":"testschemaapi",
   [junit4]   2>   "operation":"state"} current state version: 0
   [junit4]   2> 1753921 INFO  (OverseerStateUpdate-96167839020285956-127.0.0.1:34347_solr-n_0000000000) [n:127.0.0.1:34347_solr    ] o.a.s.c.o.ReplicaMutator Update state numShards=1 message={
   [junit4]   2>   "core":"testschemaapi_shard1_replica2",
   [junit4]   2>   "roles":null,
   [junit4]   2>   "base_url":"http://127.0.0.1:34347/solr",
   [junit4]   2>   "node_name":"127.0.0.1:34347_solr",
   [junit4]   2>   "numShards":"1",
   [junit4]   2>   "state":"down",
   [junit4]   2>   "shard":"shard1",
   [junit4]   2>   "collection":"testschemaapi",
   [junit4]   2>   "operation":"state"}
   [junit4]   2> 1753921 INFO  (qtp1234331341-15063) [n:127.0.0.1:34347_solr c:testschemaapi s:shard1  x:testschemaapi_shard1_replica2] o.a.s.c.c.ZkStateReader Add data for [testschemaapi] ver [0]
   [junit4]   2> 1753922 INFO  (qtp1011495084-15066) [n:127.0.0.1:46673_solr c:testschemaapi s:shard1  x:testschemaapi_shard1_replica1] o.a.s.c.ZkController Registering watch for collection testschemaapi
   [junit4]   2> 1753922 INFO  (qtp1234331341-15063) [n:127.0.0.1:34347_solr c:testschemaapi s:shard1  x:testschemaapi_shard1_replica2] o.a.s.c.ZkController look for our core node name
   [junit4]   2> 1753922 INFO  (qtp1011495084-15066) [n:127.0.0.1:46673_solr c:testschemaapi s:shard1  x:testschemaapi_shard1_replica1] o.a.s.c.c.ZkStateReader Add data for [testschemaapi] ver [0]
   [junit4]   2> 1753922 INFO  (qtp1011495084-15066) [n:127.0.0.1:46673_solr c:testschemaapi s:shard1  x:testschemaapi_shard1_replica1] o.a.s.c.ZkController look for our core node name
   [junit4]   2> 1753922 INFO  (OverseerStateUpdate-96167839020285956-127.0.0.1:34347_solr-n_0000000000) [n:127.0.0.1:34347_solr    ] o.a.s.c.Overseer processMessage: queueSize: 1, message = {
   [junit4]   2>   "core":"testschemaapi_shard1_replica1",
   [junit4]   2>   "roles":null,
   [junit4]   2>   "base_url":"http://127.0.0.1:46673/solr",
   [junit4]   2>   "node_name":"127.0.0.1:46673_solr",
   [junit4]   2>   "numShards":"1",
   [junit4]   2>   "state":"down",
   [junit4]   2>   "shard":"shard1",
   [junit4]   2>   "collection":"testschemaapi",
   [junit4]   2>   "operation":"state"} current state version: 0
   [junit4]   2> 1753922 INFO  (OverseerStateUpdate-96167839020285956-127.0.0.1:34347_solr-n_0000000000) [n:127.0.0.1:34347_solr    ] o.a.s.c.o.ReplicaMutator Update state numShards=1 message={
   [junit4]   2>   "core":"testschemaapi_shard1_replica1",
   [junit4]   2>   "roles":null,
   [junit4]   2>   "base_url":"http://127.0.0.1:46673/solr",
   [junit4]   2>   "node_name":"127.0.0.1:46673_solr",
   [junit4]   2>   "numShards":"1",
   [junit4]   2>   "state":"down",
   [junit4]   2>   "shard":"shard1",
   [junit4]   2>   "collection":"testschemaapi",
   [junit4]   2>   "operation":"state"}
   [junit4]   2> 1754025 INFO  (OverseerStateUpdate-96167839020285956-127.0.0.1:34347_solr-n_0000000000) [n:127.0.0.1:34347_solr    ] o.a.s.c.o.ZkStateWriter going to update_collection /collections/testschemaapi/state.json version: 0
   [junit4]   2> 1754026 INFO  (zkCallback-2764-thread-1-processing-n:127.0.0.1:34347_solr) [n:127.0.0.1:34347_solr    ] o.a.s.c.c.ZkStateReader A cluster state change: [WatchedEvent state:SyncConnected type:NodeDataChanged path:/collections/testschemaapi/state.json] for collection [testschemaapi] has occurred - updating... (live nodes size: [2])
   [junit4]   2> 1754026 INFO  (zkCallback-2766-thread-1-processing-n:127.0.0.1:46673_solr) [n:127.0.0.1:46673_solr    ] o.a.s.c.c.ZkStateReader A cluster state change: [WatchedEvent state:SyncConnected type:NodeDataChanged path:/collections/testschemaapi/state.json] for collection [testschemaapi] has occurred - updating... (live nodes size: [2])
   [junit4]   2> 1754026 INFO  (zkCallback-2766-thread-1-processing-n:127.0.0.1:46673_solr) [n:127.0.0.1:46673_solr    ] o.a.s.c.c.ZkStateReader Updating data for [testschemaapi] from [0] to [1]
   [junit4]   2> 1754026 INFO  (zkCallback-2764-thread-1-processing-n:127.0.0.1:34347_solr) [n:127.0.0.1:34347_solr    ] o.a.s.c.c.ZkStateReader Updating data for [testschemaapi] from [0] to [1]
   [junit4]   2> 1754922 INFO  (qtp1234331341-15063) [n:127.0.0.1:34347_solr c:testschemaapi s:shard1  x:testschemaapi_shard1_replica2] o.a.s.c.ZkController waiting to find shard id in clusterstate for testschemaapi_shard1_replica2
   [junit4]   2> 1754922 INFO  (qtp1234331341-15063) [n:127.0.0.1:34347_solr c:testschemaapi s:shard1  x:testschemaapi_shard1_replica2] o.a.s.c.ZkController Check for collection zkNode:testschemaapi
   [junit4]   2> 1754922 INFO  (qtp1011495084-15066) [n:127.0.0.1:46673_solr c:testschemaapi s:shard1  x:testschemaapi_shard1_replica1] o.a.s.c.ZkController waiting to find shard id in clusterstate for testschemaapi_shard1_replica1
   [junit4]   2> 1754922 INFO  (qtp1011495084-15066) [n:127.0.0.1:46673_solr c:testschemaapi s:shard1  x:testschemaapi_shard1_replica1] o.a.s.c.ZkController Check for collection zkNode:testschemaapi
   [junit4]   2> 1754922 INFO  (qtp1234331341-15063) [n:127.0.0.1:34347_solr c:testschemaapi s:shard1  x:testschemaapi_shard1_replica2] o.a.s.c.ZkController Collection zkNode exists
   [junit4]   2> 1754922 INFO  (qtp1234331341-15063) [n:127.0.0.1:34347_solr c:testschemaapi s:shard1  x:testschemaapi_shard1_replica2] o.a.s.c.c.ZkStateReader Load collection config from: [/collections/testschemaapi]
   [junit4]   2> 1754923 INFO  (qtp1011495084-15066) [n:127.0.0.1:46673_solr c:testschemaapi s:shard1  x:testschemaapi_shard1_replica1] o.a.s.c.ZkController Collection zkNode exists
   [junit4]   2> 1754923 INFO  (qtp1011495084-15066) [n:127.0.0.1:46673_solr c:testschemaapi s:shard1  x:testschemaapi_shard1_replica1] o.a.s.c.c.ZkStateReader Load collection config from: [/collections/testschemaapi]
   [junit4]   2> 1754923 INFO  (qtp1234331341-15063) [n:127.0.0.1:34347_solr c:testschemaapi s:shard1  x:testschemaapi_shard1_replica2] o.a.s.c.c.ZkStateReader path=[/collections/testschemaapi] [configName]=[conf1] specified config exists in ZooKeeper
   [junit4]   2> 1754923 INFO  (qtp1234331341-15063) [n:127.0.0.1:34347_solr c:testschemaapi s:shard1  x:testschemaapi_shard1_replica2] o.a.s.c.SolrResourceLoader new SolrResourceLoader for directory: '/home/jenkins/workspace/Lucene-Solr-6.x-Linux/solr/build/solr-core/test/J2/temp/solr.schema.TestManagedSchemaAPI_E53AD2C930CED3B1-001/tempDir-001/node2/testschemaapi_shard1_replica2'
   [junit4]   2> 1754923 INFO  (qtp1011495084-15066) [n:127.0.0.1:46673_solr c:testschemaapi s:shard1  x:testschemaapi_shard1_replica1] o.a.s.c.c.ZkStateReader path=[/collections/testschemaapi] [configName]=[conf1] specified config exists in ZooKeeper
   [junit4]   2> 1754923 INFO  (qtp1011495084-15066) [n:127.0.0.1:46673_solr c:testschemaapi s:shard1  x:testschemaapi_shard1_replica1] o.a.s.c.SolrResourceLoader new SolrResourceLoader for directory: '/home/jenkins/workspace/Lucene-Solr-6.x-Linux/solr/build/solr-core/test/J2/temp/solr.schema.TestManagedSchemaAPI_E53AD2C930CED3B1-001/tempDir-001/node1/testschemaapi_shard1_replica1'
   [junit4]   2> 1754923 INFO  (qtp1234331341-15063) [n:127.0.0.1:34347_solr c:testschemaapi s:shard1  x:testschemaapi_shard1_replica2] o.a.s.c.SolrResourceLoader JNDI not configured for solr (NoInitialContextEx)
   [junit4]   2> 1754923 INFO  (qtp1234331341-15063) [n:127.0.0.1:34347_solr c:testschemaapi s:shard1  x:testschemaapi_shard1_replica2] o.a.s.c.SolrResourceLoader solr home defaulted to 'solr/' (could not find system property or JNDI)
   [junit4]   2> 1754923 INFO  (qtp1011495084-15066) [n:127.0.0.1:46673_solr c:testschemaapi s:shard1  x:testschemaapi_shard1_replica1] o.a.s.c.SolrResourceLoader JNDI not configured for solr (NoInitialContextEx)
   [junit4]   2> 1754924 INFO  (qtp1011495084-15066) [n:127.0.0.1:46673_solr c:testschemaapi s:shard1  x:testschemaapi_shard1_replica1] o.a.s.c.SolrResourceLoader solr home defaulted to 'solr/' (could not find system property or JNDI)
   [junit4]   2> 1754927 INFO  (qtp1234331341-15063) [n:127.0.0.1:34347_solr c:testschemaapi s:shard1  x:testschemaapi_shard1_replica2] o.a.s.c.Config loaded config solrconfig.xml with version 0 
   [junit4]   2> 1754927 INFO  (qtp1011495084-15066) [n:127.0.0.1:46673_solr c:testschemaapi s:shard1  x:testschemaapi_shard1_replica1] o.a.s.c.Config loaded config solrconfig.xml with version 0 
   [junit4]   2> 1754933 INFO  (qtp1011495084-15066) [n:127.0.0.1:46673_solr c:testschemaapi s:shard1  x:testschemaapi_shard1_replica1] o.a.s.c.SolrConfig current version of requestparams : -1
   [junit4]   2> 1754933 INFO  (qtp1234331341-15063) [n:127.0.0.1:34347_solr c:testschemaapi s:shard1  x:testschemaapi_shard1_replica2] o.a.s.c.SolrConfig current version of requestparams : -1
   [junit4]   2> 1754936 INFO  (qtp1011495084-15066) [n:127.0.0.1:46673_solr c:testschemaapi s:shard1  x:testschemaapi_shard1_replica1] o.a.s.c.SolrConfig Using Lucene MatchVersion: 6.2.0
   [junit4]   2> 1754936 INFO  (qtp1234331341-15063) [n:127.0.0.1:34347_solr c:testschemaapi s:shard1  x:testschemaapi_shard1_replica2] o.a.s.c.SolrConfig Using Lucene MatchVersion: 6.2.0
   [junit4]   2> 1754943 INFO  (qtp1011495084-15066) [n:127.0.0.1:46673_solr c:testschemaapi s:shard1  x:testschemaapi_shard1_replica1] o.a.s.c.SolrConfig Loaded SolrConfig: solrconfig.xml
   [junit4]   2> 1754943 INFO  (qtp1234331341-15063) [n:127.0.0.1:34347_solr c:testschemaapi s:shard1  x:testschemaapi_shard1_replica2] o.a.s.c.SolrConfig Loaded SolrConfig: solrconfig.xml
   [junit4]   2> 1754946 INFO  (qtp1234331341-15063) [n:127.0.0.1:34347_solr c:testschemaapi s:shard1  x:testschemaapi_shard1_replica2] o.a.s.s.IndexSchema [testschemaapi_shard1_replica2] Schema name=minimal
   [junit4]   2> 1754946 INFO  (qtp1011495084-15066) [n:127.0.0.1:46673_solr c:testschemaapi s:shard1  x:testschemaapi_shard1_replica1] o.a.s.s.IndexSchema [testschemaapi_shard1_replica1] Schema name=minimal
   [junit4]   2> 1754951 INFO  (qtp1234331341-15063) [n:127.0.0.1:34347_solr c:testschemaapi s:shard1  x:testschemaapi_shard1_replica2] o.a.s.s.IndexSchema unique key field: id
   [junit4]   2> 1754951 INFO  (qtp1011495084-15066) [n:127.0.0.1:46673_solr c:testschemaapi s:shard1  x:testschemaapi_shard1_replica1] o.a.s.s.IndexSchema unique key field: id
   [junit4]   2> 1754952 INFO  (qtp1234331341-15063) [n:127.0.0.1:34347_solr c:testschemaapi s:shard1  x:testschemaapi_shard1_replica2] o.a.s.c.ConfigSetProperties Did not find ConfigSet properties, assuming default properties: Can't find resource 'configsetprops.json' in classpath or '/configs/conf1', cwd=/home/jenkins/workspace/Lucene-Solr-6.x-Linux/solr/build/solr-core/test/J2
   [junit4]   2> 1754952 INFO  (qtp1011495084-15066) [n:127.0.0.1:46673_solr c:testschemaapi s:shard1  x:testschemaapi_shard1_replica1] o.a.s.c.ConfigSetProperties Did not find ConfigSet properties, assuming default properties: Can't find resource 'configsetprops.json' in classpath or '/configs/conf1', cwd=/home/jenkins/workspace/Lucene-Solr-6.x-Linux/solr/build/solr-core/test/J2
   [junit4]   2> 1754952 INFO  (qtp1234331341-15063) [n:127.0.0.1:34347_solr c:testschemaapi s:shard1  x:testschemaapi_shard1_replica2] o.a.s.c.CoreContainer Creating SolrCore 'testschemaapi_shard1_replica2' using configuration from collection testschemaapi
   [junit4]   2> 1754952 INFO  (qtp1011495084-15066) [n:127.0.0.1:46673_solr c:testschemaapi s:shard1  x:testschemaapi_shard1_replica1] o.a.s.c.CoreContainer Creating SolrCore 'testschemaapi_shard1_replica1' using configuration from collection testschemaapi
   [junit4]   2> 1754952 INFO  (qtp1011495084-15066) [n:127.0.0.1:46673_solr c:testschemaapi s:shard1 r:core_node2 x:testschemaapi_shard1_replica1] o.a.s.c.SolrCore org.apache.solr.core.MockDirectoryFactory
   [junit4]   2> 1754952 INFO  (qtp1234331341-15063) [n:127.0.0.1:34347_solr c:testschemaapi s:shard1 r:core_node1 x:testschemaapi_shard1_replica2] o.a.s.c.SolrCore org.apache.solr.core.MockDirectoryFactory
   [junit4]   2> 1754952 INFO  (qtp1011495084-15066) [n:127.0.0.1:46673_solr c:testschemaapi s:shard1 r:core_node2 x:testschemaapi_shard1_replica1] o.a.s.c.SolrCore [[testschemaapi_shard1_replica1] ] Opening new SolrCore at [/home/jenkins/workspace/Lucene-Solr-6.x-Linux/solr/build/solr-core/test/J2/temp/solr.schema.TestManagedSchemaAPI_E53AD2C930CED3B1-001/tempDir-001/node1/testschemaapi_shard1_replica1], dataDir=[/home/jenkins/workspace/Lucene-Solr-6.x-Linux/solr/build/solr-core/test/J2/temp/solr.schema.TestManagedSchemaAPI_E53AD2C930CED3B1-001/tempDir-001/node1/./testschemaapi_shard1_replica1/data/]
   [junit4]   2> 1754952 INFO  (qtp1234331341-15063) [n:127.0.0.1:34347_solr c:testschemaapi s:shard1 r:core_node1 x:testschemaapi_shard1_replica2] o.a.s.c.SolrCore [[testschemaapi_shard1_replica2] ] Opening new SolrCore at [/home/jenkins/workspace/Lucene-Solr-6.x-Linux/solr/build/solr-core/test/J2/temp/solr.schema.TestManagedSchemaAPI_E53AD2C930CED3B1-001/tempDir-001/node2/testschemaapi_shard1_replica2], dataDir=[/home/jenkins/workspace/Lucene-Solr-6.x-Linux/solr/build/solr-core/test/J2/temp/solr.schema.TestManagedSchemaAPI_E53AD2C930CED3B1-001/tempDir-001/node2/./testschemaapi_shard1_replica2/data/]
   [junit4]   2> 1754953 INFO  (qtp1234331341-15063) [n:127.0.0.1:34347_solr c:testschemaapi s:shard1 r:core_node1 x:testschemaapi_shard1_replica2] o.a.s.c.SolrCore JMX monitoring not detected for core: testschemaapi_shard1_replica2
   [junit4]   2> 1754953 INFO  (qtp1011495084-15066) [n:127.0.0.1:46673_solr c:testschemaapi s:shard1 r:core_node2 x:testschemaapi_shard1_replica1] o.a.s.c.SolrCore JMX monitoring not detected for core: testschemaapi_shard1_replica1
   [junit4]   2> 1754953 INFO  (qtp1234331341-15063) [n:127.0.0.1:34347_solr c:testschemaapi s:shard1 r:core_node1 x:testschemaapi_shard1_replica2] o.a.s.c.CachingDirectoryFactory return new directory for /home/jenkins/workspace/Lucene-Solr-6.x-Linux/solr/build/solr-core/test/J2/temp/solr.schema.TestManagedSchemaAPI_E53AD2C930CED3B1-001/tempDir-001/node2/./testschemaapi_shard1_replica2/data
   [junit4]   2> 1754953 INFO  (qtp1234331341-15063) [n:127.0.0.1:34347_solr c:testschemaapi s:shard1 r:core_node1 x:testschemaapi_shard1_replica2] o.a.s.c.SolrCore New index directory detected: old=null new=/home/jenkins/workspace/Lucene-Solr-6.x-Linux/solr/build/solr-core/test/J2/temp/solr.schema.TestManagedSchemaAPI_E53AD2C930CED3B1-001/tempDir-001/node2/./testschemaapi_shard1_replica2/data/index/
   [junit4]   2> 1754953 WARN  (qtp1234331341-15063) [n:127.0.0.1:34347_solr c:testschemaapi s:shard1 r:core_node1 x:testschemaapi_shard1_replica2] o.a.s.c.SolrCore [testschemaapi_shard1_replica2] Solr index directory '/home/jenkins/workspace/Lucene-Solr-6.x-Linux/solr/build/solr-core/test/J2/temp/solr.schema.TestManagedSchemaAPI_E53AD2C930CED3B1-001/tempDir-001/node2/./testschemaapi_shard1_replica2/data/index' doesn't exist. Creating new index...
   [junit4]   2> 1754953 INFO  (qtp1011495084-15066) [n:127.0.0.1:46673_solr c:testschemaapi s:shard1 r:core_node2 x:testschemaapi_shard1_replica1] o.a.s.c.CachingDirectoryFactory return new directory for /home/jenkins/workspace/Lucene-Solr-6.x-Linux/solr/build/solr-core/test/J2/temp/solr.schema.TestManagedSchemaAPI_E53AD2C930CED3B1-001/tempDir-001/node1/./testschemaapi_shard1_replica1/data
   [junit4]   2> 1754954 INFO  (qtp1011495084-15066) [n:127.0.0.1:46673_solr c:testschemaapi s:shard1 r:core_node2 x:testschemaapi_shard1_replica1] o.a.s.c.SolrCore New index directory detected: old=null new=/home/jenkins/workspace/Lucene-Solr-6.x-Linux/solr/build/solr-core/test/J2/temp/solr.schema.TestManagedSchemaAPI_E53AD2C930CED3B1-001/tempDir-001/node1/./testschemaapi_shard1_replica1/data/index/
   [junit4]   2> 1754954 WARN  (qtp1011495084-15066) [n:127.0.0.1:46673_solr c:testschemaapi s:shard1 r:core_node2 x:testschemaapi_shard1_replica1] o.a.s.c.SolrCore [testschemaapi_shard1_replica1] Solr index directory '/home/jenkins/workspace/Lucene-Solr-6.x-Linux/solr/build/solr-core/test/J2/temp/solr.schema.TestManagedSchemaAPI_E53AD2C930CED3B1-001/tempDir-001/node1/./testschemaapi_shard1_replica1/data/index' doesn't exist. Creating new index...
   [junit4]   2> 1754954 INFO  (qtp1234331341-15063) [n:127.0.0.1:34347_solr c:testschemaapi s:shard1 r:core_node1 x:testschemaapi_shard1_replica2] o.a.s.c.CachingDirectoryFactory return new directory for /home/jenkins/workspace/Lucene-Solr-6.x-Linux/solr/build/solr-core/test/J2/temp/solr.schema.TestManagedSchemaAPI_E53AD2C930CED3B1-001/tempDir-001/node2/./testschemaapi_shard1_replica2/data/index
   [junit4]   2> 1754954 INFO  (qtp1011495084-15066) [n:127.0.0.1:46673_solr c:testschemaapi s:shard1 r:core_node2 x:testschemaapi_shard1_replica1] o.a.s.c.CachingDirectoryFactory return new directory for /home/jenkins/workspace/Lucene-Solr-6.x-Linux/solr/build/solr-core/test/J2/temp/solr.schema.TestManagedSchemaAPI_E53AD2C930CED3B1-001/tempDir-001/node1/./testschemaapi_shard1_replica1/data/index
   [junit4]   2> 1754954 INFO  (qtp1234331341-15063) [n:127.0.0.1:34347_solr c:testschemaapi s:shard1 r:core_node1 x:testschemaapi_shard1_replica2] o.a.s.c.SolrDeletionPolicy SolrDeletionPolicy.onCommit: commits: num=1
   [junit4]   2> 	commit{dir=MockDirectoryWrapper(RAMDirectory@60ae9711 lockFactory=org.apache.lucene.store.SingleInstanceLockFactory@14cebf37),segFN=segments_1,generation=1}
   [junit4]   2> 1754954 INFO  (qtp1234331341-15063) [n:127.0.0.1:34347_solr c:testschemaapi s:shard1 r:core_node1 x:testschemaapi_shard1_replica2] o.a.s.c.SolrDeletionPolicy newest commit generation = 1
   [junit4]   2> 1754954 INFO  (qtp1011495084-15066) [n:127.0.0.1:46673_solr c:testschemaapi s:shard1 r:core_node2 x:testschemaapi_shard1_replica1] o.a.s.c.SolrDeletionPolicy SolrDeletionPolicy.onCommit: commits: num=1
   [junit4]   2> 	commit{dir=MockDirectoryWrapper(RAMDirectory@5234a4ca lockFactory=org.apache.lucene.store.SingleInstanceLockFactory@1af8ed53),segFN=segments_1,generation=1}
   [junit4]   2> 1754955 INFO  (qtp1011495084-15066) [n:127.0.0.1:46673_solr c:testschemaapi s:shard1 r:core_node2 x:testschemaapi_shard1_replica1] o.a.s.c.SolrDeletionPolicy newest commit generation = 1
   [junit4]   2> 1754956 INFO  (qtp1234331341-15063) [n:127.0.0.1:34347_solr c:testschemaapi s:shard1 r:core_node1 x:testschemaapi_shard1_replica2] o.a.s.c.SolrCore no updateRequestProcessorChain defined as default, creating implicit default
   [junit4]   2> 1754972 INFO  (OldIndexDirectoryCleanupThreadForCore-testschemaapi_shard1_replica2) [n:127.0.0.1:34347_solr c:testschemaapi s:shard1 r:core_node1 x:testschemaapi_shard1_replica2] o.a.s.c.SolrCore Looking for old index directories to cleanup for core testschemaapi_shard1_replica2 in /home/jenkins/workspace/Lucene-Solr-6.x-Linux/solr/build/solr-core/test/J2/temp/solr.schema.TestManagedSchemaAPI_E53AD2C930CED3B1-001/tempDir-001/node2/./testschemaapi_shard1_replica2/data/
   [junit4]   2> 1754972 INFO  (OldIndexDirectoryCleanupThreadForCore-testschemaapi_shard1_replica1) [n:127.0.0.1:46673_solr c:testschemaapi s:shard1 r:core_node2 x:testschemaapi_shard1_replica1] o.a.s.c.SolrCore Looking for old index directories to cleanup for core testschemaapi_shard1_replica1 in /home/jenkins/workspace/Lucene-Solr-6.x-Linux/solr/build/solr-core/test/J2/temp/solr.schema.TestManagedSchemaAPI_E53AD2C930CED3B1-001/tempDir-001/node1/./testschemaapi_shard1_replica1/data/
   [junit4]   2> 1754974 WARN  (OldIndexDirectoryCleanupThreadForCore-testschemaapi_shard1_replica2) [n:127.0.0.1:34347_solr c:testschemaapi s:shard1 r:core_node1 x:testschemaapi_shard1_replica2] o.a.s.c.DirectoryFactory /home/jenkins/workspace/Lucene-Solr-6.x-Linux/solr/build/solr-core/test/J2/temp/solr.schema.TestManagedSchemaAPI_E53AD2C930CED3B1-001/tempDir-001/node2/./testschemaapi_shard1_replica2/data/ does not point to a valid data directory; skipping clean-up of old index directories.
   [junit4]   2> 1754974 INFO  (qtp1011495084-15066) [n:127.0.0.1:46673_solr c:testschemaapi s:shard1 r:core_node2 x:testschemaapi_shard1_replica1] o.a.s.c.SolrCore no updateRequestProcessorChain defined as default, creating implicit default
   [junit4]   2> 1754975 INFO  (qtp1234331341-15063) [n:127.0.0.1:34347_solr c:testschemaapi s:shard1 r:core_node1 x:testschemaapi_shard1_replica2] o.a.s.h.l.XMLLoader xsltCacheLifetimeSeconds=60
   [junit4]   2> 1754975 INFO  (qtp1011495084-15066) [n:127.0.0.1:46673_solr c:testschemaapi s:shard1 r:core_node2 x:testschemaapi_shard1_replica1] o.a.s.h.l.XMLLoader xsltCacheLifetimeSeconds=60
   [junit4]   2> 1754976 INFO  (qtp1234331341-15063) [n:127.0.0.1:34347_solr c:testschemaapi s:shard1 r:core_node1 x:testschemaapi_shard1_replica2] o.a.s.h.l.XMLLoader xsltCacheLifetimeSeconds=60
   [junit4]   2> 1754976 INFO  (qtp1011495084-15066) [n:127.0.0.1:46673_solr c:testschemaapi s:shard1 r:core_node2 x:testschemaapi_shard1_replica1] o.a.s.h.l.XMLLoader xsltCacheLifetimeSeconds=60
   [junit4]   2> 1754974 WARN  (OldIndexDirectoryCleanupThreadForCore-testschemaapi_shard1_replica1) [n:127.0.0.1:46673_solr c:testschemaapi s:shard1 r:core_node2 x:testschemaapi_shard1_replica1] o.a.s.c.DirectoryFactory /home/jenkins/workspace/Lucene-Solr-6.x-Linux/solr/build/solr-core/test/J2/temp/solr.schema.TestManagedSchemaAPI_E53AD2C930CED3B1-001/tempDir-001/node1/./testschemaapi_shard1_replica1/data/ does not point to a valid data directory; skipping clean-up of old index directories.
   [junit4]   2> 1754976 INFO  (qtp1234331341-15063) [n:127.0.0.1:34347_solr c:testschemaapi s:shard1 r:core_node1 x:testschemaapi_shard1_replica2] o.a.s.h.l.XMLLoader xsltCacheLifetimeSeconds=60
   [junit4]   2> 1754976 INFO  (qtp1011495084-15066) [n:127.0.0.1:46673_solr c:testschemaapi s:shard1 r:core_node2 x:testschemaapi_shard1_replica1] o.a.s.h.l.XMLLoader xsltCacheLifetimeSeconds=60
   [junit4]   2> 1754977 INFO  (qtp1234331341-15063) [n:127.0.0.1:34347_solr c:testschemaapi s:shard1 r:core_node1 x:testschemaapi_shard1_replica2] o.a.s.h.l.XMLLoader xsltCacheLifetimeSeconds=60
   [junit4]   2> 1754977 INFO  (qtp1011495084-15066) [n:127.0.0.1:46673_solr c:testschemaapi s:shard1 r:core_node2 x:testschemaapi_shard1_replica1] o.a.s.h.l.XMLLoader xsltCacheLifetimeSeconds=60
   [junit4]   2> 1754978 INFO  (qtp1011495084-15066) [n:127.0.0.1:46673_solr c:testschemaapi s:shard1 r:core_node2 x:testschemaapi_shard1_replica1] o.a.s.c.RequestHandlers Registered paths: /admin/mbeans,/update/csv,/sql,/update/json/docs,/admin/luke,/graph,/export,/select,/admin/segments,/get,/admin/system,/replication,/admin/properties,/config,/stream,/schema,/admin/plugins,/admin/logging,/update/json,/admin/ping,/admin/threads,/update,/admin/file
   [junit4]   2> 1754978 INFO  (qtp1234331341-15063) [n:127.0.0.1:34347_solr c:testschemaapi s:shard1 r:core_node1 x:testschemaapi_shard1_replica2] o.a.s.c.RequestHandlers Registered paths: /admin/mbeans,/update/csv,/sql,/update/json/docs,/admin/luke,/graph,/export,/select,/admin/segments,/get,/admin/system,/replication,/admin/properties,/config,/stream,/schema,/admin/plugins,/admin/logging,/update/json,/admin/ping,/admin/threads,/update,/admin/file
   [junit4]   2> 1754978 INFO  (qtp1011495084-15066) [n:127.0.0.1:46673_solr c:testschemaapi s:shard1 r:core_node2 x:testschemaapi_shard1_replica1] o.a.s.c.SolrCore Using default statsCache cache: org.apache.solr.search.stats.LocalStatsCache
   [junit4]   2> 1754978 INFO  (qtp1234331341-15063) [n:127.0.0.1:34347_solr c:testschemaapi s:shard1 r:core_node1 x:testschemaapi_shard1_replica2] o.a.s.c.SolrCore Using default statsCache cache: org.apache.solr.search.stats.LocalStatsCache
   [junit4]   2> 1754978 INFO  (qtp1011495084-15066) [n:127.0.0.1:46673_solr c:testschemaapi s:shard1 r:core_node2 x:testschemaapi_shard1_replica1] o.a.s.u.UpdateHandler Using UpdateLog implementation: org.apache.solr.update.UpdateLog
   [junit4]   2> 1754978 INFO  (qtp1234331341-15063) [n:127.0.0.1:34347_solr c:testschemaapi s:shard1 r:core_node1 x:testschemaapi_shard1_replica2] o.a.s.u.UpdateHandler Using UpdateLog implementation: org.apache.solr.update.UpdateLog
   [junit4]   2> 1754978 INFO  (qtp1011495084-15066) [n:127.0.0.1:46673_solr c:testschemaapi s:shard1 r:core_node2 x:testschemaapi_shard1_replica1] o.a.s.u.UpdateLog Initializing UpdateLog: dataDir=null defaultSyncLevel=FLUSH numRecordsToKeep=100 maxNumLogsToKeep=10 numVersionBuckets=65536
   [junit4]   2> 1754980 INFO  (qtp1011495084-15066) [n:127.0.0.1:46673_solr c:testschemaapi s:shard1 r:core_node2 x:testschemaapi_shard1_replica1] o.a.s.u.CommitTracker Hard AutoCommit: disabled
   [junit4]   2> 1754980 INFO  (qtp1011495084-15066) [n:127.0.0.1:46673_solr c:testschemaapi s:shard1 r:core_node2 x:testschemaapi_shard1_replica1] o.a.s.u.CommitTracker Soft AutoCommit: disabled
   [junit4]   2> 1754980 INFO  (qtp1011495084-15066) [n:127.0.0.1:46673_solr c:testschemaapi s:shard1 r:core_node2 x:testschemaapi_shard1_replica1] o.a.s.c.SolrDeletionPolicy SolrDeletionPolicy.onInit: commits: num=1
   [junit4]   2> 	commit{dir=MockDirectoryWrapper(RAMDirectory@5234a4ca lockFactory=org.apache.lucene.store.SingleInstanceLockFactory@1af8ed53),segFN=segments_1,generation=1}
   [junit4]   2> 1754980 INFO  (qtp1011495084-15066) [n:127.0.0.1:46673_solr c:testschemaapi s:shard1 r:core_node2 x:testschemaapi_shard1_replica1] o.a.s.c.SolrDeletionPolicy newest commit generation = 1
   [junit4]   2> 1754980 INFO  (qtp1011495084-15066) [n:127.0.0.1:46673_solr c:testschemaapi s:shard1 r:core_node2 x:testschemaapi_shard1_replica1] o.a.s.s.SolrIndexSearcher Opening [Searcher@673fe5eb[testschemaapi_shard1_replica1] main]
   [junit4]   2> 1754981 INFO  (qtp1011495084-15066) [n:127.0.0.1:46673_solr c:testschemaapi s:shard1 r:core_node2 x:testschemaapi_shard1_replica1] o.a.s.c.c.ZkStateReader Load collection config from: [/collections/testschemaapi]
   [junit4]   2> 1754981 INFO  (qtp1234331341-15063) [n:127.0.0.1:34347_solr c:testschemaapi s:shard1 r:core_node1 x:testschemaapi_shard1_replica2] o.a.s.u.UpdateLog Initializing UpdateLog: dataDir=null defaultSyncLevel=FLUSH numRecordsToKeep=100 maxNumLogsToKeep=10 numVersionBuckets=65536
   [junit4]   2> 1754981 INFO  (qtp1011495084-15066) [n:127.0.0.1:46673_solr c:testschemaapi s:shard1 r:core_node2 x:testschemaapi_shard1_replica1] o.a.s.c.c.ZkStateReader path=[/collections/testschemaapi] [configName]=[conf1] specified config exists in ZooKeeper
   [junit4]   2> 1754981 INFO  (qtp1011495084-15066) [n:127.0.0.1:46673_solr c:testschemaapi s:shard1 r:core_node2 x:testschemaapi_shard1_replica1] o.a.s.r.ManagedResourceStorage Setting up ZooKeeper-based storage for the RestManager with znodeBase: /configs/conf1
   [junit4]   2> 1754981 INFO  (qtp1011495084-15066) [n:127.0.0.1:46673_solr c:testschemaapi s:shard1 r:core_node2 x:testschemaapi_shard1_replica1] o.a.s.r.ManagedResourceStorage Configured ZooKeeperStorageIO with znodeBase: /configs/conf1
   [junit4]   2> 1754981 INFO  (qtp1011495084-15066) [n:127.0.0.1:46673_solr c:testschemaapi s:shard1 r:core_node2 x:testschemaapi_shard1_replica1] o.a.s.r.RestManager Initializing RestManager with initArgs: {}
   [junit4]   2> 1754982 INFO  (qtp1011495084-15066) [n:127.0.0.1:46673_solr c:testschemaapi s:shard1 r:core_node2 x:testschemaapi_shard1_replica1] o.a.s.r.ManagedResourceStorage Reading _rest_managed.json using ZooKeeperStorageIO:path=/configs/conf1
   [junit4]   2> 1754982 INFO  (qtp1011495084-15066) [n:127.0.0.1:46673_solr c:testschemaapi s:shard1 r:core_node2 x:testschemaapi_shard1_replica1] o.a.s.r.ManagedResourceStorage No data found for znode /configs/conf1/_rest_managed.json
   [junit4]   2> 1754982 INFO  (qtp1011495084-15066) [n:127.0.0.1:46673_solr c:testschemaapi s:shard1 r:core_node2 x:testschemaapi_shard1_replica1] o.a.s.r.ManagedResourceStorage Loaded null at path _rest_managed.json using ZooKeeperStorageIO:path=/configs/conf1
   [junit4]   2> 1754982 INFO  (qtp1011495084-15066) [n:127.0.0.1:46673_solr c:testschemaapi s:shard1 r:core_node2 x:testschemaapi_shard1_replica1] o.a.s.r.RestManager Initializing 0 registered ManagedResources
   [junit4]   2> 1754982 INFO  (qtp1011495084-15066) [n:127.0.0.1:46673_solr c:testschemaapi s:shard1 r:core_node2 x:testschemaapi_shard1_replica1] o.a.s.s.ZkIndexSchemaReader Creating ZooKeeper watch for the managed schema at /configs/conf1/managed-schema
   [junit4]   2> 1754982 INFO  (qtp1011495084-15066) [n:127.0.0.1:46673_solr c:testschemaapi s:shard1 r:core_node2 x:testschemaapi_shard1_replica1] o.a.s.c.ZkController Added new OnReconnect listener ZkIndexSchemaReader: /configs/conf1/managed-schema, uniqueCoreId: testschemaapi_shard1_replica1:1636513427529377
   [junit4]   2> 1754982 INFO  (qtp1011495084-15066) [n:127.0.0.1:46673_solr c:testschemaapi s:shard1 r:core_node2 x:testschemaapi_shard1_replica1] o.a.s.h.ReplicationHandler Commits will be reserved for  10000
   [junit4]   2> 1754983 INFO  (searcherExecutor-7292-thread-1-processing-n:127.0.0.1:46673_solr x:testschemaapi_shard1_replica1 s:shard1 c:testschemaapi r:core_node2) [n:127.0.0.1:46673_solr c:testschemaapi s:shard1 r:core_node2 x:testschemaapi_shard1_replica1] o.a.s.c.SolrCore [testschemaapi_shard1_replica1] Registered new searcher Searcher@673fe5eb[testschemaapi_shard1_replica1] main{ExitableDirectoryReader(UninvertingDirectoryReader())}
   [junit4]   2> 1754983 INFO  (qtp1234331341-15063) [n:127.0.0.1:34347_solr c:testschemaapi s:shard1 r:core_node1 x:testschemaapi_shard1_replica2] o.a.s.u.CommitTracker Hard AutoCommit: disabled
   [junit4]   2> 1754983 INFO  (qtp1234331341-15063) [n:127.0.0.1:34347_solr c:testschemaapi s:shard1 r:core_node1 x:testschemaapi_shard1_replica2] o.a.s.u.CommitTracker Soft AutoCommit: disabled
   [junit4]   2> 1754983 INFO  (qtp1011495084-15066) [n:127.0.0.1:46673_solr c:testschemaapi s:shard1 r:core_node2 x:testschemaapi_shard1_replica1] o.a.s.u.UpdateLog Looking up max value of version field to seed version buckets
   [junit4]   2> 1754983 INFO  (qtp1011495084-15066) [n:127.0.0.1:46673_solr c:testschemaapi s:shard1 r:core_node2 x:testschemaapi_shard1_replica1] o.a.s.u.VersionInfo Refreshing highest value of _version_ for 65536 version buckets from index
   [junit4]   2> 1754984 INFO  (qtp1011495084-15066) [n:127.0.0.1:46673_solr c:testschemaapi s:shard1 r:core_node2 x:testschemaapi_shard1_replica1] o.a.s.u.VersionInfo No terms found for _version_, cannot seed version bucket highest value from index
   [junit4]   2> 1754984 INFO  (qtp1011495084-15066) [n:127.0.0.1:46673_solr c:testschemaapi s:shard1 r:core_node2 x:testschemaapi_shard1_replica1] o.a.s.u.UpdateLog Could not find max version in index or recent updates, using new clock 1538685425859690496
   [junit4]   2> 1754986 INFO  (qtp1234331341-15063) [n:127.0.0.1:34347_solr c:testschemaapi s:shard1 r:core_node1 x:testschemaapi_shard1_replica2] o.a.s.c.SolrDeletionPolicy SolrDeletionPolicy.onInit: commits: num=1
   [junit4]   2> 	commit{dir=MockDirectoryWrapper(RAMDirectory@60ae9711 lockFactory=org.apache.lucene.store.SingleInstanceLockFactory@14cebf37),segFN=segments_1,generation=1}
   [junit4]   2> 1754986 INFO  (qtp1011495084-15066) [n:127.0.0.1:46673_solr c:testschemaapi s:shard1 r:core_node2 x:testschemaapi_shard1_replica1] o.a.s.u.UpdateLog Took 2.0ms to seed version buckets with highest version 1538685425859690496
   [junit4]   2> 1754987 INFO  (qtp1234331341-15063) [n:127.0.0.1:34347_solr c:testschemaapi s:shard1 r:core_node1 x:testschemaapi_shard1_replica2] o.a.s.c.SolrDeletionPolicy newest commit generation = 1
   [junit4]   2> 1754987 INFO  (qtp1011495084-15066) [n:127.0.0.1:46673_solr c:testschemaapi s:shard1 r:core_node2 x:testschemaapi_shard1_replica1] o.a.s.c.ZkController watch zkdir /configs/conf1
   [junit4]   2> 1754987 INFO  (qtp1234331341-15063) [n:127.0.0.1:34347_solr c:testschemaapi s:shard1 r:core_node1 x:testschemaapi_shard1_replica2] o.a.s.s.SolrIndexSearcher Opening [Searcher@2564b003[testschemaapi_shard1_replica2] main]
   [junit4]   2> 1754987 INFO  (qtp1234331341-15063) [n:127.0.0.1:34347_solr c:testschemaapi s:shard1 r:core_node1 x:testschemaapi_shard1_replica2] o.a.s.c.c.ZkStateReader Load collection config from: [/collections/testschemaapi]
   [junit4]   2> 1754988 INFO  (qtp1234331341-15063) [n:127.0.0.1:34347_solr c:testschemaapi s:shard1 r:core_node1 x:testschemaapi_shard1_replica2] o.a.s.c.c.ZkStateReader path=[/collections/testschemaapi] [configName]=[conf1] specified config exists in ZooKeeper
   [junit4]   2> 1754988 INFO  (qtp1234331341-15063) [n:127.0.0.1:34347_solr c:testschemaapi s:shard1 r:core_node1 x:testschemaapi_shard1_replica2] o.a.s.r.ManagedResourceStorage Setting up ZooKeeper-based storage for the RestManager with znodeBase: /configs/conf1
   [junit4]   2> 1754988 INFO  (qtp1011495084-15066) [n:127.0.0.1:46673_solr c:testschemaapi s:shard1 r:core_node2 x:testschemaapi_shard1_replica1] o.a.s.c.CoreContainer registering core: testschemaapi_shard1_replica1
   [junit4]   2> 1754988 INFO  (qtp1011495084-15066) [n:127.0.0.1:46673_solr c:testschemaapi s:shard1 r:core_node2 x:testschemaapi_shard1_replica1] o.a.s.c.ZkController Register replica - core:testschemaapi_shard1_replica1 address:http://127.0.0.1:46673/solr collection:testschemaapi shard:shard1
   [junit4]   2> 1754988 INFO  (qtp1234331341-15063) [n:127.0.0.1:34347_solr c:testschemaapi s:shard1 r:core_node1 x:testschemaapi_shard1_replica2] o.a.s.r.ManagedResourceStorage Configured ZooKeeperStorageIO with znodeBase: /configs/conf1
   [junit4]   2> 1754988 INFO  (qtp1234331341-15063) [n:127.0.0.1:34347_solr c:testschemaapi s:shard1 r:core_node1 x:testschemaapi_shard1_replica2] o.a.s.r.RestManager Initializing RestManager with initArgs: {}
   [junit4]   2> 1754988 INFO  (qtp1234331341-15063) [n:127.0.0.1:34347_solr c:testschemaapi s:shard1 r:core_node1 x:testschemaapi_shard1_replica2] o.a.s.r.ManagedResourceStorage Reading _rest_managed.json using ZooKeeperStorageIO:path=/configs/conf1
   [junit4]   2> 1754989 INFO  (qtp1234331341-15063) [n:127.0.0.1:34347_solr c:testschemaapi s:shard1 r:core_node1 x:testschemaapi_shard1_replica2] o.a.s.r.ManagedResourceStorage No data found for znode /configs/conf1/_rest_managed.json
   [junit4]   2> 1754989 INFO  (qtp1011495084-15066) [n:127.0.0.1:46673_solr c:testschemaapi s:shard1 r:core_node2 x:testschemaapi_shard1_replica1] o.a.s.c.c.SolrZkClient makePath: /collections/testschemaapi/leader_elect/shard1/election
   [junit4]   2> 1754989 INFO  (qtp1234331341-15063) [n:127.0.0.1:34347_solr c:testschemaapi s:shard1 r:core_node1 x:testschemaapi_shard1_replica2] o.a.s.r.ManagedResourceStorage Loaded null at path _rest_managed.json using ZooKeeperStorageIO:path=/configs/conf1
   [junit4]   2> 1754989 INFO  (qtp1234331341-15063) [n:127.0.0.1:34347_solr c:testschemaapi s:shard1 r:core_node1 x:testschemaapi_shard1_replica2] o.a.s.r.RestManager Initializing 0 registered ManagedResources
   [junit4]   2> 1754989 INFO  (qtp1234331341-15063) [n:127.0.0.1:34347_solr c:testschemaapi s:shard1 r:core_node1 x:testschemaapi_shard1_replica2] o.a.s.s.ZkIndexSchemaReader Creating ZooKeeper watch for the managed schema at /configs/conf1/managed-schema
   [junit4]   2> 1754990 INFO  (qtp1234331341-15063) [n:127.0.0.1:34347_solr c:testschemaapi s:shard1 r:core_node1 x:testschemaapi_shard1_replica2] o.a.s.c.ZkController Added new OnReconnect listener ZkIndexSchemaReader: /configs/conf1/managed-schema, uniqueCoreId: testschemaapi_shard1_replica2:1636513427478182
   [junit4]   2> 1754990 INFO  (qtp1234331341-15063) [n:127.0.0.1:34347_solr c:testschemaapi s:shard1 r:core_node1 x:testschemaapi_shard1_replica2] o.a.s.h.ReplicationHandler Commits will be reserved for  10000
   [junit4]   2> 1754990 INFO  (qtp1234331341-15063) [n:127.0.0.1:34347_solr c:testschemaapi s:shard1 r:core_node1 x:testschemaapi_shard1_replica2] o.a.s.u.UpdateLog Looking up max value of version field to seed version buckets
   [junit4]   2> 1754990 INFO  (qtp1234331341-15063) [n:127.0.0.1:34347_solr c:testschemaapi s:shard1 r:core_node1 x:testschemaapi_shard1_replica2] o.a.s.u.VersionInfo Refreshing highest value of _version_ for 65536 version buckets from index
   [junit4]   2> 1754990 INFO  (qtp1234331341-15063) [n:127.0.0.1:34347_solr c:testschemaapi s:shard1 r:core_node1 x:testschemaapi_shard1_replica2] o.a.s.u.VersionInfo No terms found for _version_, cannot seed version bucket highest value from index
   [junit4]   2> 1754990 INFO  (searcherExecutor-7291-thread-1-processing-n:127.0.0.1:34347_solr x:testschemaapi_shard1_replica2 s:shard1 c:testschemaapi r:core_node1) [n:127.0.0.1:34347_solr c:testschemaapi s:shard1 r:core_node1 x:testschemaapi_shard1_replica2] o.a.s.c.SolrCore [testschemaapi_shard1_replica2] Registered new searcher Searcher@2564b003[testschemaapi_shard1_replica2] main{ExitableDirectoryReader(UninvertingDirectoryReader())}
   [junit4]   2> 1754990 INFO  (qtp1234331341-15063) [n:127.0.0.1:34347_solr c:testschemaapi s:shard1 r:core_node1 x:testschemaapi_shard1_replica2] o.a.s.u.UpdateLog Could not find max version in index or recent updates, using new clock 1538685425865981952
   [junit4]   2> 1754992 INFO  (qtp1011495084-15066) [n:127.0.0.1:46673_solr c:testschemaapi s:shard1 r:core_node2 x:testschemaapi_shard1_replica1] o.a.s.c.LeaderElector Joined leadership election with path: /collections/testschemaapi/leader_elect/shard1/election/96167839020285958-core_node2-n_0000000000
   [junit4]   2> 1754992 INFO  (qtp1011495084-15066) [n:127.0.0.1:46673_solr c:testschemaapi s:shard1 r:core_node2 x:testschemaapi_shard1_replica1] o.a.s.c.ShardLeaderElectionContext Running the leader process for shard=shard1 and weAreReplacement=false and leaderVoteWait=10000
   [junit4]   2> 1754993 INFO  (qtp1011495084-15066) [n:127.0.0.1:46673_solr c:testschemaapi s:shard1 r:core_node2 x:testschemaapi_shard1_replica1] o.a.s.c.ShardLeaderElectionContext Waiting until we see more replicas up for shard shard1: total=2 found=1 timeoutin=9999ms
   [junit4]   2> 1754993 INFO  (qtp1234331341-15063) [n:127.0.0.1:34347_solr c:testschemaapi s:shard1 r:core_node1 x:testschemaapi_shard1_replica2] o.a.s.u.UpdateLog Took 3.0ms to seed version buckets with highest version 1538685425865981952
   [junit4]   2> 1754993 INFO  (OverseerStateUpdate-96167839020285956-127.0.0.1:34347_solr-n_0000000000) [n:127.0.0.1:34347_solr    ] o.a.s.c.Overseer processMessage: queueSize: 1, message = {
   [junit4]   2>   "operation":"leader",
   [junit4]   2>   "shard":"shard1",
   [junit4]   2>   "collection":"testschemaapi"} current state version: 0
   [junit4]   2> 1754993 INFO  (qtp1234331341-15063) [n:127.0.0.1:34347_solr c:testschemaapi s:shard1 r:core_node1 x:testschemaapi_shard1_replica2] o.a.s.c.ZkController watch zkdir /configs/conf1
   [junit4]   2> 1754994 INFO  (qtp1234331341-15063) [n:127.0.0.1:34347_solr c:testschemaapi s:shard1 r:core_node1 x:testschemaapi_shard1_replica2] o.a.s.c.CoreContainer registering core: testschemaapi_shard1_replica2
   [junit4]   2> 1754994 INFO  (qtp1234331341-15063) [n:127.0.0.1:34347_solr c:testschemaapi s:shard1 r:core_node1 x:testschemaapi_shard1_replica2] o.a.s.c.ZkController Register replica - core:testschemaapi_shard1_replica2 address:http://127.0.0.1:34347/solr collection:testschemaapi shard:shard1
   [junit4]   2> 1754995 INFO  (qtp1234331341-15063) [n:127.0.0.1:34347_solr c:testschemaapi s:shard1 r:core_node1 x:testschemaapi_shard1_replica2] o.a.s.c.LeaderElector Joined leadership election with path: /collections/testschemaapi/leader_elect/shard1/election/96167839020285956-core_node1-n_0000000001
   [junit4]   2> 1754995 INFO  (qtp1234331341-15063) [n:127.0.0.1:34347_solr c:testschemaapi s:shard1 r:core_node1 x:testschemaapi_shard1_replica2] o.a.s.c.LeaderElector Watching path /collections/testschemaapi/leader_elect/shard1/election/96167839020285958-core_node2-n_0000000000 to know if I could be the leader
   [junit4]   2> 1755095 INFO  (OverseerStateUpdate-96167839020285956-127.0.0.1:34347_solr-n_0000000000) [n:127.0.0.1:34347_solr    ] o.a.s.c.o.ZkStateWriter going to update_collection /collections/testschemaapi/state.json version: 1
   [junit4]   2> 1755095 INFO  (zkCallback-2764-thread-2-processing-n:127.0.0.1:34347_solr) [n:127.0.0.1:34347_solr    ] o.a.s.c.c.ZkStateReader A cluster state change: [WatchedEvent state:SyncConnected type:NodeDataChanged path:/collections/testschemaapi/state.json] for collection [testschemaapi] has occurred - updating... (live nodes size: [2])
   [junit4]   2> 1755095 INFO  (zkCallback-2766-thread-1-processing-n:127.0.0.1:46673_solr) [n:127.0.0.1:46673_solr    ] o.a.s.c.c.ZkStateReader A cluster state change: [WatchedEvent state:SyncConnected type:NodeDataChanged path:/collections/testschemaapi/state.json] for collection [testschemaapi] has occurred - updating... (live nodes size: [2])
   [junit4]   2> 1755095 INFO  (zkCallback-2764-thread-2-processing-n:127.0.0.1:34347_solr) [n:127.0.0.1:34347_solr    ] o.a.s.c.c.ZkStateReader Updating data for [testschemaapi] from [1] to [2]
   [junit4]   2> 1755095 INFO  (zkCallback-2766-thread-1-processing-n:127.0.0.1:46673_solr) [n:127.0.0.1:46673_solr    ] o.a.s.c.c.ZkStateReader Updating data for [testschemaapi] from [1] to [2]
   [junit4]   2> 1755494 INFO  (qtp1011495084-15066) [n:127.0.0.1:46673_solr c:testschemaapi s:shard1 r:core_node2 x:testschemaapi_shard1_replica1] o.a.s.c.ShardLeaderElectionContext Enough replicas found to continue.
   [junit4]   2> 1755494 INFO  (qtp1011495084-15066) [n:127.0.0.1:46673_solr c:testschemaapi s:shard1 r:core_node2 x:testschemaapi_shard1_replica1] o.a.s.c.ShardLeaderElectionContext I may be the new leader - try and sync
   [junit4]   2> 1755494 INFO  (qtp1011495084-15066) [n:127.0.0.1:46673_solr c:testschemaapi s:shard1 r:core_node2 x:testschemaapi_shard1_replica1] o.a.s.c.SyncStrategy Sync replicas to http://127.0.0.1:46673/solr/testschemaapi_shard1_replica1/
   [junit4]   2> 1755494 INFO  (qtp1011495084-15066) [n:127.0.0.1:46673_solr c:testschemaapi s:shard1 r:core_node2 x:testschemaapi_shard1_replica1] o.a.s.u.PeerSync PeerSync: core=testschemaapi_shard1_replica1 url=http://127.0.0.1:46673/solr START replicas=[http://127.0.0.1:34347/solr/testschemaapi_shard1_replica2/] nUpdates=100
   [junit4]   2> 1755495 INFO  (qtp1011495084-15066) [n:127.0.0.1:46673_solr c:testschemaapi s:shard1 r:core_node2 x:testschemaapi_shard1_replica1] o.a.s.u.PeerSync PeerSync: core=testschemaapi_shard1_replica1 url=http://127.0.0.1:46673/solr DONE.  We have no versions.  sync failed.
   [junit4]   2> 1755495 INFO  (qtp1011495084-15066) [n:127.0.0.1:46673_solr c:testschemaapi s:shard1 r:core_node2 x:testschemaapi_shard1_replica1] o.a.s.c.SyncStrategy Leader's attempt to sync with shard failed, moving to the next candidate
   [junit4]   2> 1755495 INFO  (qtp1011495084-15066) [n:127.0.0.1:46673_solr c:testschemaapi s:shard1 r:core_node2 x:testschemaapi_shard1_replica1] o.a.s.c.ShardLeaderElectionContext We failed sync, but we have no versions - we can't sync in that case - we were active before, so become leader anyway
   [junit4]   2> 1755495 INFO  (qtp1011495084-15066) [n:127.0.0.1:46673_solr c:testschemaapi s:shard1 r:core_node2 x:testschemaapi_shard1_replica1] o.a.s.c.c.SolrZkClient makePath: /collections/testschemaapi/leaders/shard1
   [junit4]   2> 1755497 INFO  (qtp1011495084-15066) [n:127.0.0.1:46673_solr c:testschemaapi s:shard1 r:core_node2 x:testschemaapi_shard1_replica1] o.a.s.c.ShardLeaderElectionContextBase Creating leader registration node /collections/testschemaapi/leaders/shard1/leader after winning as /collections/testschemaapi/leader_elect/shard1/election/96167839020285958-core_node2-n_0000000000
   [junit4]   2> 1755498 INFO  (qtp1234331341-15067) [n:127.0.0.1:34347_solr c:testschemaapi s:shard1 r:core_node1 x:testschemaapi_shard1_replica2] o.a.s.c.S.Request [testschemaapi_shard1_replica2]  webapp=/solr path=/get params={distrib=false&qt=/get&fingerprint=false&getVersions=100&wt=javabin&version=2} status=0 QTime=0
   [junit4]   2> 1755498 INFO  (qtp1011495084-15066) [n:127.0.0.1:46673_solr c:testschemaapi s:shard1 r:core_node2 x:testschemaapi_shard1_replica1] o.a.s.c.ShardLeaderElectionContext I am the new leader: http://127.0.0.1:46673/solr/testschemaapi_shard1_replica1/ shard1
   [junit4]   2> 1755498 INFO  (OverseerStateUpdate-96167839020285956-127.0.0.1:34347_solr-n_0000000000) [n:127.0.0.1:34347_solr    ] o.a.s.c.Overseer processMessage: queueSize: 1, message = {
   [junit4]   2>   "operation":"leader",
   [junit4]   2>   "shard":"shard1",
   [junit4]   2>   "collection":"testschemaapi",
   [junit4]   2>   "base_url":"http://127.0.0.1:46673/solr",
   [junit4]   2>   "core":"testschemaapi_shard1_replica1",
   [junit4]   2>   "state":"active"} current state version: 0
   [junit4]   2> 1755600 INFO  (OverseerStateUpdate-96167839020285956-127.0.0.1:34347_solr-n_0000000000) [n:127.0.0.1:34347_solr    ] o.a.s.c.o.ZkStateWriter going to update_collection /collections/testschemaapi/state.json version: 2
   [junit4]   2> 1755602 INFO  (zkCallback-2766-thread-1-processing-n:127.0.0.1:46673_solr) [n:127.0.0.1:46673_solr    ] o.a.s.c.c.ZkStateReader A cluster state change: [WatchedEvent state:SyncConnected type:NodeDataChanged path:/collections/testschemaapi/state.json] for collection [testschemaapi] has occurred - updating... (live nodes size: [2])
   [junit4]   2> 1755602 INFO  (zkCallback-2764-thread-2-processing-n:127.0.0.1:34347_solr) [n:127.0.0.1:34347_solr    ] o.a.s.c.c.ZkStateReader A cluster state change: [WatchedEvent state:SyncConnected type:NodeDataChanged path:/collections/testschemaapi/state.json] for collection [testschemaapi] has occurred - updating... (live nodes size: [2])
   [junit4]   2> 1755602 INFO  (zkCallback-2766-thread-1-processing-n:127.0.0.1:46673_solr) [n:127.0.0.1:46673_solr    ] o.a.s.c.c.ZkStateReader Updating data for [testschemaapi] from [2] to [3]
   [junit4]   2> 1755603 INFO  (zkCallback-2764-thread-2-processing-n:127.0.0.1:34347_solr) [n:127.0.0.1:34347_solr    ] o.a.s.c.c.ZkStateReader Updating data for [testschemaapi] from [2] to [3]
   [junit4]   2> 1755650 INFO  (qtp1011495084-15066) [n:127.0.0.1:46673_solr c:testschemaapi s:shard1 r:core_node2 x:testschemaapi_shard1_replica1] o.a.s.c.ZkController We are http://127.0.0.1:46673/solr/testschemaapi_shard1_replica1/ and leader is http://127.0.0.1:46673/solr/testschemaapi_shard1_replica1/
   [junit4]   2> 1755651 INFO  (qtp1011495084-15066) [n:127.0.0.1:46673_solr c:testschemaapi s:shard1 r:core_node2 x:testschemaapi_shard1_replica1] o.a.s.c.ZkController No LogReplay needed for core=testschemaapi_shard1_replica1 baseURL=http://127.0.0.1:46673/solr
   [junit4]   2> 1755651 INFO  (qtp1011495084-15066) [n:127.0.0.1:46673_solr c:testschemaapi s:shard1 r:core_node2 x:testschemaapi_shard1_replica1] o.a.s.c.ZkController I am the leader, no recovery necessary
   [junit4]   2> 1755651 INFO  (qtp1011495084-15066) [n:127.0.0.1:46673_solr c:testschemaapi s:shard1 r:core_node2 x:testschemaapi_shard1_r

[...truncated too long message...]

> 	at java.util.concurrent.ThreadPoolExecutor$Worker.run(ThreadPoolExecutor.java:617)
   [junit4]   2> 	at java.lang.Thread.run(Thread.java:745)
   [junit4]   2> 1765243 WARN  (NIOServerCxn.Factory:0.0.0.0/0.0.0.0:0) [    ] o.a.z.s.NIOServerCnxn caught end of stream exception
   [junit4]   2> EndOfStreamException: Unable to read additional data from client sessionid 0x155a823db9f0004, likely client has closed socket
   [junit4]   2> 	at org.apache.zookeeper.server.NIOServerCnxn.doIO(NIOServerCnxn.java:228)
   [junit4]   2> 	at org.apache.zookeeper.server.NIOServerCnxnFactory.run(NIOServerCnxnFactory.java:208)
   [junit4]   2> 	at java.lang.Thread.run(Thread.java:745)
   [junit4]   2> 1765243 WARN  (zkCallback-2764-thread-5-processing-n:127.0.0.1:34347_solr) [n:127.0.0.1:34347_solr    ] o.a.s.c.c.ZkStateReader ZooKeeper watch triggered, but Solr cannot talk to ZK: [KeeperErrorCode = Session expired for /live_nodes]
   [junit4]   2> 1765244 INFO  (Thread-5133) [n:127.0.0.1:46673_solr    ] o.a.s.c.ConfigSetProperties Did not find ConfigSet properties, assuming default properties: Can't find resource 'configsetprops.json' in classpath or '/configs/conf1', cwd=/home/jenkins/workspace/Lucene-Solr-6.x-Linux/solr/build/solr-core/test/J2
   [junit4]   2> 1765244 WARN  (zkCallback-2766-thread-2-processing-n:127.0.0.1:46673_solr) [n:127.0.0.1:46673_solr    ] o.a.s.c.c.ZkStateReader ZooKeeper watch triggered, but Solr cannot talk to ZK: [KeeperErrorCode = Session expired for /live_nodes]
   [junit4]   2> 1765244 INFO  (jetty-launcher-2755-thread-1) [    ] o.e.j.s.h.ContextHandler Stopped o.e.j.s.ServletContextHandler@109e1dae{/solr,null,UNAVAILABLE}
   [junit4]   2> 1765244 INFO  (Thread-5133) [n:127.0.0.1:46673_solr    ] o.a.s.c.CoreContainer Reloading SolrCore 'testschemaapi_shard1_replica1' using configuration from collection testschemaapi
   [junit4]   2> 1765244 INFO  (jetty-launcher-2755-thread-2) [    ] o.e.j.s.h.ContextHandler Stopped o.e.j.s.ServletContextHandler@5ee2548d{/solr,null,UNAVAILABLE}
   [junit4]   2> 1765246 INFO  (SUITE-TestManagedSchemaAPI-seed#[E53AD2C930CED3B1]-worker) [    ] o.a.s.c.ZkTestServer connecting to 127.0.0.1:35631 35631
   [junit4]   2> 1765401 INFO  (Thread-5100) [    ] o.a.s.c.ZkTestServer connecting to 127.0.0.1:35631 35631
   [junit4]   2> 1765402 WARN  (Thread-5100) [    ] o.a.s.c.ZkTestServer Watch limit violations: 
   [junit4]   2> Maximum concurrent create/delete watches above limit:
   [junit4]   2> 
   [junit4]   2> 	6	/solr/configs/conf1/managed-schema
   [junit4]   2> 	6	/solr/configs/conf1
   [junit4]   2> 	3	/solr/aliases.json
   [junit4]   2> 	3	/solr/clusterprops.json
   [junit4]   2> 	2	/solr/security.json
   [junit4]   2> 
   [junit4]   2> Maximum concurrent data watches above limit:
   [junit4]   2> 
   [junit4]   2> 	3	/solr/clusterstate.json
   [junit4]   2> 	2	/solr/collections/testschemaapi/state.json
   [junit4]   2> 
   [junit4]   2> Maximum concurrent children watches above limit:
   [junit4]   2> 
   [junit4]   2> 	10	/solr/overseer/queue
   [junit4]   2> 	9	/solr/overseer/collection-queue-work
   [junit4]   2> 	3	/solr/live_nodes
   [junit4]   2> 	3	/solr/collections
   [junit4]   2> 	3	/solr/overseer/queue-work
   [junit4]   2> 
   [junit4]   2> 1765402 INFO  (SUITE-TestManagedSchemaAPI-seed#[E53AD2C930CED3B1]-worker) [    ] o.a.s.SolrTestCaseJ4 ###deleteCore
   [junit4]   2> NOTE: leaving temporary files on disk at: /home/jenkins/workspace/Lucene-Solr-6.x-Linux/solr/build/solr-core/test/J2/temp/solr.schema.TestManagedSchemaAPI_E53AD2C930CED3B1-001
   [junit4]   2> NOTE: test params are: codec=Lucene62, sim=RandomSimilarity(queryNorm=true,coord=no): {}, locale=sv-SE, timezone=America/Marigot
   [junit4]   2> NOTE: Linux 4.4.0-24-generic amd64/Oracle Corporation 1.8.0_92 (64-bit)/cpus=12,threads=1,free=229774808,total=531628032
   [junit4]   2> NOTE: All tests run in this JVM: [SliceStateTest, TestXIncludeConfig, SolrXmlInZkTest, HdfsRecoveryZkTest, SpatialRPTFieldTypeTest, TestSolrConfigHandler, DateRangeFieldTest, BadIndexSchemaTest, TestIndexingPerformance, TestBackupRepositoryFactory, CoreMergeIndexesAdminHandlerTest, DistributedQueryComponentOptimizationTest, BadComponentTest, OverseerTest, TestJmxIntegration, TestFieldTypeCollectionResource, TestTrackingShardHandlerFactory, TestPerFieldSimilarity, TestPostingsSolrHighlighter, LeaderFailoverAfterPartitionTest, StatelessScriptUpdateProcessorFactoryTest, TestSort, TestChildDocTransformer, TestStressReorder, TestReversedWildcardFilterFactory, RegexBoostProcessorTest, AnalysisErrorHandlingTest, TestRecovery, TestDistributedStatsComponentCardinality, TestFileDictionaryLookup, TestImplicitCoreProperties, TestHdfsBackupRestoreCore, HdfsBasicDistributedZkTest, TestGraphTermsQParserPlugin, CircularListTest, UpdateParamsTest, DocValuesMultiTest, TestDistributedMissingSort, TestSSLRandomization, TestJsonRequest, TestFuzzyAnalyzedSuggestions, XmlUpdateRequestHandlerTest, SharedFSAutoReplicaFailoverUtilsTest, SolrTestCaseJ4Test, TestSolrCLIRunExample, TestIndexSearcher, TestSolrCloudWithKerberosAlt, RankQueryTest, TestDynamicFieldResource, BlockCacheTest, SolrCoreCheckLockOnStartupTest, TestCopyFieldCollectionResource, TestMaxScoreQueryParser, DistributedVersionInfoTest, DistribDocExpirationUpdateProcessorTest, TestFieldCacheWithThreads, ShowFileRequestHandlerTest, DirectUpdateHandlerTest, DirectSolrConnectionTest, AnalyticsQueryTest, TermVectorComponentDistributedTest, FullSolrCloudDistribCmdsTest, ConjunctionSolrSpellCheckerTest, TestGeoJSONResponseWriter, BigEndianAscendingWordSerializerTest, CollectionStateFormat2Test, SparseHLLTest, SimpleFacetsTest, DebugComponentTest, TestExtendedDismaxParser, HdfsCollectionsAPIDistributedZkTest, TestDefaultStatsCache, TestSweetSpotSimilarityFactory, ClassificationUpdateProcessorFactoryTest, RequestHandlersTest, TestNumericTerms64, TestReloadDeadlock, AutoCommitTest, TestCharFilters, HdfsDirectoryTest, TestJmxMonitoredMap, TestXmlQParser, TestWriterPerf, TestOverriddenPrefixQueryForCustomFieldType, TestUniqueKeyFieldResource, TestTolerantSearch, TestElisionMultitermQuery, StatsComponentTest, SegmentsInfoRequestHandlerTest, OverriddenZkACLAndCredentialsProvidersTest, DeleteInactiveReplicaTest, DistributedFacetPivotLargeTest, TestOnReconnectListenerSupport, HardAutoCommitTest, TestSearchPerf, SuggesterTest, TestRawTransformer, TestSolrDeletionPolicy1, SaslZkACLProviderTest, SuggesterWFSTTest, BasicDistributedZkTest, UnloadDistributedZkTest, SyncSliceTest, ShardRoutingTest, RecoveryZkTest, LeaderElectionTest, TestZkChroot, TestFaceting, ZkControllerTest, TestRealTimeGet, TestReload, TestGroupingSearch, CurrencyFieldOpenExchangeTest, SimplePostToolTest, TestCoreDiscovery, SolrRequestParserTest, TestFoldingMultitermQuery, SuggesterTSTTest, TestCSVLoader, SchemaVersionSpecificBehaviorTest, FieldMutatingUpdateProcessorTest, TestWordDelimiterFilterFactory, IndexBasedSpellCheckerTest, DocumentAnalysisRequestHandlerTest, FileBasedSpellCheckerTest, TestSolrQueryParser, IndexSchemaTest, QueryParsingTest, BinaryUpdateRequestHandlerTest, CSVRequestHandlerTest, TestBinaryResponseWriter, TestSolrIndexConfig, TestStressRecovery, PreAnalyzedFieldTest, TestSuggestSpellingConverter, DOMUtilTest, ClusterStateTest, TestUtils, TestHighlightDedupGrouping, ConnectionReuseTest, AssignTest, AsyncCallRequestStatusResponseTest, BaseCdcrDistributedZkTest, CdcrReplicationDistributedZkTest, CdcrReplicationHandlerTest, CdcrRequestHandlerTest, CleanupOldIndexTest, ConcurrentDeleteAndCreateCollectionTest, ConnectionManagerTest, DeleteLastCustomShardedReplicaTest, DeleteShardTest, DistribCursorPagingTest, HttpPartitionTest, SolrCloudExampleTest, TestCloudDeleteByQuery, TestCollectionAPI, TestDownShardTolerantSearch, TestLeaderInitiatedRecoveryThread, TestMiniSolrCloudClusterBase, TestMiniSolrCloudClusterSSL, TestRandomRequestDistribution, TestRebalanceLeaders, TestRequestForwarding, TestShortCircuitedRequests, TestStressCloudBlindAtomicUpdates, DirectoryFactoryTest, TestConfigSetImmutable, TestReloadAndDeleteDocs, RequestLoggingTest, TestRestoreCore, TestSolrConfigHandlerConcurrent, DistributedFacetPivotSmallTest, FacetPivotSmallTest, SpatialHeatmapFacetsTest, TestManagedResource, TestManagedResourceStorage, TestRestManager, TestFieldTypeResource, TestSchemaNameResource, TestSchemaResource, TestSchemaSimilarityResource, TestSchemaVersionResource, TestSerializedLuceneMatchVersion, TestManagedStopFilterFactory, TestManagedSynonymFilterFactory, BadCopyFieldTest, BooleanFieldTest, ChangedSchemaMergeTest, EnumFieldTest, TestCloudManagedSchema, TestCollationFieldDocValues, TestManagedSchema, TestManagedSchemaAPI]
   [junit4] Completed [557/618 (1!)] on J2 in 11.91s, 1 test, 1 error <<< FAILURES!

[...truncated 222 lines...]
BUILD FAILED
/home/jenkins/workspace/Lucene-Solr-6.x-Linux/build.xml:740: The following error occurred while executing this line:
/home/jenkins/workspace/Lucene-Solr-6.x-Linux/build.xml:684: The following error occurred while executing this line:
/home/jenkins/workspace/Lucene-Solr-6.x-Linux/build.xml:59: The following error occurred while executing this line:
/home/jenkins/workspace/Lucene-Solr-6.x-Linux/solr/build.xml:233: The following error occurred while executing this line:
/home/jenkins/workspace/Lucene-Solr-6.x-Linux/solr/common-build.xml:530: The following error occurred while executing this line:
/home/jenkins/workspace/Lucene-Solr-6.x-Linux/lucene/common-build.xml:1427: The following error occurred while executing this line:
/home/jenkins/workspace/Lucene-Solr-6.x-Linux/lucene/common-build.xml:984: There were test failures: 618 suites (10 ignored), 2591 tests, 1 error, 117 ignored (72 assumptions) [seed: E53AD2C930CED3B1]

Total time: 54 minutes 35 seconds
Build step 'Invoke Ant' marked build as failure
Archiving artifacts
[WARNINGS] Skipping publisher since build result is FAILURE
Recording test results
Email was triggered for: Failure - Any
Sending email for trigger: Failure - Any



Mime
View raw message