lucene-dev mailing list archives

Site index · List index
Message view « Date » · « Thread »
Top « Date » · « Thread »
From Apache Jenkins Server <jenk...@builds.apache.org>
Subject [JENKINS] Lucene-Solr-Tests-master - Build # 1255 - Still Failing
Date Mon, 04 Jul 2016 19:13:43 GMT
Build: https://builds.apache.org/job/Lucene-Solr-Tests-master/1255/

4 tests failed.
FAILED:  org.apache.solr.cloud.HttpPartitionTest.test

Error Message:
Captured an uncaught exception in thread: Thread[id=8481, name=SocketProxy-Response-53125:44295, state=RUNNABLE, group=TGRP-HttpPartitionTest]

Stack Trace:
com.carrotsearch.randomizedtesting.UncaughtExceptionError: Captured an uncaught exception in thread: Thread[id=8481, name=SocketProxy-Response-53125:44295, state=RUNNABLE, group=TGRP-HttpPartitionTest]
	at __randomizedtesting.SeedInfo.seed([ED4A515583C18D87:651E6E8F2D3DE07F]:0)
Caused by: java.lang.RuntimeException: java.net.SocketException: Socket is closed
	at __randomizedtesting.SeedInfo.seed([ED4A515583C18D87]:0)
	at org.apache.solr.cloud.SocketProxy$Bridge$Pump.run(SocketProxy.java:347)
Caused by: java.net.SocketException: Socket is closed
	at java.net.Socket.setSoTimeout(Socket.java:1137)
	at org.apache.solr.cloud.SocketProxy$Bridge$Pump.run(SocketProxy.java:344)


FAILED:  org.apache.solr.cloud.overseer.ZkStateReaderTest.testStateFormatUpdateWithExplicitRefreshLazy

Error Message:
Could not find collection : c1

Stack Trace:
org.apache.solr.common.SolrException: Could not find collection : c1
	at __randomizedtesting.SeedInfo.seed([ED4A515583C18D87:8605F128FACE50BD]:0)
	at org.apache.solr.common.cloud.ClusterState.getCollection(ClusterState.java:192)
	at org.apache.solr.cloud.overseer.ZkStateReaderTest.testStateFormatUpdate(ZkStateReaderTest.java:129)
	at org.apache.solr.cloud.overseer.ZkStateReaderTest.testStateFormatUpdateWithExplicitRefreshLazy(ZkStateReaderTest.java:48)
	at sun.reflect.NativeMethodAccessorImpl.invoke0(Native Method)
	at sun.reflect.NativeMethodAccessorImpl.invoke(NativeMethodAccessorImpl.java:62)
	at sun.reflect.DelegatingMethodAccessorImpl.invoke(DelegatingMethodAccessorImpl.java:43)
	at java.lang.reflect.Method.invoke(Method.java:498)
	at com.carrotsearch.randomizedtesting.RandomizedRunner.invoke(RandomizedRunner.java:1764)
	at com.carrotsearch.randomizedtesting.RandomizedRunner$8.evaluate(RandomizedRunner.java:871)
	at com.carrotsearch.randomizedtesting.RandomizedRunner$9.evaluate(RandomizedRunner.java:907)
	at com.carrotsearch.randomizedtesting.RandomizedRunner$10.evaluate(RandomizedRunner.java:921)
	at com.carrotsearch.randomizedtesting.rules.SystemPropertiesRestoreRule$1.evaluate(SystemPropertiesRestoreRule.java:57)
	at org.apache.lucene.util.TestRuleSetupTeardownChained$1.evaluate(TestRuleSetupTeardownChained.java:49)
	at org.apache.lucene.util.AbstractBeforeAfterRule$1.evaluate(AbstractBeforeAfterRule.java:45)
	at org.apache.lucene.util.TestRuleThreadAndTestName$1.evaluate(TestRuleThreadAndTestName.java:48)
	at org.apache.lucene.util.TestRuleIgnoreAfterMaxFailures$1.evaluate(TestRuleIgnoreAfterMaxFailures.java:64)
	at org.apache.lucene.util.TestRuleMarkFailure$1.evaluate(TestRuleMarkFailure.java:47)
	at com.carrotsearch.randomizedtesting.rules.StatementAdapter.evaluate(StatementAdapter.java:36)
	at com.carrotsearch.randomizedtesting.ThreadLeakControl$StatementRunner.run(ThreadLeakControl.java:367)
	at com.carrotsearch.randomizedtesting.ThreadLeakControl.forkTimeoutingTask(ThreadLeakControl.java:809)
	at com.carrotsearch.randomizedtesting.ThreadLeakControl$3.evaluate(ThreadLeakControl.java:460)
	at com.carrotsearch.randomizedtesting.RandomizedRunner.runSingleTest(RandomizedRunner.java:880)
	at com.carrotsearch.randomizedtesting.RandomizedRunner$5.evaluate(RandomizedRunner.java:781)
	at com.carrotsearch.randomizedtesting.RandomizedRunner$6.evaluate(RandomizedRunner.java:816)
	at com.carrotsearch.randomizedtesting.RandomizedRunner$7.evaluate(RandomizedRunner.java:827)
	at com.carrotsearch.randomizedtesting.rules.StatementAdapter.evaluate(StatementAdapter.java:36)
	at com.carrotsearch.randomizedtesting.rules.SystemPropertiesRestoreRule$1.evaluate(SystemPropertiesRestoreRule.java:57)
	at org.apache.lucene.util.AbstractBeforeAfterRule$1.evaluate(AbstractBeforeAfterRule.java:45)
	at com.carrotsearch.randomizedtesting.rules.StatementAdapter.evaluate(StatementAdapter.java:36)
	at org.apache.lucene.util.TestRuleStoreClassName$1.evaluate(TestRuleStoreClassName.java:41)
	at com.carrotsearch.randomizedtesting.rules.NoShadowingOrOverridesOnMethodsRule$1.evaluate(NoShadowingOrOverridesOnMethodsRule.java:40)
	at com.carrotsearch.randomizedtesting.rules.NoShadowingOrOverridesOnMethodsRule$1.evaluate(NoShadowingOrOverridesOnMethodsRule.java:40)
	at com.carrotsearch.randomizedtesting.rules.StatementAdapter.evaluate(StatementAdapter.java:36)
	at com.carrotsearch.randomizedtesting.rules.StatementAdapter.evaluate(StatementAdapter.java:36)
	at com.carrotsearch.randomizedtesting.rules.StatementAdapter.evaluate(StatementAdapter.java:36)
	at org.apache.lucene.util.TestRuleAssertionsRequired$1.evaluate(TestRuleAssertionsRequired.java:53)
	at org.apache.lucene.util.TestRuleMarkFailure$1.evaluate(TestRuleMarkFailure.java:47)
	at org.apache.lucene.util.TestRuleIgnoreAfterMaxFailures$1.evaluate(TestRuleIgnoreAfterMaxFailures.java:64)
	at org.apache.lucene.util.TestRuleIgnoreTestSuites$1.evaluate(TestRuleIgnoreTestSuites.java:54)
	at com.carrotsearch.randomizedtesting.rules.StatementAdapter.evaluate(StatementAdapter.java:36)
	at com.carrotsearch.randomizedtesting.ThreadLeakControl$StatementRunner.run(ThreadLeakControl.java:367)
	at java.lang.Thread.run(Thread.java:745)


FAILED:  org.apache.solr.cloud.overseer.ZkStateReaderTest.testStateFormatUpdateWithTimeDelay

Error Message:
expected:<2> but was:<1>

Stack Trace:
java.lang.AssertionError: expected:<2> but was:<1>
	at __randomizedtesting.SeedInfo.seed([ED4A515583C18D87:92D4E6D0EAA3A00D]:0)
	at org.junit.Assert.fail(Assert.java:93)
	at org.junit.Assert.failNotEquals(Assert.java:647)
	at org.junit.Assert.assertEquals(Assert.java:128)
	at org.junit.Assert.assertEquals(Assert.java:472)
	at org.junit.Assert.assertEquals(Assert.java:456)
	at org.apache.solr.cloud.overseer.ZkStateReaderTest.testStateFormatUpdate(ZkStateReaderTest.java:130)
	at org.apache.solr.cloud.overseer.ZkStateReaderTest.testStateFormatUpdateWithTimeDelay(ZkStateReaderTest.java:53)
	at sun.reflect.NativeMethodAccessorImpl.invoke0(Native Method)
	at sun.reflect.NativeMethodAccessorImpl.invoke(NativeMethodAccessorImpl.java:62)
	at sun.reflect.DelegatingMethodAccessorImpl.invoke(DelegatingMethodAccessorImpl.java:43)
	at java.lang.reflect.Method.invoke(Method.java:498)
	at com.carrotsearch.randomizedtesting.RandomizedRunner.invoke(RandomizedRunner.java:1764)
	at com.carrotsearch.randomizedtesting.RandomizedRunner$8.evaluate(RandomizedRunner.java:871)
	at com.carrotsearch.randomizedtesting.RandomizedRunner$9.evaluate(RandomizedRunner.java:907)
	at com.carrotsearch.randomizedtesting.RandomizedRunner$10.evaluate(RandomizedRunner.java:921)
	at com.carrotsearch.randomizedtesting.rules.SystemPropertiesRestoreRule$1.evaluate(SystemPropertiesRestoreRule.java:57)
	at org.apache.lucene.util.TestRuleSetupTeardownChained$1.evaluate(TestRuleSetupTeardownChained.java:49)
	at org.apache.lucene.util.AbstractBeforeAfterRule$1.evaluate(AbstractBeforeAfterRule.java:45)
	at org.apache.lucene.util.TestRuleThreadAndTestName$1.evaluate(TestRuleThreadAndTestName.java:48)
	at org.apache.lucene.util.TestRuleIgnoreAfterMaxFailures$1.evaluate(TestRuleIgnoreAfterMaxFailures.java:64)
	at org.apache.lucene.util.TestRuleMarkFailure$1.evaluate(TestRuleMarkFailure.java:47)
	at com.carrotsearch.randomizedtesting.rules.StatementAdapter.evaluate(StatementAdapter.java:36)
	at com.carrotsearch.randomizedtesting.ThreadLeakControl$StatementRunner.run(ThreadLeakControl.java:367)
	at com.carrotsearch.randomizedtesting.ThreadLeakControl.forkTimeoutingTask(ThreadLeakControl.java:809)
	at com.carrotsearch.randomizedtesting.ThreadLeakControl$3.evaluate(ThreadLeakControl.java:460)
	at com.carrotsearch.randomizedtesting.RandomizedRunner.runSingleTest(RandomizedRunner.java:880)
	at com.carrotsearch.randomizedtesting.RandomizedRunner$5.evaluate(RandomizedRunner.java:781)
	at com.carrotsearch.randomizedtesting.RandomizedRunner$6.evaluate(RandomizedRunner.java:816)
	at com.carrotsearch.randomizedtesting.RandomizedRunner$7.evaluate(RandomizedRunner.java:827)
	at com.carrotsearch.randomizedtesting.rules.StatementAdapter.evaluate(StatementAdapter.java:36)
	at com.carrotsearch.randomizedtesting.rules.SystemPropertiesRestoreRule$1.evaluate(SystemPropertiesRestoreRule.java:57)
	at org.apache.lucene.util.AbstractBeforeAfterRule$1.evaluate(AbstractBeforeAfterRule.java:45)
	at com.carrotsearch.randomizedtesting.rules.StatementAdapter.evaluate(StatementAdapter.java:36)
	at org.apache.lucene.util.TestRuleStoreClassName$1.evaluate(TestRuleStoreClassName.java:41)
	at com.carrotsearch.randomizedtesting.rules.NoShadowingOrOverridesOnMethodsRule$1.evaluate(NoShadowingOrOverridesOnMethodsRule.java:40)
	at com.carrotsearch.randomizedtesting.rules.NoShadowingOrOverridesOnMethodsRule$1.evaluate(NoShadowingOrOverridesOnMethodsRule.java:40)
	at com.carrotsearch.randomizedtesting.rules.StatementAdapter.evaluate(StatementAdapter.java:36)
	at com.carrotsearch.randomizedtesting.rules.StatementAdapter.evaluate(StatementAdapter.java:36)
	at com.carrotsearch.randomizedtesting.rules.StatementAdapter.evaluate(StatementAdapter.java:36)
	at org.apache.lucene.util.TestRuleAssertionsRequired$1.evaluate(TestRuleAssertionsRequired.java:53)
	at org.apache.lucene.util.TestRuleMarkFailure$1.evaluate(TestRuleMarkFailure.java:47)
	at org.apache.lucene.util.TestRuleIgnoreAfterMaxFailures$1.evaluate(TestRuleIgnoreAfterMaxFailures.java:64)
	at org.apache.lucene.util.TestRuleIgnoreTestSuites$1.evaluate(TestRuleIgnoreTestSuites.java:54)
	at com.carrotsearch.randomizedtesting.rules.StatementAdapter.evaluate(StatementAdapter.java:36)
	at com.carrotsearch.randomizedtesting.ThreadLeakControl$StatementRunner.run(ThreadLeakControl.java:367)
	at java.lang.Thread.run(Thread.java:745)


FAILED:  org.apache.solr.cloud.overseer.ZkStateReaderTest.testExternalCollectionWatchedNotWatched

Error Message:


Stack Trace:
java.lang.NullPointerException
	at __randomizedtesting.SeedInfo.seed([ED4A515583C18D87:E6F1A079D2987B2E]:0)
	at org.apache.solr.cloud.overseer.ZkStateReaderTest.testExternalCollectionWatchedNotWatched(ZkStateReaderTest.java:167)
	at sun.reflect.NativeMethodAccessorImpl.invoke0(Native Method)
	at sun.reflect.NativeMethodAccessorImpl.invoke(NativeMethodAccessorImpl.java:62)
	at sun.reflect.DelegatingMethodAccessorImpl.invoke(DelegatingMethodAccessorImpl.java:43)
	at java.lang.reflect.Method.invoke(Method.java:498)
	at com.carrotsearch.randomizedtesting.RandomizedRunner.invoke(RandomizedRunner.java:1764)
	at com.carrotsearch.randomizedtesting.RandomizedRunner$8.evaluate(RandomizedRunner.java:871)
	at com.carrotsearch.randomizedtesting.RandomizedRunner$9.evaluate(RandomizedRunner.java:907)
	at com.carrotsearch.randomizedtesting.RandomizedRunner$10.evaluate(RandomizedRunner.java:921)
	at com.carrotsearch.randomizedtesting.rules.SystemPropertiesRestoreRule$1.evaluate(SystemPropertiesRestoreRule.java:57)
	at org.apache.lucene.util.TestRuleSetupTeardownChained$1.evaluate(TestRuleSetupTeardownChained.java:49)
	at org.apache.lucene.util.AbstractBeforeAfterRule$1.evaluate(AbstractBeforeAfterRule.java:45)
	at org.apache.lucene.util.TestRuleThreadAndTestName$1.evaluate(TestRuleThreadAndTestName.java:48)
	at org.apache.lucene.util.TestRuleIgnoreAfterMaxFailures$1.evaluate(TestRuleIgnoreAfterMaxFailures.java:64)
	at org.apache.lucene.util.TestRuleMarkFailure$1.evaluate(TestRuleMarkFailure.java:47)
	at com.carrotsearch.randomizedtesting.rules.StatementAdapter.evaluate(StatementAdapter.java:36)
	at com.carrotsearch.randomizedtesting.ThreadLeakControl$StatementRunner.run(ThreadLeakControl.java:367)
	at com.carrotsearch.randomizedtesting.ThreadLeakControl.forkTimeoutingTask(ThreadLeakControl.java:809)
	at com.carrotsearch.randomizedtesting.ThreadLeakControl$3.evaluate(ThreadLeakControl.java:460)
	at com.carrotsearch.randomizedtesting.RandomizedRunner.runSingleTest(RandomizedRunner.java:880)
	at com.carrotsearch.randomizedtesting.RandomizedRunner$5.evaluate(RandomizedRunner.java:781)
	at com.carrotsearch.randomizedtesting.RandomizedRunner$6.evaluate(RandomizedRunner.java:816)
	at com.carrotsearch.randomizedtesting.RandomizedRunner$7.evaluate(RandomizedRunner.java:827)
	at com.carrotsearch.randomizedtesting.rules.StatementAdapter.evaluate(StatementAdapter.java:36)
	at com.carrotsearch.randomizedtesting.rules.SystemPropertiesRestoreRule$1.evaluate(SystemPropertiesRestoreRule.java:57)
	at org.apache.lucene.util.AbstractBeforeAfterRule$1.evaluate(AbstractBeforeAfterRule.java:45)
	at com.carrotsearch.randomizedtesting.rules.StatementAdapter.evaluate(StatementAdapter.java:36)
	at org.apache.lucene.util.TestRuleStoreClassName$1.evaluate(TestRuleStoreClassName.java:41)
	at com.carrotsearch.randomizedtesting.rules.NoShadowingOrOverridesOnMethodsRule$1.evaluate(NoShadowingOrOverridesOnMethodsRule.java:40)
	at com.carrotsearch.randomizedtesting.rules.NoShadowingOrOverridesOnMethodsRule$1.evaluate(NoShadowingOrOverridesOnMethodsRule.java:40)
	at com.carrotsearch.randomizedtesting.rules.StatementAdapter.evaluate(StatementAdapter.java:36)
	at com.carrotsearch.randomizedtesting.rules.StatementAdapter.evaluate(StatementAdapter.java:36)
	at com.carrotsearch.randomizedtesting.rules.StatementAdapter.evaluate(StatementAdapter.java:36)
	at org.apache.lucene.util.TestRuleAssertionsRequired$1.evaluate(TestRuleAssertionsRequired.java:53)
	at org.apache.lucene.util.TestRuleMarkFailure$1.evaluate(TestRuleMarkFailure.java:47)
	at org.apache.lucene.util.TestRuleIgnoreAfterMaxFailures$1.evaluate(TestRuleIgnoreAfterMaxFailures.java:64)
	at org.apache.lucene.util.TestRuleIgnoreTestSuites$1.evaluate(TestRuleIgnoreTestSuites.java:54)
	at com.carrotsearch.randomizedtesting.rules.StatementAdapter.evaluate(StatementAdapter.java:36)
	at com.carrotsearch.randomizedtesting.ThreadLeakControl$StatementRunner.run(ThreadLeakControl.java:367)
	at java.lang.Thread.run(Thread.java:745)




Build Log:
[...truncated 11322 lines...]
   [junit4] Suite: org.apache.solr.cloud.overseer.ZkStateReaderTest
   [junit4]   2> Creating dataDir: /x1/jenkins/jenkins-slave/workspace/Lucene-Solr-Tests-master/solr/build/solr-core/test/J0/temp/solr.cloud.overseer.ZkStateReaderTest_ED4A515583C18D87-001/init-core-data-001
   [junit4]   2> 849142 INFO  (SUITE-ZkStateReaderTest-seed#[ED4A515583C18D87]-worker) [    ] o.a.s.SolrTestCaseJ4 Randomized ssl (false) and clientAuth (false) via: @org.apache.solr.util.RandomizeSSL(reason=, ssl=NaN, value=NaN, clientAuth=NaN)
   [junit4]   2> 849143 INFO  (TEST-ZkStateReaderTest.testWatchedCollectionCreation-seed#[ED4A515583C18D87]) [    ] o.a.s.SolrTestCaseJ4 ###Starting testWatchedCollectionCreation
   [junit4]   2> 849143 INFO  (TEST-ZkStateReaderTest.testWatchedCollectionCreation-seed#[ED4A515583C18D87]) [    ] o.a.s.c.ZkTestServer STARTING ZK TEST SERVER
   [junit4]   2> 849143 INFO  (Thread-2419) [    ] o.a.s.c.ZkTestServer client port:0.0.0.0/0.0.0.0:0
   [junit4]   2> 849143 INFO  (Thread-2419) [    ] o.a.s.c.ZkTestServer Starting server
   [junit4]   2> 849243 INFO  (TEST-ZkStateReaderTest.testWatchedCollectionCreation-seed#[ED4A515583C18D87]) [    ] o.a.s.c.ZkTestServer start zk server on port:55966
   [junit4]   2> 849244 INFO  (TEST-ZkStateReaderTest.testWatchedCollectionCreation-seed#[ED4A515583C18D87]) [    ] o.a.s.c.c.SolrZkClient Using default ZkCredentialsProvider
   [junit4]   2> 849244 INFO  (TEST-ZkStateReaderTest.testWatchedCollectionCreation-seed#[ED4A515583C18D87]) [    ] o.a.s.c.c.ConnectionManager Waiting for client to connect to ZooKeeper
   [junit4]   2> 849246 INFO  (zkCallback-1034-thread-1) [    ] o.a.s.c.c.ConnectionManager Watcher org.apache.solr.common.cloud.ConnectionManager@6556ee24 name:ZooKeeperConnection Watcher:127.0.0.1:55966 got event WatchedEvent state:SyncConnected type:None path:null path:null type:None
   [junit4]   2> 849246 INFO  (TEST-ZkStateReaderTest.testWatchedCollectionCreation-seed#[ED4A515583C18D87]) [    ] o.a.s.c.c.ConnectionManager Client is connected to ZooKeeper
   [junit4]   2> 849246 INFO  (TEST-ZkStateReaderTest.testWatchedCollectionCreation-seed#[ED4A515583C18D87]) [    ] o.a.s.c.c.SolrZkClient Using default ZkACLProvider
   [junit4]   2> 849246 INFO  (TEST-ZkStateReaderTest.testWatchedCollectionCreation-seed#[ED4A515583C18D87]) [    ] o.a.s.c.c.SolrZkClient Using default ZkCredentialsProvider
   [junit4]   2> 849249 INFO  (TEST-ZkStateReaderTest.testWatchedCollectionCreation-seed#[ED4A515583C18D87]) [    ] o.a.s.c.c.ConnectionManager Waiting for client to connect to ZooKeeper
   [junit4]   2> 849249 INFO  (zkCallback-1035-thread-1) [    ] o.a.s.c.c.ConnectionManager Watcher org.apache.solr.common.cloud.ConnectionManager@1c28fc65 name:ZooKeeperConnection Watcher:127.0.0.1:55966 got event WatchedEvent state:SyncConnected type:None path:null path:null type:None
   [junit4]   2> 849250 INFO  (TEST-ZkStateReaderTest.testWatchedCollectionCreation-seed#[ED4A515583C18D87]) [    ] o.a.s.c.c.ConnectionManager Client is connected to ZooKeeper
   [junit4]   2> 849250 INFO  (TEST-ZkStateReaderTest.testWatchedCollectionCreation-seed#[ED4A515583C18D87]) [    ] o.a.s.c.c.SolrZkClient Using default ZkACLProvider
   [junit4]   2> 849250 INFO  (TEST-ZkStateReaderTest.testWatchedCollectionCreation-seed#[ED4A515583C18D87]) [    ] o.a.s.c.c.SolrZkClient makePath: /solr
   [junit4]   2> 849253 INFO  (TEST-ZkStateReaderTest.testWatchedCollectionCreation-seed#[ED4A515583C18D87]) [    ] o.a.s.c.c.SolrZkClient Using default ZkCredentialsProvider
   [junit4]   2> 849259 INFO  (TEST-ZkStateReaderTest.testWatchedCollectionCreation-seed#[ED4A515583C18D87]) [    ] o.a.s.c.c.ConnectionManager Waiting for client to connect to ZooKeeper
   [junit4]   2> 849259 INFO  (zkCallback-1036-thread-1) [    ] o.a.s.c.c.ConnectionManager Watcher org.apache.solr.common.cloud.ConnectionManager@68bad37c name:ZooKeeperConnection Watcher:127.0.0.1:55966/solr got event WatchedEvent state:SyncConnected type:None path:null path:null type:None
   [junit4]   2> 849259 INFO  (TEST-ZkStateReaderTest.testWatchedCollectionCreation-seed#[ED4A515583C18D87]) [    ] o.a.s.c.c.ConnectionManager Client is connected to ZooKeeper
   [junit4]   2> 849259 INFO  (TEST-ZkStateReaderTest.testWatchedCollectionCreation-seed#[ED4A515583C18D87]) [    ] o.a.s.c.c.SolrZkClient Using default ZkACLProvider
   [junit4]   2> 849259 INFO  (TEST-ZkStateReaderTest.testWatchedCollectionCreation-seed#[ED4A515583C18D87]) [    ] o.a.s.c.c.SolrZkClient makePath: /live_nodes
   [junit4]   2> 849260 INFO  (TEST-ZkStateReaderTest.testWatchedCollectionCreation-seed#[ED4A515583C18D87]) [    ] o.a.s.c.c.SolrZkClient makePath: /collections
   [junit4]   2> 849260 INFO  (TEST-ZkStateReaderTest.testWatchedCollectionCreation-seed#[ED4A515583C18D87]) [    ] o.a.s.c.c.SolrZkClient makePath: /aliases.json
   [junit4]   2> 849261 INFO  (TEST-ZkStateReaderTest.testWatchedCollectionCreation-seed#[ED4A515583C18D87]) [    ] o.a.s.c.c.SolrZkClient makePath: /clusterstate.json
   [junit4]   2> 849261 INFO  (TEST-ZkStateReaderTest.testWatchedCollectionCreation-seed#[ED4A515583C18D87]) [    ] o.a.s.c.c.SolrZkClient makePath: /security.json
   [junit4]   2> 849262 INFO  (TEST-ZkStateReaderTest.testWatchedCollectionCreation-seed#[ED4A515583C18D87]) [    ] o.a.s.c.c.ZkStateReader Updating cluster state from ZooKeeper... 
   [junit4]   2> 849262 INFO  (TEST-ZkStateReaderTest.testWatchedCollectionCreation-seed#[ED4A515583C18D87]) [    ] o.a.s.c.c.ZkStateReader Loaded empty cluster properties
   [junit4]   2> 849262 INFO  (TEST-ZkStateReaderTest.testWatchedCollectionCreation-seed#[ED4A515583C18D87]) [    ] o.a.s.c.c.ZkStateReader Updated live nodes from ZooKeeper... (0) -> (0)
   [junit4]   2> 849263 INFO  (TEST-ZkStateReaderTest.testWatchedCollectionCreation-seed#[ED4A515583C18D87]) [    ] o.a.s.c.c.ZkStateReader Deleting data for [c1]
   [junit4]   2> 849269 INFO  (TEST-ZkStateReaderTest.testWatchedCollectionCreation-seed#[ED4A515583C18D87]) [    ] o.a.s.c.c.SolrZkClient makePath: /collections/c1
   [junit4]   2> 849270 INFO  (zkCallback-1036-thread-1) [    ] o.a.s.c.c.ZkStateReader A collections change: [WatchedEvent state:SyncConnected type:NodeChildrenChanged path:/collections], has occurred - updating...
   [junit4]   2> 849271 INFO  (TEST-ZkStateReaderTest.testWatchedCollectionCreation-seed#[ED4A515583C18D87]) [    ] o.a.s.c.o.ZkStateWriter going to create_collection /collections/c1/state.json
   [junit4]   2> 849272 INFO  (zkCallback-1036-thread-1) [    ] o.a.s.c.c.ZkStateReader A cluster state change: [WatchedEvent state:SyncConnected type:NodeCreated path:/collections/c1/state.json] for collection [c1] has occurred - updating... (live nodes size: [0])
   [junit4]   2> 849273 INFO  (zkCallback-1036-thread-1) [    ] o.a.s.c.c.ZkStateReader Add data for [c1] ver [0]
   [junit4]   2> 849286 INFO  (TEST-ZkStateReaderTest.testWatchedCollectionCreation-seed#[ED4A515583C18D87]) [    ] o.a.s.c.ZkTestServer connecting to 127.0.0.1:55966 55966
   [junit4]   2> 849452 INFO  (Thread-2419) [    ] o.a.s.c.ZkTestServer connecting to 127.0.0.1:55966 55966
   [junit4]   2> 849453 INFO  (TEST-ZkStateReaderTest.testWatchedCollectionCreation-seed#[ED4A515583C18D87]) [    ] o.a.s.SolrTestCaseJ4 ###Ending testWatchedCollectionCreation
   [junit4]   2> 849454 INFO  (TEST-ZkStateReaderTest.testStateFormatUpdateWithExplicitRefreshLazy-seed#[ED4A515583C18D87]) [    ] o.a.s.SolrTestCaseJ4 ###Starting testStateFormatUpdateWithExplicitRefreshLazy
   [junit4]   2> 849455 INFO  (TEST-ZkStateReaderTest.testStateFormatUpdateWithExplicitRefreshLazy-seed#[ED4A515583C18D87]) [    ] o.a.s.c.ZkTestServer STARTING ZK TEST SERVER
   [junit4]   2> 849475 INFO  (Thread-2420) [    ] o.a.s.c.ZkTestServer client port:0.0.0.0/0.0.0.0:0
   [junit4]   2> 849475 INFO  (Thread-2420) [    ] o.a.s.c.ZkTestServer Starting server
   [junit4]   2> 849571 INFO  (TEST-ZkStateReaderTest.testStateFormatUpdateWithExplicitRefreshLazy-seed#[ED4A515583C18D87]) [    ] o.a.s.c.ZkTestServer start zk server on port:33629
   [junit4]   2> 849571 INFO  (TEST-ZkStateReaderTest.testStateFormatUpdateWithExplicitRefreshLazy-seed#[ED4A515583C18D87]) [    ] o.a.s.c.c.SolrZkClient Using default ZkCredentialsProvider
   [junit4]   2> 849595 INFO  (TEST-ZkStateReaderTest.testStateFormatUpdateWithExplicitRefreshLazy-seed#[ED4A515583C18D87]) [    ] o.a.s.c.c.ConnectionManager Waiting for client to connect to ZooKeeper
   [junit4]   2> 849604 INFO  (zkCallback-1038-thread-1) [    ] o.a.s.c.c.ConnectionManager Watcher org.apache.solr.common.cloud.ConnectionManager@28763df3 name:ZooKeeperConnection Watcher:127.0.0.1:33629 got event WatchedEvent state:SyncConnected type:None path:null path:null type:None
   [junit4]   2> 849604 INFO  (TEST-ZkStateReaderTest.testStateFormatUpdateWithExplicitRefreshLazy-seed#[ED4A515583C18D87]) [    ] o.a.s.c.c.ConnectionManager Client is connected to ZooKeeper
   [junit4]   2> 849604 INFO  (TEST-ZkStateReaderTest.testStateFormatUpdateWithExplicitRefreshLazy-seed#[ED4A515583C18D87]) [    ] o.a.s.c.c.SolrZkClient Using default ZkACLProvider
   [junit4]   2> 849605 INFO  (TEST-ZkStateReaderTest.testStateFormatUpdateWithExplicitRefreshLazy-seed#[ED4A515583C18D87]) [    ] o.a.s.c.c.SolrZkClient Using default ZkCredentialsProvider
   [junit4]   2> 849635 INFO  (TEST-ZkStateReaderTest.testStateFormatUpdateWithExplicitRefreshLazy-seed#[ED4A515583C18D87]) [    ] o.a.s.c.c.ConnectionManager Waiting for client to connect to ZooKeeper
   [junit4]   2> 849651 INFO  (zkCallback-1039-thread-1) [    ] o.a.s.c.c.ConnectionManager Watcher org.apache.solr.common.cloud.ConnectionManager@7a6e4b8d name:ZooKeeperConnection Watcher:127.0.0.1:33629 got event WatchedEvent state:SyncConnected type:None path:null path:null type:None
   [junit4]   2> 849651 INFO  (TEST-ZkStateReaderTest.testStateFormatUpdateWithExplicitRefreshLazy-seed#[ED4A515583C18D87]) [    ] o.a.s.c.c.ConnectionManager Client is connected to ZooKeeper
   [junit4]   2> 849651 INFO  (TEST-ZkStateReaderTest.testStateFormatUpdateWithExplicitRefreshLazy-seed#[ED4A515583C18D87]) [    ] o.a.s.c.c.SolrZkClient Using default ZkACLProvider
   [junit4]   2> 849651 INFO  (TEST-ZkStateReaderTest.testStateFormatUpdateWithExplicitRefreshLazy-seed#[ED4A515583C18D87]) [    ] o.a.s.c.c.SolrZkClient makePath: /solr
   [junit4]   2> 849659 INFO  (TEST-ZkStateReaderTest.testStateFormatUpdateWithExplicitRefreshLazy-seed#[ED4A515583C18D87]) [    ] o.a.s.c.c.SolrZkClient Using default ZkCredentialsProvider
   [junit4]   2> 849671 INFO  (TEST-ZkStateReaderTest.testStateFormatUpdateWithExplicitRefreshLazy-seed#[ED4A515583C18D87]) [    ] o.a.s.c.c.ConnectionManager Waiting for client to connect to ZooKeeper
   [junit4]   2> 849675 INFO  (zkCallback-1040-thread-1) [    ] o.a.s.c.c.ConnectionManager Watcher org.apache.solr.common.cloud.ConnectionManager@23174709 name:ZooKeeperConnection Watcher:127.0.0.1:33629/solr got event WatchedEvent state:SyncConnected type:None path:null path:null type:None
   [junit4]   2> 849675 INFO  (TEST-ZkStateReaderTest.testStateFormatUpdateWithExplicitRefreshLazy-seed#[ED4A515583C18D87]) [    ] o.a.s.c.c.ConnectionManager Client is connected to ZooKeeper
   [junit4]   2> 849675 INFO  (TEST-ZkStateReaderTest.testStateFormatUpdateWithExplicitRefreshLazy-seed#[ED4A515583C18D87]) [    ] o.a.s.c.c.SolrZkClient Using default ZkACLProvider
   [junit4]   2> 849676 INFO  (TEST-ZkStateReaderTest.testStateFormatUpdateWithExplicitRefreshLazy-seed#[ED4A515583C18D87]) [    ] o.a.s.c.c.SolrZkClient makePath: /live_nodes
   [junit4]   2> 849676 INFO  (TEST-ZkStateReaderTest.testStateFormatUpdateWithExplicitRefreshLazy-seed#[ED4A515583C18D87]) [    ] o.a.s.c.c.SolrZkClient makePath: /collections
   [junit4]   2> 849677 INFO  (TEST-ZkStateReaderTest.testStateFormatUpdateWithExplicitRefreshLazy-seed#[ED4A515583C18D87]) [    ] o.a.s.c.c.SolrZkClient makePath: /aliases.json
   [junit4]   2> 849677 INFO  (TEST-ZkStateReaderTest.testStateFormatUpdateWithExplicitRefreshLazy-seed#[ED4A515583C18D87]) [    ] o.a.s.c.c.SolrZkClient makePath: /clusterstate.json
   [junit4]   2> 849678 INFO  (TEST-ZkStateReaderTest.testStateFormatUpdateWithExplicitRefreshLazy-seed#[ED4A515583C18D87]) [    ] o.a.s.c.c.SolrZkClient makePath: /security.json
   [junit4]   2> 849678 INFO  (TEST-ZkStateReaderTest.testStateFormatUpdateWithExplicitRefreshLazy-seed#[ED4A515583C18D87]) [    ] o.a.s.c.c.ZkStateReader Updating cluster state from ZooKeeper... 
   [junit4]   2> 849679 INFO  (TEST-ZkStateReaderTest.testStateFormatUpdateWithExplicitRefreshLazy-seed#[ED4A515583C18D87]) [    ] o.a.s.c.c.ZkStateReader Loaded empty cluster properties
   [junit4]   2> 849679 INFO  (TEST-ZkStateReaderTest.testStateFormatUpdateWithExplicitRefreshLazy-seed#[ED4A515583C18D87]) [    ] o.a.s.c.c.ZkStateReader Updated live nodes from ZooKeeper... (0) -> (0)
   [junit4]   2> 849680 INFO  (TEST-ZkStateReaderTest.testStateFormatUpdateWithExplicitRefreshLazy-seed#[ED4A515583C18D87]) [    ] o.a.s.c.c.SolrZkClient makePath: /collections/c1
   [junit4]   2> 849681 INFO  (TEST-ZkStateReaderTest.testStateFormatUpdateWithExplicitRefreshLazy-seed#[ED4A515583C18D87]) [    ] o.a.s.c.o.ZkStateWriter going to create_collection /collections/c1/state.json
   [junit4]   2> 849685 INFO  (zkCallback-1040-thread-1) [    ] o.a.s.c.c.ZkStateReader A collections change: [WatchedEvent state:SyncConnected type:NodeChildrenChanged path:/collections], has occurred - updating...
   [junit4]   2> 849687 INFO  (zkCallback-1040-thread-2) [    ] o.a.s.c.c.ZkStateReader A cluster state change: [WatchedEvent state:SyncConnected type:NodeDataChanged path:/clusterstate.json], has occurred - updating... (live nodes size: [0])
   [junit4]   2> 849687 WARN  (zkCallback-1040-thread-2) [    ] o.a.s.c.c.ZkStateReader ZooKeeper watch triggered, but Solr cannot talk to ZK: [KeeperErrorCode = Session expired for /clusterstate.json]
   [junit4]   2> 851185 WARN  (zkCallback-1040-thread-1) [    ] o.a.s.c.c.ZkStateReader ZooKeeper watch triggered, but Solr cannot talk to ZK: [KeeperErrorCode = Session expired for /collections]
   [junit4]   2> 851186 INFO  (TEST-ZkStateReaderTest.testStateFormatUpdateWithExplicitRefreshLazy-seed#[ED4A515583C18D87]) [    ] o.a.s.c.ZkTestServer connecting to 127.0.0.1:33629 33629
   [junit4]   2> 851287 INFO  (Thread-2420) [    ] o.a.s.c.ZkTestServer connecting to 127.0.0.1:33629 33629
   [junit4]   2> 851288 INFO  (TEST-ZkStateReaderTest.testStateFormatUpdateWithExplicitRefreshLazy-seed#[ED4A515583C18D87]) [    ] o.a.s.SolrTestCaseJ4 ###Ending testStateFormatUpdateWithExplicitRefreshLazy
   [junit4]   2> NOTE: reproduce with: ant test  -Dtestcase=ZkStateReaderTest -Dtests.method=testStateFormatUpdateWithExplicitRefreshLazy -Dtests.seed=ED4A515583C18D87 -Dtests.multiplier=2 -Dtests.slow=true -Dtests.locale=es-DO -Dtests.timezone=America/Louisville -Dtests.asserts=true -Dtests.file.encoding=US-ASCII
   [junit4] ERROR   1.84s J0 | ZkStateReaderTest.testStateFormatUpdateWithExplicitRefreshLazy <<<
   [junit4]    > Throwable #1: org.apache.solr.common.SolrException: Could not find collection : c1
   [junit4]    > 	at __randomizedtesting.SeedInfo.seed([ED4A515583C18D87:8605F128FACE50BD]:0)
   [junit4]    > 	at org.apache.solr.common.cloud.ClusterState.getCollection(ClusterState.java:192)
   [junit4]    > 	at org.apache.solr.cloud.overseer.ZkStateReaderTest.testStateFormatUpdate(ZkStateReaderTest.java:129)
   [junit4]    > 	at org.apache.solr.cloud.overseer.ZkStateReaderTest.testStateFormatUpdateWithExplicitRefreshLazy(ZkStateReaderTest.java:48)
   [junit4]    > 	at java.lang.Thread.run(Thread.java:745)
   [junit4]   2> 851291 INFO  (TEST-ZkStateReaderTest.testStateFormatUpdateWithExplicitRefresh-seed#[ED4A515583C18D87]) [    ] o.a.s.SolrTestCaseJ4 ###Starting testStateFormatUpdateWithExplicitRefresh
   [junit4]   2> 851291 INFO  (TEST-ZkStateReaderTest.testStateFormatUpdateWithExplicitRefresh-seed#[ED4A515583C18D87]) [    ] o.a.s.c.ZkTestServer STARTING ZK TEST SERVER
   [junit4]   2> 851291 INFO  (Thread-2421) [    ] o.a.s.c.ZkTestServer client port:0.0.0.0/0.0.0.0:0
   [junit4]   2> 851291 INFO  (Thread-2421) [    ] o.a.s.c.ZkTestServer Starting server
   [junit4]   2> 851391 INFO  (TEST-ZkStateReaderTest.testStateFormatUpdateWithExplicitRefresh-seed#[ED4A515583C18D87]) [    ] o.a.s.c.ZkTestServer start zk server on port:33997
   [junit4]   2> 851392 INFO  (TEST-ZkStateReaderTest.testStateFormatUpdateWithExplicitRefresh-seed#[ED4A515583C18D87]) [    ] o.a.s.c.c.SolrZkClient Using default ZkCredentialsProvider
   [junit4]   2> 851392 INFO  (TEST-ZkStateReaderTest.testStateFormatUpdateWithExplicitRefresh-seed#[ED4A515583C18D87]) [    ] o.a.s.c.c.ConnectionManager Waiting for client to connect to ZooKeeper
   [junit4]   2> 851393 INFO  (zkCallback-1042-thread-1) [    ] o.a.s.c.c.ConnectionManager Watcher org.apache.solr.common.cloud.ConnectionManager@b3a1658 name:ZooKeeperConnection Watcher:127.0.0.1:33997 got event WatchedEvent state:SyncConnected type:None path:null path:null type:None
   [junit4]   2> 851394 INFO  (TEST-ZkStateReaderTest.testStateFormatUpdateWithExplicitRefresh-seed#[ED4A515583C18D87]) [    ] o.a.s.c.c.ConnectionManager Client is connected to ZooKeeper
   [junit4]   2> 851394 INFO  (TEST-ZkStateReaderTest.testStateFormatUpdateWithExplicitRefresh-seed#[ED4A515583C18D87]) [    ] o.a.s.c.c.SolrZkClient Using default ZkACLProvider
   [junit4]   2> 851394 INFO  (TEST-ZkStateReaderTest.testStateFormatUpdateWithExplicitRefresh-seed#[ED4A515583C18D87]) [    ] o.a.s.c.c.SolrZkClient Using default ZkCredentialsProvider
   [junit4]   2> 851398 INFO  (TEST-ZkStateReaderTest.testStateFormatUpdateWithExplicitRefresh-seed#[ED4A515583C18D87]) [    ] o.a.s.c.c.ConnectionManager Waiting for client to connect to ZooKeeper
   [junit4]   2> 851398 INFO  (zkCallback-1043-thread-1) [    ] o.a.s.c.c.ConnectionManager Watcher org.apache.solr.common.cloud.ConnectionManager@3786812d name:ZooKeeperConnection Watcher:127.0.0.1:33997 got event WatchedEvent state:SyncConnected type:None path:null path:null type:None
   [junit4]   2> 851398 INFO  (TEST-ZkStateReaderTest.testStateFormatUpdateWithExplicitRefresh-seed#[ED4A515583C18D87]) [    ] o.a.s.c.c.ConnectionManager Client is connected to ZooKeeper
   [junit4]   2> 851398 INFO  (TEST-ZkStateReaderTest.testStateFormatUpdateWithExplicitRefresh-seed#[ED4A515583C18D87]) [    ] o.a.s.c.c.SolrZkClient Using default ZkACLProvider
   [junit4]   2> 851399 INFO  (TEST-ZkStateReaderTest.testStateFormatUpdateWithExplicitRefresh-seed#[ED4A515583C18D87]) [    ] o.a.s.c.c.SolrZkClient makePath: /solr
   [junit4]   2> 851400 INFO  (TEST-ZkStateReaderTest.testStateFormatUpdateWithExplicitRefresh-seed#[ED4A515583C18D87]) [    ] o.a.s.c.c.SolrZkClient Using default ZkCredentialsProvider
   [junit4]   2> 851403 INFO  (TEST-ZkStateReaderTest.testStateFormatUpdateWithExplicitRefresh-seed#[ED4A515583C18D87]) [    ] o.a.s.c.c.ConnectionManager Waiting for client to connect to ZooKeeper
   [junit4]   2> 851403 INFO  (zkCallback-1044-thread-1) [    ] o.a.s.c.c.ConnectionManager Watcher org.apache.solr.common.cloud.ConnectionManager@6f97e18 name:ZooKeeperConnection Watcher:127.0.0.1:33997/solr got event WatchedEvent state:SyncConnected type:None path:null path:null type:None
   [junit4]   2> 851403 INFO  (TEST-ZkStateReaderTest.testStateFormatUpdateWithExplicitRefresh-seed#[ED4A515583C18D87]) [    ] o.a.s.c.c.ConnectionManager Client is connected to ZooKeeper
   [junit4]   2> 851403 INFO  (TEST-ZkStateReaderTest.testStateFormatUpdateWithExplicitRefresh-seed#[ED4A515583C18D87]) [    ] o.a.s.c.c.SolrZkClient Using default ZkACLProvider
   [junit4]   2> 851403 INFO  (TEST-ZkStateReaderTest.testStateFormatUpdateWithExplicitRefresh-seed#[ED4A515583C18D87]) [    ] o.a.s.c.c.SolrZkClient makePath: /live_nodes
   [junit4]   2> 851404 INFO  (TEST-ZkStateReaderTest.testStateFormatUpdateWithExplicitRefresh-seed#[ED4A515583C18D87]) [    ] o.a.s.c.c.SolrZkClient makePath: /collections
   [junit4]   2> 851404 INFO  (TEST-ZkStateReaderTest.testStateFormatUpdateWithExplicitRefresh-seed#[ED4A515583C18D87]) [    ] o.a.s.c.c.SolrZkClient makePath: /aliases.json
   [junit4]   2> 851405 INFO  (TEST-ZkStateReaderTest.testStateFormatUpdateWithExplicitRefresh-seed#[ED4A515583C18D87]) [    ] o.a.s.c.c.SolrZkClient makePath: /clusterstate.json
   [junit4]   2> 851406 INFO  (TEST-ZkStateReaderTest.testStateFormatUpdateWithExplicitRefresh-seed#[ED4A515583C18D87]) [    ] o.a.s.c.c.SolrZkClient makePath: /security.json
   [junit4]   2> 851406 INFO  (TEST-ZkStateReaderTest.testStateFormatUpdateWithExplicitRefresh-seed#[ED4A515583C18D87]) [    ] o.a.s.c.c.ZkStateReader Updating cluster state from ZooKeeper... 
   [junit4]   2> 851406 INFO  (TEST-ZkStateReaderTest.testStateFormatUpdateWithExplicitRefresh-seed#[ED4A515583C18D87]) [    ] o.a.s.c.c.ZkStateReader Loaded empty cluster properties
   [junit4]   2> 851407 INFO  (TEST-ZkStateReaderTest.testStateFormatUpdateWithExplicitRefresh-seed#[ED4A515583C18D87]) [    ] o.a.s.c.c.ZkStateReader Updated live nodes from ZooKeeper... (0) -> (0)
   [junit4]   2> 851408 INFO  (TEST-ZkStateReaderTest.testStateFormatUpdateWithExplicitRefresh-seed#[ED4A515583C18D87]) [    ] o.a.s.c.c.ZkStateReader Deleting data for [c1]
   [junit4]   2> 851408 INFO  (TEST-ZkStateReaderTest.testStateFormatUpdateWithExplicitRefresh-seed#[ED4A515583C18D87]) [    ] o.a.s.c.c.SolrZkClient makePath: /collections/c1
   [junit4]   2> 851408 INFO  (zkCallback-1044-thread-1) [    ] o.a.s.c.c.ZkStateReader A collections change: [WatchedEvent state:SyncConnected type:NodeChildrenChanged path:/collections], has occurred - updating...
   [junit4]   2> 851409 INFO  (zkCallback-1044-thread-1) [    ] o.a.s.c.c.ZkStateReader A cluster state change: [WatchedEvent state:SyncConnected type:NodeDataChanged path:/clusterstate.json], has occurred - updating... (live nodes size: [0])
   [junit4]   2> 851410 INFO  (TEST-ZkStateReaderTest.testStateFormatUpdateWithExplicitRefresh-seed#[ED4A515583C18D87]) [    ] o.a.s.c.o.ZkStateWriter going to create_collection /collections/c1/state.json
   [junit4]   2> 851410 INFO  (zkCallback-1044-thread-1) [    ] o.a.s.c.c.ZkStateReader A cluster state change: [WatchedEvent state:SyncConnected type:NodeCreated path:/collections/c1/state.json] for collection [c1] has occurred - updating... (live nodes size: [0])
   [junit4]   2> 851410 INFO  (zkCallback-1044-thread-1) [    ] o.a.s.c.c.ZkStateReader Add data for [c1] ver [0]
   [junit4]   2> 851410 INFO  (zkCallback-1044-thread-1) [    ] o.a.s.c.c.ZkStateReader A cluster state change: [WatchedEvent state:SyncConnected type:NodeDataChanged path:/clusterstate.json], has occurred - updating... (live nodes size: [0])
   [junit4]   2> 851411 INFO  (TEST-ZkStateReaderTest.testStateFormatUpdateWithExplicitRefresh-seed#[ED4A515583C18D87]) [    ] o.a.s.c.ZkTestServer connecting to 127.0.0.1:33997 33997
   [junit4]   2> 851515 INFO  (Thread-2421) [    ] o.a.s.c.ZkTestServer connecting to 127.0.0.1:33997 33997
   [junit4]   2> 851516 INFO  (TEST-ZkStateReaderTest.testStateFormatUpdateWithExplicitRefresh-seed#[ED4A515583C18D87]) [    ] o.a.s.SolrTestCaseJ4 ###Ending testStateFormatUpdateWithExplicitRefresh
   [junit4]   2> 851517 INFO  (TEST-ZkStateReaderTest.testExternalCollectionWatchedNotWatched-seed#[ED4A515583C18D87]) [    ] o.a.s.SolrTestCaseJ4 ###Starting testExternalCollectionWatchedNotWatched
   [junit4]   2> 851517 INFO  (TEST-ZkStateReaderTest.testExternalCollectionWatchedNotWatched-seed#[ED4A515583C18D87]) [    ] o.a.s.c.ZkTestServer STARTING ZK TEST SERVER
   [junit4]   2> 851518 INFO  (Thread-2422) [    ] o.a.s.c.ZkTestServer client port:0.0.0.0/0.0.0.0:0
   [junit4]   2> 851518 INFO  (Thread-2422) [    ] o.a.s.c.ZkTestServer Starting server
   [junit4]   2> 851618 INFO  (TEST-ZkStateReaderTest.testExternalCollectionWatchedNotWatched-seed#[ED4A515583C18D87]) [    ] o.a.s.c.ZkTestServer start zk server on port:52354
   [junit4]   2> 851618 INFO  (TEST-ZkStateReaderTest.testExternalCollectionWatchedNotWatched-seed#[ED4A515583C18D87]) [    ] o.a.s.c.c.SolrZkClient Using default ZkCredentialsProvider
   [junit4]   2> 851618 INFO  (TEST-ZkStateReaderTest.testExternalCollectionWatchedNotWatched-seed#[ED4A515583C18D87]) [    ] o.a.s.c.c.ConnectionManager Waiting for client to connect to ZooKeeper
   [junit4]   2> 851620 INFO  (zkCallback-1046-thread-1) [    ] o.a.s.c.c.ConnectionManager Watcher org.apache.solr.common.cloud.ConnectionManager@7bac341d name:ZooKeeperConnection Watcher:127.0.0.1:52354 got event WatchedEvent state:SyncConnected type:None path:null path:null type:None
   [junit4]   2> 851620 INFO  (TEST-ZkStateReaderTest.testExternalCollectionWatchedNotWatched-seed#[ED4A515583C18D87]) [    ] o.a.s.c.c.ConnectionManager Client is connected to ZooKeeper
   [junit4]   2> 851620 INFO  (TEST-ZkStateReaderTest.testExternalCollectionWatchedNotWatched-seed#[ED4A515583C18D87]) [    ] o.a.s.c.c.SolrZkClient Using default ZkACLProvider
   [junit4]   2> 851621 WARN  (NIOServerCxn.Factory:0.0.0.0/0.0.0.0:0) [    ] o.a.z.s.NIOServerCnxn caught end of stream exception
   [junit4]   2> EndOfStreamException: Unable to read additional data from client sessionid 0x155b740cdf80000, likely client has closed socket
   [junit4]   2> 	at org.apache.zookeeper.server.NIOServerCnxn.doIO(NIOServerCnxn.java:228)
   [junit4]   2> 	at org.apache.zookeeper.server.NIOServerCnxnFactory.run(NIOServerCnxnFactory.java:208)
   [junit4]   2> 	at java.lang.Thread.run(Thread.java:745)
   [junit4]   2> 851621 INFO  (TEST-ZkStateReaderTest.testExternalCollectionWatchedNotWatched-seed#[ED4A515583C18D87]) [    ] o.a.s.c.c.SolrZkClient Using default ZkCredentialsProvider
   [junit4]   2> 851622 INFO  (TEST-ZkStateReaderTest.testExternalCollectionWatchedNotWatched-seed#[ED4A515583C18D87]) [    ] o.a.s.c.c.ConnectionManager Waiting for client to connect to ZooKeeper
   [junit4]   2> 851622 INFO  (zkCallback-1047-thread-1) [    ] o.a.s.c.c.ConnectionManager Watcher org.apache.solr.common.cloud.ConnectionManager@76061557 name:ZooKeeperConnection Watcher:127.0.0.1:52354 got event WatchedEvent state:SyncConnected type:None path:null path:null type:None
   [junit4]   2> 851622 INFO  (TEST-ZkStateReaderTest.testExternalCollectionWatchedNotWatched-seed#[ED4A515583C18D87]) [    ] o.a.s.c.c.ConnectionManager Client is connected to ZooKeeper
   [junit4]   2> 851623 INFO  (TEST-ZkStateReaderTest.testExternalCollectionWatchedNotWatched-seed#[ED4A515583C18D87]) [    ] o.a.s.c.c.SolrZkClient Using default ZkACLProvider
   [junit4]   2> 851623 INFO  (TEST-ZkStateReaderTest.testExternalCollectionWatchedNotWatched-seed#[ED4A515583C18D87]) [    ] o.a.s.c.c.SolrZkClient makePath: /solr
   [junit4]   2> 851624 WARN  (NIOServerCxn.Factory:0.0.0.0/0.0.0.0:0) [    ] o.a.z.s.NIOServerCnxn caught end of stream exception
   [junit4]   2> EndOfStreamException: Unable to read additional data from client sessionid 0x155b740cdf80001, likely client has closed socket
   [junit4]   2> 	at org.apache.zookeeper.server.NIOServerCnxn.doIO(NIOServerCnxn.java:228)
   [junit4]   2> 	at org.apache.zookeeper.server.NIOServerCnxnFactory.run(NIOServerCnxnFactory.java:208)
   [junit4]   2> 	at java.lang.Thread.run(Thread.java:745)
   [junit4]   2> 851624 INFO  (TEST-ZkStateReaderTest.testExternalCollectionWatchedNotWatched-seed#[ED4A515583C18D87]) [    ] o.a.s.c.c.SolrZkClient Using default ZkCredentialsProvider
   [junit4]   2> 851625 INFO  (TEST-ZkStateReaderTest.testExternalCollectionWatchedNotWatched-seed#[ED4A515583C18D87]) [    ] o.a.s.c.c.ConnectionManager Waiting for client to connect to ZooKeeper
   [junit4]   2> 851625 INFO  (zkCallback-1048-thread-1) [    ] o.a.s.c.c.ConnectionManager Watcher org.apache.solr.common.cloud.ConnectionManager@29ee87d1 name:ZooKeeperConnection Watcher:127.0.0.1:52354/solr got event WatchedEvent state:SyncConnected type:None path:null path:null type:None
   [junit4]   2> 851625 INFO  (TEST-ZkStateReaderTest.testExternalCollectionWatchedNotWatched-seed#[ED4A515583C18D87]) [    ] o.a.s.c.c.ConnectionManager Client is connected to ZooKeeper
   [junit4]   2> 851625 INFO  (TEST-ZkStateReaderTest.testExternalCollectionWatchedNotWatched-seed#[ED4A515583C18D87]) [    ] o.a.s.c.c.SolrZkClient Using default ZkACLProvider
   [junit4]   2> 851626 INFO  (TEST-ZkStateReaderTest.testExternalCollectionWatchedNotWatched-seed#[ED4A515583C18D87]) [    ] o.a.s.c.c.SolrZkClient makePath: /live_nodes
   [junit4]   2> 851626 INFO  (TEST-ZkStateReaderTest.testExternalCollectionWatchedNotWatched-seed#[ED4A515583C18D87]) [    ] o.a.s.c.c.SolrZkClient makePath: /collections
   [junit4]   2> 851627 INFO  (TEST-ZkStateReaderTest.testExternalCollectionWatchedNotWatched-seed#[ED4A515583C18D87]) [    ] o.a.s.c.c.SolrZkClient makePath: /aliases.json
   [junit4]   2> 851627 INFO  (TEST-ZkStateReaderTest.testExternalCollectionWatchedNotWatched-seed#[ED4A515583C18D87]) [    ] o.a.s.c.c.SolrZkClient makePath: /clusterstate.json
   [junit4]   2> 851628 INFO  (TEST-ZkStateReaderTest.testExternalCollectionWatchedNotWatched-seed#[ED4A515583C18D87]) [    ] o.a.s.c.c.SolrZkClient makePath: /security.json
   [junit4]   2> 851628 INFO  (TEST-ZkStateReaderTest.testExternalCollectionWatchedNotWatched-seed#[ED4A515583C18D87]) [    ] o.a.s.c.c.ZkStateReader Updating cluster state from ZooKeeper... 
   [junit4]   2> 851628 INFO  (TEST-ZkStateReaderTest.testExternalCollectionWatchedNotWatched-seed#[ED4A515583C18D87]) [    ] o.a.s.c.c.ZkStateReader Loaded empty cluster properties
   [junit4]   2> 851628 INFO  (TEST-ZkStateReaderTest.testExternalCollectionWatchedNotWatched-seed#[ED4A515583C18D87]) [    ] o.a.s.c.c.ZkStateReader Updated live nodes from ZooKeeper... (0) -> (0)
   [junit4]   2> 851630 INFO  (TEST-ZkStateReaderTest.testExternalCollectionWatchedNotWatched-seed#[ED4A515583C18D87]) [    ] o.a.s.c.c.SolrZkClient makePath: /collections/c1
   [junit4]   2> 851631 INFO  (TEST-ZkStateReaderTest.testExternalCollectionWatchedNotWatched-seed#[ED4A515583C18D87]) [    ] o.a.s.c.o.ZkStateWriter going to create_collection /collections/c1/state.json
   [junit4]   2> 851631 INFO  (zkCallback-1048-thread-1) [    ] o.a.s.c.c.ZkStateReader A collections change: [WatchedEvent state:SyncConnected type:NodeChildrenChanged path:/collections], has occurred - updating...
   [junit4]   2> 851633 WARN  (NIOServerCxn.Factory:0.0.0.0/0.0.0.0:0) [    ] o.a.z.s.NIOServerCnxn caught end of stream exception
   [junit4]   2> EndOfStreamException: Unable to read additional data from client sessionid 0x155b740cdf80002, likely client has closed socket
   [junit4]   2> 	at org.apache.zookeeper.server.NIOServerCnxn.doIO(NIOServerCnxn.java:228)
   [junit4]   2> 	at org.apache.zookeeper.server.NIOServerCnxnFactory.run(NIOServerCnxnFactory.java:208)
   [junit4]   2> 	at java.lang.Thread.run(Thread.java:745)
   [junit4]   2> 851634 INFO  (TEST-ZkStateReaderTest.testExternalCollectionWatchedNotWatched-seed#[ED4A515583C18D87]) [    ] o.a.s.c.ZkTestServer connecting to 127.0.0.1:52354 52354
   [junit4]   2> 851735 INFO  (Thread-2422) [    ] o.a.s.c.ZkTestServer connecting to 127.0.0.1:52354 52354
   [junit4]   2> 851736 INFO  (TEST-ZkStateReaderTest.testExternalCollectionWatchedNotWatched-seed#[ED4A515583C18D87]) [    ] o.a.s.SolrTestCaseJ4 ###Ending testExternalCollectionWatchedNotWatched
   [junit4]   2> NOTE: reproduce with: ant test  -Dtestcase=ZkStateReaderTest -Dtests.method=testExternalCollectionWatchedNotWatched -Dtests.seed=ED4A515583C18D87 -Dtests.multiplier=2 -Dtests.slow=true -Dtests.locale=es-DO -Dtests.timezone=America/Louisville -Dtests.asserts=true -Dtests.file.encoding=US-ASCII
   [junit4] ERROR   0.22s J0 | ZkStateReaderTest.testExternalCollectionWatchedNotWatched <<<
   [junit4]    > Throwable #1: java.lang.NullPointerException
   [junit4]    > 	at __randomizedtesting.SeedInfo.seed([ED4A515583C18D87:E6F1A079D2987B2E]:0)
   [junit4]    > 	at org.apache.solr.cloud.overseer.ZkStateReaderTest.testExternalCollectionWatchedNotWatched(ZkStateReaderTest.java:167)
   [junit4]    > 	at java.lang.Thread.run(Thread.java:745)
   [junit4]   2> 851738 INFO  (TEST-ZkStateReaderTest.testStateFormatUpdateWithTimeDelayLazy-seed#[ED4A515583C18D87]) [    ] o.a.s.SolrTestCaseJ4 ###Starting testStateFormatUpdateWithTimeDelayLazy
   [junit4]   2> 851738 INFO  (TEST-ZkStateReaderTest.testStateFormatUpdateWithTimeDelayLazy-seed#[ED4A515583C18D87]) [    ] o.a.s.c.ZkTestServer STARTING ZK TEST SERVER
   [junit4]   2> 851747 INFO  (Thread-2423) [    ] o.a.s.c.ZkTestServer client port:0.0.0.0/0.0.0.0:0
   [junit4]   2> 851747 INFO  (Thread-2423) [    ] o.a.s.c.ZkTestServer Starting server
   [junit4]   2> 851847 INFO  (TEST-ZkStateReaderTest.testStateFormatUpdateWithTimeDelayLazy-seed#[ED4A515583C18D87]) [    ] o.a.s.c.ZkTestServer start zk server on port:50981
   [junit4]   2> 851847 INFO  (TEST-ZkStateReaderTest.testStateFormatUpdateWithTimeDelayLazy-seed#[ED4A515583C18D87]) [    ] o.a.s.c.c.SolrZkClient Using default ZkCredentialsProvider
   [junit4]   2> 851847 INFO  (TEST-ZkStateReaderTest.testStateFormatUpdateWithTimeDelayLazy-seed#[ED4A515583C18D87]) [    ] o.a.s.c.c.ConnectionManager Waiting for client to connect to ZooKeeper
   [junit4]   2> 851849 INFO  (zkCallback-1050-thread-1) [    ] o.a.s.c.c.ConnectionManager Watcher org.apache.solr.common.cloud.ConnectionManager@59c1047f name:ZooKeeperConnection Watcher:127.0.0.1:50981 got event WatchedEvent state:SyncConnected type:None path:null path:null type:None
   [junit4]   2> 851849 INFO  (TEST-ZkStateReaderTest.testStateFormatUpdateWithTimeDelayLazy-seed#[ED4A515583C18D87]) [    ] o.a.s.c.c.ConnectionManager Client is connected to ZooKeeper
   [junit4]   2> 851849 INFO  (TEST-ZkStateReaderTest.testStateFormatUpdateWithTimeDelayLazy-seed#[ED4A515583C18D87]) [    ] o.a.s.c.c.SolrZkClient Using default ZkACLProvider
   [junit4]   2> 851850 INFO  (TEST-ZkStateReaderTest.testStateFormatUpdateWithTimeDelayLazy-seed#[ED4A515583C18D87]) [    ] o.a.s.c.c.SolrZkClient Using default ZkCredentialsProvider
   [junit4]   2> 851851 INFO  (TEST-ZkStateReaderTest.testStateFormatUpdateWithTimeDelayLazy-seed#[ED4A515583C18D87]) [    ] o.a.s.c.c.ConnectionManager Waiting for client to connect to ZooKeeper
   [junit4]   2> 851862 INFO  (zkCallback-1051-thread-1) [    ] o.a.s.c.c.ConnectionManager Watcher org.apache.solr.common.cloud.ConnectionManager@38a1fc35 name:ZooKeeperConnection Watcher:127.0.0.1:50981 got event WatchedEvent state:SyncConnected type:None path:null path:null type:None
   [junit4]   2> 851862 INFO  (TEST-ZkStateReaderTest.testStateFormatUpdateWithTimeDelayLazy-seed#[ED4A515583C18D87]) [    ] o.a.s.c.c.ConnectionManager Client is connected to ZooKeeper
   [junit4]   2> 851862 INFO  (TEST-ZkStateReaderTest.testStateFormatUpdateWithTimeDelayLazy-seed#[ED4A515583C18D87]) [    ] o.a.s.c.c.SolrZkClient Using default ZkACLProvider
   [junit4]   2> 851862 INFO  (TEST-ZkStateReaderTest.testStateFormatUpdateWithTimeDelayLazy-seed#[ED4A515583C18D87]) [    ] o.a.s.c.c.SolrZkClient makePath: /solr
   [junit4]   2> 851864 INFO  (TEST-ZkStateReaderTest.testStateFormatUpdateWithTimeDelayLazy-seed#[ED4A515583C18D87]) [    ] o.a.s.c.c.SolrZkClient Using default ZkCredentialsProvider
   [junit4]   2> 851864 INFO  (TEST-ZkStateReaderTest.testStateFormatUpdateWithTimeDelayLazy-seed#[ED4A515583C18D87]) [    ] o.a.s.c.c.ConnectionManager Waiting for client to connect to ZooKeeper
   [junit4]   2> 851865 INFO  (zkCallback-1052-thread-1) [    ] o.a.s.c.c.ConnectionManager Watcher org.apache.solr.common.cloud.ConnectionManager@4045d4eb name:ZooKeeperConnection Watcher:127.0.0.1:50981/solr got event WatchedEvent state:SyncConnected type:None path:null path:null type:None
   [junit4]   2> 851865 INFO  (TEST-ZkStateReaderTest.testStateFormatUpdateWithTimeDelayLazy-seed#[ED4A515583C18D87]) [    ] o.a.s.c.c.ConnectionManager Client is connected to ZooKeeper
   [junit4]   2> 851865 INFO  (TEST-ZkStateReaderTest.testStateFormatUpdateWithTimeDelayLazy-seed#[ED4A515583C18D87]) [    ] o.a.s.c.c.SolrZkClient Using default ZkACLProvider
   [junit4]   2> 851865 INFO  (TEST-ZkStateReaderTest.testStateFormatUpdateWithTimeDelayLazy-seed#[ED4A515583C18D87]) [    ] o.a.s.c.c.SolrZkClient makePath: /live_nodes
   [junit4]   2> 851866 INFO  (TEST-ZkStateReaderTest.testStateFormatUpdateWithTimeDelayLazy-seed#[ED4A515583C18D87]) [    ] o.a.s.c.c.SolrZkClient makePath: /collections
   [junit4]   2> 851867 INFO  (TEST-ZkStateReaderTest.testStateFormatUpdateWithTimeDelayLazy-seed#[ED4A515583C18D87]) [    ] o.a.s.c.c.SolrZkClient makePath: /aliases.json
   [junit4]   2> 851868 INFO  (TEST-ZkStateReaderTest.testStateFormatUpdateWithTimeDelayLazy-seed#[ED4A515583C18D87]) [    ] o.a.s.c.c.SolrZkClient makePath: /clusterstate.json
   [junit4]   2> 851868 INFO  (TEST-ZkStateReaderTest.testStateFormatUpdateWithTimeDelayLazy-seed#[ED4A515583C18D87]) [    ] o.a.s.c.c.SolrZkClient makePath: /security.json
   [junit4]   2> 851869 INFO  (TEST-ZkStateReaderTest.testStateFormatUpdateWithTimeDelayLazy-seed#[ED4A515583C18D87]) [    ] o.a.s.c.c.ZkStateReader Updating cluster state from ZooKeeper... 
   [junit4]   2> 851879 INFO  (TEST-ZkStateReaderTest.testStateFormatUpdateWithTimeDelayLazy-seed#[ED4A515583C18D87]) [    ] o.a.s.c.c.ZkStateReader Loaded empty cluster properties
   [junit4]   2> 851879 INFO  (TEST-ZkStateReaderTest.testStateFormatUpdateWithTimeDelayLazy-seed#[ED4A515583C18D87]) [    ] o.a.s.c.c.ZkStateReader Updated live nodes from ZooKeeper... (0) -> (0)
   [junit4]   2> 851880 INFO  (TEST-ZkStateReaderTest.testStateFormatUpdateWithTimeDelayLazy-seed#[ED4A515583C18D87]) [    ] o.a.s.c.c.SolrZkClient makePath: /collections/c1
   [junit4]   2> 851880 INFO  (zkCallback-1052-thread-1) [    ] o.a.s.c.c.ZkStateReader A collections change: [WatchedEvent state:SyncConnected type:NodeChildrenChanged path:/collections], has occurred - updating...
   [junit4]   2> 851881 INFO  (zkCallback-1052-thread-2) [    ] o.a.s.c.c.ZkStateReader A cluster state change: [WatchedEvent state:SyncConnected type:NodeDataChanged path:/clusterstate.json], has occurred - updating... (live nodes size: [0])
   [junit4]   2> 851882 INFO  (TEST-ZkStateReaderTest.testStateFormatUpdateWithTimeDelayLazy-seed#[ED4A515583C18D87]) [    ] o.a.s.c.c.ZkStateReader Deleting data for [c1]
   [junit4]   2> 851882 INFO  (TEST-ZkStateReaderTest.testStateFormatUpdateWithTimeDelayLazy-seed#[ED4A515583C18D87]) [    ] o.a.s.c.o.ZkStateWriter going to create_collection /collections/c1/state.json
   [junit4]   2> 851883 INFO  (zkCallback-1052-thread-2) [    ] o.a.s.c.c.ZkStateReader Uninteresting collection c1
   [junit4]   2> 851883 INFO  (zkCallback-1052-thread-2) [    ] o.a.s.c.c.ZkStateReader A cluster state change: [WatchedEvent state:SyncConnected type:NodeDataChanged path:/clusterstate.json], has occurred - updating... (live nodes size: [0])
   [junit4]   2> 851886 INFO  (TEST-ZkStateReaderTest.testStateFormatUpdateWithTimeDelayLazy-seed#[ED4A515583C18D87]) [    ] o.a.s.c.c.ZkStateReader Add data for [c1] ver [0]
   [junit4]   2> 851887 INFO  (TEST-ZkStateReaderTest.testStateFormatUpdateWithTimeDelayLazy-seed#[ED4A515583C18D87]) [    ] o.a.s.c.ZkTestServer connecting to 127.0.0.1:50981 50981
   [junit4]   2> 851987 INFO  (Thread-2423) [    ] o.a.s.c.ZkTestServer connecting to 127.0.0.1:50981 50981
   [junit4]   2> 851988 INFO  (TEST-ZkStateReaderTest.testStateFormatUpdateWithTimeDelayLazy-seed#[ED4A515583C18D87]) [    ] o.a.s.SolrTestCaseJ4 ###Ending testStateFormatUpdateWithTimeDelayLazy
   [junit4]   2> 851990 INFO  (TEST-ZkStateReaderTest.testStateFormatUpdateWithTimeDelay-seed#[ED4A515583C18D87]) [    ] o.a.s.SolrTestCaseJ4 ###Starting testStateFormatUpdateWithTimeDelay
   [junit4]   2> 851991 INFO  (TEST-ZkStateReaderTest.testStateFormatUpdateWithTimeDelay-seed#[ED4A515583C18D87]) [    ] o.a.s.c.ZkTestServer STARTING ZK TEST SERVER
   [junit4]   2> 851991 INFO  (Thread-2424) [    ] o.a.s.c.ZkTestServer client port:0.0.0.0/0.0.0.0:0
   [junit4]   2> 851991 INFO  (Thread-2424) [    ] o.a.s.c.ZkTestServer Starting server
   [junit4]   2> 852092 INFO  (TEST-ZkStateReaderTest.testStateFormatUpdateWithTimeDelay-seed#[ED4A515583C18D87]) [    ] o.a.s.c.ZkTestServer start zk server on port:56948
   [junit4]   2> 852092 INFO  (TEST-ZkStateReaderTest.testStateFormatUpdateWithTimeDelay-seed#[ED4A515583C18D87]) [    ] o.a.s.c.c.SolrZkClient Using default ZkCredentialsProvider
   [junit4]   2> 852092 INFO  (TEST-ZkStateReaderTest.testStateFormatUpdateWithTimeDelay-seed#[ED4A515583C18D87]) [    ] o.a.s.c.c.ConnectionManager Waiting for client to connect to ZooKeeper
   [junit4]   2> 852094 INFO  (zkCallback-1054-thread-1) [    ] o.a.s.c.c.ConnectionManager Watcher org.apache.solr.common.cloud.ConnectionManager@73adb59c name:ZooKeeperConnection Watcher:127.0.0.1:56948 got event WatchedEvent state:SyncConnected type:None path:null path:null type:None
   [junit4]   2> 852094 INFO  (TEST-ZkStateReaderTest.testStateFormatUpdateWithTimeDelay-seed#[ED4A515583C18D87]) [    ] o.a.s.c.c.ConnectionManager Client is connected to ZooKeeper
   [junit4]   2> 852094 INFO  (TEST-ZkStateReaderTest.testStateFormatUpdateWithTimeDelay-seed#[ED4A515583C18D87]) [    ] o.a.s.c.c.SolrZkClient Using default ZkACLProvider
   [junit4]   2> 852095 INFO  (TEST-ZkStateReaderTest.testStateFormatUpdateWithTimeDelay-seed#[ED4A515583C18D87]) [    ] o.a.s.c.c.SolrZkClient Using default ZkCredentialsProvider
   [junit4]   2> 852095 INFO  (TEST-ZkStateReaderTest.testStateFormatUpdateWithTimeDelay-seed#[ED4A515583C18D87]) [    ] o.a.s.c.c.ConnectionManager Waiting for client to connect to ZooKeeper
   [junit4]   2> 852099 INFO  (zkCallback-1055-thread-1) [    ] o.a.s.c.c.ConnectionManager Watcher org.apache.solr.common.cloud.ConnectionManager@2ebe8784 name:ZooKeeperConnection Watcher:127.0.0.1:56948 got event WatchedEvent state:SyncConnected type:None path:null path:null type:None
   [junit4]   2> 852099 INFO  (TEST-ZkStateReaderTest.testStateFormatUpdateWithTimeDelay-seed#[ED4A515583C18D87]) [    ] o.a.s.c.c.ConnectionManager Client is connected to ZooKeeper
   [junit4]   2> 852099 INFO  (TEST-ZkStateReaderTest.testStateFormatUpdateWithTimeDelay-seed#[ED4A515583C18D87]) [    ] o.a.s.c.c.SolrZkClient Using default ZkACLProvider
   [junit4]   2> 852099 INFO  (TEST-ZkStateReaderTest.testStateFormatUpdateWithTimeDelay-seed#[ED4A515583C18D87]) [    ] o.a.s.c.c.SolrZkClient makePath: /solr
   [junit4]   2> 852100 INFO  (TEST-ZkStateReaderTest.testStateFormatUpdateWithTimeDelay-seed#[ED4A515583C18D87]) [    ] o.a.s.c.c.SolrZkClient Using default ZkCredentialsProvider
   [junit4]   2> 852100 INFO  (TEST-ZkStateReaderTest.testStateFormatUpdateWithTimeDelay-seed#[ED4A515583C18D87]) [    ] o.a.s.c.c.ConnectionManager Waiting for client to connect to ZooKeeper
   [junit4]   2> 852101 INFO  (zkCallback-1056-thread-1) [    ] o.a.s.c.c.ConnectionManager Watcher org.apache.solr.common.cloud.ConnectionManager@7adfa416 name:ZooKeeperConnection Watcher:127.0.0.1:56948/solr got event WatchedEvent state:SyncConnected type:None path:null path:null type:None
   [junit4]   2> 852101 INFO  (TEST-ZkStateReaderTest.testStateFormatUpdateWithTimeDelay-seed#[ED4A515583C18D87]) [    ] o.a.s.c.c.ConnectionManager Client is connected to ZooKeeper
   [junit4]   2> 852101 INFO  (TEST-ZkStateReaderTest.testStateFormatUpdateWithTimeDelay-seed#[ED4A515583C18D87]) [    ] o.a.s.c.c.SolrZkClient Using default ZkACLProvider
   [junit4]   2> 852101 INFO  (TEST-ZkStateReaderTest.testStateFormatUpdateWithTimeDelay-seed#[ED4A515583C18D87]) [    ] o.a.s.c.c.SolrZkClient makePath: /live_nodes
   [junit4]   2> 852102 INFO  (TEST-ZkStateReaderTest.testStateFormatUpdateWithTimeDelay-seed#[ED4A515583C18D87]) [    ] o.a.s.c.c.SolrZkClient makePath: /collections
   [junit4]   2> 852103 INFO  (TEST-ZkStateReaderTest.testStateFormatUpdateWithTimeDelay-seed#[ED4A515583C18D87]) [    ] o.a.s.c.c.SolrZkClient makePath: /aliases.json
   [junit4]   2> 852103 INFO  (TEST-ZkStateReaderTest.testStateFormatUpdateWithTimeDelay-seed#[ED4A515583C18D87]) [    ] o.a.s.c.c.SolrZkClient makePath: /clusterstate.json
   [junit4]   2> 852104 INFO  (TEST-ZkStateReaderTest.testStateFormatUpdateWithTimeDelay-seed#[ED4A515583C18D87]) [    ] o.a.s.c.c.SolrZkClient makePath: /security.json
   [junit4]   2> 852104 INFO  (TEST-ZkStateReaderTest.testStateFormatUpdateWithTimeDelay-seed#[ED4A515583C18D87]) [    ] o.a.s.c.c.ZkStateReader Updating cluster state from ZooKeeper... 
   [junit4]   2> 852105 INFO  (TEST-ZkStateReaderTest.testStateFormatUpdateWithTimeDelay-seed#[ED4A515583C18D87]) [    ] o.a.s.c.c.ZkStateReader Loaded empty cluster properties
   [junit4]   2> 852105 INFO  (TEST-ZkStateReaderTest.testStateFormatUpdateWithTimeDelay-seed#[ED4A515583C18D87]) [    ] o.a.s.c.c.ZkStateReader Updated live nodes from ZooKeeper... (0) -> (0)
   [junit4]   2> 852106 INFO  (TEST-ZkStateReaderTest.testStateFormatUpdateWithTimeDelay-seed#[ED4A515583C18D87]) [    ] o.a.s.c.c.ZkStateReader Deleting data for [c1]
   [junit4]   2> 852106 INFO  (TEST-ZkStateReaderTest.testStateFormatUpdateWithTimeDelay-seed#[ED4A515583C18D87]) [    ] o.a.s.c.c.SolrZkClient makePath: /collections/c1
   [junit4]   2> 852107 INFO  (zkCallback-1056-thread-1) [    ] o.a.s.c.c.ZkStateReader A collections change: [WatchedEvent state:SyncConnected type:NodeChildrenChanged path:/collections], has occurred - updating...
   [junit4]   2> 852111 INFO  (zkCallback-1056-thread-1) [    ] o.a.s.c.c.ZkStateReader A cluster state change: [WatchedEvent state:SyncConnected type:NodeDataChanged path:/clusterstate.json], has occurred - updating... (live nodes size: [0])
   [junit4]   2> 852111 INFO  (TEST-ZkStateReaderTest.testStateFormatUpdateWithTimeDelay-seed#[ED4A515583C18D87]) [    ] o.a.s.c.o.ZkStateWriter going to create_collection /collections/c1/state.json
   [junit4]   2> 852112 INFO  (zkCallback-1056-thread-1) [    ] o.a.s.c.c.ZkStateReader A cluster state change: [WatchedEvent state:SyncConnected type:NodeCreated path:/collections/c1/state.json] for collection [c1] has occurred - updating... (live nodes size: [0])
   [junit4]   2> 852112 INFO  (zkCallback-1056-thread-1) [    ] o.a.s.c.c.ZkStateReader Add data for [c1] ver [0]
   [junit4]   2> 852119 INFO  (zkCallback-1056-thread-2) [    ] o.a.s.c.c.ZkStateReader A cluster state change: [WatchedEvent state:SyncConnected type:NodeDataChanged path:/clusterstate.json], has occurred - updating... (live nodes size: [0])
   [junit4]   2> 852119 WARN  (zkCallback-1056-thread-2) [    ] o.a.s.c.c.ZkStateReader ZooKeeper watch triggered, but Solr cannot talk to ZK: [KeeperErrorCode = Session expired for /clusterstate.json]
   [junit4]   2> 852121 INFO  (TEST-ZkStateReaderTest.testStateFormatUpdateWithTimeDelay-seed#[ED4A515583C18D87]) [    ] o.a.s.c.ZkTestServer connecting to 127.0.0.1:56948 56948
   [junit4]   2> 852222 INFO  (Thread-2424) [    ] o.a.s.c.ZkTestServer connecting to 127.0.0.1:56948 56948
   [junit4]   2> 852223 INFO  (TEST-ZkStateReaderTest.testStateFormatUpdateWithTimeDelay-seed#[ED4A515583C18D87]) [    ] o.a.s.SolrTestCaseJ4 ###Ending testStateFormatUpdateWithTimeDelay
   [junit4]   2> NOTE: reproduce with: ant test  -Dtestcase=ZkStateReaderTest -Dtests.method=testStateFormatUpdateWithTimeDelay -Dtests.seed=ED4A515583C18D87 -Dtests.multiplier=2 -Dtests.slow=true -Dtests.locale=es-DO -Dtests.timezone=America/Louisville -Dtests.asserts=true -Dtests.file.encoding=US-ASCII
   [junit4] FAILURE 0.23s J0 | ZkStateReaderTest.testStateFormatUpdateWithTimeDelay <<<
   [junit4]    > Throwable #1: java.lang.AssertionError: expected:<2> but was:<1>
   [junit4]    > 	at __randomizedtesting.SeedInfo.seed([ED4A515583C18D87:92D4E6D0EAA3A00D]:0)
   [junit4]    > 	at org.apache.solr.cloud.overseer.ZkStateReaderTest.testStateFormatUpdate(ZkStateReaderTest.java:130)
   [junit4]    > 	at org.apache.solr.cloud.overseer.ZkStateReaderTest.testStateFormatUpdateWithTimeDelay(ZkStateReaderTest.java:53)
   [junit4]    > 	at java.lang.Thread.run(Thread.java:745)
   [junit4]   2> 852224 INFO  (SUITE-ZkStateReaderTest-seed#[ED4A515583C18D87]-worker) [    ] o.a.s.SolrTestCaseJ4 ###deleteCore
   [junit4]   2> NOTE: leaving temporary files on disk at: /x1/jenkins/jenkins-slave/workspace/Lucene-Solr-Tests-master/solr/build/solr-core/test/J0/temp/solr.cloud.overseer.ZkStateReaderTest_ED4A515583C18D87-001
   [junit4]   2> Jul 04, 2016 6:52:06 PM com.carrotsearch.randomizedtesting.ThreadLeakControl checkThreadLeaks
   [junit4]   2> WARNING: Will linger awaiting termination of 1 leaked thread(s).
   [junit4]   2> NOTE: test params are: codec=Lucene62, sim=ClassicSimilarity, locale=es-DO, timezone=America/Louisville
   [junit4]   2> NOTE: Linux 3.13.0-85-generic amd64/Oracle Corporation 1.8.0_74 (64-bit)/cpus=4,threads=1,free=85106008,total=465567744
   [junit4]   2> NOTE: All tests run in this JVM: [TestOrdValues, MultiThreadedOCPTest, TestLRUCache, ZkNodePropsTest, TestRTGBase, AnalyticsQueryTest, TestChildDocTransformer, TestConfigSetsAPIZkFailure, TestSha256AuthenticationProvider, PolyFieldTest, HdfsWriteToMultipleCollectionsTest, SignatureUpdateProcessorFactoryTest, TestCopyFieldCollectionResource, SimpleCollectionCreateDeleteTest, TestRandomDVFaceting, TestFoldingMultitermQuery, TestPseudoReturnFields, ForceLeaderTest, ExternalFileFieldSortTest, TestLuceneMatchVersion, TestCSVLoader, TestGraphTermsQParserPlugin, TestBadConfig, TestRestoreCore, BadCopyFieldTest, BitVectorTest, DeleteLastCustomShardedReplicaTest, TestSolrCloudWithKerberosAlt, RankQueryTest, SolrCoreTest, ResponseLogComponentTest, TestCollectionAPI, TestAuthorizationFramework, TestSSLRandomization, TestConfigSetProperties, CdcrUpdateLogTest, CacheHeaderTest, TestJoin, DistribJoinFromCollectionTest, JsonLoaderTest, ActionThrottleTest, TestFieldCacheSortRandom, AddSchemaFieldsUpdateProcessorFactoryTest, CdcrVersionReplicationTest, TestTolerantUpdateProcessorCloud, TestReloadDeadlock, TolerantUpdateProcessorTest, URLClassifyProcessorTest, OverseerStatusTest, TestJsonRequest, PeerSyncTest, IndexSchemaRuntimeFieldTest, BlockJoinFacetDistribTest, DistributedFacetPivotSmallTest, AnalysisAfterCoreReloadTest, OverseerCollectionConfigSetProcessorTest, DateRangeFieldTest, PrimUtilsTest, TestDynamicFieldResource, TestCrossCoreJoin, TestXmlQParser, TestLazyCores, TestFreeTextSuggestions, TestRandomFaceting, PreAnalyzedFieldTest, TestLegacyFieldCache, TestRestManager, TestDownShardTolerantSearch, TestDocSet, TestMiniSolrCloudClusterBase, XsltUpdateRequestHandlerTest, TestConfig, CursorPagingTest, TestSolrConfigHandlerConcurrent, TestCustomSort, TestAtomicUpdateErrorCases, TestReplicationHandler, TestUninvertingReader, LeaderElectionIntegrationTest, TestNRTOpen, BasicZkTest, ZkStateReaderTest]
   [junit4] Completed [243/618 (1!)] on J0 in 4.10s, 6 tests, 1 failure, 2 errors <<< FAILURES!

[...truncated 19 lines...]
   [junit4] Suite: org.apache.solr.cloud.HttpPartitionTest
   [junit4]   2> Creating dataDir: /x1/jenkins/jenkins-slave/workspace/Lucene-Solr-Tests-master/solr/build/solr-core/test/J1/temp/solr.cloud.HttpPartitionTest_ED4A515583C18D87-001/init-core-data-001
   [junit4]   2> 726666 INFO  (SUITE-HttpPartitionTest-seed#[ED4A515583C18D87]-worker) [    ] o.a.s.SolrTestCaseJ4 Randomized ssl (false) and clientAuth (false) via: @org.apache.solr.SolrTestCaseJ4$SuppressSSL(bugUrl=https://issues.apache.org/jira/browse/SOLR-5776)
   [junit4]   2> 726666 INFO  (SUITE-HttpPartitionTest-seed#[ED4A515583C18D87]-worker) [    ] o.a.s.BaseDistributedSearchTestCase Setting hostContext system property: /
   [junit4]   2> 726679 INFO  (TEST-HttpPartitionTest.test-seed#[ED4A515583C18D87]) [    ] o.a.s.c.ZkTestServer STARTING ZK TEST SERVER
   [junit4]   2> 726681 INFO  (Thread-2908) [    ] o.a.s.c.ZkTestServer client port:0.0.0.0/0.0.0.0:0
   [junit4]   2> 726681 INFO  (Thread-2908) [    ] o.a.s.c.ZkTestServer Starting server
   [junit4]   2> 726781 INFO  (TEST-HttpPartitionTest.test-seed#[ED4A515583C18D87]) [    ] o.a.s.c.ZkTestServer start zk server on port:39548
   [junit4]   2> 726781 INFO  (TEST-HttpPartitionTest.test-seed#[ED4A515583C18D87]) [    ] o.a.s.c.c.SolrZkClient Using default ZkCredentialsProvider
   [junit4]   2> 726807 INFO  (TEST-HttpPartitionTest.test-seed#[ED4A515583C18D87]) [    ] o.a.s.c.c.ConnectionManager Waiting for client to connect to ZooKeeper
   [junit4]   2> 726823 INFO  (zkCallback-1054-thread-1) [    ] o.a.s.c.c.ConnectionManager Watcher org.apache.solr.common.cloud.ConnectionManager@a4a8a6c name:ZooKeeperConnection Watcher:127.0.0.1:39548 got event WatchedEvent state:SyncConnected type:None path:null path:null type:None
   [junit4]   2> 726823 INFO  (TEST-HttpPartitionTest.test-seed#[ED4A515583C18D87]) [    ] o.a.s.c.c.ConnectionManager Client is connected to ZooKeeper
   [junit4]   2> 726823 INFO  (TEST-HttpPartitionTest.test-seed#[ED4A515583C18D87]) [    ] o.a.s.c.c.SolrZkClient Using default ZkACLProvider
   [junit4]   2> 726823 INFO  (TEST-HttpPartitionTest.test-seed#[ED4A515583C18D87]) [    ] o.a.s.c.c.SolrZkClient makePath: /solr
   [junit4]   2> 726825 INFO  (TEST-HttpPartitionTest.test-seed#[ED4A515583C18D87]) [    ] o.a.s.c.c.SolrZkClient Using default ZkCredentialsProvider
   [junit4]   2> 726855 INFO  (TEST-HttpPartitionTest.test-seed#[ED4A515583C18D87]) [    ] o.a.s.c.c.ConnectionManager Waiting for client to connect to ZooKeeper
   [junit4]   2> 726887 INFO  (zkCallback-1055-thread-1) [    ] o.a.s.c.c.ConnectionManager Watcher org.apache.solr.common.cloud.ConnectionManager@2359a388 name:ZooKeeperConnection Watcher:127.0.0.1:39548/solr got event WatchedEvent state:SyncConnected type:None path:null path:null type:None
   [junit4]   2> 726887 INFO  (TEST-HttpPartitionTest.test-seed#[ED4A515583C18D87]) [    ] o.a.s.c.c.ConnectionManager Client is connected to ZooKeeper
   [junit4]   2> 726887 INFO  (TEST-HttpPartitionTest.test-seed#[ED4A515583C18D87]) [    ] o.a.s.c.c.SolrZkClient Using default ZkACLProvider
   [junit4]   2> 726887 INFO  (TEST-HttpPartitionTest.test-seed#[ED4A515583C18D87]) [    ] o.a.s.c.c.SolrZkClient makePath: /collections/collection1
   [junit4]   2> 726888 INFO  (TEST-HttpPartitionTest.test-seed#[ED4A515583C18D87]) [    ] o.a.s.c.c.SolrZkClient makePath: /collections/collection1/shards
   [junit4]   2> 726888 INFO  (TEST-HttpPartitionTest.test-seed#[ED4A515583C18D87]) [    ] o.a.s.c.c.SolrZkClient makePath: /collections/control_collection
   [junit4]   2> 726889 INFO  (TEST-HttpPartitionTest.test-seed#[ED4A515583C18D87]) [    ] o.a.s.c.c.SolrZkClient makePath: /collections/control_collection/shards
   [junit4]   2> 726889 INFO  (TEST-HttpPartitionTest.test-seed#[ED4A515583C18D87]) [    ] o.a.s.c.AbstractZkTestCase put /x1/jenkins/jenkins-slave/workspace/Lucene-Solr-Tests-master/solr/core/src/test-files/solr/collection1/conf/solrconfig-tlog.xml to /configs/conf1/solrconfig.xml
   [junit4]   2> 726890 INFO  (TEST-HttpPartitionTest.test-seed#[ED4A515583C18D87]) [    ] o.a.s.c.c.SolrZkClient makePath: /configs/conf1/solrconfig.xml
   [junit4]   2> 726890 INFO  (TEST-HttpPartitionTest.test-seed#[ED4A515583C18D87]) [    ] o.a.s.c.AbstractZkTestCase put /x1/jenkins/jenkins-slave/workspace/Lucene-Solr-Tests-master/solr/core/src/test-files/solr/collection1/conf/schema.xml to /configs/conf1/schema.xml
   [junit4]   2> 726890 INFO  (TEST-HttpPartitionTest.test-seed#[ED4A515583C18D87]) [    ] o.a.s.c.c.SolrZkClient makePath: /configs/conf1/schema.xml
   [junit4]   2> 726891 INFO  (TEST-HttpPartitionTest.test-seed#[ED4A515583C18D87]) [    ] o.a.s.c.AbstractZkTestCase put /x1/jenkins/jenkins-slave/workspace/Lucene-Solr-Tests-master/solr/core/src/test-files/solr/collection1/conf/solrconfig.snippet.randomindexconfig.xml to /configs/conf1/solrconfig.snippet.randomindexconfig.xml
   [junit4]   2> 726891 INFO  (TEST-HttpPartitionTest.test-seed#[ED4A515583C18D87]) [    ] o.a.s.c.c.SolrZkClient makePath: /configs/conf1/solrconfig.snippet.randomindexconfig.xml
   [junit4]   2> 726892 INFO  (TEST-HttpPartitionTest.test-seed#[ED4A515583C18D87]) [    ] o.a.s.c.AbstractZkTestCase put /x1/jenkins/jenkins-slave/workspace/Lucene-Solr-Tests-master/solr/core/src/test-files/solr/collection1/conf/stopwords.txt to /configs/conf1/stopwords.txt
   [junit4]   2> 726892 INFO  (TEST-HttpPartitionTest.test-seed#[ED4A515583C18D87]) [    ] o.a.s.c.c.SolrZkClient makePath: /configs/conf1/stopwords.txt
   [junit4]   2> 726893 INFO  (TEST-HttpPartitionTest.test-seed#[ED4A515583C18D87]) [    ] o.a.s.c.AbstractZkTestCase put /x1/jenkins/jenkins-slave/workspace/Lucene-Solr-Tests-master/solr/core/src/test-files/solr/collection1/conf/protwords.txt to /configs/conf1/protwords.txt
   [junit4]   2> 726893 INFO  (TEST-HttpPartitionTest.test-seed#[ED4A515583C18D87]) [    ] o.a.s.c.c.SolrZkClient makePath: /configs/conf1/protwords.txt
   [junit4]   2> 726893 INFO  (TEST-HttpPartitionTest.test-seed#[ED4A515583C18D87]) [    ] o.a.s.c.AbstractZkTestCase put /x1/jenkins/jenkins-slave/workspace/Lucene-Solr-Tests-master/solr/core/src/test-files/solr/collection1/conf/currency.xml to /configs/conf1/currency.xml
   [junit4]   2> 726893 INFO  (TEST-HttpPartitionTest.test-seed#[ED4A515583C18D87]) [    ] o.a.s.c.c.SolrZkClient makePath: /configs/conf1/currency.xml
   [junit4]   2> 726894 INFO  (TEST-HttpPartitionTest.test-seed#[ED4A515583C18D87]) [    ] o.a.s.c.AbstractZkTestCase put /x1/jenkins/jenkins-slave/workspace/Lucene-Solr-Tests-master/solr/core/src/test-files/solr/collection1/conf/enumsConfig.xml to /configs/conf1/enumsConfig.xml
   [junit4]   2> 726894 INFO  (TEST-HttpPartitionTest.test-seed#[ED4A515583C18D87]) [    ] o.a.s.c.c.SolrZkClient makePath: /configs/conf1/enumsConfig.xml
   [junit4]   2> 726894 INFO  (TEST-HttpPartitionTest.test-seed#[ED4A515583C18D87]) [    ] o.a.s.c.AbstractZkTestCase put /x1/jenkins/jenkins-slave/workspace/Lucene-Solr-Tests-master/solr/core/src/test-files/solr/collection1/conf/open-exchange-rates.json to /configs/conf1/open-exchange-rates.json
   [junit4]   2> 726894 INFO  (TEST-HttpPartitionTest.test-seed#[ED4A515583C18D87]) [    ] o.a.s.c.c.SolrZkClient makePath: /configs/conf1/open-exchange-rates.json
   [junit4]   2> 726895 INFO  (TEST-HttpPartitionTest.test-seed#[ED4A515583C18D87]) [    ] o.a.s.c.AbstractZkTestCase put /x1/jenkins/jenkins-slave/workspace/Lucene-Solr-Tests-master/solr/core/src/test-files/solr/collection1/conf/mapping-ISOLatin1Accent.txt to /configs/conf1/mapping-ISOLatin1Accent.txt
   [junit4]   2> 726895 INFO  (TEST-HttpPartitionTest.test-seed#[ED4A515583C18D87]) [    ] o.a.s.c.c.SolrZkClient makePath: /configs/conf1/mapping-ISOLatin1Accent.txt
   [junit4]   2> 726896 INFO  (TEST-HttpPartitionTest.test-seed#[ED4A515583C18D87]) [    ] o.a.s.c.AbstractZkTestCase put /x1/jenkins/jenkins-slave/workspace/Lucene-Solr-Tests-master/solr/core/src/test-files/solr/collection1/conf/old_synonyms.txt to /configs/conf1/old_synonyms.txt
   [junit4]   2> 726896 INFO  (TEST-HttpPartitionTest.test-seed#[ED4A515583C18D87]) [    ] o.a.s.c.c.SolrZkClient makePath: /configs/conf1/old_synonyms.txt
   [junit4]   2> 726896 INFO  (TEST-HttpPartitionTest.test-seed#[ED4A515583C18D87]) [    ] o.a.s.c.AbstractZkTestCase put /x1/jenkins/jenkins-slave/workspace/Lucene-Solr-Tests-master/solr/core/src/test-files/solr/collection1/conf/synonyms.txt to /configs/conf1/synonyms.txt
   [junit4]   2> 726896 INFO  (TEST-HttpPartitionTest.test-seed#[ED4A515583C18D87]) [    ] o.a.s.c.c.SolrZkClient makePath: /configs/conf1/synonyms.txt
   [junit4]   2> 727227 INFO  (TEST-HttpPartitionTest.test-seed#[ED4A515583C18D87]) [    ] o.a.s.SolrTestCaseJ4 Writing core.properties file to /x1/jenkins/jenkins-slave/workspace/Lucene-Solr-Tests-master/solr/build/solr-core/test/J1/temp/solr.cloud.HttpPartitionTest_ED4A515583C18D87-001/control-001/cores/collection1
   [junit4]   2> 727243 INFO  (TEST-HttpPartitionTest.test-seed#[ED4A515583C18D87]) [    ] o.e.j.s.Server jetty-9.3.8.v20160314
   [junit4]   2> 727304 INFO  (TEST-HttpPartitionTest.test-seed#[ED4A515583C18D87]) [    ] o.e.j.s.h.ContextHandler Started o.e.j.s.ServletContextHandler@3084bfe5{/,null,AVAILABLE}
   [junit4]   2> 727305 INFO  (TEST-HttpPartitionTest.test-seed#[ED4A515583C18D87]) [    ] o.e.j.s.ServerConnector Started ServerConnector@732542d9{HTTP/1.1,[http/1.1]}{127.0.0.1:58299}
   [junit4]   2> 727305 INFO  (TEST-HttpPartitionTest.test-seed#[ED4A515583C18D87]) [    ] o.e.j.s.Server Started @731368ms
   [junit4]   2> 727305 INFO  (TEST-HttpPartitionTest.test-seed#[ED4A515583C18D87]) [    ] o.a.s.c.s.e.JettySolrRunner Jetty properties: {solr.data.dir=/x1/jenkins/jenkins-slave/workspace/Lucene-Solr-Tests-master/solr/build/solr-core/test/J1/temp/solr.cloud.HttpPartitionTest_ED4A515583C18D87-001/tempDir-001/control/data, hostContext=/, hostPort=59099, coreRootDirectory=/x1/jenkins/jenkins-slave/workspace/Lucene-Solr-Tests-master/solr/build/solr-core/test/J1/temp/solr.cloud.HttpPartitionTest_ED4A515583C18D87-001/control-001/cores}
   [junit4]   2> 727305 INFO  (TEST-HttpPartitionTest.test-seed#[ED4A515583C18D87]) [    ] o.a.s.s.SolrDispatchFilter SolrDispatchFilter.init(): sun.misc.Launcher$AppClassLoader@73d16e93
   [junit4]   2> 727305 INFO  (TEST-HttpPartitionTest.test-seed#[ED4A515583C18D87]) [    ] o.a.s.c.SolrResourceLoader new SolrResourceLoader for directory: '/x1/jenkins/jenkins-slave/workspace/Lucene-Solr-Tests-master/solr/build/solr-core/test/J1/temp/solr.cloud.HttpPartitionTest_ED4A515583C18D87-001/control-001'
   [junit4]   2> 727305 INFO  (TEST-HttpPartitionTest.test-seed#[ED4A515583C18D87]) [    ] o.a.s.c.SolrResourceLoader JNDI not configured for solr (NoInitialContextEx)
   [junit4]   2> 727305 INFO  (TEST-HttpPartitionTest.test-seed#[ED4A515583C18D87]) [    ] o.a.s.c.SolrResourceLoader solr home defaulted to 'solr/' (could not find system property or JNDI)
   [junit4]   2> 727305 INFO  (TEST-HttpPartitionTest.test-seed#[ED4A515583C18D87]) [    ] o.a.s.c.c.SolrZkClient Using default ZkCredentialsProvider
   [junit4]   2> 727306 INFO  (TEST-HttpPartitionTest.test-seed#[ED4A515583C18D87]) [    ] o.a.s.c.c.ConnectionManager Waiting for client to connect to ZooKeeper
   [junit4]   2> 727309 INFO  (zkCallback-1056-thread-1) [    ] o.a.s.c.c.ConnectionManager Watcher org.apache.solr.common.cloud.ConnectionManager@108e6f9e name:ZooKeeperConnection Watcher:127.0.0.1:39548/solr got event WatchedEvent state:SyncConnected type:None path:null path:null type:None
   [junit4]   2> 727309 INFO  (TEST-HttpPartitionTest.test-seed#[ED4A515583C18D87]) [    ] o.a.s.c.c.ConnectionManager Client is connected to ZooKeeper
   [junit4]   2> 727309 INFO  (TEST-HttpPartitionTest.test-seed#[ED4A515583C18D87]) [    ] o.a.s.c.c.SolrZkClient Using default ZkACLProvider
   [junit4]   2> 727309 INFO  (TEST-HttpPartitionTest.test-seed#[ED4A515583C18D87]) [    ] o.a.s.s.SolrDispatchFilter Loading solr.xml from SolrHome (not found in ZooKeeper)
   [junit4]   2> 727309 INFO  (TEST-HttpPartitionTest.test-seed#[ED4A515583C18D87]) [    ] o.a.s.c.SolrXmlConfig Loading container configuration from /x1/jenkins/jenkins-slave/workspace/Lucene-Solr-Tests-master/solr/build/solr-core/test/J1/temp/solr.cloud.HttpPartitionTest_ED4A515583C18D87-001/control-001/solr.xml
   [junit4]   2> 727313 INFO  (TEST-HttpPartitionTest.test-seed#[ED4A515583C18D87]) [    ] o.a.s.c.CorePropertiesLocator Config-defined core root directory: /x1/jenkins/jenkins-slave/workspace/Lucene-Solr-Tests-master/solr/build/solr-core/test/J1/temp/solr.cloud.HttpPartitionTest_ED4A515583C18D87-001/control-001/cores
   [junit4]   2> 727314 INFO  (TEST-HttpPartitionTest.test-seed#[ED4A515583C18D87]) [    ] o.a.s.c.CoreContainer New CoreContainer 37682451
   [junit4]   2> 727314 INFO  (TEST-HttpPartitionTest.test-seed#[ED4A515583C18D87]) [    ] o.a.s.c.CoreContainer Loading cores into CoreContainer [instanceDir=/x1/jenkins/jenkins-slave/workspace/Lucene-Solr-Tests-master/solr/build/solr-core/test/J1/temp/solr.cloud.HttpPartitionTest_ED4A515583C18D87-001/control-001]
   [junit4]   2> 727314 WARN  (TEST-HttpPartitionTest.test-seed#[ED4A515583C18D87]) [    ] o.a.s.c.CoreContainer Couldn't add files from /x1/jenkins/jenkins-slave/workspace/Lucene-Solr-Tests-master/solr/build/solr-core/test/J1/temp/solr.cloud.HttpPartitionTest_ED4A515583C18D87-001/control-001/lib to classpath: /x1/jenkins/jenkins-slave/workspace/Lucene-Solr-Tests-master/solr/build/solr-core/test/J1/temp/solr.cloud.HttpPartitionTest_ED4A515583C18D87-001/control-001/lib
   [junit4]   2> 727327 INFO  (TEST-HttpPartitionTest.test-seed#[ED4A515583C18D87]) [    ] o.a.s.h.c.HttpShardHandlerFactory created with socketTimeout : 90000,urlScheme : ,connTimeout : 15000,maxConnectionsPerHost : 20,maxConnections : 10000,corePoolSize : 0,maximumPoolSize : 2147483647,maxThreadIdleTime : 5,sizeOfQueue : -1,fairnessPolicy : false,
   [junit4]   2> 727339 INFO  (TEST-HttpPartitionTest.test-seed#[ED4A515583C18D87]) [    ] o.a.s.u.UpdateShardHandler Created UpdateShardHandler HTTP client with params: socketTimeout=340000&connTimeout=45000&maxConnections=100000&maxConnectionsPerHost=100000
   [junit4]   2> 727339 INFO  (TEST-HttpPartitionTest.test-seed#[ED4A515583C18D87]) [    ] o.a.s.l.LogWatcher SLF4J impl is org.slf4j.impl.Log4jLoggerFactory
   [junit4]   2> 727339 INFO  (TEST-HttpPartitionTest.test-seed#[ED4A515583C18D87]) [    ] o.a.s.l.LogWatcher Registering Log Listener [Log4j (org.slf4j.impl.Log4jLoggerFactory)]
   [junit4]   2> 727339 INFO  (TEST-HttpPartitionTest.test-seed#[ED4A515583C18D87]) [    ] o.a.s.c.ZkContainer Zookeeper client=127.0.0.1:39548/solr
   [junit4]   2> 727339 INFO  (TEST-HttpPartitionTest.test-seed#[ED4A515583C18D87]) [    ] o.a.s.c.ZkController zkHost includes chroot
   [junit4]   2> 727339 INFO  (TEST-HttpPartitionTest.test-seed#[ED4A515583C18D87]) [    ] o.a.s.c.c.SolrZkClient Using default ZkCredentialsProvider
   [junit4]   2> 727359 INFO  (TEST-HttpPartitionTest.test-seed#[ED4A515583C18D87]) [    ] o.a.s.c.c.ConnectionManager Waiting for client to connect to ZooKeeper
   [junit4]   2> 727391 INFO  (zkCallback-1059-thread-1) [    ] o.a.s.c.c.ConnectionManager Watcher org.apache.solr.common.cloud.ConnectionManager@740b040c name:ZooKeeperConnection Watcher:127.0.0.1:39548 got event WatchedEvent state:SyncConnected type:None path:null path:null type:None
   [junit4]   2> 727396 INFO  (TEST-HttpPartitionTest.test-seed#[ED4A515583C18D87]) [    ] o.a.s.c.c.ConnectionManager Client is connected to ZooKeeper
   [junit4]   2> 727396 INFO  (TEST-HttpPartitionTest.test-seed#[ED4A515583C18D87]) [    ] o.a.s.c.c.SolrZkClient Using default ZkACLProvider
   [junit4]   2> 727397 INFO  (TEST-HttpPartitionTest.test-seed#[ED4A515583C18D87]) [n:127.0.0.1:59099_    ] o.a.s.c.ZkController Added new OnReconnect listener org.apache.solr.cloud.ZkController$$Lambda$34/721205766@68adbf08
   [junit4]   2> 727407 INFO  (TEST-HttpPartitionTest.test-seed#[ED4A515583C18D87]) [n:127.0.0.1:59099_    ] o.a.s.c.c.ConnectionManager Waiting for client to connect to ZooKeeper
   [junit4]   2> 727407 INFO  (zkCallback-1060-thread-1-processing-n:127.0.0.1:59099_) [n:127.0.0.1:59099_    ] o.a.s.c.c.ConnectionManager Watcher org.apache.solr.common.cloud.ConnectionManager@53ef1217 name:ZooKeeperConnection Watcher:127.0.0.1:39548/solr got event WatchedEvent state:SyncConnected type:None path:null path:null type:None
   [junit4]   2> 727407 INFO  (TEST-HttpPartitionTest.test-seed#[ED4A515583C18D87]) [n:127.0.0.1:59099_    ] o.a.s.c.c.ConnectionManager Client is connected to ZooKeeper
   [junit4]   2> 727408 INFO  (TEST-HttpPartitionTest.test-seed#[ED4A515583C18D87]) [n:127.0.0.1:59099_    ] o.a.s.c.c.SolrZkClient makePath: /overseer/queue
   [junit4]   2> 727408 INFO  (TEST-HttpPartitionTest.test-seed#[ED4A515583C18D87]) [n:127.0.0.1:59099_    ] o.a.s.c.c.SolrZkClient makePath: /overseer/collection-queue-work
   [junit4]   2> 727409 INFO  (TEST-HttpPartitionTest.test-seed#[ED4A515583C18D87]) [n:127.0.0.1:59099_    ] o.a.s.c.c.SolrZkClient makePath: /overseer/collection-map-running
   [junit4]   2> 727410 INFO  (TEST-HttpPartitionTest.test-seed#[ED4A515583C18D87]) [n:127.0.0.1:59099_    ] o.a.s.c.c.SolrZkClient makePath: /overseer/collection-map-completed
   [junit4]   2> 727411 INFO  (TEST-HttpPartitionTest.test-seed#[ED4A515583C18D87]) [n:127.0.0.1:59099_    ] o.a.s.c.c.SolrZkClient makePath: /overseer/collection-map-failure
   [junit4]   2> 727411 INFO  (TEST-HttpPartitionTest.test-seed#[ED4A515583C18D87]) [n:127.0.0.1:59099_    ] o.a.s.c.c.SolrZkClient makePath: /live_nodes
   [junit4]   2> 727412 INFO  (TEST-HttpPartitionTest.test-seed#[ED4A515583C18D87]) [n:127.0.0.1:59099_    ] o.a.s.c.c.SolrZkClient makePath: /aliases.json
   [junit4]   2> 727412 INFO  (TEST-HttpPartitionTest.test-seed#[ED4A515583C18D87]) [n:127.0.0.1:59099_    ] o.a.s.c.c.SolrZkClient makePath: /clusterstate.json
   [junit4]   2> 727412 INFO  (TEST-HttpPartitionTest.test-seed#[ED4A515583C18D87]) [n:127.0.0.1:59099_    ] o.a.s.c.c.SolrZkClient makePath: /security.json
   [junit4]   2> 727413 INFO  (TEST-HttpPartitionTest.test-seed#[ED4A515583C18D87]) [n:127.0.0.1:59099_    ] o.a.s.c.c.ZkStateReader Updating cluster state from ZooKeeper... 
   [junit4]   2> 727413 INFO  (TEST-HttpPartitionTest.test-seed#[ED4A515583C18D87]) [n:127.0.0.1:59099_    ] o.a.s.c.c.ZkStateReader Loaded empty cluster properties
   [junit4]   2> 727413 INFO  (TEST-HttpPartitionTest.test-seed#[ED4A515583C18D87]) [n:127.0.0.1:59099_    ] o.a.s.c.c.ZkStateReader Updated live nodes from ZooKeeper... (0) -> (0)
   [junit4]   2> 727414 INFO  (TEST-HttpPartitionTest.test-seed#[ED4A515583C18D87]) [n:127.0.0.1:59099_    ] o.a.s.c.c.SolrZkClient makePath: /overseer_elect
   [junit4]   2> 727415 INFO  (TEST-HttpPartitionTest.test-seed#[ED4A515583C18D87]) [n:127.0.0.1:59099_    ] o.a.s.c.c.SolrZkClient makePath: /overseer_elect/election
   [junit4]   2> 727415 INFO  (TEST-HttpPartitionTest.test-seed#[ED4A515583C18D87]) [n:127.0.0.1:59099_    ] o.a.s.c.Overseer Overseer (id=null) closing
   [junit4]   2> 727416 INFO  (TEST-HttpPartitionTest.test-seed#[ED4A515583C18D87]) [n:127.0.0.1:59099_    ] o.a.s.c.LeaderElector Joined leadership election with path: /overseer_elect/election/96184447713083396-127.0.0.1:59099_-n_0000000000
   [junit4]   2> 727416 INFO  (TEST-HttpPartitionTest.test-seed#[ED4A515583C18D87]) [n:127.0.0.1:59099_    ] o.a.s.c.OverseerElectionContext I am going to be the leader 127.0.0.1:59099_
   [junit4]   2> 727416 INFO  (TEST-HttpPartitionTest.test-seed#[ED4A515583C18D87]) [n:127.0.0.1:59099_    ] o.a.s.c.c.SolrZkClient makePath: /overseer_elect/leader
   [junit4]   2> 727416 INFO  (TEST-HttpPartitionTest.test-seed#[ED4A515583C18D87]) [n:127.0.0.1:59099_    ] o.a.s.c.Overseer Overseer (id=96184447713083396-127.0.0.1:59099_-n_0000000000) starting
   [junit4]   2> 727417 INFO  (TEST-HttpPartitionTest.test-seed#[ED4A515583C18D87]) [n:127.0.0.1:59099_    ] o.a.s.c.c.SolrZkClient makePath: /overseer/queue-work
   [junit4]   2> 727419 INFO  (TEST-HttpPartitionTest.test-seed#[ED4A515583C18D87]) [n:127.0.0.1:59099_    ] o.a.s.c.OverseerAutoReplicaFailoverThread Starting OverseerAutoReplicaFailoverThread autoReplicaFailoverWorkLoopDelay=10000 autoReplicaFailoverWaitAfterExpiration=30000 autoReplicaFailoverBadNodeExpiration=60000
   [junit4]   2> 727419 INFO  (OverseerStateUpdate-96184447713083396-127.0.0.1:59099_-n_0000000000) [n:127.0.0.1:59099_    ] o.a.s.c.Overseer Starting to work on the main queue
   [junit4]   2> 727421 INFO  (OverseerCollectionConfigSetProcessor-96184447713083396-127.0.0.1:59099_-n_0000000000) [n:127.0.0.1:59099_    ] o.a.s.c.OverseerTaskProcessor Process current queue of overseer operations
   [junit4]   2> 727428 INFO  (TEST-HttpPartitionTest.test-seed#[ED4A515583C18D87]) [n:127.0.0.1:59099_    ] o.a.s.c.ZkController Register node as live in ZooKeeper:/live_nodes/127.0.0.1:59099_
   [junit4]   2> 727428 INFO  (TEST-HttpPartitionTest.test-seed#[ED4A515583C18D87]) [n:127.0.0.1:59099_    ] o.a.s.c.c.SolrZkClient makePath: /live_nodes/127.0.0.1:59099_
   [junit4]   2> 727429 INFO  (OverseerStateUpdate-96184447713083396-127.0.0.1:59099_-n_0000000000) [n:127.0.0.1:59099_    ] o.a.s.c.c.ZkStateReader Updated live nodes from ZooKeeper... (0) -> (0)
   [junit4]   2> 727429 INFO  (zkCallback-1060-thread-1-processing-n:127.0.0.1:59099_) [n:127.0.0.1:59099_    ] o.a.s.c.c.ZkStateReader A live node change: [WatchedEvent state:SyncConnected type:NodeChildrenChanged path:/live_nodes], has occurred - updating... (live nodes size: [0])
   [junit4]   2> 727429 INFO  (zkCallback-1060-thread-1-processing-n:127.0.0.1:59099_) [n:127.0.0.1:59099_    ] o.a.s.c.c.ZkStateReader Updated live nodes from ZooKeeper... (0) -> (1)
   [junit4]   2> 727440 INFO  (TEST-HttpPartitionTest.test-seed#[ED4A515583C18D87]) [n:127.0.0.1:59099_    ] o.a.s.c.CoreContainer Security conf doesn't exist. Skipping setup for authorization module.
   [junit4]   2> 727440 INFO  (TEST-HttpPartitionTest.test-seed#[ED4A515583C18D87]) [n:127.0.0.1:59099_    ] o.a.s.c.CoreContainer No authentication plugin used.
   [junit4]   2> 727440 INFO  (TEST-HttpPartitionTest.test-seed#[ED4A515583C18D87]) [n:127.0.0.1:59099_    ] o.a.s.c.CorePropertiesLocator Looking for core definitions underneath /x1/jenkins/jenkins-slave/workspace/Lucene-Solr-Tests-master/solr/build/solr-core/test/J1/temp/solr.cloud.HttpPartitionTest_ED4A515583C18D87-001/control-001/cores
   [junit4]   2> 727441 INFO  (TEST-HttpPartitionTest.test-seed#[ED4A515583C18D87]) [n:127.0.0.1:59099_    ] o.a.s.c.CoreDescriptor Created CoreDescriptor: {name=collection1, config=solrconfig.xml, transient=false, schema=schema.xml, loadOnStartup=true, configSetProperties=configsetprops.json, collection=control_collection, coreNodeName=, dataDir=data/, shard=}
   [junit4]   2> 727441 INFO  (TEST-HttpPartitionTest.test-seed#[ED4A515583C18D87]) [n:127.0.0.1:59099_    ] o.a.s.c.CorePropertiesLocator Found core collection1 in /x1/jenkins/jenkins-slave/workspace/Lucene-Solr-Tests-master/solr/build/solr-core/test/J1/temp/solr.cloud.HttpPartitionTest_ED4A515583C18D87-001/control-001/cores/collection1
   [junit4]   2> 727441 INFO  (TEST-HttpPartitionTest.test-seed#[ED4A515583C18D87]) [n:127.0.0.1:59099_    ] o.a.s.c.CorePropertiesLocator Found 1 core definitions
   [junit4]   2> 727447 INFO  (coreLoadExecutor-2989-thread-1-processing-n:127.0.0.1:59099_) [n:127.0.0.1:59099_ c:control_collection   x:collection1] o.a.s.c.ZkController publishing state=down
   [junit4]   2> 727447 INFO  (coreLoadExecutor-2989-thread-1-processing-n:127.0.0.1:59099_) [n:127.0.0.1:59099_ c:control_collection   x:collection1] o.a.s.c.ZkController numShards not found on descriptor - reading it from system property
   [junit4]   2> 727448 INFO  (coreLoadExecutor-2989-thread-1-processing-n:127.0.0.1:59099_) [n:127.0.0.1:59099_ c:control_collection   x:collection1] o.a.s.c.ZkController Collection control_collection not visible yet, but flagging it so a watch is registered when it becomes visible
   [junit4]   2> 727448 INFO  (coreLoadExecutor-2989-thread-1-processing-n:127.0.0.1:59099_) [n:127.0.0.1:59099_ c:control_collection   x:collection1] o.a.s.c.c.ZkStateReader Deleting data for [control_collection]
   [junit4]   2> 727463 INFO  (TEST-HttpPartitionTest.test-seed#[ED4A515583C18D87]) [n:127.0.0.1:59099_    ] o.a.s.s.SolrDispatchFilter user.dir=/x1/jenkins/jenkins-slave/workspace/Lucene-Solr-Tests-master/solr/build/solr-core/test/J1
   [junit4]   2> 727463 INFO  (TEST-HttpPartitionTest.test-seed#[ED4A515583C18D87]) [n:127.0.0.1:59099_    ] o.a.s.s.SolrDispatchFilter SolrDispatchFilter.init() done
   [junit4]   2> 727474 INFO  (coreLoadExecutor-2989-thread-1-processing-n:127.0.0.1:59099_) [n:127.0.0.1:59099_ c:control_collection   x:collection1] o.a.s.c.ZkController look for our core node name
   [junit4]   2> 727474 INFO  (OverseerStateUpdate-96184447713083396-127.0.0.1:59099_-n_0000000000) [n:127.0.0.1

[...truncated too long message...]


   [junit4]   2> 887542 INFO  (OverseerStateUpdate-96184447713083406-127.0.0.1:52770_-n_0000000003) [n:127.0.0.1:52770_    ] o.a.s.c.Overseer Overseer Loop exiting : 127.0.0.1:52770_
   [junit4]   2> 887546 INFO  (zkCallback-1064-thread-2) [    ] o.a.s.c.c.ZkStateReader A live node change: [WatchedEvent state:SyncConnected type:NodeChildrenChanged path:/live_nodes], has occurred - updating... (live nodes size: [1])
   [junit4]   2> 887546 INFO  (zkCallback-1081-thread-3-processing-n:127.0.0.1:52770_) [n:127.0.0.1:52770_    ] o.a.s.c.c.ZkStateReader A live node change: [WatchedEvent state:SyncConnected type:NodeChildrenChanged path:/live_nodes], has occurred - updating... (live nodes size: [1])
   [junit4]   2> 887547 WARN  (zkCallback-1081-thread-3-processing-n:127.0.0.1:52770_) [n:127.0.0.1:52770_    ] o.a.s.c.c.ZkStateReader ZooKeeper watch triggered, but Solr cannot talk to ZK: [KeeperErrorCode = Session expired for /live_nodes]
   [junit4]   2> 887547 INFO  (zkCallback-1064-thread-2) [    ] o.a.s.c.c.ZkStateReader Updated live nodes from ZooKeeper... (1) -> (0)
   [junit4]   2> 887547 INFO  (TEST-HttpPartitionTest.test-seed#[ED4A515583C18D87]) [    ] o.e.j.s.ServerConnector Stopped ServerConnector@34d7f240{HTTP/1.1,[http/1.1]}{127.0.0.1:0}
   [junit4]   2> 887548 INFO  (TEST-HttpPartitionTest.test-seed#[ED4A515583C18D87]) [    ] o.e.j.s.h.ContextHandler Stopped o.e.j.s.ServletContextHandler@445af633{/,null,UNAVAILABLE}
   [junit4]   2> 887550 INFO  (TEST-HttpPartitionTest.test-seed#[ED4A515583C18D87]) [    ] o.a.s.c.ChaosMonkey monkey: stop shard! 59099
   [junit4]   2> 887555 INFO  (TEST-HttpPartitionTest.test-seed#[ED4A515583C18D87]) [    ] o.a.s.c.ZkTestServer connecting to 127.0.0.1:39548 39548
   [junit4]   2> 887731 INFO  (Thread-2908) [    ] o.a.s.c.ZkTestServer connecting to 127.0.0.1:39548 39548
   [junit4]   2> 887732 WARN  (Thread-2908) [    ] o.a.s.c.ZkTestServer Watch limit violations: 
   [junit4]   2> Maximum concurrent create/delete watches above limit:
   [junit4]   2> 
   [junit4]   2> 	6	/solr/clusterprops.json
   [junit4]   2> 	6	/solr/aliases.json
   [junit4]   2> 	5	/solr/security.json
   [junit4]   2> 	5	/solr/configs/conf1
   [junit4]   2> 	4	/solr/collections/collection1/state.json
   [junit4]   2> 	4	/solr/collections/collMinRf_1x3/state.json
   [junit4]   2> 	3	/solr/collections/c8n_1x3/state.json
   [junit4]   2> 	3	/solr/collections/c8n_1x2_leader_session_loss/state.json
   [junit4]   2> 	2	/solr/collections/c8n_1x2/state.json
   [junit4]   2> 	2	/solr/collections/c8n_crud_1x2/state.json
   [junit4]   2> 
   [junit4]   2> Maximum concurrent data watches above limit:
   [junit4]   2> 
   [junit4]   2> 	6	/solr/clusterstate.json
   [junit4]   2> 	2	/solr/overseer_elect/election/96184447713083400-127.0.0.1:60660_-n_0000000001
   [junit4]   2> 	2	/solr/collections/c8n_1x3/leader_elect/shard1/election/96184447713083400-core_node3-n_0000000000
   [junit4]   2> 	2	/solr/collections/collMinRf_1x3/leader_elect/shard1/election/96184447713083406-core_node2-n_0000000001
   [junit4]   2> 
   [junit4]   2> Maximum concurrent children watches above limit:
   [junit4]   2> 
   [junit4]   2> 	145	/solr/overseer/collection-queue-work
   [junit4]   2> 	106	/solr/overseer/queue
   [junit4]   2> 	21	/solr/overseer/queue-work
   [junit4]   2> 	7	/solr/live_nodes
   [junit4]   2> 	6	/solr/collections
   [junit4]   2> 
   [junit4]   2> 887733 WARN  (TEST-HttpPartitionTest.test-seed#[ED4A515583C18D87]) [    ] o.a.s.c.SocketProxy Closing 14 connections to: http://127.0.0.1:35269/, target: http://127.0.0.1:35180/
   [junit4]   2> 887733 WARN  (TEST-HttpPartitionTest.test-seed#[ED4A515583C18D87]) [    ] o.a.s.c.SocketProxy Closing 7 connections to: http://127.0.0.1:59099/, target: http://127.0.0.1:58299/
   [junit4]   2> 887733 WARN  (TEST-HttpPartitionTest.test-seed#[ED4A515583C18D87]) [    ] o.a.s.c.SocketProxy Closing 6 connections to: http://127.0.0.1:52770/, target: http://127.0.0.1:55353/
   [junit4]   2> 887733 WARN  (TEST-HttpPartitionTest.test-seed#[ED4A515583C18D87]) [    ] o.a.s.c.SocketProxy Closing 26 connections to: http://127.0.0.1:60660/, target: http://127.0.0.1:53125/
   [junit4]   2> NOTE: reproduce with: ant test  -Dtestcase=HttpPartitionTest -Dtests.method=test -Dtests.seed=ED4A515583C18D87 -Dtests.multiplier=2 -Dtests.slow=true -Dtests.locale=ca-ES -Dtests.timezone=Canada/East-Saskatchewan -Dtests.asserts=true -Dtests.file.encoding=US-ASCII
   [junit4] ERROR    161s J1 | HttpPartitionTest.test <<<
   [junit4]    > Throwable #1: com.carrotsearch.randomizedtesting.UncaughtExceptionError: Captured an uncaught exception in thread: Thread[id=8481, name=SocketProxy-Response-53125:44295, state=RUNNABLE, group=TGRP-HttpPartitionTest]
   [junit4]    > 	at __randomizedtesting.SeedInfo.seed([ED4A515583C18D87:651E6E8F2D3DE07F]:0)
   [junit4]    > Caused by: java.lang.RuntimeException: java.net.SocketException: Socket is closed
   [junit4]    > 	at __randomizedtesting.SeedInfo.seed([ED4A515583C18D87]:0)
   [junit4]    > 	at org.apache.solr.cloud.SocketProxy$Bridge$Pump.run(SocketProxy.java:347)
   [junit4]    > Caused by: java.net.SocketException: Socket is closed
   [junit4]    > 	at java.net.Socket.setSoTimeout(Socket.java:1137)
   [junit4]    > 	at org.apache.solr.cloud.SocketProxy$Bridge$Pump.run(SocketProxy.java:344)
   [junit4]   2> 887736 INFO  (SUITE-HttpPartitionTest-seed#[ED4A515583C18D87]-worker) [    ] o.a.s.SolrTestCaseJ4 ###deleteCore
   [junit4]   2> Jul 04, 2016 6:52:39 PM com.carrotsearch.randomizedtesting.ThreadLeakControl checkThreadLeaks
   [junit4]   2> WARNING: Will linger awaiting termination of 1 leaked thread(s).
   [junit4]   2> NOTE: test params are: codec=Asserting(Lucene62): {range_facet_l_dv=PostingsFormat(name=Memory doPackFST= false), _version_=PostingsFormat(name=Direct), multiDefault=PostingsFormat(name=LuceneVarGapFixedInterval), a_t=PostingsFormat(name=Direct), intDefault=PostingsFormat(name=Direct), id=PostingsFormat(name=Memory doPackFST= false), range_facet_i_dv=PostingsFormat(name=Direct), text=PostingsFormat(name=LuceneFixedGap), range_facet_l=PostingsFormat(name=Direct), timestamp=PostingsFormat(name=Direct)}, docValues:{range_facet_l_dv=DocValuesFormat(name=Memory), range_facet_i_dv=DocValuesFormat(name=Lucene54), timestamp=DocValuesFormat(name=Lucene54)}, maxPointsInLeafNode=639, maxMBSortInHeap=6.716706860332174, sim=RandomSimilarity(queryNorm=true,coord=yes): {}, locale=ca-ES, timezone=Canada/East-Saskatchewan
   [junit4]   2> NOTE: Linux 3.13.0-85-generic amd64/Oracle Corporation 1.8.0_74 (64-bit)/cpus=4,threads=1,free=153399088,total=447741952
   [junit4]   2> NOTE: All tests run in this JVM: [TestPKIAuthenticationPlugin, OutOfBoxZkACLAndCredentialsProvidersTest, TestStressVersions, TestTolerantUpdateProcessorRandomCloud, TestSortByMinMaxFunction, TestHashQParserPlugin, TestSubQueryTransformer, TestConfigSetsAPI, BufferStoreTest, TestBulkSchemaConcurrent, HdfsChaosMonkeyNothingIsSafeTest, FileUtilsTest, TestDefaultSearchFieldResource, ShardRoutingTest, TestSolrCoreProperties, TestSolr4Spatial2, SortByFunctionTest, DistributedQueueTest, NumericFieldsTest, TestEmbeddedSolrServerConstructors, CoreAdminCreateDiscoverTest, TestStressUserVersions, TestConfigSets, BlockJoinFacetRandomTest, MBeansHandlerTest, BooleanFieldTest, ExplicitHLLTest, CustomCollectionTest, TestRequestForwarding, TestMissingGroups, OpenCloseCoreStressTest, JavabinLoaderTest, TestCloudInspectUtil, TestHighFrequencyDictionaryFactory, TestRandomRequestDistribution, TestInfoStreamLogging, AtomicUpdatesTest, TestDocTermOrds, TestSimpleTrackingShardHandler, DistribCursorPagingTest, MoreLikeThisHandlerTest, AsyncMigrateRouteKeyTest, SolrIndexSplitterTest, UUIDUpdateProcessorFallbackTest, ClusterStateUpdateTest, TestShortCircuitedRequests, CloudMLTQParserTest, SimplePostToolTest, SolrPluginUtilsTest, OverseerTaskQueueTest, IndexBasedSpellCheckerTest, DocExpirationUpdateProcessorFactoryTest, OpenExchangeRatesOrgProviderTest, ResponseHeaderTest, SpellCheckComponentTest, BasicFunctionalityTest, OverseerModifyCollectionTest, NotRequiredUniqueKeyTest, TestRTimerTree, TestFieldCollectionResource, TestCursorMarkWithoutUniqueKey, TestExactSharedStatsCache, TestQuerySenderNoQuery, DataDrivenBlockJoinTest, TestTrie, TestCloudSchemaless, TestHdfsUpdateLog, TestBulkSchemaAPI, TestCryptoKeys, TestSearcherReuse, TestHashPartitioner, DistributedFacetPivotLongTailTest, TestCoreContainer, ConvertedLegacyTest, DistributedDebugComponentTest, TestReRankQParserPlugin, PreAnalyzedUpdateProcessorTest, LoggingHandlerTest, TestUpdate, HttpPartitionTest]
   [junit4] Completed [251/618 (2!)] on J1 in 161.61s, 1 test, 1 error <<< FAILURES!

[...truncated 1198 lines...]
BUILD FAILED
/x1/jenkins/jenkins-slave/workspace/Lucene-Solr-Tests-master/build.xml:740: The following error occurred while executing this line:
/x1/jenkins/jenkins-slave/workspace/Lucene-Solr-Tests-master/build.xml:684: The following error occurred while executing this line:
/x1/jenkins/jenkins-slave/workspace/Lucene-Solr-Tests-master/build.xml:59: The following error occurred while executing this line:
/x1/jenkins/jenkins-slave/workspace/Lucene-Solr-Tests-master/solr/build.xml:233: The following error occurred while executing this line:
/x1/jenkins/jenkins-slave/workspace/Lucene-Solr-Tests-master/solr/common-build.xml:530: The following error occurred while executing this line:
/x1/jenkins/jenkins-slave/workspace/Lucene-Solr-Tests-master/lucene/common-build.xml:1427: The following error occurred while executing this line:
/x1/jenkins/jenkins-slave/workspace/Lucene-Solr-Tests-master/lucene/common-build.xml:984: There were test failures: 618 suites (10 ignored), 2590 tests, 3 errors, 1 failure, 87 ignored (72 assumptions) [seed: ED4A515583C18D87]

Total time: 60 minutes 45 seconds
Build step 'Invoke Ant' marked build as failure
Archiving artifacts
Recording test results
Email was triggered for: Failure - Any
Sending email for trigger: Failure - Any




Mime
View raw message