lucene-dev mailing list archives

Site index · List index
Message view « Date » · « Thread »
Top « Date » · « Thread »
From Policeman Jenkins Server <jenk...@thetaphi.de>
Subject [JENKINS] Lucene-Solr-6.x-Solaris (64bit/jdk1.8.0) - Build # 476 - Unstable!
Date Fri, 28 Oct 2016 08:25:23 GMT
Build: https://jenkins.thetaphi.de/job/Lucene-Solr-6.x-Solaris/476/
Java: 64bit/jdk1.8.0 -XX:-UseCompressedOops -XX:+UseG1GC

1 tests failed.
FAILED:  org.apache.solr.cloud.TestSolrCloudWithDelegationTokens.testDelegationTokenCancelFail

Error Message:
expected:<200> but was:<404>

Stack Trace:
java.lang.AssertionError: expected:<200> but was:<404>
	at __randomizedtesting.SeedInfo.seed([3911B017773FD073:51AE853DA7A5C29F]:0)
	at org.junit.Assert.fail(Assert.java:93)
	at org.junit.Assert.failNotEquals(Assert.java:647)
	at org.junit.Assert.assertEquals(Assert.java:128)
	at org.junit.Assert.assertEquals(Assert.java:472)
	at org.junit.Assert.assertEquals(Assert.java:456)
	at org.apache.solr.cloud.TestSolrCloudWithDelegationTokens.cancelDelegationToken(TestSolrCloudWithDelegationTokens.java:144)
	at org.apache.solr.cloud.TestSolrCloudWithDelegationTokens.testDelegationTokenCancelFail(TestSolrCloudWithDelegationTokens.java:298)
	at sun.reflect.NativeMethodAccessorImpl.invoke0(Native Method)
	at sun.reflect.NativeMethodAccessorImpl.invoke(NativeMethodAccessorImpl.java:62)
	at sun.reflect.DelegatingMethodAccessorImpl.invoke(DelegatingMethodAccessorImpl.java:43)
	at java.lang.reflect.Method.invoke(Method.java:498)
	at com.carrotsearch.randomizedtesting.RandomizedRunner.invoke(RandomizedRunner.java:1713)
	at com.carrotsearch.randomizedtesting.RandomizedRunner$8.evaluate(RandomizedRunner.java:907)
	at com.carrotsearch.randomizedtesting.RandomizedRunner$9.evaluate(RandomizedRunner.java:943)
	at com.carrotsearch.randomizedtesting.RandomizedRunner$10.evaluate(RandomizedRunner.java:957)
	at com.carrotsearch.randomizedtesting.rules.SystemPropertiesRestoreRule$1.evaluate(SystemPropertiesRestoreRule.java:57)
	at org.apache.lucene.util.TestRuleSetupTeardownChained$1.evaluate(TestRuleSetupTeardownChained.java:49)
	at org.apache.lucene.util.AbstractBeforeAfterRule$1.evaluate(AbstractBeforeAfterRule.java:45)
	at org.apache.lucene.util.TestRuleThreadAndTestName$1.evaluate(TestRuleThreadAndTestName.java:48)
	at org.apache.lucene.util.TestRuleIgnoreAfterMaxFailures$1.evaluate(TestRuleIgnoreAfterMaxFailures.java:64)
	at org.apache.lucene.util.TestRuleMarkFailure$1.evaluate(TestRuleMarkFailure.java:47)
	at com.carrotsearch.randomizedtesting.rules.StatementAdapter.evaluate(StatementAdapter.java:36)
	at com.carrotsearch.randomizedtesting.ThreadLeakControl$StatementRunner.run(ThreadLeakControl.java:367)
	at com.carrotsearch.randomizedtesting.ThreadLeakControl.forkTimeoutingTask(ThreadLeakControl.java:811)
	at com.carrotsearch.randomizedtesting.ThreadLeakControl$3.evaluate(ThreadLeakControl.java:462)
	at com.carrotsearch.randomizedtesting.RandomizedRunner.runSingleTest(RandomizedRunner.java:916)
	at com.carrotsearch.randomizedtesting.RandomizedRunner$5.evaluate(RandomizedRunner.java:802)
	at com.carrotsearch.randomizedtesting.RandomizedRunner$6.evaluate(RandomizedRunner.java:852)
	at com.carrotsearch.randomizedtesting.RandomizedRunner$7.evaluate(RandomizedRunner.java:863)
	at com.carrotsearch.randomizedtesting.rules.StatementAdapter.evaluate(StatementAdapter.java:36)
	at com.carrotsearch.randomizedtesting.rules.SystemPropertiesRestoreRule$1.evaluate(SystemPropertiesRestoreRule.java:57)
	at org.apache.lucene.util.AbstractBeforeAfterRule$1.evaluate(AbstractBeforeAfterRule.java:45)
	at com.carrotsearch.randomizedtesting.rules.StatementAdapter.evaluate(StatementAdapter.java:36)
	at org.apache.lucene.util.TestRuleStoreClassName$1.evaluate(TestRuleStoreClassName.java:41)
	at com.carrotsearch.randomizedtesting.rules.NoShadowingOrOverridesOnMethodsRule$1.evaluate(NoShadowingOrOverridesOnMethodsRule.java:40)
	at com.carrotsearch.randomizedtesting.rules.NoShadowingOrOverridesOnMethodsRule$1.evaluate(NoShadowingOrOverridesOnMethodsRule.java:40)
	at com.carrotsearch.randomizedtesting.rules.StatementAdapter.evaluate(StatementAdapter.java:36)
	at com.carrotsearch.randomizedtesting.rules.StatementAdapter.evaluate(StatementAdapter.java:36)
	at com.carrotsearch.randomizedtesting.rules.StatementAdapter.evaluate(StatementAdapter.java:36)
	at org.apache.lucene.util.TestRuleAssertionsRequired$1.evaluate(TestRuleAssertionsRequired.java:53)
	at org.apache.lucene.util.TestRuleMarkFailure$1.evaluate(TestRuleMarkFailure.java:47)
	at org.apache.lucene.util.TestRuleIgnoreAfterMaxFailures$1.evaluate(TestRuleIgnoreAfterMaxFailures.java:64)
	at org.apache.lucene.util.TestRuleIgnoreTestSuites$1.evaluate(TestRuleIgnoreTestSuites.java:54)
	at com.carrotsearch.randomizedtesting.rules.StatementAdapter.evaluate(StatementAdapter.java:36)
	at com.carrotsearch.randomizedtesting.ThreadLeakControl$StatementRunner.run(ThreadLeakControl.java:367)
	at java.lang.Thread.run(Thread.java:745)




Build Log:
[...truncated 12168 lines...]
   [junit4] Suite: org.apache.solr.cloud.TestSolrCloudWithDelegationTokens
   [junit4]   2> Creating dataDir: /export/home/jenkins/workspace/Lucene-Solr-6.x-Solaris/solr/build/solr-core/test/J0/temp/solr.cloud.TestSolrCloudWithDelegationTokens_3911B017773FD073-001/init-core-data-001
   [junit4]   2> 2423878 INFO  (SUITE-TestSolrCloudWithDelegationTokens-seed#[3911B017773FD073]-worker) [    ] o.a.s.SolrTestCaseJ4 Randomized ssl (false) and clientAuth (false) via: @org.apache.solr.SolrTestCaseJ4$SuppressSSL(bugUrl=None)
   [junit4]   2> 2423886 INFO  (SUITE-TestSolrCloudWithDelegationTokens-seed#[3911B017773FD073]-worker) [    ] o.a.s.c.MiniSolrCloudCluster Starting cluster of 2 servers in /export/home/jenkins/workspace/Lucene-Solr-6.x-Solaris/solr/build/solr-core/test/J0/temp/solr.cloud.TestSolrCloudWithDelegationTokens_3911B017773FD073-001/tempDir-001
   [junit4]   2> 2423887 INFO  (SUITE-TestSolrCloudWithDelegationTokens-seed#[3911B017773FD073]-worker) [    ] o.a.s.c.ZkTestServer STARTING ZK TEST SERVER
   [junit4]   2> 2423887 INFO  (Thread-5140) [    ] o.a.s.c.ZkTestServer client port:0.0.0.0/0.0.0.0:0
   [junit4]   2> 2423887 INFO  (Thread-5140) [    ] o.a.s.c.ZkTestServer Starting server
   [junit4]   2> 2423987 INFO  (SUITE-TestSolrCloudWithDelegationTokens-seed#[3911B017773FD073]-worker) [    ] o.a.s.c.ZkTestServer start zk server on port:42847
   [junit4]   2> 2424002 INFO  (jetty-launcher-10996-thread-1) [    ] o.e.j.s.Server jetty-9.3.8.v20160314
   [junit4]   2> 2424002 INFO  (jetty-launcher-10996-thread-2) [    ] o.e.j.s.Server jetty-9.3.8.v20160314
   [junit4]   2> 2424008 INFO  (jetty-launcher-10996-thread-1) [    ] o.e.j.s.h.ContextHandler Started o.e.j.s.ServletContextHandler@76638c0b{/solr,null,AVAILABLE}
   [junit4]   2> 2424008 INFO  (jetty-launcher-10996-thread-2) [    ] o.e.j.s.h.ContextHandler Started o.e.j.s.ServletContextHandler@7c538f68{/solr,null,AVAILABLE}
   [junit4]   2> 2424011 INFO  (jetty-launcher-10996-thread-2) [    ] o.e.j.s.ServerConnector Started ServerConnector@380c405a{HTTP/1.1,[http/1.1]}{127.0.0.1:43935}
   [junit4]   2> 2424011 INFO  (jetty-launcher-10996-thread-2) [    ] o.e.j.s.Server Started @2428273ms
   [junit4]   2> 2424011 INFO  (jetty-launcher-10996-thread-1) [    ] o.e.j.s.ServerConnector Started ServerConnector@4d42ca8e{HTTP/1.1,[http/1.1]}{127.0.0.1:56774}
   [junit4]   2> 2424011 INFO  (jetty-launcher-10996-thread-2) [    ] o.a.s.c.s.e.JettySolrRunner Jetty properties: {hostContext=/solr, hostPort=43935}
   [junit4]   2> 2424011 INFO  (jetty-launcher-10996-thread-1) [    ] o.e.j.s.Server Started @2428274ms
   [junit4]   2> 2424012 INFO  (jetty-launcher-10996-thread-1) [    ] o.a.s.c.s.e.JettySolrRunner Jetty properties: {hostContext=/solr, hostPort=56774}
   [junit4]   2> 2424012 ERROR (jetty-launcher-10996-thread-1) [    ] o.a.s.s.StartupLoggingUtils Missing Java Option solr.log.dir. Logging may be missing or incomplete.
   [junit4]   2> 2424012 INFO  (jetty-launcher-10996-thread-1) [    ] o.a.s.s.SolrDispatchFilter  ___      _       Welcome to Apache Solr? version 6.3.0
   [junit4]   2> 2424012 INFO  (jetty-launcher-10996-thread-1) [    ] o.a.s.s.SolrDispatchFilter / __| ___| |_ _   Starting in cloud mode on port null
   [junit4]   2> 2424012 ERROR (jetty-launcher-10996-thread-2) [    ] o.a.s.s.StartupLoggingUtils Missing Java Option solr.log.dir. Logging may be missing or incomplete.
   [junit4]   2> 2424012 INFO  (jetty-launcher-10996-thread-1) [    ] o.a.s.s.SolrDispatchFilter \__ \/ _ \ | '_|  Install dir: null
   [junit4]   2> 2424013 INFO  (jetty-launcher-10996-thread-2) [    ] o.a.s.s.SolrDispatchFilter  ___      _       Welcome to Apache Solr? version 6.3.0
   [junit4]   2> 2424013 INFO  (jetty-launcher-10996-thread-1) [    ] o.a.s.s.SolrDispatchFilter |___/\___/_|_|    Start time: 2016-10-28T07:51:10.289Z
   [junit4]   2> 2424013 INFO  (jetty-launcher-10996-thread-2) [    ] o.a.s.s.SolrDispatchFilter / __| ___| |_ _   Starting in cloud mode on port null
   [junit4]   2> 2424013 INFO  (jetty-launcher-10996-thread-2) [    ] o.a.s.s.SolrDispatchFilter \__ \/ _ \ | '_|  Install dir: null
   [junit4]   2> 2424013 INFO  (jetty-launcher-10996-thread-2) [    ] o.a.s.s.SolrDispatchFilter |___/\___/_|_|    Start time: 2016-10-28T07:51:10.289Z
   [junit4]   2> 2424017 INFO  (jetty-launcher-10996-thread-2) [    ] o.a.s.s.SolrDispatchFilter solr.xml found in ZooKeeper. Loading...
   [junit4]   2> 2424018 INFO  (jetty-launcher-10996-thread-1) [    ] o.a.s.s.SolrDispatchFilter solr.xml found in ZooKeeper. Loading...
   [junit4]   2> 2424031 INFO  (jetty-launcher-10996-thread-1) [    ] o.a.s.u.UpdateShardHandler Creating UpdateShardHandler HTTP client with params: socketTimeout=340000&connTimeout=45000&retry=true
   [junit4]   2> 2424033 INFO  (jetty-launcher-10996-thread-2) [    ] o.a.s.u.UpdateShardHandler Creating UpdateShardHandler HTTP client with params: socketTimeout=340000&connTimeout=45000&retry=true
   [junit4]   2> 2424033 INFO  (jetty-launcher-10996-thread-1) [    ] o.a.s.c.ZkContainer Zookeeper client=127.0.0.1:42847/solr
   [junit4]   2> 2424034 INFO  (jetty-launcher-10996-thread-2) [    ] o.a.s.c.ZkContainer Zookeeper client=127.0.0.1:42847/solr
   [junit4]   2> 2424090 INFO  (jetty-launcher-10996-thread-2) [n:127.0.0.1:43935_solr    ] o.a.s.c.OverseerElectionContext I am going to be the leader 127.0.0.1:43935_solr
   [junit4]   2> 2424091 INFO  (jetty-launcher-10996-thread-1) [n:127.0.0.1:56774_solr    ] o.a.s.c.ZkController Register node as live in ZooKeeper:/live_nodes/127.0.0.1:56774_solr
   [junit4]   2> 2424092 INFO  (jetty-launcher-10996-thread-2) [n:127.0.0.1:43935_solr    ] o.a.s.c.Overseer Overseer (id=96838685174333446-127.0.0.1:43935_solr-n_0000000000) starting
   [junit4]   2> 2424094 INFO  (zkCallback-11007-thread-1-processing-n:127.0.0.1:43935_solr) [n:127.0.0.1:43935_solr    ] o.a.s.c.c.ZkStateReader Updated live nodes from ZooKeeper... (0) -> (1)
   [junit4]   2> 2424094 INFO  (zkCallback-11006-thread-1-processing-n:127.0.0.1:56774_solr) [n:127.0.0.1:56774_solr    ] o.a.s.c.c.ZkStateReader Updated live nodes from ZooKeeper... (0) -> (1)
   [junit4]   2> 2424109 INFO  (jetty-launcher-10996-thread-2) [n:127.0.0.1:43935_solr    ] o.a.s.c.ZkController Register node as live in ZooKeeper:/live_nodes/127.0.0.1:43935_solr
   [junit4]   2> 2424126 INFO  (jetty-launcher-10996-thread-1) [n:127.0.0.1:56774_solr    ] o.a.s.c.CoreContainer Authentication plugin class obtained from system property 'authenticationPlugin': org.apache.solr.security.KerberosPlugin
   [junit4]   2> 2424127 INFO  (zkCallback-11006-thread-1-processing-n:127.0.0.1:56774_solr) [n:127.0.0.1:56774_solr    ] o.a.s.c.c.ZkStateReader Updated live nodes from ZooKeeper... (1) -> (2)
   [junit4]   2> 2424127 INFO  (OverseerStateUpdate-96838685174333446-127.0.0.1:43935_solr-n_0000000000) [n:127.0.0.1:43935_solr    ] o.a.s.c.c.ZkStateReader Updated live nodes from ZooKeeper... (1) -> (2)
   [junit4]   2> 2424138 INFO  (jetty-launcher-10996-thread-1) [n:127.0.0.1:56774_solr    ] o.a.s.s.KerberosPlugin Params: {token.valid=30, delegation-token.token-kind=solr-dt, cookie.domain=127.0.0.1, cookie.path=/, zk-dt-secret-manager.znodeWorkingPath=solr/security/zkdtsm, token.validity=36000, signer.secret.provider.zookeeper.path=/token, type=org.apache.solr.security.HttpParamDelegationTokenAuthenticationHandler, zk-dt-secret-manager.enable=true, kerberos.name.rules=DEFAULT, signer.secret.provider=zookeeper}
   [junit4]   2> 2424160 INFO  (jetty-launcher-10996-thread-2) [n:127.0.0.1:43935_solr    ] o.a.s.c.CoreContainer Authentication plugin class obtained from system property 'authenticationPlugin': org.apache.solr.security.KerberosPlugin
   [junit4]   2> 2424160 INFO  (jetty-launcher-10996-thread-2) [n:127.0.0.1:43935_solr    ] o.a.s.s.KerberosPlugin Params: {token.valid=30, delegation-token.token-kind=solr-dt, cookie.domain=127.0.0.1, cookie.path=/, zk-dt-secret-manager.znodeWorkingPath=solr/security/zkdtsm, token.validity=36000, signer.secret.provider.zookeeper.path=/token, type=org.apache.solr.security.HttpParamDelegationTokenAuthenticationHandler, zk-dt-secret-manager.enable=true, kerberos.name.rules=DEFAULT, signer.secret.provider=zookeeper}
   [junit4]   2> 2424253 INFO  (jetty-launcher-10996-thread-2) [n:127.0.0.1:43935_solr    ] o.a.c.f.i.CuratorFrameworkImpl Starting
   [junit4]   2> 2424253 INFO  (jetty-launcher-10996-thread-1) [n:127.0.0.1:56774_solr    ] o.a.c.f.i.CuratorFrameworkImpl Starting
   [junit4]   2> 2424284 INFO  (jetty-launcher-10996-thread-1-EventThread) [n:127.0.0.1:56774_solr    ] o.a.c.f.s.ConnectionStateManager State change: CONNECTED
   [junit4]   2> 2424284 INFO  (jetty-launcher-10996-thread-2-EventThread) [n:127.0.0.1:43935_solr    ] o.a.c.f.s.ConnectionStateManager State change: CONNECTED
   [junit4]   2> 2424441 INFO  (jetty-launcher-10996-thread-2) [n:127.0.0.1:43935_solr    ] o.a.s.h.c.HttpShardHandlerFactory Reconfiguring the default client with: org.apache.solr.client.solrj.impl.Krb5HttpClientConfigurer@1ecebd0c
   [junit4]   2> 2424442 INFO  (jetty-launcher-10996-thread-2) [n:127.0.0.1:43935_solr    ] o.a.s.u.UpdateShardHandler Reconfiguring the default client with: org.apache.solr.client.solrj.impl.Krb5HttpClientConfigurer@1ecebd0c
   [junit4]   2> 2424444 INFO  (jetty-launcher-10996-thread-1) [n:127.0.0.1:56774_solr    ] o.a.s.h.c.HttpShardHandlerFactory Reconfiguring the default client with: org.apache.solr.client.solrj.impl.Krb5HttpClientConfigurer@102685b8
   [junit4]   2> 2424444 INFO  (jetty-launcher-10996-thread-1) [n:127.0.0.1:56774_solr    ] o.a.s.u.UpdateShardHandler Reconfiguring the default client with: org.apache.solr.client.solrj.impl.Krb5HttpClientConfigurer@102685b8
   [junit4]   2> 2424446 INFO  (jetty-launcher-10996-thread-2) [n:127.0.0.1:43935_solr    ] o.a.s.c.CorePropertiesLocator Found 0 core definitions underneath /export/home/jenkins/workspace/Lucene-Solr-6.x-Solaris/solr/build/solr-core/test/J0/temp/solr.cloud.TestSolrCloudWithDelegationTokens_3911B017773FD073-001/tempDir-001/node2/.
   [junit4]   2> 2424446 INFO  (jetty-launcher-10996-thread-1) [n:127.0.0.1:56774_solr    ] o.a.s.c.CorePropertiesLocator Found 0 core definitions underneath /export/home/jenkins/workspace/Lucene-Solr-6.x-Solaris/solr/build/solr-core/test/J0/temp/solr.cloud.TestSolrCloudWithDelegationTokens_3911B017773FD073-001/tempDir-001/node1/.
   [junit4]   2> 2424490 INFO  (TEST-TestSolrCloudWithDelegationTokens.testDelegationTokenSolrClient-seed#[3911B017773FD073]) [    ] o.a.s.SolrTestCaseJ4 ###Starting testDelegationTokenSolrClient
   [junit4]   2> 2424568 WARN  (TEST-TestSolrCloudWithDelegationTokens.testDelegationTokenSolrClient-seed#[3911B017773FD073]) [    ] o.a.h.c.p.ResponseProcessCookies Invalid cookie header: "Set-Cookie: hadoop.auth=; Path=/; Domain=127.0.0.1; Expires=   , 01-   -1970 00:00:00 GMT; HttpOnly". Invalid 'expires' attribute: , 01- -1970 00:00:00 GMT
   [junit4]   2> 2424582 INFO  (qtp250965841-47822) [n:127.0.0.1:43935_solr    ] o.a.s.h.a.CollectionsHandler Invoked Collection Action :list with params action=LIST&delegation=GgADYmFyA2JhcgCKAVgKRWjBigFYLlHswQEDFGblU_6glNHVl8eIFwKnziHDZ4jlB3NvbHItZHQA&wt=javabin&version=2 and sendToOCPQueue=true
   [junit4]   2> 2424582 INFO  (qtp250965841-47822) [n:127.0.0.1:43935_solr    ] o.a.s.s.HttpSolrCall [admin] webapp=null path=/admin/collections params={action=LIST&delegation=GgADYmFyA2JhcgCKAVgKRWjBigFYLlHswQEDFGblU_6glNHVl8eIFwKnziHDZ4jlB3NvbHItZHQA&wt=javabin&version=2} status=0 QTime=0
   [junit4]   2> 2424584 INFO  (TEST-TestSolrCloudWithDelegationTokens.testDelegationTokenSolrClient-seed#[3911B017773FD073]) [    ] o.a.s.SolrTestCaseJ4 ###Ending testDelegationTokenSolrClient
   [junit4]   2> 2424618 INFO  (TEST-TestSolrCloudWithDelegationTokens.testZNodePaths-seed#[3911B017773FD073]) [    ] o.a.s.SolrTestCaseJ4 ###Starting testZNodePaths
   [junit4]   2> 2424635 INFO  (TEST-TestSolrCloudWithDelegationTokens.testZNodePaths-seed#[3911B017773FD073]) [    ] o.a.s.SolrTestCaseJ4 ###Ending testZNodePaths
   [junit4]   2> 2424668 INFO  (TEST-TestSolrCloudWithDelegationTokens.testDelegationTokenCancelFail-seed#[3911B017773FD073]) [    ] o.a.s.SolrTestCaseJ4 ###Starting testDelegationTokenCancelFail
   [junit4]   2> 2424702 INFO  (TEST-TestSolrCloudWithDelegationTokens.testDelegationTokenCancelFail-seed#[3911B017773FD073]) [    ] o.a.s.SolrTestCaseJ4 ###Ending testDelegationTokenCancelFail
   [junit4]   2> NOTE: reproduce with: ant test  -Dtestcase=TestSolrCloudWithDelegationTokens -Dtests.method=testDelegationTokenCancelFail -Dtests.seed=3911B017773FD073 -Dtests.slow=true -Dtests.locale=sr-RS -Dtests.timezone=Asia/Dili -Dtests.asserts=true -Dtests.file.encoding=ISO-8859-1
   [junit4] FAILURE 0.07s J0 | TestSolrCloudWithDelegationTokens.testDelegationTokenCancelFail <<<
   [junit4]    > Throwable #1: java.lang.AssertionError: expected:<200> but was:<404>
   [junit4]    > 	at __randomizedtesting.SeedInfo.seed([3911B017773FD073:51AE853DA7A5C29F]:0)
   [junit4]    > 	at org.apache.solr.cloud.TestSolrCloudWithDelegationTokens.cancelDelegationToken(TestSolrCloudWithDelegationTokens.java:144)
   [junit4]    > 	at org.apache.solr.cloud.TestSolrCloudWithDelegationTokens.testDelegationTokenCancelFail(TestSolrCloudWithDelegationTokens.java:298)
   [junit4]    > 	at java.lang.Thread.run(Thread.java:745)
   [junit4]   2> 2424750 INFO  (TEST-TestSolrCloudWithDelegationTokens.testDelegationTokenVerify-seed#[3911B017773FD073]) [    ] o.a.s.SolrTestCaseJ4 ###Starting testDelegationTokenVerify
   [junit4]   2> 2424764 INFO  (qtp250965841-47822) [n:127.0.0.1:43935_solr    ] o.a.s.h.a.CollectionsHandler Invoked Collection Action :list with params action=LIST&delegation=GgADYmFyA2JhcgCKAVgKRWm1igFYLlHttQQDFKGG33CsGWSf6PHmE3C07hydUH2gB3NvbHItZHQA&wt=javabin&version=2 and sendToOCPQueue=true
   [junit4]   2> 2424764 INFO  (qtp250965841-47822) [n:127.0.0.1:43935_solr    ] o.a.s.s.HttpSolrCall [admin] webapp=null path=/admin/collections params={action=LIST&delegation=GgADYmFyA2JhcgCKAVgKRWm1igFYLlHttQQDFKGG33CsGWSf6PHmE3C07hydUH2gB3NvbHItZHQA&wt=javabin&version=2} status=0 QTime=0
   [junit4]   2> 2424768 INFO  (TEST-TestSolrCloudWithDelegationTokens.testDelegationTokenVerify-seed#[3911B017773FD073]) [    ] o.a.s.c.c.ZkStateReader Updated live nodes from ZooKeeper... (0) -> (2)
   [junit4]   2> 2424774 WARN  (TEST-TestSolrCloudWithDelegationTokens.testDelegationTokenVerify-seed#[3911B017773FD073]) [    ] o.a.h.c.p.ResponseProcessCookies Invalid cookie header: "Set-Cookie: hadoop.auth=; Path=/; Domain=127.0.0.1; Expires=   , 01-   -1970 00:00:00 GMT; HttpOnly". Invalid 'expires' attribute: , 01- -1970 00:00:00 GMT
   [junit4]   2> 2424777 INFO  (qtp1267326501-47815) [n:127.0.0.1:56774_solr    ] o.a.s.h.a.CollectionsHandler Invoked Collection Action :list with params action=LIST&delegation=GgADYmFyA2JhcgCKAVgKRWm1igFYLlHttQQDFKGG33CsGWSf6PHmE3C07hydUH2gB3NvbHItZHQA&wt=javabin&version=2 and sendToOCPQueue=true
   [junit4]   2> 2424778 INFO  (qtp1267326501-47815) [n:127.0.0.1:56774_solr    ] o.a.s.s.HttpSolrCall [admin] webapp=null path=/admin/collections params={action=LIST&delegation=GgADYmFyA2JhcgCKAVgKRWm1igFYLlHttQQDFKGG33CsGWSf6PHmE3C07hydUH2gB3NvbHItZHQA&wt=javabin&version=2} status=0 QTime=0
   [junit4]   2> 2424782 INFO  (TEST-TestSolrCloudWithDelegationTokens.testDelegationTokenVerify-seed#[3911B017773FD073]) [    ] o.a.s.c.c.ZkStateReader Updated live nodes from ZooKeeper... (0) -> (2)
   [junit4]   2> 2424785 WARN  (TEST-TestSolrCloudWithDelegationTokens.testDelegationTokenVerify-seed#[3911B017773FD073]) [    ] o.a.h.c.p.ResponseProcessCookies Invalid cookie header: "Set-Cookie: hadoop.auth=; Path=/; Domain=127.0.0.1; Expires=   , 01-   -1970 00:00:00 GMT; HttpOnly". Invalid 'expires' attribute: , 01- -1970 00:00:00 GMT
   [junit4]   2> 2424786 INFO  (TEST-TestSolrCloudWithDelegationTokens.testDelegationTokenVerify-seed#[3911B017773FD073]) [    ] o.a.s.SolrTestCaseJ4 ###Ending testDelegationTokenVerify
   [junit4]   2> 2424833 INFO  (TEST-TestSolrCloudWithDelegationTokens.testDelegationOtherOp-seed#[3911B017773FD073]) [    ] o.a.s.SolrTestCaseJ4 ###Starting testDelegationOtherOp
   [junit4]   2> 2424835 INFO  (qtp250965841-47822) [n:127.0.0.1:43935_solr    ] o.a.s.h.a.CollectionsHandler Invoked Collection Action :list with params op=someSolrOperation&action=LIST&user=bar&wt=javabin&version=2 and sendToOCPQueue=true
   [junit4]   2> 2424835 INFO  (qtp250965841-47822) [n:127.0.0.1:43935_solr    ] o.a.s.s.HttpSolrCall [admin] webapp=null path=/admin/collections params={op=someSolrOperation&action=LIST&user=bar&wt=javabin&version=2} status=0 QTime=0
   [junit4]   2> 2424836 WARN  (TEST-TestSolrCloudWithDelegationTokens.testDelegationOtherOp-seed#[3911B017773FD073]) [    ] o.a.h.c.p.ResponseProcessCookies Invalid cookie header: "Set-Cookie: hadoop.auth="u=bar&p=bar&t=test&e=1477677071111&s=CpLf0pdmXHlswx0zhYD90n0I2V0="; Path=/; Domain=127.0.0.1; Expires=   , 28-   -2016 17:51:11 GMT; HttpOnly". Invalid 'expires' attribute: , 28- -2016 17:51:11 GMT
   [junit4]   2> 2424837 INFO  (TEST-TestSolrCloudWithDelegationTokens.testDelegationOtherOp-seed#[3911B017773FD073]) [    ] o.a.s.SolrTestCaseJ4 ###Ending testDelegationOtherOp
   [junit4]   2> 2424878 INFO  (TEST-TestSolrCloudWithDelegationTokens.testDelegationTokenRenew-seed#[3911B017773FD073]) [    ] o.a.s.SolrTestCaseJ4 ###Starting testDelegationTokenRenew
   [junit4]   2> 2424900 INFO  (TEST-TestSolrCloudWithDelegationTokens.testDelegationTokenRenew-seed#[3911B017773FD073]) [    ] o.a.s.c.c.ZkStateReader Updated live nodes from ZooKeeper... (0) -> (2)
   [junit4]   2> 2424904 INFO  (qtp1267326501-47820) [n:127.0.0.1:56774_solr    ] o.a.s.h.a.CollectionsHandler Invoked Collection Action :list with params action=LIST&delegation=GgADYmFyA2JhcgCKAVgKRWo1igFYLlHuNQUDFIGTzTDXDUnfM0VxGBilnTuJLuiqB3NvbHItZHQA&wt=javabin&version=2 and sendToOCPQueue=true
   [junit4]   2> 2424904 INFO  (qtp1267326501-47820) [n:127.0.0.1:56774_solr    ] o.a.s.s.HttpSolrCall [admin] webapp=null path=/admin/collections params={action=LIST&delegation=GgADYmFyA2JhcgCKAVgKRWo1igFYLlHuNQUDFIGTzTDXDUnfM0VxGBilnTuJLuiqB3NvbHItZHQA&wt=javabin&version=2} status=0 QTime=0
   [junit4]   2> 2424910 INFO  (TEST-TestSolrCloudWithDelegationTokens.testDelegationTokenRenew-seed#[3911B017773FD073]) [    ] o.a.s.c.c.ZkStateReader Updated live nodes from ZooKeeper... (0) -> (2)
   [junit4]   2> 2424914 WARN  (TEST-TestSolrCloudWithDelegationTokens.testDelegationTokenRenew-seed#[3911B017773FD073]) [    ] o.a.h.c.p.ResponseProcessCookies Invalid cookie header: "Set-Cookie: hadoop.auth=; Path=/; Domain=127.0.0.1; Expires=   , 01-   -1970 00:00:00 GMT; HttpOnly". Invalid 'expires' attribute: , 01- -1970 00:00:00 GMT
   [junit4]   2> 2424919 INFO  (TEST-TestSolrCloudWithDelegationTokens.testDelegationTokenRenew-seed#[3911B017773FD073]) [    ] o.a.s.c.c.ZkStateReader Updated live nodes from ZooKeeper... (0) -> (2)
   [junit4]   2> 2424923 INFO  (qtp1267326501-47815) [n:127.0.0.1:56774_solr    ] o.a.s.h.a.CollectionsHandler Invoked Collection Action :list with params action=LIST&delegation=GgADYmFyA2JhcgCKAVgKRWo1igFYLlHuNQUDFIGTzTDXDUnfM0VxGBilnTuJLuiqB3NvbHItZHQA&wt=javabin&version=2 and sendToOCPQueue=true
   [junit4]   2> 2424923 INFO  (qtp1267326501-47815) [n:127.0.0.1:56774_solr    ] o.a.s.s.HttpSolrCall [admin] webapp=null path=/admin/collections params={action=LIST&delegation=GgADYmFyA2JhcgCKAVgKRWo1igFYLlHuNQUDFIGTzTDXDUnfM0VxGBilnTuJLuiqB3NvbHItZHQA&wt=javabin&version=2} status=0 QTime=0
   [junit4]   2> 2424929 INFO  (TEST-TestSolrCloudWithDelegationTokens.testDelegationTokenRenew-seed#[3911B017773FD073]) [    ] o.a.s.c.c.ZkStateReader Updated live nodes from ZooKeeper... (0) -> (2)
   [junit4]   2> 2424932 WARN  (TEST-TestSolrCloudWithDelegationTokens.testDelegationTokenRenew-seed#[3911B017773FD073]) [    ] o.a.h.c.p.ResponseProcessCookies Invalid cookie header: "Set-Cookie: hadoop.auth=; Path=/; Domain=127.0.0.1; Expires=   , 01-   -1970 00:00:00 GMT; HttpOnly". Invalid 'expires' attribute: , 01- -1970 00:00:00 GMT
   [junit4]   2> 2424958 INFO  (TEST-TestSolrCloudWithDelegationTokens.testDelegationTokenRenew-seed#[3911B017773FD073]) [    ] o.a.s.c.c.ZkStateReader Updated live nodes from ZooKeeper... (0) -> (2)
   [junit4]   2> 2424962 INFO  (qtp1267326501-47812) [n:127.0.0.1:56774_solr    ] o.a.s.h.a.CollectionsHandler Invoked Collection Action :list with params action=LIST&delegation=GgADYmFyA2JhcgCKAVgKRWprigFYLlHuawYDFH5D4-dLjkJr4rgGMrgDtnUXrvaxB3NvbHItZHQA&wt=javabin&version=2 and sendToOCPQueue=true
   [junit4]   2> 2424962 INFO  (qtp1267326501-47812) [n:127.0.0.1:56774_solr    ] o.a.s.s.HttpSolrCall [admin] webapp=null path=/admin/collections params={action=LIST&delegation=GgADYmFyA2JhcgCKAVgKRWprigFYLlHuawYDFH5D4-dLjkJr4rgGMrgDtnUXrvaxB3NvbHItZHQA&wt=javabin&version=2} status=0 QTime=0
   [junit4]   2> 2424965 WARN  (TEST-TestSolrCloudWithDelegationTokens.testDelegationTokenRenew-seed#[3911B017773FD073]) [    ] o.a.h.c.p.ResponseProcessCookies Invalid cookie header: "Set-Cookie: hadoop.auth=; Path=/; Domain=127.0.0.1; Expires=   , 01-   -1970 00:00:00 GMT; HttpOnly". Invalid 'expires' attribute: , 01- -1970 00:00:00 GMT
   [junit4]   2> 2424971 INFO  (TEST-TestSolrCloudWithDelegationTokens.testDelegationTokenRenew-seed#[3911B017773FD073]) [    ] o.a.s.c.c.ZkStateReader Updated live nodes from ZooKeeper... (0) -> (2)
   [junit4]   2> 2424975 INFO  (qtp1267326501-47818) [n:127.0.0.1:56774_solr    ] o.a.s.h.a.CollectionsHandler Invoked Collection Action :list with params action=LIST&delegation=GgADYmFyA2JhcgCKAVgKRWprigFYLlHuawYDFH5D4-dLjkJr4rgGMrgDtnUXrvaxB3NvbHItZHQA&wt=javabin&version=2 and sendToOCPQueue=true
   [junit4]   2> 2424975 INFO  (qtp1267326501-47818) [n:127.0.0.1:56774_solr    ] o.a.s.s.HttpSolrCall [admin] webapp=null path=/admin/collections params={action=LIST&delegation=GgADYmFyA2JhcgCKAVgKRWprigFYLlHuawYDFH5D4-dLjkJr4rgGMrgDtnUXrvaxB3NvbHItZHQA&wt=javabin&version=2} status=0 QTime=0
   [junit4]   2> 2424979 WARN  (TEST-TestSolrCloudWithDelegationTokens.testDelegationTokenRenew-seed#[3911B017773FD073]) [    ] o.a.h.c.p.ResponseProcessCookies Invalid cookie header: "Set-Cookie: hadoop.auth=; Path=/; Domain=127.0.0.1; Expires=   , 01-   -1970 00:00:00 GMT; HttpOnly". Invalid 'expires' attribute: , 01- -1970 00:00:00 GMT
   [junit4]   2> 2424995 INFO  (TEST-TestSolrCloudWithDelegationTokens.testDelegationTokenRenew-seed#[3911B017773FD073]) [    ] o.a.s.c.c.ZkStateReader Updated live nodes from ZooKeeper... (0) -> (2)
   [junit4]   2> 2424998 INFO  (qtp1267326501-47817) [n:127.0.0.1:56774_solr    ] o.a.s.h.a.CollectionsHandler Invoked Collection Action :list with params action=LIST&delegation=GgADYmFyA2JhcgCKAVgKRWqZigFYLlHumQcDFOqSFz9vGcmK1YSezuaejKaI1e6CB3NvbHItZHQA&wt=javabin&version=2 and sendToOCPQueue=true
   [junit4]   2> 2424998 INFO  (qtp1267326501-47817) [n:127.0.0.1:56774_solr    ] o.a.s.s.HttpSolrCall [admin] webapp=null path=/admin/collections params={action=LIST&delegation=GgADYmFyA2JhcgCKAVgKRWqZigFYLlHumQcDFOqSFz9vGcmK1YSezuaejKaI1e6CB3NvbHItZHQA&wt=javabin&version=2} status=0 QTime=0
   [junit4]   2> 2425002 WARN  (TEST-TestSolrCloudWithDelegationTokens.testDelegationTokenRenew-seed#[3911B017773FD073]) [    ] o.a.h.c.p.ResponseProcessCookies Invalid cookie header: "Set-Cookie: hadoop.auth=; Path=/; Domain=127.0.0.1; Expires=   , 01-   -1970 00:00:00 GMT; HttpOnly". Invalid 'expires' attribute: , 01- -1970 00:00:00 GMT
   [junit4]   2> 2425007 INFO  (TEST-TestSolrCloudWithDelegationTokens.testDelegationTokenRenew-seed#[3911B017773FD073]) [    ] o.a.s.c.c.ZkStateReader Updated live nodes from ZooKeeper... (0) -> (2)
   [junit4]   2> 2425011 INFO  (qtp1267326501-47807) [n:127.0.0.1:56774_solr    ] o.a.s.h.a.CollectionsHandler Invoked Collection Action :list with params action=LIST&delegation=GgADYmFyA2JhcgCKAVgKRWqZigFYLlHumQcDFOqSFz9vGcmK1YSezuaejKaI1e6CB3NvbHItZHQA&wt=javabin&version=2 and sendToOCPQueue=true
   [junit4]   2> 2425011 INFO  (qtp1267326501-47807) [n:127.0.0.1:56774_solr    ] o.a.s.s.HttpSolrCall [admin] webapp=null path=/admin/collections params={action=LIST&delegation=GgADYmFyA2JhcgCKAVgKRWqZigFYLlHumQcDFOqSFz9vGcmK1YSezuaejKaI1e6CB3NvbHItZHQA&wt=javabin&version=2} status=0 QTime=0
   [junit4]   2> 2425017 INFO  (TEST-TestSolrCloudWithDelegationTokens.testDelegationTokenRenew-seed#[3911B017773FD073]) [    ] o.a.s.c.c.ZkStateReader Updated live nodes from ZooKeeper... (0) -> (2)
   [junit4]   2> 2425022 WARN  (TEST-TestSolrCloudWithDelegationTokens.testDelegationTokenRenew-seed#[3911B017773FD073]) [    ] o.a.h.c.p.ResponseProcessCookies Invalid cookie header: "Set-Cookie: hadoop.auth=; Path=/; Domain=127.0.0.1; Expires=   , 01-   -1970 00:00:00 GMT; HttpOnly". Invalid 'expires' attribute: , 01- -1970 00:00:00 GMT
   [junit4]   2> 2425056 INFO  (qtp250965841-47821) [n:127.0.0.1:43935_solr    ] o.a.s.h.a.CollectionsHandler Invoked Collection Action :list with params action=LIST&delegation=GgADYmFyA2JhcgCKAVgKRWrHigFYLlHuxwgDFBY6JcoPs5D7A_DkIERWP2twbGFlB3NvbHItZHQA&wt=javabin&version=2 and sendToOCPQueue=true
   [junit4]   2> 2425056 INFO  (qtp250965841-47821) [n:127.0.0.1:43935_solr    ] o.a.s.s.HttpSolrCall [admin] webapp=null path=/admin/collections params={action=LIST&delegation=GgADYmFyA2JhcgCKAVgKRWrHigFYLlHuxwgDFBY6JcoPs5D7A_DkIERWP2twbGFlB3NvbHItZHQA&wt=javabin&version=2} status=0 QTime=0
   [junit4]   2> 2425061 INFO  (TEST-TestSolrCloudWithDelegationTokens.testDelegationTokenRenew-seed#[3911B017773FD073]) [    ] o.a.s.c.c.ZkStateReader Updated live nodes from ZooKeeper... (0) -> (2)
   [junit4]   2> 2425065 WARN  (TEST-TestSolrCloudWithDelegationTokens.testDelegationTokenRenew-seed#[3911B017773FD073]) [    ] o.a.h.c.p.ResponseProcessCookies Invalid cookie header: "Set-Cookie: hadoop.auth=; Path=/; Domain=127.0.0.1; Expires=   , 01-   -1970 00:00:00 GMT; HttpOnly". Invalid 'expires' attribute: , 01- -1970 00:00:00 GMT
   [junit4]   2> 2425068 INFO  (qtp1267326501-47818) [n:127.0.0.1:56774_solr    ] o.a.s.h.a.CollectionsHandler Invoked Collection Action :list with params action=LIST&delegation=GgADYmFyA2JhcgCKAVgKRWrHigFYLlHuxwgDFBY6JcoPs5D7A_DkIERWP2twbGFlB3NvbHItZHQA&wt=javabin&version=2 and sendToOCPQueue=true
   [junit4]   2> 2425068 INFO  (qtp1267326501-47818) [n:127.0.0.1:56774_solr    ] o.a.s.s.HttpSolrCall [admin] webapp=null path=/admin/collections params={action=LIST&delegation=GgADYmFyA2JhcgCKAVgKRWrHigFYLlHuxwgDFBY6JcoPs5D7A_DkIERWP2twbGFlB3NvbHItZHQA&wt=javabin&version=2} status=0 QTime=0
   [junit4]   2> 2425072 INFO  (TEST-TestSolrCloudWithDelegationTokens.testDelegationTokenRenew-seed#[3911B017773FD073]) [    ] o.a.s.c.c.ZkStateReader Updated live nodes from ZooKeeper... (0) -> (2)
   [junit4]   2> 2425075 WARN  (TEST-TestSolrCloudWithDelegationTokens.testDelegationTokenRenew-seed#[3911B017773FD073]) [    ] o.a.h.c.p.ResponseProcessCookies Invalid cookie header: "Set-Cookie: hadoop.auth=; Path=/; Domain=127.0.0.1; Expires=   , 01-   -1970 00:00:00 GMT; HttpOnly". Invalid 'expires' attribute: , 01- -1970 00:00:00 GMT
   [junit4]   2> 2425076 INFO  (TEST-TestSolrCloudWithDelegationTokens.testDelegationTokenRenew-seed#[3911B017773FD073]) [    ] o.a.s.SolrTestCaseJ4 ###Ending testDelegationTokenRenew
   [junit4]   2> 2425124 INFO  (TEST-TestSolrCloudWithDelegationTokens.testDelegationTokenCancel-seed#[3911B017773FD073]) [    ] o.a.s.SolrTestCaseJ4 ###Starting testDelegationTokenCancel
   [junit4]   2> 2425146 ERROR (qtp250965841-47822) [n:127.0.0.1:43935_solr    ] o.a.h.s.t.d.ZKDelegationTokenSecretManager No node in path [/ZKDTSMTokensRoot/DT_9]
   [junit4]   2> 2425199 WARN  (TEST-TestSolrCloudWithDelegationTokens.testDelegationTokenCancel-seed#[3911B017773FD073]) [    ] o.a.h.c.p.ResponseProcessCookies Invalid cookie header: "Set-Cookie: hadoop.auth=; Path=/; Domain=127.0.0.1; Expires=   , 01-   -1970 00:00:00 GMT; HttpOnly". Invalid 'expires' attribute: , 01- -1970 00:00:00 GMT
   [junit4]   2> 2425215 WARN  (TEST-TestSolrCloudWithDelegationTokens.testDelegationTokenCancel-seed#[3911B017773FD073]) [    ] o.a.h.c.p.ResponseProcessCookies Invalid cookie header: "Set-Cookie: hadoop.auth=; Path=/; Domain=127.0.0.1; Expires=   , 01-   -1970 00:00:00 GMT; HttpOnly". Invalid 'expires' attribute: , 01- -1970 00:00:00 GMT
   [junit4]   2> 2425255 INFO  (TEST-TestSolrCloudWithDelegationTokens.testDelegationTokenCancel-seed#[3911B017773FD073]) [    ] o.a.s.c.c.ZkStateReader Updated live nodes from ZooKeeper... (0) -> (2)
   [junit4]   2> 2425260 ERROR (qtp1267326501-47815) [n:127.0.0.1:56774_solr    ] o.a.h.s.t.d.ZKDelegationTokenSecretManager No node in path [/ZKDTSMTokensRoot/DT_10]
   [junit4]   2> 2425268 WARN  (TEST-TestSolrCloudWithDelegationTokens.testDelegationTokenCancel-seed#[3911B017773FD073]) [    ] o.a.h.c.p.ResponseProcessCookies Invalid cookie header: "Set-Cookie: hadoop.auth=; Path=/; Domain=127.0.0.1; Expires=   , 01-   -1970 00:00:00 GMT; HttpOnly". Invalid 'expires' attribute: , 01- -1970 00:00:00 GMT
   [junit4]   2> 2425274 INFO  (TEST-TestSolrCloudWithDelegationTokens.testDelegationTokenCancel-seed#[3911B017773FD073]) [    ] o.a.s.c.c.ZkStateReader Updated live nodes from ZooKeeper... (0) -> (2)
   [junit4]   2> 2425279 WARN  (TEST-TestSolrCloudWithDelegationTokens.testDelegationTokenCancel-seed#[3911B017773FD073]) [    ] o.a.h.c.p.ResponseProcessCookies Invalid cookie header: "Set-Cookie: hadoop.auth=; Path=/; Domain=127.0.0.1; Expires=   , 01-   -1970 00:00:00 GMT; HttpOnly". Invalid 'expires' attribute: , 01- -1970 00:00:00 GMT
   [junit4]   2> 2425281 INFO  (TEST-TestSolrCloudWithDelegationTokens.testDelegationTokenCancel-seed#[3911B017773FD073]) [    ] o.a.s.SolrTestCaseJ4 ###Ending testDelegationTokenCancel
   [junit4]   2> 2425371 INFO  (TEST-TestSolrCloudWithDelegationTokens.testDelegationTokenRenewFail-seed#[3911B017773FD073]) [    ] o.a.s.SolrTestCaseJ4 ###Starting testDelegationTokenRenewFail
   [junit4]   2> 2425382 WARN  (qtp250965841-47821) [n:127.0.0.1:43935_solr    ] o.a.h.s.a.s.AuthenticationFilter Authentication exception: org.apache.hadoop.security.AccessControlException: foo tries to renew a token with renewer bar
   [junit4]   2> 2425382 WARN  (qtp250965841-47821) [n:127.0.0.1:43935_solr    ] o.a.s.s.KerberosPlugin Could not find org.apache.solr.security.kerberosplugin.requestcontinues
   [junit4]   2> 2425382 WARN  (TEST-TestSolrCloudWithDelegationTokens.testDelegationTokenRenewFail-seed#[3911B017773FD073]) [    ] o.a.h.c.p.ResponseProcessCookies Invalid cookie header: "Set-Cookie: hadoop.auth=; Path=/; Domain=127.0.0.1; Expires=   , 01-   -1970 00:00:00 GMT; HttpOnly". Invalid 'expires' attribute: , 01- -1970 00:00:00 GMT
   [junit4]   2> 2425384 WARN  (qtp1267326501-47818) [n:127.0.0.1:56774_solr    ] o.a.h.s.a.s.AuthenticationFilter Authentication exception: org.apache.hadoop.security.AccessControlException: foo tries to renew a token with renewer bar
   [junit4]   2> 2425385 WARN  (qtp1267326501-47818) [n:127.0.0.1:56774_solr    ] o.a.s.s.KerberosPlugin Could not find org.apache.solr.security.kerberosplugin.requestcontinues
   [junit4]   2> 2425385 WARN  (TEST-TestSolrCloudWithDelegationTokens.testDelegationTokenRenewFail-seed#[3911B017773FD073]) [    ] o.a.h.c.p.ResponseProcessCookies Invalid cookie header: "Set-Cookie: hadoop.auth=; Path=/; Domain=127.0.0.1; Expires=   , 01-   -1970 00:00:00 GMT; HttpOnly". Invalid 'expires' attribute: , 01- -1970 00:00:00 GMT
   [junit4]   2> 2425408 WARN  (qtp250965841-47813) [    ] o.a.h.s.a.s.AuthenticationFilter Authentication exception: org.apache.hadoop.security.AccessControlException: notRenewUser tries to renew a token with renewer renewUser
   [junit4]   2> 2425409 WARN  (qtp250965841-47813) [    ] o.a.s.s.KerberosPlugin Could not find org.apache.solr.security.kerberosplugin.requestcontinues
   [junit4]   2> 2425409 WARN  (TEST-TestSolrCloudWithDelegationTokens.testDelegationTokenRenewFail-seed#[3911B017773FD073]) [    ] o.a.h.c.p.ResponseProcessCookies Invalid cookie header: "Set-Cookie: hadoop.auth=; Path=/; Domain=127.0.0.1; Expires=   , 01-   -1970 00:00:00 GMT; HttpOnly". Invalid 'expires' attribute: , 01- -1970 00:00:00 GMT
   [junit4]   2> 2425411 WARN  (qtp1267326501-47817) [n:127.0.0.1:56774_solr    ] o.a.h.s.a.s.AuthenticationFilter Authentication exception: org.apache.hadoop.security.AccessControlException: notRenewUser tries to renew a token with renewer renewUser
   [junit4]   2> 2425412 WARN  (qtp1267326501-47817) [n:127.0.0.1:56774_solr    ] o.a.s.s.KerberosPlugin Could not find org.apache.solr.security.kerberosplugin.requestcontinues
   [junit4]   2> 2425412 WARN  (TEST-TestSolrCloudWithDelegationTokens.testDelegationTokenRenewFail-seed#[3911B017773FD073]) [    ] o.a.h.c.p.ResponseProcessCookies Invalid cookie header: "Set-Cookie: hadoop.auth=; Path=/; Domain=127.0.0.1; Expires=   , 01-   -1970 00:00:00 GMT; HttpOnly". Invalid 'expires' attribute: , 01- -1970 00:00:00 GMT
   [junit4]   2> 2425412 INFO  (TEST-TestSolrCloudWithDelegationTokens.testDelegationTokenRenewFail-seed#[3911B017773FD073]) [    ] o.a.s.SolrTestCaseJ4 ###Ending testDelegationTokenRenewFail
   [junit4]   2> 2425414 INFO  (jetty-launcher-10996-thread-2) [    ] o.e.j.s.ServerConnector Stopped ServerConnector@4d42ca8e{HTTP/1.1,[http/1.1]}{127.0.0.1:0}
   [junit4]   2> 2425415 INFO  (jetty-launcher-10996-thread-1) [    ] o.e.j.s.ServerConnector Stopped ServerConnector@380c405a{HTTP/1.1,[http/1.1]}{127.0.0.1:0}
   [junit4]   2> 2425427 INFO  (jetty-launcher-10996-thread-2) [    ] o.a.s.c.CoreContainer Shutting down CoreContainer instance=2096906317
   [junit4]   2> 2425427 INFO  (jetty-launcher-10996-thread-1) [    ] o.a.s.c.CoreContainer Shutting down CoreContainer instance=863507698
   [junit4]   2> 2425438 INFO  (jetty-launcher-10996-thread-1) [    ] o.a.s.c.Overseer Overseer (id=96838685174333446-127.0.0.1:43935_solr-n_0000000000) closing
   [junit4]   2> 2425438 INFO  (OverseerStateUpdate-96838685174333446-127.0.0.1:43935_solr-n_0000000000) [n:127.0.0.1:43935_solr    ] o.a.s.c.Overseer Overseer Loop exiting : 127.0.0.1:43935_solr
   [junit4]   2> 2425440 WARN  (NIOServerCxn.Factory:0.0.0.0/0.0.0.0:0) [    ] o.a.z.s.NIOServerCnxn caught end of stream exception
   [junit4]   2> EndOfStreamException: Unable to read additional data from client sessionid 0x1580a4566550006, likely client has closed socket
   [junit4]   2> 	at org.apache.zookeeper.server.NIOServerCnxn.doIO(NIOServerCnxn.java:228)
   [junit4]   2> 	at org.apache.zookeeper.server.NIOServerCnxnFactory.run(NIOServerCnxnFactory.java:208)
   [junit4]   2> 	at java.lang.Thread.run(Thread.java:745)
   [junit4]   2> 2425441 WARN  (zkCallback-11006-thread-2-processing-n:127.0.0.1:56774_solr) [n:127.0.0.1:56774_solr    ] o.a.s.c.c.ZkStateReader ZooKeeper watch triggered, but Solr cannot talk to ZK: [KeeperErrorCode = Session expired for /live_nodes]
   [junit4]   2> 2426941 WARN  (zkCallback-11007-thread-2-processing-n:127.0.0.1:43935_solr) [n:127.0.0.1:43935_solr    ] o.a.s.c.c.ZkStateReader ZooKeeper watch triggered, but Solr cannot talk to ZK: [KeeperErrorCode = Session expired for /live_nodes]
   [junit4]   2> 2426942 ERROR (Thread[Thread-5157,5,TGRP-TestSolrCloudWithDelegationTokens]) [n:127.0.0.1:43935_solr    ] o.a.h.s.t.d.AbstractDelegationTokenSecretManager ExpiredTokenRemover received java.lang.InterruptedException: sleep interrupted
   [junit4]   2> 2426944 ERROR (Thread[Thread-5158,5,TGRP-TestSolrCloudWithDelegationTokens]) [n:127.0.0.1:56774_solr    ] o.a.h.s.t.d.AbstractDelegationTokenSecretManager ExpiredTokenRemover received java.lang.InterruptedException: sleep interrupted
   [junit4]   2> 2426963 INFO  (jetty-launcher-10996-thread-2) [    ] o.e.j.s.h.ContextHandler Stopped o.e.j.s.ServletContextHandler@76638c0b{/solr,null,UNAVAILABLE}
   [junit4]   2> 2426972 INFO  (jetty-launcher-10996-thread-1) [    ] o.e.j.s.h.ContextHandler Stopped o.e.j.s.ServletContextHandler@7c538f68{/solr,null,UNAVAILABLE}
   [junit4]   2> 2426976 INFO  (SUITE-TestSolrCloudWithDelegationTokens-seed#[3911B017773FD073]-worker) [    ] o.a.s.c.ZkTestServer connecting to 127.0.0.1:42847 42847
   [junit4]   2> 2427163 INFO  (Thread-5140) [    ] o.a.s.c.ZkTestServer connecting to 127.0.0.1:42847 42847
   [junit4]   2> 2427165 WARN  (Thread-5140) [    ] o.a.s.c.ZkTestServer Watch limit violations: 
   [junit4]   2> Maximum concurrent create/delete watches above limit:
   [junit4]   2> 
   [junit4]   2> 	17	/solr/aliases.json
   [junit4]   2> 	17	/solr/clusterprops.json
   [junit4]   2> 	2	/solr/security.json
   [junit4]   2> 
   [junit4]   2> Maximum concurrent data watches above limit:
   [junit4]   2> 
   [junit4]   2> 	17	/solr/clusterstate.json
   [junit4]   2> 	4	/solr/security/zkdtsm/ZKDTSMRoot/ZKDTSMKeyIdRoot
   [junit4]   2> 	2	/solr/security/zkdtsm/ZKDTSMRoot/ZKDTSMTokensRoot/DT_7
   [junit4]   2> 	2	/solr/security/zkdtsm/ZKDTSMRoot/ZKDTSMTokensRoot/DT_6
   [junit4]   2> 	2	/solr/security/zkdtsm/ZKDTSMRoot/ZKDTSMTokensRoot/DT_9
   [junit4]   2> 	2	/solr/security/zkdtsm/ZKDTSMRoot/ZKDTSMTokensRoot/DT_8
   [junit4]   2> 	2	/solr/security/zkdtsm/ZKDTSMRoot/ZKDTSMMasterKeyRoot/DK_1
   [junit4]   2> 	2	/solr/security/zkdtsm/ZKDTSMRoot/ZKDTSMTokensRoot/DT_1
   [junit4]   2> 	2	/solr/security/zkdtsm/ZKDTSMRoot/ZKDTSMMasterKeyRoot/DK_3
   [junit4]   2> 	2	/solr/security/zkdtsm/ZKDTSMRoot/ZKDTSMTokensRoot/DT_3
   [junit4]   2> 	2	/solr/security/zkdtsm/ZKDTSMRoot/ZKDTSMMasterKeyRoot/DK_2
   [junit4]   2> 	2	/solr/security/zkdtsm/ZKDTSMRoot/ZKDTSMTokensRoot/DT_2
   [junit4]   2> 	2	/solr/security/zkdtsm/ZKDTSMRoot/ZKDTSMTokensRoot/DT_5
   [junit4]   2> 	2	/solr/security/zkdtsm/ZKDTSMRoot/ZKDTSMMasterKeyRoot/DK_4
   [junit4]   2> 	2	/solr/security/zkdtsm/ZKDTSMRoot/ZKDTSMTokensRoot/DT_4
   [junit4]   2> 	2	/solr/security/zkdtsm/ZKDTSMRoot/ZKDTSMTokensRoot/DT_12
   [junit4]   2> 	2	/solr/security/zkdtsm/ZKDTSMRoot/ZKDTSMSeqNumRoot
   [junit4]   2> 	2	/solr/security/zkdtsm/ZKDTSMRoot/ZKDTSMTokensRoot/DT_11
   [junit4]   2> 	2	/solr/security/zkdtsm/ZKDTSMRoot/ZKDTSMTokensRoot/DT_10
   [junit4]   2> 
   [junit4]   2> Maximum concurrent children watches above limit:
   [junit4]   2> 
   [junit4]   2> 	17	/solr/live_nodes
   [junit4]   2> 	17	/solr/collections
   [junit4]   2> 	4	/solr/overseer/queue
   [junit4]   2> 	2	/solr/security/zkdtsm/ZKDTSMRoot/ZKDTSMMasterKeyRoot
   [junit4]   2> 	2	/solr/overseer/queue-work
   [junit4]   2> 	2	/solr/security/zkdtsm/ZKDTSMRoot/ZKDTSMTokensRoot
   [junit4]   2> 
   [junit4]   2> 2427165 INFO  (SUITE-TestSolrCloudWithDelegationTokens-seed#[3911B017773FD073]-worker) [    ] o.a.s.SolrTestCaseJ4 ###deleteCore
   [junit4]   2> NOTE: leaving temporary files on disk at: /export/home/jenkins/workspace/Lucene-Solr-6.x-Solaris/solr/build/solr-core/test/J0/temp/solr.cloud.TestSolrCloudWithDelegationTokens_3911B017773FD073-001
   [junit4]   2> Oct 28, 2016 7:51:13 AM com.carrotsearch.randomizedtesting.ThreadLeakControl checkThreadLeaks
   [junit4]   2> WARNING: Will linger awaiting termination of 1 leaked thread(s).
   [junit4]   2> NOTE: test params are: codec=Asserting(Lucene62), sim=ClassicSimilarity, locale=sr-RS, timezone=Asia/Dili
   [junit4]   2> NOTE: SunOS 5.11 amd64/Oracle Corporation 1.8.0_102 (64-bit)/cpus=3,threads=1,free=323292368,total=536870912
   [junit4]   2> NOTE: All tests run in this JVM: [AnalysisErrorHandlingTest, TestLFUCache, PolyFieldTest, DistributedDebugComponentTest, TestScoreJoinQPScore, BaseCdcrDistributedZkTest, TestManagedSchemaAPI, SaslZkACLProviderTest, MergeStrategyTest, TestSolrCloudSnapshots, SegmentsInfoRequestHandlerTest, TestCorePropertiesReload, DirectSolrSpellCheckerTest, SystemInfoHandlerTest, TestRandomCollapseQParserPlugin, TestJmxIntegration, TestChildDocTransformer, DataDrivenBlockJoinTest, TestNumericTerms32, TestCSVLoader, TestCollationField, TestDocBasedVersionConstraints, TestShardHandlerFactory, DocumentBuilderTest, ChaosMonkeyNothingIsSafeTest, CdcrReplicationDistributedZkTest, TestRestoreCore, ParsingFieldUpdateProcessorsTest, SynonymTokenizerTest, TestConfigReload, ZkControllerTest, ExitableDirectoryReaderTest, TestSQLHandlerNonCloud, DeleteLastCustomShardedReplicaTest, TestDynamicFieldResource, SuggesterFSTTest, LeaderInitiatedRecoveryOnShardRestartTest, PeerSyncTest, LeaderFailureAfterFreshStartTest, TestCloudInspectUtil, TolerantUpdateProcessorTest, HLLUtilTest, DistributedMLTComponentTest, QueryEqualityTest, AddSchemaFieldsUpdateProcessorFactoryTest, TestMiniSolrCloudClusterSSL, TestXIncludeConfig, TestLeaderElectionZkExpiry, TestGraphTermsQParserPlugin, TestPostingsSolrHighlighter, TestUniqueKeyFieldResource, TestManagedSynonymFilterFactory, SpatialHeatmapFacetsTest, TestNonDefinedSimilarityFactory, DistributedQueryComponentCustomSortTest, DistributedQueryElevationComponentTest, TestCollationFieldDocValues, TestFunctionQuery, TestFieldCache, TestComplexPhraseQParserPlugin, DocumentAnalysisRequestHandlerTest, TestFieldResource, TestOrdValues, DistributedSpellCheckComponentTest, TestCoreContainer, TestSchemaVersionResource, TestLocalFSCloudBackupRestore, TestFastLRUCache, HdfsBasicDistributedZk2Test, TestHashPartitioner, TestConfigOverlay, LeaderElectionContextKeyTest, RequestLoggingTest, TestPerFieldSimilarityWithDefaultOverride, TestCSVResponseWriter, DistributedQueueTest, TestBM25SimilarityFactory, TestXmlQParserPlugin, SpatialFilterTest, OpenExchangeRatesOrgProviderTest, DirectUpdateHandlerTest, TestIBSimilarityFactory, BasicDistributedZkTest, DateFieldTest, TestMacroExpander, TemplateUpdateProcessorTest, RemoteQueryErrorTest, MultiTermTest, TestMiniSolrCloudCluster, DisMaxRequestHandlerTest, TestSizeLimitedDistributedMap, TestPerFieldSimilarity, TestFieldTypeResource, TestTrieFacet, TestSolrDeletionPolicy1, RollingRestartTest, HdfsRecoverLeaseTest, AssignTest, SoftAutoCommitTest, ConnectionManagerTest, TestCharFilters, HdfsLockFactoryTest, TestExactSharedStatsCache, TestRandomDVFaceting, RequiredFieldsTest, OutputWriterTest, TestElisionMultitermQuery, FullHLLTest, TestSimpleQParserPlugin, TestInitQParser, StressHdfsTest, TestDownShardTolerantSearch, RecoveryZkTest, XsltUpdateRequestHandlerTest, GraphQueryTest, TestStressLiveNodes, UnloadDistributedZkTest, BooleanFieldTest, QueryResultKeyTest, TestAuthenticationFramework, TestDefaultSearchFieldResource, HdfsChaosMonkeyNothingIsSafeTest, ConjunctionSolrSpellCheckerTest, TestStandardQParsers, TestMissingGroups, TestSubQueryTransformerCrossCore, SolrCloudExampleTest, TestSolrIndexConfig, HardAutoCommitTest, TestManagedResource, PKIAuthenticationIntegrationTest, BigEndianAscendingWordDeserializerTest, BufferStoreTest, ZkStateReaderTest, DateRangeFieldTest, XmlUpdateRequestHandlerTest, DeleteStatusTest, SyncSliceTest, DistributedSuggestComponentTest, TestGroupingSearch, OverriddenZkACLAndCredentialsProvidersTest, OverseerStatusTest, TestHdfsCloudBackupRestore, SimplePostToolTest, BadComponentTest, DirectSolrConnectionTest, TestHighlightDedupGrouping, StatelessScriptUpdateProcessorFactoryTest, TestLRUCache, TestDocumentBuilder, TestComponentsName, TestAnalyzedSuggestions, TestSolrJ, TestOverriddenPrefixQueryForCustomFieldType, ChaosMonkeySafeLeaderTest, OverseerTest, ShardRoutingTest, BasicZkTest, FullSolrCloudDistribCmdsTest, TestReplicationHandler, ClusterStateUpdateTest, TestRandomFaceting, LeaderElectionTest, ZkSolrClientTest, ZkCLITest, ShardRoutingCustomTest, TestDistributedSearch, TestStressLucene, SuggesterWFSTTest, WordBreakSolrSpellCheckerTest, SchemaVersionSpecificBehaviorTest, SolrCoreCheckLockOnStartupTest, TestPseudoReturnFields, TestUpdate, FieldMutatingUpdateProcessorTest, TestAtomicUpdateErrorCases, TestWordDelimiterFilterFactory, DirectUpdateHandlerOptimizeTest, TestRemoteStreaming, DocValuesMultiTest, IndexBasedSpellCheckerTest, TestSurroundQueryParser, TestWriterPerf, TestOmitPositions, RequestHandlersTest, TermVectorComponentTest, MoreLikeThisHandlerTest, TestSolrQueryParser, IndexSchemaRuntimeFieldTest, SolrPluginUtilsTest, JsonLoaderTest, PingRequestHandlerTest, TestSolrDeletionPolicy2, SampleTest, TestDocSet, TestBinaryField, NumericFieldsTest, MinimalSchemaTest, TestConfig, NotRequiredUniqueKeyTest, TestPhraseSuggestions, EchoParamsTest, TestSweetSpotSimilarityFactory, TestDFRSimilarityFactory, TestFastWriter, TestJmxMonitoredMap, TimeZoneUtilsTest, TestFastOutputStream, PluginInfoTest, DateMathParserTest, PreAnalyzedFieldTest, TestSystemIdResolver, PrimUtilsTest, TestSuggestSpellingConverter, SpellingQueryConverterTest, DOMUtilTest, ClusterStateTest, ZkNodePropsTest, UUIDFieldTest, FileUtilsTest, TestRTGBase, CursorPagingTest, SolrTestCaseJ4Test, TestCursorMarkWithoutUniqueKey, TestSimpleTrackingShardHandler, TestTolerantSearch, TestJettySolrRunner, ConnectionReuseTest, ActionThrottleTest, CdcrRequestHandlerTest, CdcrVersionReplicationTest, CloudExitableDirectoryReaderTest, CollectionReloadTest, CollectionStateFormat2Test, CollectionsAPIAsyncDistributedZkTest, CollectionsAPISolrJTest, CustomCollectionTest, DistribDocExpirationUpdateProcessorTest, ForceLeaderTest, ReplaceNodeTest, ReplicationFactorTest, SharedFSAutoReplicaFailoverTest, SharedFSAutoReplicaFailoverUtilsTest, SimpleCollectionCreateDeleteTest, TestCloudPseudoReturnFields, TestConfigSetsAPI, TestConfigSetsAPIExclusivity, TestCryptoKeys, TestExclusionRuleCollectionAccess, TestLockTree, TestRandomFlRTGCloud, TestRebalanceLeaders, TestSSLRandomization, TestSolrCloudWithDelegationTokens]
   [junit4] Completed [502/646 (1!)] on J0 in 4.07s, 8 tests, 1 failure <<< FAILURES!

[...truncated 60903 lines...]


Mime
View raw message