lucene-dev mailing list archives

Site index · List index
Message view « Date » · « Thread »
Top « Date » · « Thread »
From Policeman Jenkins Server <jenk...@thetaphi.de>
Subject [JENKINS] Lucene-Solr-6.x-Linux (32bit/jdk1.8.0_102) - Build # 2045 - Unstable!
Date Wed, 26 Oct 2016 21:41:07 GMT
Build: https://jenkins.thetaphi.de/job/Lucene-Solr-6.x-Linux/2045/
Java: 32bit/jdk1.8.0_102 -client -XX:+UseSerialGC

8 tests failed.
FAILED:  junit.framework.TestSuite.org.apache.solr.uninverting.TestFieldCacheVsDocValues

Error Message:
Suite timeout exceeded (>= 7200000 msec).

Stack Trace:
java.lang.Exception: Suite timeout exceeded (>= 7200000 msec).
	at __randomizedtesting.SeedInfo.seed([1D8FDD545C59321]:0)


FAILED:  org.apache.solr.search.facet.TestJsonFacets.testStatsDistrib {p0=SMART}

Error Message:
mismatch: 'A'!='B' @ facets/cat0/buckets/[0]/val

Stack Trace:
java.lang.RuntimeException: mismatch: 'A'!='B' @ facets/cat0/buckets/[0]/val
	at __randomizedtesting.SeedInfo.seed([1D8FDD545C59321:DD1854A3284437EB]:0)
	at org.apache.solr.SolrTestCaseHS.matchJSON(SolrTestCaseHS.java:161)
	at org.apache.solr.SolrTestCaseHS.assertJQ(SolrTestCaseHS.java:143)
	at org.apache.solr.SolrTestCaseHS$Client$Tester.assertJQ(SolrTestCaseHS.java:255)
	at org.apache.solr.SolrTestCaseHS$Client.testJQ(SolrTestCaseHS.java:296)
	at org.apache.solr.search.facet.TestJsonFacets.doStatsTemplated(TestJsonFacets.java:1152)
	at org.apache.solr.search.facet.TestJsonFacets.doStats(TestJsonFacets.java:361)
	at org.apache.solr.search.facet.TestJsonFacets.testStatsDistrib(TestJsonFacets.java:322)
	at sun.reflect.NativeMethodAccessorImpl.invoke0(Native Method)
	at sun.reflect.NativeMethodAccessorImpl.invoke(NativeMethodAccessorImpl.java:62)
	at sun.reflect.DelegatingMethodAccessorImpl.invoke(DelegatingMethodAccessorImpl.java:43)
	at java.lang.reflect.Method.invoke(Method.java:498)
	at com.carrotsearch.randomizedtesting.RandomizedRunner.invoke(RandomizedRunner.java:1713)
	at com.carrotsearch.randomizedtesting.RandomizedRunner$8.evaluate(RandomizedRunner.java:907)
	at com.carrotsearch.randomizedtesting.RandomizedRunner$9.evaluate(RandomizedRunner.java:943)
	at com.carrotsearch.randomizedtesting.RandomizedRunner$10.evaluate(RandomizedRunner.java:957)
	at com.carrotsearch.randomizedtesting.rules.SystemPropertiesRestoreRule$1.evaluate(SystemPropertiesRestoreRule.java:57)
	at org.apache.lucene.util.TestRuleSetupTeardownChained$1.evaluate(TestRuleSetupTeardownChained.java:49)
	at org.apache.lucene.util.AbstractBeforeAfterRule$1.evaluate(AbstractBeforeAfterRule.java:45)
	at org.apache.lucene.util.TestRuleThreadAndTestName$1.evaluate(TestRuleThreadAndTestName.java:48)
	at org.apache.lucene.util.TestRuleIgnoreAfterMaxFailures$1.evaluate(TestRuleIgnoreAfterMaxFailures.java:64)
	at org.apache.lucene.util.TestRuleMarkFailure$1.evaluate(TestRuleMarkFailure.java:47)
	at com.carrotsearch.randomizedtesting.rules.StatementAdapter.evaluate(StatementAdapter.java:36)
	at com.carrotsearch.randomizedtesting.ThreadLeakControl$StatementRunner.run(ThreadLeakControl.java:367)
	at com.carrotsearch.randomizedtesting.ThreadLeakControl.forkTimeoutingTask(ThreadLeakControl.java:811)
	at com.carrotsearch.randomizedtesting.ThreadLeakControl$3.evaluate(ThreadLeakControl.java:462)
	at com.carrotsearch.randomizedtesting.RandomizedRunner.runSingleTest(RandomizedRunner.java:916)
	at com.carrotsearch.randomizedtesting.RandomizedRunner$5.evaluate(RandomizedRunner.java:802)
	at com.carrotsearch.randomizedtesting.RandomizedRunner$6.evaluate(RandomizedRunner.java:852)
	at com.carrotsearch.randomizedtesting.RandomizedRunner$7.evaluate(RandomizedRunner.java:863)
	at com.carrotsearch.randomizedtesting.rules.StatementAdapter.evaluate(StatementAdapter.java:36)
	at com.carrotsearch.randomizedtesting.rules.SystemPropertiesRestoreRule$1.evaluate(SystemPropertiesRestoreRule.java:57)
	at org.apache.lucene.util.AbstractBeforeAfterRule$1.evaluate(AbstractBeforeAfterRule.java:45)
	at com.carrotsearch.randomizedtesting.rules.StatementAdapter.evaluate(StatementAdapter.java:36)
	at org.apache.lucene.util.TestRuleStoreClassName$1.evaluate(TestRuleStoreClassName.java:41)
	at com.carrotsearch.randomizedtesting.rules.NoShadowingOrOverridesOnMethodsRule$1.evaluate(NoShadowingOrOverridesOnMethodsRule.java:40)
	at com.carrotsearch.randomizedtesting.rules.NoShadowingOrOverridesOnMethodsRule$1.evaluate(NoShadowingOrOverridesOnMethodsRule.java:40)
	at com.carrotsearch.randomizedtesting.rules.StatementAdapter.evaluate(StatementAdapter.java:36)
	at com.carrotsearch.randomizedtesting.rules.StatementAdapter.evaluate(StatementAdapter.java:36)
	at com.carrotsearch.randomizedtesting.rules.StatementAdapter.evaluate(StatementAdapter.java:36)
	at org.apache.lucene.util.TestRuleAssertionsRequired$1.evaluate(TestRuleAssertionsRequired.java:53)
	at org.apache.lucene.util.TestRuleMarkFailure$1.evaluate(TestRuleMarkFailure.java:47)
	at org.apache.lucene.util.TestRuleIgnoreAfterMaxFailures$1.evaluate(TestRuleIgnoreAfterMaxFailures.java:64)
	at org.apache.lucene.util.TestRuleIgnoreTestSuites$1.evaluate(TestRuleIgnoreTestSuites.java:54)
	at com.carrotsearch.randomizedtesting.rules.StatementAdapter.evaluate(StatementAdapter.java:36)
	at com.carrotsearch.randomizedtesting.ThreadLeakControl$StatementRunner.run(ThreadLeakControl.java:367)
	at java.lang.Thread.run(Thread.java:745)


FAILED:  org.apache.solr.search.facet.TestJsonFacets.testStatsDistrib {p0=DVHASH}

Error Message:
mismatch: 'A'!='B' @ facets/cat0/buckets/[0]/val

Stack Trace:
java.lang.RuntimeException: mismatch: 'A'!='B' @ facets/cat0/buckets/[0]/val
	at __randomizedtesting.SeedInfo.seed([1D8FDD545C59321:DD1854A3284437EB]:0)
	at org.apache.solr.SolrTestCaseHS.matchJSON(SolrTestCaseHS.java:161)
	at org.apache.solr.SolrTestCaseHS.assertJQ(SolrTestCaseHS.java:143)
	at org.apache.solr.SolrTestCaseHS$Client$Tester.assertJQ(SolrTestCaseHS.java:255)
	at org.apache.solr.SolrTestCaseHS$Client.testJQ(SolrTestCaseHS.java:296)
	at org.apache.solr.search.facet.TestJsonFacets.doStatsTemplated(TestJsonFacets.java:1152)
	at org.apache.solr.search.facet.TestJsonFacets.doStats(TestJsonFacets.java:361)
	at org.apache.solr.search.facet.TestJsonFacets.testStatsDistrib(TestJsonFacets.java:322)
	at sun.reflect.NativeMethodAccessorImpl.invoke0(Native Method)
	at sun.reflect.NativeMethodAccessorImpl.invoke(NativeMethodAccessorImpl.java:62)
	at sun.reflect.DelegatingMethodAccessorImpl.invoke(DelegatingMethodAccessorImpl.java:43)
	at java.lang.reflect.Method.invoke(Method.java:498)
	at com.carrotsearch.randomizedtesting.RandomizedRunner.invoke(RandomizedRunner.java:1713)
	at com.carrotsearch.randomizedtesting.RandomizedRunner$8.evaluate(RandomizedRunner.java:907)
	at com.carrotsearch.randomizedtesting.RandomizedRunner$9.evaluate(RandomizedRunner.java:943)
	at com.carrotsearch.randomizedtesting.RandomizedRunner$10.evaluate(RandomizedRunner.java:957)
	at com.carrotsearch.randomizedtesting.rules.SystemPropertiesRestoreRule$1.evaluate(SystemPropertiesRestoreRule.java:57)
	at org.apache.lucene.util.TestRuleSetupTeardownChained$1.evaluate(TestRuleSetupTeardownChained.java:49)
	at org.apache.lucene.util.AbstractBeforeAfterRule$1.evaluate(AbstractBeforeAfterRule.java:45)
	at org.apache.lucene.util.TestRuleThreadAndTestName$1.evaluate(TestRuleThreadAndTestName.java:48)
	at org.apache.lucene.util.TestRuleIgnoreAfterMaxFailures$1.evaluate(TestRuleIgnoreAfterMaxFailures.java:64)
	at org.apache.lucene.util.TestRuleMarkFailure$1.evaluate(TestRuleMarkFailure.java:47)
	at com.carrotsearch.randomizedtesting.rules.StatementAdapter.evaluate(StatementAdapter.java:36)
	at com.carrotsearch.randomizedtesting.ThreadLeakControl$StatementRunner.run(ThreadLeakControl.java:367)
	at com.carrotsearch.randomizedtesting.ThreadLeakControl.forkTimeoutingTask(ThreadLeakControl.java:811)
	at com.carrotsearch.randomizedtesting.ThreadLeakControl$3.evaluate(ThreadLeakControl.java:462)
	at com.carrotsearch.randomizedtesting.RandomizedRunner.runSingleTest(RandomizedRunner.java:916)
	at com.carrotsearch.randomizedtesting.RandomizedRunner$5.evaluate(RandomizedRunner.java:802)
	at com.carrotsearch.randomizedtesting.RandomizedRunner$6.evaluate(RandomizedRunner.java:852)
	at com.carrotsearch.randomizedtesting.RandomizedRunner$7.evaluate(RandomizedRunner.java:863)
	at com.carrotsearch.randomizedtesting.rules.StatementAdapter.evaluate(StatementAdapter.java:36)
	at com.carrotsearch.randomizedtesting.rules.SystemPropertiesRestoreRule$1.evaluate(SystemPropertiesRestoreRule.java:57)
	at org.apache.lucene.util.AbstractBeforeAfterRule$1.evaluate(AbstractBeforeAfterRule.java:45)
	at com.carrotsearch.randomizedtesting.rules.StatementAdapter.evaluate(StatementAdapter.java:36)
	at org.apache.lucene.util.TestRuleStoreClassName$1.evaluate(TestRuleStoreClassName.java:41)
	at com.carrotsearch.randomizedtesting.rules.NoShadowingOrOverridesOnMethodsRule$1.evaluate(NoShadowingOrOverridesOnMethodsRule.java:40)
	at com.carrotsearch.randomizedtesting.rules.NoShadowingOrOverridesOnMethodsRule$1.evaluate(NoShadowingOrOverridesOnMethodsRule.java:40)
	at com.carrotsearch.randomizedtesting.rules.StatementAdapter.evaluate(StatementAdapter.java:36)
	at com.carrotsearch.randomizedtesting.rules.StatementAdapter.evaluate(StatementAdapter.java:36)
	at com.carrotsearch.randomizedtesting.rules.StatementAdapter.evaluate(StatementAdapter.java:36)
	at org.apache.lucene.util.TestRuleAssertionsRequired$1.evaluate(TestRuleAssertionsRequired.java:53)
	at org.apache.lucene.util.TestRuleMarkFailure$1.evaluate(TestRuleMarkFailure.java:47)
	at org.apache.lucene.util.TestRuleIgnoreAfterMaxFailures$1.evaluate(TestRuleIgnoreAfterMaxFailures.java:64)
	at org.apache.lucene.util.TestRuleIgnoreTestSuites$1.evaluate(TestRuleIgnoreTestSuites.java:54)
	at com.carrotsearch.randomizedtesting.rules.StatementAdapter.evaluate(StatementAdapter.java:36)
	at com.carrotsearch.randomizedtesting.ThreadLeakControl$StatementRunner.run(ThreadLeakControl.java:367)
	at java.lang.Thread.run(Thread.java:745)


FAILED:  org.apache.solr.search.facet.TestJsonFacets.testStatsDistrib {p0=ENUM}

Error Message:
mismatch: 'A'!='B' @ facets/cat0/buckets/[0]/val

Stack Trace:
java.lang.RuntimeException: mismatch: 'A'!='B' @ facets/cat0/buckets/[0]/val
	at __randomizedtesting.SeedInfo.seed([1D8FDD545C59321:DD1854A3284437EB]:0)
	at org.apache.solr.SolrTestCaseHS.matchJSON(SolrTestCaseHS.java:161)
	at org.apache.solr.SolrTestCaseHS.assertJQ(SolrTestCaseHS.java:143)
	at org.apache.solr.SolrTestCaseHS$Client$Tester.assertJQ(SolrTestCaseHS.java:255)
	at org.apache.solr.SolrTestCaseHS$Client.testJQ(SolrTestCaseHS.java:296)
	at org.apache.solr.search.facet.TestJsonFacets.doStatsTemplated(TestJsonFacets.java:1152)
	at org.apache.solr.search.facet.TestJsonFacets.doStats(TestJsonFacets.java:361)
	at org.apache.solr.search.facet.TestJsonFacets.testStatsDistrib(TestJsonFacets.java:322)
	at sun.reflect.NativeMethodAccessorImpl.invoke0(Native Method)
	at sun.reflect.NativeMethodAccessorImpl.invoke(NativeMethodAccessorImpl.java:62)
	at sun.reflect.DelegatingMethodAccessorImpl.invoke(DelegatingMethodAccessorImpl.java:43)
	at java.lang.reflect.Method.invoke(Method.java:498)
	at com.carrotsearch.randomizedtesting.RandomizedRunner.invoke(RandomizedRunner.java:1713)
	at com.carrotsearch.randomizedtesting.RandomizedRunner$8.evaluate(RandomizedRunner.java:907)
	at com.carrotsearch.randomizedtesting.RandomizedRunner$9.evaluate(RandomizedRunner.java:943)
	at com.carrotsearch.randomizedtesting.RandomizedRunner$10.evaluate(RandomizedRunner.java:957)
	at com.carrotsearch.randomizedtesting.rules.SystemPropertiesRestoreRule$1.evaluate(SystemPropertiesRestoreRule.java:57)
	at org.apache.lucene.util.TestRuleSetupTeardownChained$1.evaluate(TestRuleSetupTeardownChained.java:49)
	at org.apache.lucene.util.AbstractBeforeAfterRule$1.evaluate(AbstractBeforeAfterRule.java:45)
	at org.apache.lucene.util.TestRuleThreadAndTestName$1.evaluate(TestRuleThreadAndTestName.java:48)
	at org.apache.lucene.util.TestRuleIgnoreAfterMaxFailures$1.evaluate(TestRuleIgnoreAfterMaxFailures.java:64)
	at org.apache.lucene.util.TestRuleMarkFailure$1.evaluate(TestRuleMarkFailure.java:47)
	at com.carrotsearch.randomizedtesting.rules.StatementAdapter.evaluate(StatementAdapter.java:36)
	at com.carrotsearch.randomizedtesting.ThreadLeakControl$StatementRunner.run(ThreadLeakControl.java:367)
	at com.carrotsearch.randomizedtesting.ThreadLeakControl.forkTimeoutingTask(ThreadLeakControl.java:811)
	at com.carrotsearch.randomizedtesting.ThreadLeakControl$3.evaluate(ThreadLeakControl.java:462)
	at com.carrotsearch.randomizedtesting.RandomizedRunner.runSingleTest(RandomizedRunner.java:916)
	at com.carrotsearch.randomizedtesting.RandomizedRunner$5.evaluate(RandomizedRunner.java:802)
	at com.carrotsearch.randomizedtesting.RandomizedRunner$6.evaluate(RandomizedRunner.java:852)
	at com.carrotsearch.randomizedtesting.RandomizedRunner$7.evaluate(RandomizedRunner.java:863)
	at com.carrotsearch.randomizedtesting.rules.StatementAdapter.evaluate(StatementAdapter.java:36)
	at com.carrotsearch.randomizedtesting.rules.SystemPropertiesRestoreRule$1.evaluate(SystemPropertiesRestoreRule.java:57)
	at org.apache.lucene.util.AbstractBeforeAfterRule$1.evaluate(AbstractBeforeAfterRule.java:45)
	at com.carrotsearch.randomizedtesting.rules.StatementAdapter.evaluate(StatementAdapter.java:36)
	at org.apache.lucene.util.TestRuleStoreClassName$1.evaluate(TestRuleStoreClassName.java:41)
	at com.carrotsearch.randomizedtesting.rules.NoShadowingOrOverridesOnMethodsRule$1.evaluate(NoShadowingOrOverridesOnMethodsRule.java:40)
	at com.carrotsearch.randomizedtesting.rules.NoShadowingOrOverridesOnMethodsRule$1.evaluate(NoShadowingOrOverridesOnMethodsRule.java:40)
	at com.carrotsearch.randomizedtesting.rules.StatementAdapter.evaluate(StatementAdapter.java:36)
	at com.carrotsearch.randomizedtesting.rules.StatementAdapter.evaluate(StatementAdapter.java:36)
	at com.carrotsearch.randomizedtesting.rules.StatementAdapter.evaluate(StatementAdapter.java:36)
	at org.apache.lucene.util.TestRuleAssertionsRequired$1.evaluate(TestRuleAssertionsRequired.java:53)
	at org.apache.lucene.util.TestRuleMarkFailure$1.evaluate(TestRuleMarkFailure.java:47)
	at org.apache.lucene.util.TestRuleIgnoreAfterMaxFailures$1.evaluate(TestRuleIgnoreAfterMaxFailures.java:64)
	at org.apache.lucene.util.TestRuleIgnoreTestSuites$1.evaluate(TestRuleIgnoreTestSuites.java:54)
	at com.carrotsearch.randomizedtesting.rules.StatementAdapter.evaluate(StatementAdapter.java:36)
	at com.carrotsearch.randomizedtesting.ThreadLeakControl$StatementRunner.run(ThreadLeakControl.java:367)
	at java.lang.Thread.run(Thread.java:745)


FAILED:  org.apache.solr.search.facet.TestJsonFacets.testStatsDistrib {p0=UIF}

Error Message:
mismatch: 'A'!='B' @ facets/cat0/buckets/[0]/val

Stack Trace:
java.lang.RuntimeException: mismatch: 'A'!='B' @ facets/cat0/buckets/[0]/val
	at __randomizedtesting.SeedInfo.seed([1D8FDD545C59321:DD1854A3284437EB]:0)
	at org.apache.solr.SolrTestCaseHS.matchJSON(SolrTestCaseHS.java:161)
	at org.apache.solr.SolrTestCaseHS.assertJQ(SolrTestCaseHS.java:143)
	at org.apache.solr.SolrTestCaseHS$Client$Tester.assertJQ(SolrTestCaseHS.java:255)
	at org.apache.solr.SolrTestCaseHS$Client.testJQ(SolrTestCaseHS.java:296)
	at org.apache.solr.search.facet.TestJsonFacets.doStatsTemplated(TestJsonFacets.java:1152)
	at org.apache.solr.search.facet.TestJsonFacets.doStats(TestJsonFacets.java:361)
	at org.apache.solr.search.facet.TestJsonFacets.testStatsDistrib(TestJsonFacets.java:322)
	at sun.reflect.NativeMethodAccessorImpl.invoke0(Native Method)
	at sun.reflect.NativeMethodAccessorImpl.invoke(NativeMethodAccessorImpl.java:62)
	at sun.reflect.DelegatingMethodAccessorImpl.invoke(DelegatingMethodAccessorImpl.java:43)
	at java.lang.reflect.Method.invoke(Method.java:498)
	at com.carrotsearch.randomizedtesting.RandomizedRunner.invoke(RandomizedRunner.java:1713)
	at com.carrotsearch.randomizedtesting.RandomizedRunner$8.evaluate(RandomizedRunner.java:907)
	at com.carrotsearch.randomizedtesting.RandomizedRunner$9.evaluate(RandomizedRunner.java:943)
	at com.carrotsearch.randomizedtesting.RandomizedRunner$10.evaluate(RandomizedRunner.java:957)
	at com.carrotsearch.randomizedtesting.rules.SystemPropertiesRestoreRule$1.evaluate(SystemPropertiesRestoreRule.java:57)
	at org.apache.lucene.util.TestRuleSetupTeardownChained$1.evaluate(TestRuleSetupTeardownChained.java:49)
	at org.apache.lucene.util.AbstractBeforeAfterRule$1.evaluate(AbstractBeforeAfterRule.java:45)
	at org.apache.lucene.util.TestRuleThreadAndTestName$1.evaluate(TestRuleThreadAndTestName.java:48)
	at org.apache.lucene.util.TestRuleIgnoreAfterMaxFailures$1.evaluate(TestRuleIgnoreAfterMaxFailures.java:64)
	at org.apache.lucene.util.TestRuleMarkFailure$1.evaluate(TestRuleMarkFailure.java:47)
	at com.carrotsearch.randomizedtesting.rules.StatementAdapter.evaluate(StatementAdapter.java:36)
	at com.carrotsearch.randomizedtesting.ThreadLeakControl$StatementRunner.run(ThreadLeakControl.java:367)
	at com.carrotsearch.randomizedtesting.ThreadLeakControl.forkTimeoutingTask(ThreadLeakControl.java:811)
	at com.carrotsearch.randomizedtesting.ThreadLeakControl$3.evaluate(ThreadLeakControl.java:462)
	at com.carrotsearch.randomizedtesting.RandomizedRunner.runSingleTest(RandomizedRunner.java:916)
	at com.carrotsearch.randomizedtesting.RandomizedRunner$5.evaluate(RandomizedRunner.java:802)
	at com.carrotsearch.randomizedtesting.RandomizedRunner$6.evaluate(RandomizedRunner.java:852)
	at com.carrotsearch.randomizedtesting.RandomizedRunner$7.evaluate(RandomizedRunner.java:863)
	at com.carrotsearch.randomizedtesting.rules.StatementAdapter.evaluate(StatementAdapter.java:36)
	at com.carrotsearch.randomizedtesting.rules.SystemPropertiesRestoreRule$1.evaluate(SystemPropertiesRestoreRule.java:57)
	at org.apache.lucene.util.AbstractBeforeAfterRule$1.evaluate(AbstractBeforeAfterRule.java:45)
	at com.carrotsearch.randomizedtesting.rules.StatementAdapter.evaluate(StatementAdapter.java:36)
	at org.apache.lucene.util.TestRuleStoreClassName$1.evaluate(TestRuleStoreClassName.java:41)
	at com.carrotsearch.randomizedtesting.rules.NoShadowingOrOverridesOnMethodsRule$1.evaluate(NoShadowingOrOverridesOnMethodsRule.java:40)
	at com.carrotsearch.randomizedtesting.rules.NoShadowingOrOverridesOnMethodsRule$1.evaluate(NoShadowingOrOverridesOnMethodsRule.java:40)
	at com.carrotsearch.randomizedtesting.rules.StatementAdapter.evaluate(StatementAdapter.java:36)
	at com.carrotsearch.randomizedtesting.rules.StatementAdapter.evaluate(StatementAdapter.java:36)
	at com.carrotsearch.randomizedtesting.rules.StatementAdapter.evaluate(StatementAdapter.java:36)
	at org.apache.lucene.util.TestRuleAssertionsRequired$1.evaluate(TestRuleAssertionsRequired.java:53)
	at org.apache.lucene.util.TestRuleMarkFailure$1.evaluate(TestRuleMarkFailure.java:47)
	at org.apache.lucene.util.TestRuleIgnoreAfterMaxFailures$1.evaluate(TestRuleIgnoreAfterMaxFailures.java:64)
	at org.apache.lucene.util.TestRuleIgnoreTestSuites$1.evaluate(TestRuleIgnoreTestSuites.java:54)
	at com.carrotsearch.randomizedtesting.rules.StatementAdapter.evaluate(StatementAdapter.java:36)
	at com.carrotsearch.randomizedtesting.ThreadLeakControl$StatementRunner.run(ThreadLeakControl.java:367)
	at java.lang.Thread.run(Thread.java:745)


FAILED:  org.apache.solr.search.facet.TestJsonFacets.testStatsDistrib {p0=DV}

Error Message:
mismatch: 'A'!='B' @ facets/cat0/buckets/[0]/val

Stack Trace:
java.lang.RuntimeException: mismatch: 'A'!='B' @ facets/cat0/buckets/[0]/val
	at __randomizedtesting.SeedInfo.seed([1D8FDD545C59321:DD1854A3284437EB]:0)
	at org.apache.solr.SolrTestCaseHS.matchJSON(SolrTestCaseHS.java:161)
	at org.apache.solr.SolrTestCaseHS.assertJQ(SolrTestCaseHS.java:143)
	at org.apache.solr.SolrTestCaseHS$Client$Tester.assertJQ(SolrTestCaseHS.java:255)
	at org.apache.solr.SolrTestCaseHS$Client.testJQ(SolrTestCaseHS.java:296)
	at org.apache.solr.search.facet.TestJsonFacets.doStatsTemplated(TestJsonFacets.java:1152)
	at org.apache.solr.search.facet.TestJsonFacets.doStats(TestJsonFacets.java:361)
	at org.apache.solr.search.facet.TestJsonFacets.testStatsDistrib(TestJsonFacets.java:322)
	at sun.reflect.NativeMethodAccessorImpl.invoke0(Native Method)
	at sun.reflect.NativeMethodAccessorImpl.invoke(NativeMethodAccessorImpl.java:62)
	at sun.reflect.DelegatingMethodAccessorImpl.invoke(DelegatingMethodAccessorImpl.java:43)
	at java.lang.reflect.Method.invoke(Method.java:498)
	at com.carrotsearch.randomizedtesting.RandomizedRunner.invoke(RandomizedRunner.java:1713)
	at com.carrotsearch.randomizedtesting.RandomizedRunner$8.evaluate(RandomizedRunner.java:907)
	at com.carrotsearch.randomizedtesting.RandomizedRunner$9.evaluate(RandomizedRunner.java:943)
	at com.carrotsearch.randomizedtesting.RandomizedRunner$10.evaluate(RandomizedRunner.java:957)
	at com.carrotsearch.randomizedtesting.rules.SystemPropertiesRestoreRule$1.evaluate(SystemPropertiesRestoreRule.java:57)
	at org.apache.lucene.util.TestRuleSetupTeardownChained$1.evaluate(TestRuleSetupTeardownChained.java:49)
	at org.apache.lucene.util.AbstractBeforeAfterRule$1.evaluate(AbstractBeforeAfterRule.java:45)
	at org.apache.lucene.util.TestRuleThreadAndTestName$1.evaluate(TestRuleThreadAndTestName.java:48)
	at org.apache.lucene.util.TestRuleIgnoreAfterMaxFailures$1.evaluate(TestRuleIgnoreAfterMaxFailures.java:64)
	at org.apache.lucene.util.TestRuleMarkFailure$1.evaluate(TestRuleMarkFailure.java:47)
	at com.carrotsearch.randomizedtesting.rules.StatementAdapter.evaluate(StatementAdapter.java:36)
	at com.carrotsearch.randomizedtesting.ThreadLeakControl$StatementRunner.run(ThreadLeakControl.java:367)
	at com.carrotsearch.randomizedtesting.ThreadLeakControl.forkTimeoutingTask(ThreadLeakControl.java:811)
	at com.carrotsearch.randomizedtesting.ThreadLeakControl$3.evaluate(ThreadLeakControl.java:462)
	at com.carrotsearch.randomizedtesting.RandomizedRunner.runSingleTest(RandomizedRunner.java:916)
	at com.carrotsearch.randomizedtesting.RandomizedRunner$5.evaluate(RandomizedRunner.java:802)
	at com.carrotsearch.randomizedtesting.RandomizedRunner$6.evaluate(RandomizedRunner.java:852)
	at com.carrotsearch.randomizedtesting.RandomizedRunner$7.evaluate(RandomizedRunner.java:863)
	at com.carrotsearch.randomizedtesting.rules.StatementAdapter.evaluate(StatementAdapter.java:36)
	at com.carrotsearch.randomizedtesting.rules.SystemPropertiesRestoreRule$1.evaluate(SystemPropertiesRestoreRule.java:57)
	at org.apache.lucene.util.AbstractBeforeAfterRule$1.evaluate(AbstractBeforeAfterRule.java:45)
	at com.carrotsearch.randomizedtesting.rules.StatementAdapter.evaluate(StatementAdapter.java:36)
	at org.apache.lucene.util.TestRuleStoreClassName$1.evaluate(TestRuleStoreClassName.java:41)
	at com.carrotsearch.randomizedtesting.rules.NoShadowingOrOverridesOnMethodsRule$1.evaluate(NoShadowingOrOverridesOnMethodsRule.java:40)
	at com.carrotsearch.randomizedtesting.rules.NoShadowingOrOverridesOnMethodsRule$1.evaluate(NoShadowingOrOverridesOnMethodsRule.java:40)
	at com.carrotsearch.randomizedtesting.rules.StatementAdapter.evaluate(StatementAdapter.java:36)
	at com.carrotsearch.randomizedtesting.rules.StatementAdapter.evaluate(StatementAdapter.java:36)
	at com.carrotsearch.randomizedtesting.rules.StatementAdapter.evaluate(StatementAdapter.java:36)
	at org.apache.lucene.util.TestRuleAssertionsRequired$1.evaluate(TestRuleAssertionsRequired.java:53)
	at org.apache.lucene.util.TestRuleMarkFailure$1.evaluate(TestRuleMarkFailure.java:47)
	at org.apache.lucene.util.TestRuleIgnoreAfterMaxFailures$1.evaluate(TestRuleIgnoreAfterMaxFailures.java:64)
	at org.apache.lucene.util.TestRuleIgnoreTestSuites$1.evaluate(TestRuleIgnoreTestSuites.java:54)
	at com.carrotsearch.randomizedtesting.rules.StatementAdapter.evaluate(StatementAdapter.java:36)
	at com.carrotsearch.randomizedtesting.ThreadLeakControl$StatementRunner.run(ThreadLeakControl.java:367)
	at java.lang.Thread.run(Thread.java:745)


FAILED:  org.apache.solr.search.facet.TestJsonFacets.testStatsDistrib {p0=STREAM}

Error Message:
mismatch: 'A'!='B' @ facets/cat0/buckets/[0]/val

Stack Trace:
java.lang.RuntimeException: mismatch: 'A'!='B' @ facets/cat0/buckets/[0]/val
	at __randomizedtesting.SeedInfo.seed([1D8FDD545C59321:DD1854A3284437EB]:0)
	at org.apache.solr.SolrTestCaseHS.matchJSON(SolrTestCaseHS.java:161)
	at org.apache.solr.SolrTestCaseHS.assertJQ(SolrTestCaseHS.java:143)
	at org.apache.solr.SolrTestCaseHS$Client$Tester.assertJQ(SolrTestCaseHS.java:255)
	at org.apache.solr.SolrTestCaseHS$Client.testJQ(SolrTestCaseHS.java:296)
	at org.apache.solr.search.facet.TestJsonFacets.doStatsTemplated(TestJsonFacets.java:1152)
	at org.apache.solr.search.facet.TestJsonFacets.doStats(TestJsonFacets.java:361)
	at org.apache.solr.search.facet.TestJsonFacets.testStatsDistrib(TestJsonFacets.java:322)
	at sun.reflect.NativeMethodAccessorImpl.invoke0(Native Method)
	at sun.reflect.NativeMethodAccessorImpl.invoke(NativeMethodAccessorImpl.java:62)
	at sun.reflect.DelegatingMethodAccessorImpl.invoke(DelegatingMethodAccessorImpl.java:43)
	at java.lang.reflect.Method.invoke(Method.java:498)
	at com.carrotsearch.randomizedtesting.RandomizedRunner.invoke(RandomizedRunner.java:1713)
	at com.carrotsearch.randomizedtesting.RandomizedRunner$8.evaluate(RandomizedRunner.java:907)
	at com.carrotsearch.randomizedtesting.RandomizedRunner$9.evaluate(RandomizedRunner.java:943)
	at com.carrotsearch.randomizedtesting.RandomizedRunner$10.evaluate(RandomizedRunner.java:957)
	at com.carrotsearch.randomizedtesting.rules.SystemPropertiesRestoreRule$1.evaluate(SystemPropertiesRestoreRule.java:57)
	at org.apache.lucene.util.TestRuleSetupTeardownChained$1.evaluate(TestRuleSetupTeardownChained.java:49)
	at org.apache.lucene.util.AbstractBeforeAfterRule$1.evaluate(AbstractBeforeAfterRule.java:45)
	at org.apache.lucene.util.TestRuleThreadAndTestName$1.evaluate(TestRuleThreadAndTestName.java:48)
	at org.apache.lucene.util.TestRuleIgnoreAfterMaxFailures$1.evaluate(TestRuleIgnoreAfterMaxFailures.java:64)
	at org.apache.lucene.util.TestRuleMarkFailure$1.evaluate(TestRuleMarkFailure.java:47)
	at com.carrotsearch.randomizedtesting.rules.StatementAdapter.evaluate(StatementAdapter.java:36)
	at com.carrotsearch.randomizedtesting.ThreadLeakControl$StatementRunner.run(ThreadLeakControl.java:367)
	at com.carrotsearch.randomizedtesting.ThreadLeakControl.forkTimeoutingTask(ThreadLeakControl.java:811)
	at com.carrotsearch.randomizedtesting.ThreadLeakControl$3.evaluate(ThreadLeakControl.java:462)
	at com.carrotsearch.randomizedtesting.RandomizedRunner.runSingleTest(RandomizedRunner.java:916)
	at com.carrotsearch.randomizedtesting.RandomizedRunner$5.evaluate(RandomizedRunner.java:802)
	at com.carrotsearch.randomizedtesting.RandomizedRunner$6.evaluate(RandomizedRunner.java:852)
	at com.carrotsearch.randomizedtesting.RandomizedRunner$7.evaluate(RandomizedRunner.java:863)
	at com.carrotsearch.randomizedtesting.rules.StatementAdapter.evaluate(StatementAdapter.java:36)
	at com.carrotsearch.randomizedtesting.rules.SystemPropertiesRestoreRule$1.evaluate(SystemPropertiesRestoreRule.java:57)
	at org.apache.lucene.util.AbstractBeforeAfterRule$1.evaluate(AbstractBeforeAfterRule.java:45)
	at com.carrotsearch.randomizedtesting.rules.StatementAdapter.evaluate(StatementAdapter.java:36)
	at org.apache.lucene.util.TestRuleStoreClassName$1.evaluate(TestRuleStoreClassName.java:41)
	at com.carrotsearch.randomizedtesting.rules.NoShadowingOrOverridesOnMethodsRule$1.evaluate(NoShadowingOrOverridesOnMethodsRule.java:40)
	at com.carrotsearch.randomizedtesting.rules.NoShadowingOrOverridesOnMethodsRule$1.evaluate(NoShadowingOrOverridesOnMethodsRule.java:40)
	at com.carrotsearch.randomizedtesting.rules.StatementAdapter.evaluate(StatementAdapter.java:36)
	at com.carrotsearch.randomizedtesting.rules.StatementAdapter.evaluate(StatementAdapter.java:36)
	at com.carrotsearch.randomizedtesting.rules.StatementAdapter.evaluate(StatementAdapter.java:36)
	at org.apache.lucene.util.TestRuleAssertionsRequired$1.evaluate(TestRuleAssertionsRequired.java:53)
	at org.apache.lucene.util.TestRuleMarkFailure$1.evaluate(TestRuleMarkFailure.java:47)
	at org.apache.lucene.util.TestRuleIgnoreAfterMaxFailures$1.evaluate(TestRuleIgnoreAfterMaxFailures.java:64)
	at org.apache.lucene.util.TestRuleIgnoreTestSuites$1.evaluate(TestRuleIgnoreTestSuites.java:54)
	at com.carrotsearch.randomizedtesting.rules.StatementAdapter.evaluate(StatementAdapter.java:36)
	at com.carrotsearch.randomizedtesting.ThreadLeakControl$StatementRunner.run(ThreadLeakControl.java:367)
	at java.lang.Thread.run(Thread.java:745)


FAILED:  org.apache.solr.uninverting.TestFieldCacheVsDocValues.testIntMissingVsFieldCache

Error Message:
Test abandoned because suite timeout was reached.

Stack Trace:
java.lang.Exception: Test abandoned because suite timeout was reached.
	at __randomizedtesting.SeedInfo.seed([1D8FDD545C59321]:0)




Build Log:
[...truncated 10820 lines...]
   [junit4] Suite: org.apache.solr.search.facet.TestJsonFacets
   [junit4]   2> Creating dataDir: /home/jenkins/workspace/Lucene-Solr-6.x-Linux/solr/build/solr-core/test/J1/temp/solr.search.facet.TestJsonFacets_1D8FDD545C59321-001/init-core-data-001
   [junit4]   2> 66738 INFO  (SUITE-TestJsonFacets-seed#[1D8FDD545C59321]-worker) [    ] o.a.s.SolrTestCaseJ4 Randomized ssl (false) and clientAuth (false) via: @org.apache.solr.SolrTestCaseJ4$SuppressSSL(bugUrl=None)
   [junit4]   2> 66752 INFO  (SUITE-TestJsonFacets-seed#[1D8FDD545C59321]-worker) [    ] o.a.s.SolrTestCaseJ4 ####initCore
   [junit4]   2> 66752 INFO  (SUITE-TestJsonFacets-seed#[1D8FDD545C59321]-worker) [    ] o.a.s.c.SolrResourceLoader [null] Added 2 libs to classloader, from paths: [/home/jenkins/workspace/Lucene-Solr-6.x-Linux/solr/core/src/test-files/solr/collection1/lib, /home/jenkins/workspace/Lucene-Solr-6.x-Linux/solr/core/src/test-files/solr/collection1/lib/classes]
   [junit4]   2> 66804 WARN  (SUITE-TestJsonFacets-seed#[1D8FDD545C59321]-worker) [    ] o.a.s.c.Config Beginning with Solr 5.5, <mergePolicy> is deprecated, use <mergePolicyFactory> instead.
   [junit4]   2> 66805 INFO  (SUITE-TestJsonFacets-seed#[1D8FDD545C59321]-worker) [    ] o.a.s.c.SolrConfig Using Lucene MatchVersion: 6.3.0
   [junit4]   2> 66845 INFO  (SUITE-TestJsonFacets-seed#[1D8FDD545C59321]-worker) [    ] o.a.s.s.IndexSchema [null] Schema name=example
   [junit4]   2> 66945 INFO  (SUITE-TestJsonFacets-seed#[1D8FDD545C59321]-worker) [    ] o.a.s.s.IndexSchema Loaded schema example/1.6 with uniqueid field id
   [junit4]   2> 66970 INFO  (SUITE-TestJsonFacets-seed#[1D8FDD545C59321]-worker) [    ] o.a.s.u.UpdateShardHandler Creating UpdateShardHandler HTTP client with params: socketTimeout=30000&connTimeout=30000&retry=true
   [junit4]   2> 66973 INFO  (coreLoadExecutor-212-thread-1) [    ] o.a.s.c.SolrResourceLoader [null] Added 2 libs to classloader, from paths: [/home/jenkins/workspace/Lucene-Solr-6.x-Linux/solr/core/src/test-files/solr/collection1/lib, /home/jenkins/workspace/Lucene-Solr-6.x-Linux/solr/core/src/test-files/solr/collection1/lib/classes]
   [junit4]   2> 67029 WARN  (coreLoadExecutor-212-thread-1) [    ] o.a.s.c.Config Beginning with Solr 5.5, <mergePolicy> is deprecated, use <mergePolicyFactory> instead.
   [junit4]   2> 67031 INFO  (coreLoadExecutor-212-thread-1) [    ] o.a.s.c.SolrConfig Using Lucene MatchVersion: 6.3.0
   [junit4]   2> 67079 INFO  (coreLoadExecutor-212-thread-1) [    ] o.a.s.s.IndexSchema [collection1] Schema name=example
   [junit4]   2> 67193 INFO  (coreLoadExecutor-212-thread-1) [    ] o.a.s.s.IndexSchema Loaded schema example/1.6 with uniqueid field id
   [junit4]   2> 67210 INFO  (coreLoadExecutor-212-thread-1) [    ] o.a.s.c.CoreContainer Creating SolrCore 'collection1' using configuration from instancedir /home/jenkins/workspace/Lucene-Solr-6.x-Linux/solr/core/src/test-files/solr/collection1
   [junit4]   2> 67210 INFO  (coreLoadExecutor-212-thread-1) [    x:collection1] o.a.s.c.SolrCore [[collection1] ] Opening new SolrCore at [/home/jenkins/workspace/Lucene-Solr-6.x-Linux/solr/core/src/test-files/solr/collection1], dataDir=[/home/jenkins/workspace/Lucene-Solr-6.x-Linux/solr/build/solr-core/test/J1/temp/solr.search.facet.TestJsonFacets_1D8FDD545C59321-001/init-core-data-001/]
   [junit4]   2> 67210 INFO  (coreLoadExecutor-212-thread-1) [    x:collection1] o.a.s.c.JmxMonitoredMap JMX monitoring is enabled. Adding Solr mbeans to JMX Server: com.sun.jmx.mbeanserver.JmxMBeanServer@abc02f
   [junit4]   2> 67212 INFO  (coreLoadExecutor-212-thread-1) [    x:collection1] o.a.s.u.RandomMergePolicy RandomMergePolicy wrapping class org.apache.lucene.index.LogByteSizeMergePolicy: [LogByteSizeMergePolicy: minMergeSize=1677721, mergeFactor=40, maxMergeSize=2147483648, maxMergeSizeForForcedMerge=9223372036854775807, calibrateSizeByDeletes=true, maxMergeDocs=2147483647, maxCFSSegmentSizeMB=8.796093022207999E12, noCFSRatio=0.0]
   [junit4]   2> 67219 WARN  (coreLoadExecutor-212-thread-1) [    x:collection1] o.a.s.c.RequestHandlers INVALID paramSet a in requestHandler {type = requestHandler,name = /dump,class = DumpRequestHandler,args = {defaults={a=A,b=B}}}
   [junit4]   2> 67234 INFO  (coreLoadExecutor-212-thread-1) [    x:collection1] o.a.s.u.UpdateHandler Using UpdateLog implementation: org.apache.solr.update.UpdateLog
   [junit4]   2> 67234 INFO  (coreLoadExecutor-212-thread-1) [    x:collection1] o.a.s.u.UpdateLog Initializing UpdateLog: dataDir= defaultSyncLevel=FLUSH numRecordsToKeep=100 maxNumLogsToKeep=10 numVersionBuckets=65536
   [junit4]   2> 67241 INFO  (coreLoadExecutor-212-thread-1) [    x:collection1] o.a.s.u.CommitTracker Hard AutoCommit: disabled
   [junit4]   2> 67241 INFO  (coreLoadExecutor-212-thread-1) [    x:collection1] o.a.s.u.CommitTracker Soft AutoCommit: disabled
   [junit4]   2> 67241 INFO  (coreLoadExecutor-212-thread-1) [    x:collection1] o.a.s.u.RandomMergePolicy RandomMergePolicy wrapping class org.apache.lucene.index.TieredMergePolicy: [TieredMergePolicy: maxMergeAtOnce=31, maxMergeAtOnceExplicit=13, maxMergedSegmentMB=63.0166015625, floorSegmentMB=0.3974609375, forceMergeDeletesPctAllowed=15.321469531256579, segmentsPerTier=10.0, maxCFSSegmentSizeMB=8.796093022207999E12, noCFSRatio=0.12377787797066225
   [junit4]   2> 67242 INFO  (coreLoadExecutor-212-thread-1) [    x:collection1] o.a.s.s.SolrIndexSearcher Opening [Searcher@2b3ea7[collection1] main]
   [junit4]   2> 67242 WARN  (coreLoadExecutor-212-thread-1) [    x:collection1] o.a.s.r.ManagedResourceStorage Cannot write to config directory /home/jenkins/workspace/Lucene-Solr-6.x-Linux/solr/core/src/test-files/solr/collection1/conf; switching to use InMemory storage instead.
   [junit4]   2> 67243 INFO  (coreLoadExecutor-212-thread-1) [    x:collection1] o.a.s.h.ReplicationHandler Commits will be reserved for  10000
   [junit4]   2> 67245 INFO  (searcherExecutor-213-thread-1-processing-x:collection1) [    x:collection1] o.a.s.c.SolrCore [collection1] Registered new searcher Searcher@2b3ea7[collection1] main{ExitableDirectoryReader(UninvertingDirectoryReader())}
   [junit4]   2> 67246 INFO  (coreLoadExecutor-212-thread-1) [    x:collection1] o.a.s.u.UpdateLog Could not find max version in index or recent updates, using new clock 1549281022330273792
   [junit4]   2> 67250 INFO  (SUITE-TestJsonFacets-seed#[1D8FDD545C59321]-worker) [    ] o.a.s.SolrTestCaseJ4 ####initCore end
   [junit4]   2> 67253 INFO  (TEST-TestJsonFacets.testStats-seed#[1D8FDD545C59321]) [    ] o.a.s.SolrTestCaseJ4 ###Starting testStats {p0=SMART}
   [junit4]   2> 67257 INFO  (TEST-TestJsonFacets.testStats-seed#[1D8FDD545C59321]) [    ] o.a.s.u.p.LogUpdateProcessorFactory [collection1]  webapp=null path=null params={}{deleteByQuery=*:* (-1549281022339710976)} 0 2
   [junit4]   2> 67268 INFO  (TEST-TestJsonFacets.testStats-seed#[1D8FDD545C59321]) [    ] o.a.s.u.p.LogUpdateProcessorFactory [collection1]  webapp=null path=null params={versions=true&wt=json&indent=true}{add=[1 (1549281022351245312)]} 0 8
   [junit4]   2> 67269 INFO  (TEST-TestJsonFacets.testStats-seed#[1D8FDD545C59321]) [    ] o.a.s.u.p.LogUpdateProcessorFactory [collection1]  webapp=null path=null params={versions=true&wt=json&indent=true}{add=[1 (1549281022353342464)]} 0 0
   [junit4]   2> 67270 INFO  (TEST-TestJsonFacets.testStats-seed#[1D8FDD545C59321]) [    ] o.a.s.u.p.LogUpdateProcessorFactory [collection1]  webapp=null path=null params={versions=true&wt=json&indent=true}{add=[1 (1549281022355439616)]} 0 0
   [junit4]   2> 67272 INFO  (TEST-TestJsonFacets.testStats-seed#[1D8FDD545C59321]) [    ] o.a.s.u.p.LogUpdateProcessorFactory [collection1]  webapp=null path=null params={versions=true&wt=json&indent=true}{add=[2 (1549281022356488192)]} 0 1
   [junit4]   2> 67272 INFO  (TEST-TestJsonFacets.testStats-seed#[1D8FDD545C59321]) [    ] o.a.s.u.p.LogUpdateProcessorFactory [collection1]  webapp=null path=null params={versions=true&wt=json&indent=true}{add=[3 (1549281022357536768)]} 0 0
   [junit4]   2> 67273 INFO  (TEST-TestJsonFacets.testStats-seed#[1D8FDD545C59321]) [    ] o.a.s.u.DirectUpdateHandler2 start commit{,optimize=false,openSearcher=true,waitSearcher=true,expungeDeletes=false,softCommit=false,prepareCommit=false}
   [junit4]   2> 67273 INFO  (TEST-TestJsonFacets.testStats-seed#[1D8FDD545C59321]) [    ] o.a.s.u.SolrIndexWriter Calling setCommitData with IW:org.apache.solr.update.SolrIndexWriter@1165f2c
   [junit4]   2> 67280 INFO  (TEST-TestJsonFacets.testStats-seed#[1D8FDD545C59321]) [    ] o.a.s.s.SolrIndexSearcher Opening [Searcher@194a5e8[collection1] main]
   [junit4]   2> 67281 INFO  (TEST-TestJsonFacets.testStats-seed#[1D8FDD545C59321]) [    ] o.a.s.u.DirectUpdateHandler2 end_commit_flush
   [junit4]   2> 67285 INFO  (searcherExecutor-213-thread-1) [    ] o.a.s.c.SolrCore [collection1] Registered new searcher Searcher@194a5e8[collection1] main{ExitableDirectoryReader(UninvertingDirectoryReader(Uninverting(_0(6.3.0):C5/2:delGen=1)))}
   [junit4]   2> 67286 INFO  (TEST-TestJsonFacets.testStats-seed#[1D8FDD545C59321]) [    ] o.a.s.u.p.LogUpdateProcessorFactory [collection1]  webapp=null path=null params={}{commit=} 0 13
   [junit4]   2> 67290 INFO  (TEST-TestJsonFacets.testStats-seed#[1D8FDD545C59321]) [    ] o.a.s.u.p.LogUpdateProcessorFactory [collection1]  webapp=null path=null params={versions=true&wt=json&indent=true}{add=[4 (1549281022373265408)]} 0 3
   [junit4]   2> 67291 INFO  (TEST-TestJsonFacets.testStats-seed#[1D8FDD545C59321]) [    ] o.a.s.u.p.LogUpdateProcessorFactory [collection1]  webapp=null path=null params={versions=true&wt=json&indent=true}{add=[5 (1549281022376411136)]} 0 0
   [junit4]   2> 67291 INFO  (TEST-TestJsonFacets.testStats-seed#[1D8FDD545C59321]) [    ] o.a.s.u.DirectUpdateHandler2 start commit{,optimize=false,openSearcher=true,waitSearcher=true,expungeDeletes=false,softCommit=false,prepareCommit=false}
   [junit4]   2> 67291 INFO  (TEST-TestJsonFacets.testStats-seed#[1D8FDD545C59321]) [    ] o.a.s.u.SolrIndexWriter Calling setCommitData with IW:org.apache.solr.update.SolrIndexWriter@1165f2c
   [junit4]   2> 67298 INFO  (TEST-TestJsonFacets.testStats-seed#[1D8FDD545C59321]) [    ] o.a.s.s.SolrIndexSearcher Opening [Searcher@14a08cc[collection1] main]
   [junit4]   2> 67298 INFO  (TEST-TestJsonFacets.testStats-seed#[1D8FDD545C59321]) [    ] o.a.s.u.DirectUpdateHandler2 end_commit_flush
   [junit4]   2> 67302 INFO  (searcherExecutor-213-thread-1) [    ] o.a.s.c.SolrCore [collection1] Registered new searcher Searcher@14a08cc[collection1] main{ExitableDirectoryReader(UninvertingDirectoryReader(Uninverting(_0(6.3.0):C5/2:delGen=1) Uninverting(_1(6.3.0):C2)))}
   [junit4]   2> 67303 INFO  (TEST-TestJsonFacets.testStats-seed#[1D8FDD545C59321]) [    ] o.a.s.u.p.LogUpdateProcessorFactory [collection1]  webapp=null path=null params={}{commit=} 0 11
   [junit4]   2> 67306 INFO  (TEST-TestJsonFacets.testStats-seed#[1D8FDD545C59321]) [    ] o.a.s.u.p.LogUpdateProcessorFactory [collection1]  webapp=null path=null params={versions=true&wt=json&indent=true}{add=[6 (1549281022391091200)]} 0 1
   [junit4]   2> 67306 INFO  (TEST-TestJsonFacets.testStats-seed#[1D8FDD545C59321]) [    ] o.a.s.u.DirectUpdateHandler2 start commit{,optimize=false,openSearcher=true,waitSearcher=true,expungeDeletes=false,softCommit=false,prepareCommit=false}
   [junit4]   2> 67306 INFO  (TEST-TestJsonFacets.testStats-seed#[1D8FDD545C59321]) [    ] o.a.s.u.SolrIndexWriter Calling setCommitData with IW:org.apache.solr.update.SolrIndexWriter@1165f2c
   [junit4]   2> 67311 INFO  (TEST-TestJsonFacets.testStats-seed#[1D8FDD545C59321]) [    ] o.a.s.s.SolrIndexSearcher Opening [Searcher@1d8788c[collection1] main]
   [junit4]   2> 67312 INFO  (TEST-TestJsonFacets.testStats-seed#[1D8FDD545C59321]) [    ] o.a.s.u.DirectUpdateHandler2 end_commit_flush
   [junit4]   2> 67315 INFO  (searcherExecutor-213-thread-1) [    ] o.a.s.c.SolrCore [collection1] Registered new searcher Searcher@1d8788c[collection1] main{ExitableDirectoryReader(UninvertingDirectoryReader(Uninverting(_0(6.3.0):C5/2:delGen=1) Uninverting(_1(6.3.0):C2) Uninverting(_2(6.3.0):C1)))}
   [junit4]   2> 67316 INFO  (TEST-TestJsonFacets.testStats-seed#[1D8FDD545C59321]) [    ] o.a.s.u.p.LogUpdateProcessorFactory [collection1]  webapp=null path=null params={}{commit=} 0 9
   [junit4]   2> 67329 INFO  (TEST-TestJsonFacets.testStats-seed#[1D8FDD545C59321]) [    ] o.a.s.c.S.Request [collection1]  webapp=null path=null params={debugQuery=true&rows=0&noexist=noexist_s&cat_s=cat_s&where_s=where_s&num_d=num_d&num_i=num_i&super_s=super_s&val_b=val_b&date=date_dt&sparse_s=sparse_s&multi_ss=multi_ss&Z_num_i=Z_num_i&num_is=num_is&num_fs=num_fs&q=*:*&json.facet={catA:{query:{q:'${cat_s}:A'}},++catA2:{query:{query:'${cat_s}:A'}},++catA3:{query:'${cat_s}:A'}++++}&wt=json&indent=true} hits=6 status=0 QTime=12
   [junit4]   2> 67332 INFO  (TEST-TestJsonFacets.testStats-seed#[1D8FDD545C59321]) [    ] o.a.s.c.S.Request [collection1]  webapp=null path=null params={debugQuery=false&rows=0&noexist=noexist_s&cat_s=cat_s&where_s=where_s&num_d=num_d&num_i=num_i&super_s=super_s&val_b=val_b&date=date_dt&sparse_s=sparse_s&multi_ss=multi_ss&Z_num_i=Z_num_i&num_is=num_is&num_fs=num_fs&q=*:*&json.facet={catA:{query:{q:'${cat_s}:A'}},++catA2:{query:{query:'${cat_s}:A'}},++catA3:{query:'${cat_s}:A'}++++}&wt=json&indent=true} hits=6 status=0 QTime=0
   [junit4]   2> 67333 INFO  (TEST-TestJsonFacets.testStats-seed#[1D8FDD545C59321]) [    ] o.a.s.c.S.Request [collection1]  webapp=null path=null params={debugQuery=false&rows=0&noexist=noexist_s&cat_s=cat_s&where_s=where_s&num_d=num_d&num_i=num_i&super_s=super_s&val_b=val_b&date=date_dt&sparse_s=sparse_s&multi_ss=multi_ss&Z_num_i=Z_num_i&num_is=num_is&num_fs=num_fs&q=*:*&json.facet={+catB:{type:query,+q:'${cat_s}:B',+facet:{nj:{query:'${where_s}:NJ'},+ny:{query:'${where_s}:NY'}}+}}&wt=json&indent=true} hits=6 status=0 QTime=1
   [junit4]   2> 67335 INFO  (TEST-TestJsonFacets.testStats-seed#[1D8FDD545C59321]) [    ] o.a.s.c.S.Request [collection1]  webapp=null path=null params={debugQuery=false&rows=0&noexist=noexist_s&cat_s=cat_s&where_s=where_s&num_d=num_d&num_i=num_i&super_s=super_s&val_b=val_b&date=date_dt&sparse_s=sparse_s&multi_ss=multi_ss&Z_num_i=Z_num_i&num_is=num_is&num_fs=num_fs&q=id:(2+3)&json.facet={+catB:{query:{q:'${cat_s}:B',+facet:{nj:{query:'${where_s}:NJ'},+ny:{query:'${where_s}:NY'}}+}}}&wt=json&indent=true} hits=2 status=0 QTime=1
   [junit4]   2> 67336 INFO  (TEST-TestJsonFacets.testStats-seed#[1D8FDD545C59321]) [    ] o.a.s.c.S.Request [collection1]  webapp=null path=null params={debugQuery=false&rows=0&noexist=noexist_s&cat_s=cat_s&where_s=where_s&num_d=num_d&num_i=num_i&super_s=super_s&val_b=val_b&date=date_dt&sparse_s=sparse_s&multi_ss=multi_ss&Z_num_i=Z_num_i&num_is=num_is&num_fs=num_fs&q=*:*&json.facet={+catB:{query:{q:'${cat_s}:B',+facet:{nj:{query:{q:'${where_s}:NJ'}},+ny:{query:'${where_s}:NY'}}+}}}&wt=json&indent=true} hits=6 status=0 QTime=1
   [junit4]   2> 67364 INFO  (TEST-TestJsonFacets.testStats-seed#[1D8FDD545C59321]) [    ] o.a.s.c.S.Request [collection1]  webapp=null path=null params={debugQuery=false&rows=0&noexist=noexist_s&cat_s=cat_s&where_s=where_s&num_d=num_d&num_i=num_i&super_s=super_s&val_b=val_b&date=date_dt&sparse_s=sparse_s&multi_ss=multi_ss&Z_num_i=Z_num_i&num_is=num_is&num_fs=num_fs&q=*:*&json.facet={c1:{field:'${cat_s}'},+c2:{field:{field:'${cat_s}'}},+c3:{${terms}+type:terms,+field:'${cat_s}'}++}&wt=json&indent=true} hits=6 status=0 QTime=27
   [junit4]   2> 67365 INFO  (TEST-TestJsonFacets.testStats-seed#[1D8FDD545C59321]) [    ] o.a.s.c.S.Request [collection1]  webapp=null path=null params={debugQuery=false&rows=0&noexist=noexist_s&cat_s=cat_s&where_s=where_s&num_d=num_d&num_i=num_i&super_s=super_s&val_b=val_b&date=date_dt&sparse_s=sparse_s&multi_ss=multi_ss&Z_num_i=Z_num_i&num_is=num_is&num_fs=num_fs&q=*:*&json.facet={f1:{terms:{${terms}+field:'${cat_s}',+mincount:3}}}&wt=json&indent=true} hits=6 status=0 QTime=0
   [junit4]   2> 67366 INFO  (TEST-TestJsonFacets.testStats-seed#[1D8FDD545C59321]) [    ] o.a.s.c.S.Request [collection1]  webapp=null path=null params={debugQuery=false&rows=0&noexist=noexist_s&cat_s=cat_s&where_s=where_s&num_d=num_d&num_i=num_i&super_s=super_s&val_b=val_b&date=date_dt&sparse_s=sparse_s&multi_ss=multi_ss&Z_num_i=Z_num_i&num_is=num_is&num_fs=num_fs&q=id:1&json.facet={f1:{terms:'${cat_s}'}}&wt=json&indent=true} hits=1 status=0 QTime=0
   [junit4]   2> 67366 INFO  (TEST-TestJsonFacets.testStats-seed#[1D8FDD545C59321]) [    ] o.a.s.c.S.Request [collection1]  webapp=null path=null params={debugQuery=false&rows=0&noexist=noexist_s&cat_s=cat_s&where_s=where_s&num_d=num_d&num_i=num_i&super_s=super_s&val_b=val_b&date=date_dt&sparse_s=sparse_s&multi_ss=multi_ss&Z_num_i=Z_num_i&num_is=num_is&num_fs=num_fs&q=id:1&json.facet={processEmpty:true,+f1:{terms:{${terms}+field:'${cat_s}',+mincount:0}}}&wt=json&indent=true} hits=1 status=0 QTime=0
   [junit4]   2> 67380 INFO  (TEST-TestJsonFacets.testStats-seed#[1D8FDD545C59321]) [    ] o.a.s.c.S.Request [collection1]  webapp=null path=null params={debugQuery=false&rows=0&noexist=noexist_s&cat_s=cat_s&where_s=where_s&num_d=num_d&num_i=num_i&super_s=super_s&val_b=val_b&date=date_dt&sparse_s=sparse_s&multi_ss=multi_ss&Z_num_i=Z_num_i&num_is=num_is&num_fs=num_fs&q=id:1&json.facet={processEmpty:true,+f1:{terms:{${terms}+field:'${cat_s}',+mincount:0,+allBuckets:true,+facet:{n1:'sum(${num_d})'}++}}}&wt=json&indent=true} hits=1 status=0 QTime=13
   [junit4]   2> 67381 INFO  (TEST-TestJsonFacets.testStats-seed#[1D8FDD545C59321]) [    ] o.a.s.c.S.Request [collection1]  webapp=null path=null params={debugQuery=false&rows=0&noexist=noexist_s&cat_s=cat_s&where_s=where_s&num_d=num_d&num_i=num_i&super_s=super_s&val_b=val_b&date=date_dt&sparse_s=sparse_s&multi_ss=multi_ss&Z_num_i=Z_num_i&num_is=num_is&num_fs=num_fs&q=*:*&json.facet={f1:{terms:{${terms}+field:'${cat_s}',+sort:'n1+desc',+facet:{n1:'sum(${num_d})'}++}}+,+f2:{terms:{${terms}+field:'${cat_s}',+sort:'n1+asc',+facet:{n1:'sum(${num_d})'}++}}+}&wt=json&indent=true} hits=6 status=0 QTime=0
   [junit4]   2> 67393 INFO  (TEST-TestJsonFacets.testStats-seed#[1D8FDD545C59321]) [    ] o.a.s.c.S.Request [collection1]  webapp=null path=null params={debugQuery=false&rows=0&noexist=noexist_s&cat_s=cat_s&where_s=where_s&num_d=num_d&num_i=num_i&super_s=super_s&val_b=val_b&date=date_dt&sparse_s=sparse_s&multi_ss=multi_ss&Z_num_i=Z_num_i&num_is=num_is&num_fs=num_fs&q=*:*&json.facet={f1:{${terms}+type:terms,+field:'${cat_s}',+sort:'x+desc',+facet:{x:'min(${num_d})'}++}+,+f2:{${terms}+type:terms,+field:'${cat_s}',+sort:'x+desc',+facet:{x:'max(${num_d})'}++}++,+f3:{${terms}+type:terms,+field:'${cat_s}',+sort:'x+desc',+facet:{x:'unique(${where_s})'}++}++,+f4:{${terms}+type:terms,+field:'${cat_s}',+sort:'x+desc',+facet:{x:'hll(${where_s})'}++}+}&wt=json&indent=true} hits=6 status=0 QTime=11
   [junit4]   2> 67396 INFO  (TEST-TestJsonFacets.testStats-seed#[1D8FDD545C59321]) [    ] o.a.s.c.S.Request [collection1]  webapp=null path=null params={debugQuery=false&rows=0&noexist=noexist_s&cat_s=cat_s&where_s=where_s&num_d=num_d&num_i=num_i&super_s=super_s&val_b=val_b&date=date_dt&sparse_s=sparse_s&multi_ss=multi_ss&Z_num_i=Z_num_i&num_is=num_is&num_fs=num_fs&q=*:*&json.facet={f1:{terms:{${terms}+field:'${cat_s}',+sort:'n1+desc',+facet:{n1:'avg(add(${num_d},${num_d}))'}++}}+,+f2:{terms:{${terms}+field:'${cat_s}',+sort:'n1+asc',+facet:{n1:'avg(add(${num_d},${num_d}))'}++}}+}&wt=json&indent=true} hits=6 status=0 QTime=2
   [junit4]   2> 67407 INFO  (TEST-TestJsonFacets.testStats-seed#[1D8FDD545C59321]) [    ] o.a.s.c.S.Request [collection1]  webapp=null path=null params={debugQuery=false&rows=0&noexist=noexist_s&cat_s=cat_s&where_s=where_s&num_d=num_d&num_i=num_i&super_s=super_s&val_b=val_b&date=date_dt&sparse_s=sparse_s&multi_ss=multi_ss&Z_num_i=Z_num_i&num_is=num_is&num_fs=num_fs&q=*:*&json.facet={f1:{terms:{${terms}+field:'${cat_s}',+sort:'n1+desc',+facet:{n1:'percentile(${num_d},50)'}++}}+,+f2:{terms:{${terms}+field:'${cat_s}',+sort:'n1+asc',+facet:{n1:'percentile(${num_d},50)'}++}}+}&wt=json&indent=true} hits=6 status=0 QTime=9
   [junit4]   2> 67408 INFO  (TEST-TestJsonFacets.testStats-seed#[1D8FDD545C59321]) [    ] o.a.s.c.S.Request [collection1]  webapp=null path=null params={debugQuery=false&rows=0&noexist=noexist_s&cat_s=cat_s&where_s=where_s&num_d=num_d&num_i=num_i&super_s=super_s&val_b=val_b&date=date_dt&sparse_s=sparse_s&multi_ss=multi_ss&Z_num_i=Z_num_i&num_is=num_is&num_fs=num_fs&q=*:*&json.facet={f1:{terms:{${terms}+field:${cat_s},+sort:'n1+desc',+facet:{n1:'percentile(${num_d},50,0,100)'}++}}+,+f2:{terms:{${terms}+field:${cat_s},+sort:'n1+asc',+facet:{n1:'percentile(${num_d},50,0,100)'}++}}+}&wt=json&indent=true} hits=6 status=0 QTime=1
   [junit4]   2> 67409 INFO  (TEST-TestJsonFacets.testStats-seed#[1D8FDD545C59321]) [    ] o.a.s.c.S.Request [collection1]  webapp=null path=null params={debugQuery=false&rows=0&noexist=noexist_s&cat_s=cat_s&where_s=where_s&num_d=num_d&num_i=num_i&super_s=super_s&val_b=val_b&date=date_dt&sparse_s=sparse_s&multi_ss=multi_ss&Z_num_i=Z_num_i&num_is=num_is&num_fs=num_fs&q=*:*&json.facet={f1:{terms:{${terms}+field:'${cat_s}',+sort:'count+desc'+}++}+++++++++++,+f2:{terms:{${terms}+field:'${cat_s}',+sort:'count+asc'++}++}+++++++++++,+f3:{terms:{${terms}+field:'${cat_s}',+sort:'index+asc'++}++}+++++++++++,+f4:{terms:{${terms}+field:'${cat_s}',+sort:'index+desc'+}++}}&wt=json&indent=true} hits=6 status=0 QTime=0
   [junit4]   2> 67410 INFO  (TEST-TestJsonFacets.testStats-seed#[1D8FDD545C59321]) [    ] o.a.s.c.S.Request [collection1]  webapp=null path=null params={debugQuery=false&rows=0&noexist=noexist_s&cat_s=cat_s&where_s=where_s&num_d=num_d&num_i=num_i&super_s=super_s&val_b=val_b&date=date_dt&sparse_s=sparse_s&multi_ss=multi_ss&Z_num_i=Z_num_i&num_is=num_is&num_fs=num_fs&q=*:*&json.facet={f1:{terms:{${terms}+field:'${cat_s}',+sort:'count'+}++}+++++++++++,+f2:{terms:{${terms}+field:'${cat_s}',+sort:'count+asc'++}++}+++++++++++,+f3:{terms:{${terms}+field:'${cat_s}',+sort:'index'++}++}+++++++++++,+f4:{terms:{${terms}+field:'${cat_s}',+sort:'index+desc'+}++}}&wt=json&indent=true} hits=6 status=0 QTime=0
   [junit4]   2> 67412 INFO  (TEST-TestJsonFacets.testStats-seed#[1D8FDD545C59321]) [    ] o.a.s.c.S.Request [collection1]  webapp=null path=null params={debugQuery=false&rows=0&noexist=noexist_s&cat_s=cat_s&where_s=where_s&num_d=num_d&num_i=num_i&super_s=super_s&val_b=val_b&date=date_dt&sparse_s=sparse_s&multi_ss=multi_ss&Z_num_i=Z_num_i&num_is=num_is&num_fs=num_fs&q=id:1+id:6&json.facet={f1:{terms:{${terms}+field:'${cat_s}',+sort:'count+desc'+}++}+++++++++++,+f2:{terms:{${terms}+field:'${cat_s}',+sort:'count+asc'++}++}}&wt=json&indent=true} hits=2 status=0 QTime=1
   [junit4]   2> 67413 INFO  (TEST-TestJsonFacets.testStats-seed#[1D8FDD545C59321]) [    ] o.a.s.c.S.Request [collection1]  webapp=null path=null params={debugQuery=false&rows=0&noexist=noexist_s&cat_s=cat_s&where_s=where_s&num_d=num_d&num_i=num_i&super_s=super_s&val_b=val_b&date=date_dt&sparse_s=sparse_s&multi_ss=multi_ss&Z_num_i=Z_num_i&num_is=num_is&num_fs=num_fs&q=*:*&json.facet={cat:{terms:{${terms}+field:'${cat_s}',+facet:{nj:{query:'${where_s}:NJ'}}++++}+++}}+}&wt=json&indent=true} hits=6 status=0 QTime=0
   [junit4]   2> 67414 INFO  (TEST-TestJsonFacets.testStats-seed#[1D8FDD545C59321]) [    ] o.a.s.c.S.Request [collection1]  webapp=null path=null params={debugQuery=false&rows=0&noexist=noexist_s&cat_s=cat_s&where_s=where_s&num_d=num_d&num_i=num_i&super_s=super_s&val_b=val_b&date=date_dt&sparse_s=sparse_s&multi_ss=multi_ss&Z_num_i=Z_num_i&num_is=num_is&num_fs=num_fs&q=id:(2+5+4)&json.facet={cat:{terms:{${terms}+field:'${cat_s}',+facet:{nj:{query:'${where_s}:NJ'}}++++}+++}}+}&wt=json&indent=true} hits=3 status=0 QTime=0
   [junit4]   2> 67415 INFO  (TEST-TestJsonFacets.testStats-seed#[1D8FDD545C59321]) [    ] o.a.s.c.S.Request [collection1]  webapp=null path=null params={debugQuery=false&rows=0&noexist=noexist_s&cat_s=cat_s&where_s=where_s&num_d=num_d&num_i=num_i&super_s=super_s&val_b=val_b&date=date_dt&sparse_s=sparse_s&multi_ss=multi_ss&Z_num_i=Z_num_i&num_is=num_is&num_fs=num_fs&q=*:*&json.facet={f1:{terms:{${terms}+field:${super_s},+prefix:s,+mincount:0+}}}&wt=json&indent=true} hits=6 status=0 QTime=0
   [junit4]   2> 67415 INFO  (TEST-TestJsonFacets.testStats-seed#[1D8FDD545C59321]) [    ] o.a.s.c.S.Request [collection1]  webapp=null path=null params={debugQuery=false&rows=0&noexist=noexist_s&cat_s=cat_s&where_s=where_s&num_d=num_d&num_i=num_i&super_s=super_s&val_b=val_b&date=date_dt&sparse_s=sparse_s&multi_ss=multi_ss&Z_num_i=Z_num_i&num_is=num_is&num_fs=num_fs&q=*:*&json.facet={f1:{terms:{${terms}+field:${super_s},+prefix:ttt,+mincount:0+}}}&wt=json&indent=true} hits=6 status=0 QTime=0
   [junit4]   2> 67416 INFO  (TEST-TestJsonFacets.testStats-seed#[1D8FDD545C59321]) [    ] o.a.s.c.S.Request [collection1]  webapp=null path=null params={debugQuery=false&rows=0&noexist=noexist_s&cat_s=cat_s&where_s=where_s&num_d=num_d&num_i=num_i&super_s=super_s&val_b=val_b&date=date_dt&sparse_s=sparse_s&multi_ss=multi_ss&Z_num_i=Z_num_i&num_is=num_is&num_fs=num_fs&q=*:*&json.facet={f1:{terms:{${terms}+field:${super_s},+prefix:aaaaaa,+mincount:0+}}}&wt=json&indent=true} hits=6 status=0 QTime=0
   [junit4]   2> 67416 INFO  (TEST-TestJsonFacets.testStats-seed#[1D8FDD545C59321]) [    ] o.a.s.c.S.Request [collection1]  webapp=null path=null params={debugQuery=false&rows=0&noexist=noexist_s&cat_s=cat_s&where_s=where_s&num_d=num_d&num_i=num_i&super_s=super_s&val_b=val_b&date=date_dt&sparse_s=sparse_s&multi_ss=multi_ss&Z_num_i=Z_num_i&num_is=num_is&num_fs=num_fs&q=*:*&json.facet={f1:{terms:{${terms}+field:${super_s},+prefix:zzzzzz,+mincount:0+}}}&wt=json&indent=true} hits=6 status=0 QTime=0
   [junit4]   2> 67417 INFO  (TEST-TestJsonFacets.testStats-seed#[1D8FDD545C59321]) [    ] o.a.s.c.S.Request [collection1]  webapp=null path=null params={debugQuery=false&rows=0&noexist=noexist_s&cat_s=cat_s&where_s=where_s&num_d=num_d&num_i=num_i&super_s=super_s&val_b=val_b&date=date_dt&sparse_s=sparse_s&multi_ss=multi_ss&Z_num_i=Z_num_i&num_is=num_is&num_fs=num_fs&q=*:*&json.facet={+f1:{${terms}+type:terms,+field:${where_s},+prefix:N++},f2:{${terms}+type:terms,+field:${where_s},+prefix:NY+},f3:{${terms}+type:terms,+field:${where_s},+prefix:NJ+}}&wt=json&indent=true} hits=6 status=0 QTime=0
   [junit4]   2> 67425 INFO  (TEST-TestJsonFacets.testStats-seed#[1D8FDD545C59321]) [    ] o.a.s.s.f.UnInvertedField UnInverted multi-valued field {field=multi_ss,memSize=4515,tindexSize=41,time=3,phase1=3,nTerms=2,bigTerms=2,termInstances=0,uses=0}
   [junit4]   2> 67426 INFO  (TEST-TestJsonFacets.testStats-seed#[1D8FDD545C59321]) [    ] o.a.s.c.S.Request [collection1]  webapp=null path=null params={debugQuery=false&rows=0&noexist=noexist_s&cat_s=cat_s&where_s=where_s&num_d=num_d&num_i=num_i&super_s=super_s&val_b=val_b&date=date_dt&sparse_s=sparse_s&multi_ss=multi_ss&Z_num_i=Z_num_i&num_is=num_is&num_fs=num_fs&q=*:*&json.facet={+f1:{${terms}+type:terms,+field:${multi_ss},+prefix:A++},f2:{${terms}+type:terms,+field:${multi_ss},+prefix:z+},f3:{${terms}+type:terms,+field:${multi_ss},+prefix:aa+},f4:{${terms}+type:terms,+field:${multi_ss},+prefix:bb+},f5:{${terms}+type:terms,+field:${multi_ss},+prefix:a+},f6:{${terms}+type:terms,+field:${multi_ss},+prefix:b+}}&wt=json&indent=true} hits=6 status=0 QTime=8
   [junit4]   2> 67426 INFO  (TEST-TestJsonFacets.testStats-seed#[1D8FDD545C59321]) [    ] o.a.s.c.S.Request [collection1]  webapp=null path=null params={debugQuery=false&rows=0&noexist=noexist_s&cat_s=cat_s&where_s=where_s&num_d=num_d&num_i=num_i&super_s=super_s&val_b=val_b&date=date_dt&sparse_s=sparse_s&multi_ss=multi_ss&Z_num_i=Z_num_i&num_is=num_is&num_fs=num_fs&q=*:*&json.facet={f1:{terms:{${terms}+field:${noexist},+missing:true}}}&wt=json&indent=true} hits=6 status=0 QTime=0
   [junit4]   2> 67430 INFO  (TEST-TestJsonFacets.testStats-seed#[1D8FDD545C59321]) [    ] o.a.s.c.S.Request [collection1]  webapp=null path=null params={debugQuery=false&rows=0&noexist=noexist_s&cat_s=cat_s&where_s=where_s&num_d=num_d&num_i=num_i&super_s=super_s&val_b=val_b&date=date_dt&sparse_s=sparse_s&multi_ss=multi_ss&Z_num_i=Z_num_i&num_is=num_is&num_fs=num_fs&q=*:*&json.facet={f1:{terms:{${terms}+field:${sparse_s},+missing:true+}}}&wt=json&indent=true} hits=6 status=0 QTime=3
   [junit4]   2> 67432 INFO  (TEST-TestJsonFacets.testStats-seed#[1D8FDD545C59321]) [    ] o.a.s.c.S.Request [collection1]  webapp=null path=null params={debugQuery=false&rows=0&noexist=noexist_s&cat_s=cat_s&where_s=where_s&num_d=num_d&num_i=num_i&super_s=super_s&val_b=val_b&date=date_dt&sparse_s=sparse_s&multi_ss=multi_ss&Z_num_i=Z_num_i&num_is=num_is&num_fs=num_fs&q=*:*&json.facet={f1:{terms:{${terms}+field:${sparse_s},+missing:true,+facet:{x:'sum(${num_d})'}+++}}}&wt=json&indent=true} hits=6 status=0 QTime=1
   [junit4]   2> 67433 INFO  (TEST-TestJsonFacets.testStats-seed#[1D8FDD545C59321]) [    ] o.a.s.c.S.Request [collection1]  webapp=null path=null params={debugQuery=false&rows=0&noexist=noexist_s&cat_s=cat_s&where_s=where_s&num_d=num_d&num_i=num_i&super_s=super_s&val_b=val_b&date=date_dt&sparse_s=sparse_s&multi_ss=multi_ss&Z_num_i=Z_num_i&num_is=num_is&num_fs=num_fs&q=*:*&json.facet={f1:{terms:{${terms}+field:${sparse_s},+missing:true,+prefix:on,+facet:{x:'sum(${num_d})'}+++}}}&wt=json&indent=true} hits=6 status=0 QTime=0
   [junit4]   2> 67433 INFO  (TEST-TestJsonFacets.testStats-seed#[1D8FDD545C59321]) [    ] o.a.s.c.S.Request [collection1]  webapp=null path=null params={debugQuery=false&rows=0&noexist=noexist_s&cat_s=cat_s&where_s=where_s&num_d=num_d&num_i=num_i&super_s=super_s&val_b=val_b&date=date_dt&sparse_s=sparse_s&multi_ss=multi_ss&Z_num_i=Z_num_i&num_is=num_is&num_fs=num_fs&q=*:*&json.facet={f1:{terms:{${terms}+field:${sparse_s},+missing:true,+prefix:ppp,+facet:{x:'sum(${num_d})'}+++}}}&wt=json&indent=true} hits=6 status=0 QTime=0
   [junit4]   2> 67434 INFO  (TEST-TestJsonFacets.testStats-seed#[1D8FDD545C59321]) [    ] o.a.s.c.S.Request [collection1]  webapp=null path=null params={debugQuery=false&rows=0&rows=0&noexist=noexist_s&cat_s=cat_s&where_s=where_s&num_d=num_d&num_i=num_i&super_s=super_s&val_b=val_b&date=date_dt&sparse_s=sparse_s&multi_ss=multi_ss&Z_num_i=Z_num_i&num_is=num_is&num_fs=num_fs&q=*:*&facet=true&json.facet={f1:{terms:{${terms}+field:${cat_s},+numBuckets:true,+limit:1}}}&wt=json&indent=true} hits=6 status=0 QTime=0
   [junit4]   2> 67434 INFO  (TEST-TestJsonFacets.testStats-seed#[1D8FDD545C59321]) [    ] o.a.s.c.S.Request [collection1]  webapp=null path=null params={debugQuery=false&rows=0&rows=0&noexist=noexist_s&cat_s=cat_s&where_s=where_s&num_d=num_d&num_i=num_i&super_s=super_s&val_b=val_b&date=date_dt&sparse_s=sparse_s&multi_ss=multi_ss&Z_num_i=Z_num_i&num_is=num_is&num_fs=num_fs&q=*:*&facet=true&json.facet={f1:{terms:{${terms}+field:${cat_s},+numBuckets:true,+prefix:B}}}&wt=json&indent=true} hits=6 status=0 QTime=0
   [junit4]   2> 67435 INFO  (TEST-TestJsonFacets.testStats-seed#[1D8FDD545C59321]) [    ] o.a.s.c.S.Request [collection1]  webapp=null path=null params={debugQuery=false&rows=0&rows=0&noexist=noexist_s&cat_s=cat_s&where_s=where_s&num_d=num_d&num_i=num_i&super_s=super_s&val_b=val_b&date=date_dt&sparse_s=sparse_s&multi_ss=multi_ss&Z_num_i=Z_num_i&num_is=num_is&num_fs=num_fs&q=*:*&facet=true&json.facet={f1:{terms:{${terms}+field:${cat_s},+numBuckets:true,+mincount:3}}}&wt=json&indent=true} hits=6 status=0 QTime=0
   [junit4]   2> 67452 INFO  (TEST-TestJsonFacets.testStats-seed#[1D8FDD545C59321]) [    ] o.a.s.c.S.Request [collection1]  webapp=null path=null params={debugQuery=false&rows=0&noexist=noexist_s&cat_s=cat_s&where_s=where_s&num_d=num_d&num_i=num_i&super_s=super_s&val_b=val_b&date=date_dt&sparse_s=sparse_s&multi_ss=multi_ss&Z_num_i=Z_num_i&num_is=num_is&num_fs=num_fs&q=*:*&json.facet={f:{type:range,+field:${num_d},+start:-5,+end:10,+gap:5}}&wt=json&indent=true} hits=6 status=0 QTime=17
   [junit4]   2> 67457 INFO  (TEST-TestJsonFacets.testStats-seed#[1D8FDD545C59321]) [    ] o.a.s.c.S.Request [collection1]  webapp=null path=null params={debugQuery=false&rows=0&noexist=noexist_s&cat_s=cat_s&where_s=where_s&num_d=num_d&num_i=num_i&super_s=super_s&val_b=val_b&date=date_dt&sparse_s=sparse_s&multi_ss=multi_ss&Z_num_i=Z_num_i&num_is=num_is&num_fs=num_fs&q=*:*&json.facet={f:{type:range,+field:${date},+start:'2001-01-01T00:00:00Z',+end:'2003-01-01T00:00:00Z',+gap:'%2B1YEAR'}}&wt=json&indent=true} hits=6 status=0 QTime=4
   [junit4]   2> 67460 INFO  (TEST-TestJsonFacets.testStats-seed#[1D8FDD545C59321]) [    ] o.a.s.c.S.Request [collection1]  webapp=null path=null params={debugQuery=false&rows=0&noexist=noexist_s&cat_s=cat_s&where_s=where_s&num_d=num_d&num_i=num_i&super_s=super_s&val_b=val_b&date=date_dt&sparse_s=sparse_s&multi_ss=multi_ss&Z_num_i=Z_num_i&num_is=num_is&num_fs=num_fs&q=*:*&json.facet={f:{type:range,+field:${date},+start:'2002-01-01T00:00:00Z',+end:'2005-01-01T00:00:00Z',+gap:'%2B1YEAR',+++other:all,+facet:{+x:'avg(${num_d})'+}+}+}&wt=json&indent=true} hits=6 status=0 QTime=2
   [junit4]   2> 67461 INFO  (TEST-TestJsonFacets.testStats-seed#[1D8FDD545C59321]) [    ] o.a.s.c.S.Request [collection1]  webapp=null path=null params={debugQuery=false&rows=0&noexist=noexist_s&cat_s=cat_s&where_s=where_s&num_d=num_d&num_i=num_i&super_s=super_s&val_b=val_b&date=date_dt&sparse_s=sparse_s&multi_ss=multi_ss&Z_num_i=Z_num_i&num_is=num_is&num_fs=num_fs&q=*:*&json.facet={f:{range:{field:${num_d},+start:-5,+end:10,+gap:5,+include:upper}}}&wt=json&indent=true} hits=6 status=0 QTime=0
   [junit4]   2> 67462 INFO  (TEST-TestJsonFacets.testStats-seed#[1D8FDD545C59321]) [    ] o.a.s.c.S.Request [collection1]  webapp=null path=null params={debugQuery=false&rows=0&noexist=noexist_s&cat_s=cat_s&where_s=where_s&num_d=num_d&num_i=num_i&super_s=super_s&val_b=val_b&date=date_dt&sparse_s=sparse_s&multi_ss=multi_ss&Z_num_i=Z_num_i&num_is=num_is&num_fs=num_fs&q=*:*&json.facet={f:{range:{field:${num_d},+start:-5,+end:10,+gap:5,+++facet:{+x:'sum(${num_i})',+ny:{query:'${where_s}:NY'}}+++}}}&wt=json&indent=true} hits=6 status=0 QTime=0
   [junit4]   2> 67464 INFO  (TEST-TestJsonFacets.testStats-seed#[1D8FDD545C59321]) [    ] o.a.s.c.S.Request [collection1]  webapp=null path=null params={debugQuery=false&rows=0&noexist=noexist_s&cat_s=cat_s&where_s=where_s&num_d=num_d&num_i=num_i&super_s=super_s&val_b=val_b&date=date_dt&sparse_s=sparse_s&multi_ss=multi_ss&Z_num_i=Z_num_i&num_is=num_is&num_fs=num_fs&q=*:*&json.facet={f:{range:{field:${num_d},+start:-5,+end:10,+gap:5,+other:all,+++facet:{+x:'sum(${num_i})',+ny:{query:'${where_s}:NY'}}+++}}}&wt=json&indent=true} hits=6 status=0 QTime=1
   [junit4]   2> 67465 INFO  (TEST-TestJsonFacets.testStats-seed#[1D8FDD545C59321]) [    ] o.a.s.c.S.Request [collection1]  webapp=null path=null params={debugQuery=false&rows=0&noexist=noexist_s&cat_s=cat_s&where_s=where_s&num_d=num_d&num_i=num_i&super_s=super_s&val_b=val_b&date=date_dt&sparse_s=sparse_s&multi_ss=multi_ss&Z_num_i=Z_num_i&num_is=num_is&num_fs=num_fs&q=*:*&json.facet={f:{type:range,+field:${num_d},+start:-5,+end:10,+gap:5,+other:all,+mincount:2,++++facet:{+x:'sum(${num_i})',+ny:{query:'${where_s}:NY'}}+++}}&wt=json&indent=true} hits=6 status=0 QTime=0
   [junit4]   2> 67466 INFO  (TEST-TestJsonFacets.testStats-seed#[1D8FDD545C59321]) [    ] o.a.s.c.S.Request [collection1]  webapp=null path=null params={debugQuery=false&rows=0&noexist=noexist_s&cat_s=cat_s&where_s=where_s&num_d=num_d&num_i=num_i&super_s=super_s&val_b=val_b&date=date_dt&sparse_s=sparse_s&multi_ss=multi_ss&Z_num_i=Z_num_i&num_is=num_is&num_fs=num_fs&q=id:(3+4+6)&json.facet={f:{range:{field:${num_d},+start:-5,+end:10,+gap:5,+other:all,+++facet:{+x:'sum(${num_i})',+ny:{query:'${where_s}:NY'}}+++}}}&wt=json&indent=true} hits=3 status=0 QTime=0
   [junit4]   2> 67496 INFO  (TEST-TestJsonFacets.testStats-seed#[1D8FDD545C59321]) [    ] o.a.s.c.S.Request [collection1]  webapp=null path=null params={debugQuery=false&rows=0&noexist=noexist_s&cat_s=cat_s&where_s=where_s&num_d=num_d&num_i=num_i&super_s=super_s&val_b=val_b&date=date_dt&sparse_s=sparse_s&multi_ss=multi_ss&Z_num_i=Z_num_i&num_is=num_is&num_fs=num_fs&q=*:*&json.facet={+sum1:'sum(${num_d})',+sumsq1:'sumsq(${num_d})',+avg1:'avg(${num_d})',+avg2:'avg(def(${num_d},0))',+min1:'min(${num_d})',+max1:'max(${num_d})',+numwhere:'unique(${where_s})',+unique_num_i:'unique(${num_i})',+unique_num_d:'unique(${num_d})',+unique_date:'unique(${date})',+where_hll:'hll(${where_s})',+hll_num_i:'hll(${num_i})',+hll_num_d:'hll(${num_d})',+hll_date:'hll(${date})',+med:'percentile(${num_d},50)',+perc:'percentile(${num_d},0,50.0,100)'+}&wt=json&indent=true} hits=6 status=0 QTime=29
   [junit4]   2> 67497 INFO  (TEST-TestJsonFacets.testStats-seed#[1D8FDD545C59321]) [    ] o.a.s.c.S.Request [collection1]  webapp=null path=null params={debugQuery=false&rows=0&noexist=noexist_s&cat_s=cat_s&where_s=where_s&num_d=num_d&num_i=num_i&super_s=super_s&val_b=val_b&date=date_dt&sparse_s=sparse_s&multi_ss=multi_ss&Z_num_i=Z_num_i&num_is=num_is&num_fs=num_fs&q=id:DOESNOTEXIST&json.facet={+sum1:'sum(${num_d})',+sumsq1:'sumsq(${num_d})',+avg1:'avg(${num_d})',+min1:'min(${num_d})',+max1:'max(${num_d})',+numwhere:'unique(${where_s})',+unique_num_i:'unique(${num_i})',+unique_num_d:'unique(${num_d})',+unique_date:'unique(${date})',+where_hll:'hll(${where_s})',+hll_num_i:'hll(${num_i})',+hll_num_d:'hll(${num_d})',+hll_date:'hll(${date})',+med:'percentile(${num_d},50)',+perc:'percentile(${num_d},0,50.0,100)'+}&wt=json&indent=true} hits=0 status=0 QTime=0
   [junit4]   2> 67498 INFO  (TEST-TestJsonFacets.testStats-seed#[1D8FDD545C59321]) [    ] o.a.s.c.S.Request [collection1]  webapp=null path=null params={debugQuery=false&rows=0&noexist=noexist_s&cat_s=cat_s&where_s=where_s&num_d=num_d&num_i=num_i&super_s=super_s&val_b=val_b&date=date_dt&sparse_s=sparse_s&multi_ss=multi_ss&Z_num_i=Z_num_i&num_is=num_is&num_fs=num_fs&q=*:*&json.facet={cat:{terms:{${terms}+field:'${multi_ss}',+facet:{nj:{query:'${where_s}:NJ'}}++++}+++}}+}&wt=json&indent=true} hits=6 status=0 QTime=0
   [junit4]   2> 67500 INFO  (TEST-TestJsonFacets.testStats-seed#[1D8FDD545C59321]) [    ] o.a.s.c.S.Request [collection1]  webapp=null path=null params={debugQuery=false&rows=0&noexist=noexist_s&cat_s=cat_s&where_s=where_s&num_d=num_d&num_i=num_i&super_s=super_s&val_b=val_b&date=date_dt&sparse_s=sparse_s&multi_ss=multi_ss&Z_num_i=Z_num_i&num_is=num_is&num_fs=num_fs&q=*:*&json.facet={x:'unique(${multi_ss})',y:{query:{q:'id:2',+facet:{x:'unique(${multi_ss})'}+}}++,x2:'hll(${multi_ss})',y2:{query:{q:'id:2',+facet:{x:'hll(${multi_ss})'}+}}+++}&wt=json&indent=true} hits=6 status=0 QTime=1
   [junit4]   2> 67500 INFO  (TEST-TestJsonFacets.testStats-seed#[1D8FDD545C59321]) [    ] o.a.s.c.S.Request [collection1]  webapp=null path=null params={debugQuery=false&rows=0&noexist=noexist_s&cat_s=cat_s&where_s=where_s&num_d=num_d&num_i=num_i&super_s=super_s&val_b=val_b&date=date_dt&sparse_s=sparse_s&multi_ss=multi_ss&Z_num_i=Z_num_i&num_is=num_is&num_fs=num_fs&q=*:*&json.facet={x:{terms:{${terms}+field:'${multi_ss}',allBuckets:true}}}&wt=json&indent=true} hits=6 status=0 QTime=0
   [junit4]   2> 67502 INFO  (TEST-TestJsonFacets.testStats-seed#[1D8FDD545C59321]) [    ] o.a.s.c.S.Request [collection1]  webapp=null path=null params={debugQuery=false&rows=0&noexist=noexist_s&cat_s=cat_s&where_s=where_s&num_d=num_d&num_i=num_i&super_s=super_s&val_b=val_b&date=date_dt&sparse_s=sparse_s&multi_ss=multi_ss&Z_num_i=Z_num_i&num_is=num_is&num_fs=num_fs&q=*:*&json.facet={+f0:{${terms}+type:terms,+field:${multi_ss},+allBuckets:true,+limit:0}+,f1:{${terms}+type:terms,+field:${multi_ss},+allBuckets:true,+limit:0,+offset:1}+,f2:{${terms}+type:terms,+field:${multi_ss},+allBuckets:true,+limit:0,+facet:{x:'sum(${num_d})'},+sort:'x+desc'+}+,f3:{${terms}+type:terms,+field:${multi_ss},+allBuckets:true,+limit:0,+missing:true,+facet:{x:'sum(${num_d})',+y:'avg(${num_d})'},+sort:'x+desc'+}+}&wt=json&indent=true} hits=6 status=0 QTime=1
   [junit4]   2> 67507 INFO  (TEST-TestJsonFacets.testStats-seed#[1D8FDD545C59321]) [    ] o.a.s.c.S.Request [collection1]  webapp=null path=null params={debugQuery=false&rows=0&noexist=noexist_s&cat_s=cat_s&where_s=where_s&num_d=num_d&num_i=num_i&super_s=super_s&val_b=val_b&date=date_dt&sparse_s=sparse_s&multi_ss=multi_ss&Z_num_i=Z_num_i&num_is=num_is&num_fs=num_fs&q=*:*&json.facet={+f0:{${terms}+type:terms,+field:${num_i},+allBuckets:true,+limit:0}+,f1:{${terms}+type:terms,+field:${num_i},+allBuckets:true,+limit:0,+offset:1}+,f2:{${terms}+type:terms,+field:${num_i},+allBuckets:true,+limit:0,+facet:{x:'sum(${num_d})'},+sort:'x+desc'+}+}&wt=json&indent=true} hits=6 status=0 QTime=4
   [junit4]   2> 67510 INFO  (TEST-TestJsonFacets.testStats-seed#[1D8FDD545C59321]) [    ] o.a.s.c.S.Request [collection1]  webapp=null path=null params={debugQuery=false&rows=0&noexist=noexist_s&cat_s=cat_s&where_s=where_s&num_d=num_d&num_i=num_i&super_s=super_s&val_b=val_b&date=date_dt&sparse_s=sparse_s&multi_ss=multi_ss&Z_num_i=Z_num_i&num_is=num_is&num_fs=num_fs&q=*:*&facet=true&facet.version=2&facet.field={!key%3Df1}${cat_s}&facet.mincount=3&wt=json&indent=true} hits=6 status=0 QTime=3
   [junit4]   2> 67511 INFO  (TEST-TestJsonFacets.testStats-seed#[1D8FDD545C59321]) [    ] o.a.s.c.S.Request [collection1]  webapp=null path=null params={debugQuery=false&rows=0&noexist=noexist_s&cat_s=cat_s&where_s=where_s&num_d=num_d&num_i=num_i&super_s=super_s&val_b=val_b&date=date_dt&sparse_s=sparse_s&multi_ss=multi_ss&Z_num_i=Z_num_i&num_is=num_is&num_fs=num_fs&q=*:*&facet=true&facet.version=2&facet.field={!key%3Df1}${super_s}&facet.prefix=s&facet.mincount=0&wt=json&indent=true} hits=6 status=0 QTime=0
   [junit4]   2> 67521 INFO  (TEST-TestJsonFacets.testStats-seed#[1D8FDD545C59321]) [    ] o.a.s.c.S.Request [collection1]  webapp=null path=null params={debugQuery=false&rows=0&noexist=noexist_s&cat_s=cat_s&where_s=where_s&num_d=num_d&num_i=num_i&super_s=super_s&val_b=val_b&date=date_dt&sparse_s=sparse_s&multi_ss=multi_ss&Z_num_i=Z_num_i&num_is=num_is&num_fs=num_fs&q=*:*&facet=true&facet.version=2&facet.range={!key%3Df}${num_d}&facet.range.start=-5&facet.range.end=10&facet.range.gap=5&f.f.facet.stat=x:sum(${num_i})&subfacet.f.query={!key%3Dny}${where_s}:NY&wt=json&indent=true} hits=6 status=0 QTime=9
   [junit4]   2> 67522 INFO  (TEST-TestJsonFacets.testStats-seed#[1D8FDD545C59321]) [    ] o.a.s.c.S.Request [collection1]  webapp=null path=null params={debugQuery=false&rows=0&noexist=noexist_s&cat_s=cat_s&where_s=where_s&num_d=num_d&num_i=num_i&super_s=super_s&val_b=val_b&date=date_dt&sparse_s=sparse_s&multi_ss=multi_ss&Z_num_i=Z_num_i&num_is=num_is&num_fs=num_fs&q=*:*&facet=true&facet.version=2&facet.field={!key%3Df1}${cat_s}&facet.field={!key%3Df2}${cat_s}&f.f1.facet.sort=n1+desc&f.f1.facet.sort=n1+asc&facet.stat=n1:sum(${num_d})&wt=json&indent=true} hits=6 status=0 QTime=0
   [junit4]   2> 67523 INFO  (TEST-TestJsonFacets.testStats-seed#[1D8FDD545C59321]) [    ] o.a.s.c.S.Request [collection1]  webapp=null path=null params={debugQuery=false&rows=0&noexist=noexist_s&cat_s=cat_s&where_s=where_s&num_d=num_d&num_i=num_i&super_s=super_s&val_b=val_b&date=date_dt&sparse_s=sparse_s&multi_ss=multi_ss&Z_num_i=Z_num_i&num_is=num_is&num_fs=num_fs&q=id:(3+4+6)&facet=true&facet.version=2&facet.range={!key%3Df}${num_d}&facet.range.start=-5&facet.range.end=10&facet.range.gap=5&f.f.facet.stat=x:sum(${num_i})&subfacet.f.query={!key%3Dny}${where_s}:NY&facet.range.other=all&wt=json&indent=true} hits=3 status=0 QTime=1
   [junit4]   2> 67526 INFO  (TEST-TestJsonFacets.testStats-seed#[1D8FDD545C59321]) [    ] o.a.s.c.S.Request [collection1]  webapp=null path=null params={debugQuery=false&rows=0&noexist=noexist_s&cat_s=cat_s&where_s=where_s&num_d=num_d&num_i=num_i&super_s=super_s&val_b=val_b&date=date_dt&sparse_s=sparse_s&multi_ss=multi_ss&Z_num_i=Z_num_i&num_is=num_is&num_fs=num_fs&q={!cache%3Dfalse}*:*&fq={!tag%3Ddoc3,allfilt}-id:3&json.facet={f1:{${terms}+type:terms,+field:${cat_s},+domain:{excludeTags:doc3}+}++}&wt=json&indent=true} hits=5 status=0 QTime=2
   [junit4]   2> 67529 INFO  (TEST-TestJsonFacets.testStats-seed#[1D8FDD545C59321]) [    ] o.a.s.c.S.Request [collection1]  webapp=null path=null params={debugQuery=false&rows=0&noexist=noexist_s&cat_s=cat_s&where_s=where_s&num_d=num_d&num_i=num_i&super_s=super_s&val_b=val_b&date=date_dt&sparse_s=sparse_s&multi_ss=multi_ss&Z_num_i=Z_num_i&num_is=num_is&num_fs=num_fs&q=*:*&fq={!tag%3Dabc}id:(2+3)&json.facet={+processEmpty:true,+f1:{query:{q:'${cat_s}:B',+facet:{nj:{query:'${where_s}:NJ'},+ny:{query:'${where_s}:NY'}}+,+excludeTags:[xyz,qaz]}},f2:{query:{q:'${cat_s}:B',+facet:{nj:{query:'${where_s}:NJ'},+ny:{query:'${where_s}:NY'}}+,+excludeTags:abc+}},f3:{query:{q:'${cat_s}:B',+facet:{nj:{query:'${where_s}:NJ'},+ny:{query:'${where_s}:NY'}}+,+excludeTags:'xyz,abc,qaz'+}},f4:{query:{q:'${cat_s}:B',+facet:{nj:{query:'${where_s}:NJ'},+ny:{query:'${where_s}:NY'}}+,+excludeTags:[xyz+,+abc+,+qaz]+}},f5:{query:{q:'${cat_s}:B',+facet:{nj:{query:'${where_s}:NJ'},+ny:{query:'${where_s}:NY'}}+,+excludeTags:[xyz,qaz]}},f6:{query:{q:'${cat_s}:B',+facet:{processEmpty:true,+nj:{query:'${where_s}:NJ'},+ny:{+type:query,+q:'${where_s}:NY',+excludeTags:abc}}++}},f7:{query:{q:'${cat_s}:B',+facet:{processEmpty:true,+nj:{query:'${where_s}:NJ'},+ny:{+type:query,+q:'${where_s}:NY',+excludeTags:xyz}}++}}}&wt=json&indent=true} hits=2 status=0 QTime=2
   [junit4]   2> 67531 INFO  (TEST-TestJsonFacets.testStats-seed#[1D8FDD545C59321]) [    ] o.a.s.c.S.Request [collection1]  webapp=null path=null params={debugQuery=false&rows=0&noexist=noexist_s&cat_s=cat_s&where_s=where_s&num_d=num_d&num_i=num_i&super_s=super_s&val_b=val_b&date=date_dt&sparse_s=sparse_s&multi_ss=multi_ss&Z_num_i=Z_num_i&num_is=num_is&num_fs=num_fs&q={!cache%3Dfalse}*:*&fq={!tag%3Ddoc6,allfilt}-id:6&fq={!tag%3Ddoc3,allfilt}-id:3&json.facet={processEmpty:true,++f0:{${terms}+type:terms,+field:${cat_s},++++++++++++++++++++++++++++++++++++facet:{nj:{query:'${where_s}:NJ'}}+}++,f1:{${terms}+type:terms,+field:${cat_s},+domain:{excludeTags:doc3},+++missing:true,++facet:{nj:{query:'${where_s}:NJ'}}+}++,f2:{${terms}+type:terms,+field:${cat_s},+domain:{excludeTags:allfilt},missing:true,++facet:{nj:{query:'${where_s}:NJ'}}+}++,f3:{${terms}+type:terms,+field:${cat_s},+domain:{excludeTags:doc6},+++missing:true,++facet:{nj:{query:'${where_s}:NJ'}}+}++}&wt=json&indent=true} hits=4 status=0 QTime=2
   [junit4]   2> 67533 INFO  (TEST-TestJsonFacets.testStats-seed#[1D8FDD545C59321]) [    ] o.a.s.c.S.Request [collection1]  webapp=null path=null params={debugQuery=false&rows=0&noexist=noexist_s&cat_s=cat_s&where_s=where_s&num_d=num_d&num_i=num_i&super_s=super_s&val_b=val_b&date=date_dt&sparse_s=sparse_s&multi_ss=multi_ss&Z_num_i=Z_num_i&num_is=num_is&num_fs=num_fs&q=*:*&fq={!tag%3Ddoc6,allfilt}-id:6&fq={!tag%3Ddoc3,allfilt}-id:3&json.facet={processEmpty:true+,+f1:{type:range,+field:${num_d},+start:-5,+end:10,+gap:5,+other:all,+++facet:{+x:'sum(${num_i})',+ny:{query:'${where_s}:NY'}}+,+domain:{excludeTags:allfilt}+},+f2:{type:range,+field:${num_d},+start:-5,+end:10,+gap:5,+other:all,+++facet:{+x:'sum(${num_i})',+ny:{query:'${where_s}:NY'}}++}}&wt=json&indent=true} hits=4 status=0 QTime=1
   [junit4]   2> 67537 INFO  (TEST-TestJsonFacets.testStats-seed#[1D8FDD545C59321]) [    ] o.a.s.c.S.Request [collection1]  webapp=null path=null params={debugQuery=false&rows=0&noexist=noexist_s&cat_s=cat_s&where_s=where_s&num_d=num_d&num_i=num_i&super_s=super_s&val_b=val_b&date=date_dt&sparse_s=sparse_s&multi_ss=multi_ss&Z_num_i=Z_num_i&num_is=num_is&num_fs=num_fs&q=*:*&json.facet={+f1:{${terms}++type:field,+field:${num_i}+},f2:{${terms}++type:field,+field:${num_i},+sort:'count+asc'+},f3:{${terms}++type:field,+field:${num_i},+sort:'index+asc'+},f4:{${terms}++type:field,+field:${num_i},+sort:'index+desc'+},f5:{${terms}++type:field,+field:${num_i},+sort:'index+desc',+limit:1,+missing:true,+allBuckets:true,+numBuckets:true+},f6:{${terms}++type:field,+field:${num_i},+sort:'index+desc',+mincount:2,+numBuckets:true+},f7:{${terms}++type:field,+field:${num_i},+sort:'index+desc',+offset:2,+numBuckets:true+},f8:{${terms}++type:field,+field:${num_i},+sort:'index+desc',+offset:100,+numBuckets:true+},f9:{${terms}++type:field,+field:${num_i},+sort:'x+desc',+facet:{x:'avg(${num_d})'},+missing:true,+allBuckets:true,+numBuckets:true+},f10:{${terms}++type:field,+field:${num_i},+facet:{a:{query:'${cat_s}:A'}},+missing:true,+allBuckets:true,+numBuckets:true+},f11:{${terms}++type:field,+field:${num_i},+facet:{a:'unique(${num_d})'}+,missing:true,+allBuckets:true,+sort:'a+desc'+}}&wt=json&indent=true} hits=6 status=0 QTime=3
   [junit4]   2> 67538 INFO  (TEST-TestJsonFacets.testStats-seed#[1D8FDD545C59321]) [    ] o.a.s.c.S.Request [collection1]  webapp=null path=null params={debugQuery=false&rows=0&noexist=noexist_s&cat_s=cat_s&where_s=where_s&num_d=num_d&num_i=num_i&super_s=super_s&val_b=val_b&date=date_dt&sparse_s=sparse_s&multi_ss=multi_ss&Z_num_i=Z_num_i&num_is=num_is&num_fs=num_fs&q=*:*&json.facet={+f1:{${terms}++type:field,+field:${num_d}+},f2:{${terms}++type:field,+field:${num_d},+sort:'index+desc'+}}&wt=json&indent=true} hits=6 status=0 QTime=0
   [junit4]   2> 67539 INFO  (TEST-TestJsonFacets.testStats-seed#[1D8FDD545C59321]) [    ] o.a.s.c.S.Request [collection1]  webapp=null path=null params={debugQuery=false&rows=0&noexist=noexist_s&cat_s=cat_s&where_s=where_s&num_d=num_d&num_i=num_i&super_s=super_s&val_b=val_b&date=date_dt&sparse_s=sparse_s&multi_ss=multi_ss&Z_num_i=Z_num_i&num_is=num_is&num_fs=num_fs&q=*:*&json.facet={+u+:+'unique(${Z_num_i})',+f1:{${terms}++type:field,+field:${Z_num_i}+}}&wt=json&indent=true} hits=6 status=0 QTime=0
   [junit4]   2> 67540 INFO  (TEST-TestJsonFacets.testStats-seed#[1D8FDD545C59321]) [    ] o.a.s.s.f.UnInvertedField UnInverted multi-valued field {field=num_is,memSize=4562,tindexSize=46,time=0,phase1=0,nTerms=5,bigTerms=2,termInstances=6,uses=0}
   [junit4]   2> 67540 INFO  (TEST-TestJsonFacets.testStats-seed#[1D8FDD545C59321]) [    ] o.a.s.c.S.Request [collection1]  webapp=null path=null params={debugQuery=false&rows=0&noexist=noexist_s&cat_s=cat_s&where_s=where_s&num_d=num_d&num_i=num_i&super_s=super_s&val_b=val_b&date=date_dt&sparse_s=sparse_s&multi_ss=multi_ss&Z_num_i=Z_num_i&num_is=num_is&num_fs=num_fs&q=*:*&json.facet={++c1:'unique(${num_is})',+c2:'hll(${num_is})',f1:{${terms}+type:terms,+field:${num_is}+}++}&wt=json&indent=true} hits=6 status=0 QTime=0
   [junit4]   2> 67541 INFO  (TEST-TestJsonFacets.testStats-seed#[1D8FDD545C59321]) [    ] o.a.s.s.f.UnInvertedField UnInverted multi-valued field {field=num_fs,memSize=4562,tindexSize=46,time=0,phase1=0,nTerms=5,bigTerms=2,termInstances=6,uses=0}
   [junit4]   2> 67542 INFO  (TEST-TestJsonFacets.testStats-seed#[1D8FDD545C59321]) [    ] o.a.s.c.S.Request [collection1]  webapp=null path=null params={debugQuery=false&rows=0&noexist=noexist_s&cat_s=cat_s&where_s=where_s&num_d=num_d&num_i=num_i&super_s=super_s&val_b=val_b&date=date_dt&sparse_s=sparse_s&multi_ss=multi_ss&Z_num_i=Z_num_i&num_is=num_is&num_fs=num_fs&q=*:*&json.facet={++c1:'unique(${num_fs})',+c2:'hll(${num_fs})',f1:{${terms}+type:terms,+field:${num_fs}+}++}&wt=json&indent=true} hits=6 status=0 QTime=0
   [junit4]   2> 67542 INFO  (TEST-TestJsonFacets.testStats-seed#[1D8FDD545C59321]) [    ] o.a.s.c.S.Request [collection1]  webapp=null path=null params={debugQuery=false&rows=0&noexist=noexist_s&cat_s=cat_s&where_s=where_s&num_d=num_d&num_i=num_i&super_s=super_s&val_b=val_b&date=date_dt&sparse_s=sparse_s&multi_ss=multi_ss&Z_num_i=Z_num_i&num_is=num_is&num_fs=num_fs&q=*:*&json.facet={cat0:{type:terms,+field:${cat_s},+sort:'count+desc',+limit:1,+overrequest:0},cat1:{type:terms,+field:${cat_s},+sort:'count+desc',+limit:1,+overrequest:1},catDef:{type:terms,+field:${cat_s},+sort:'count+desc',+limit:1,+overrequest:-1},catBig:{type:terms,+field:${cat_s},+sort:'count+desc',+offset:1,+limit:2147483647,+overrequest:2147483647}}&wt=json&indent=true} hits=6 status=0 QTime=0
   [junit4]   2> 67546 INFO  (TEST-TestJsonFacets.testStats-seed#[1D8FDD545C59321]) [    ] o.a.s.s.SolrIndexSearcher Opening [Searcher@b20250[collection1] realtime]
   [junit4]   2> 67546 INFO  (TEST-TestJsonFacets.testStats-seed#[1D8FDD545C59321]) [    ] o.a.s.u.p.LogUpdateProcessorFactory [collection1]  webapp=null path=null params={}{deleteByQuery=*:* (-1549281022641700864)} 0 3
   [junit4]   2> 67548 INFO  (TEST-TestJsonFacets.testStats-seed#[1D8FDD545C59321]) [    ] o.a.s.u.p.LogUpdateProcessorFactory [collection1]  webapp=null path=null params={versions=true&wt=json&indent=true}{add=[1 (1549281022645895168)]} 0 1
   [junit4]   2> 67549 INFO  (TEST-TestJsonFacets.testStats-seed#[1D8FDD545C59321]) [    ] o.a.s.u.p.LogUpdateProcessorFactory [collection1]  webapp=null path=null params={versions=true&wt=json&indent=true}{add=[1 (1549281022647992320)]} 0 0
   [junit4]   2> 67550 INFO  (TEST-TestJsonFacets.testStats-seed#[1D8FDD545C59321]) [    ] o.a.s.u.p.LogUpdateProcessorFactory [collection1]  webapp=null path=null params={versions=true&wt=json&indent=true}{add=[1 (1549281022647992321)]} 0 0
   [junit4]   2> 67551 INFO  (TEST-TestJsonFacets.testStats-seed#[1D8FDD545C59321]) [    ] o.a.s.u.p.LogUpdateProcessorFactory [collection1]  webapp=null path=null params={versions=true&wt=json&indent=true}{add=[2 (1549281022649040896)]} 0 0
   [junit4]   2> 67551 INFO  (TEST-TestJsonFacets.testStats-seed#[1D8FDD545C59321]) [    ] o.a.s.u.p.LogUpdateProcessorFactory [collection1]  webapp=null path=null params={versions=true&wt=json&indent=true}{add=[3 (1549281022650089472)]} 0 0
   [junit4]   2> 67552 INFO  (TEST-TestJsonFacets.testStats-seed#[1D8FDD545C59321]) [    ] o.a.s.u.DirectUpdateHandler2 start commit{,optimize=false,openSearcher=true,waitSearcher=true,expungeDeletes=false,softCommit=false,prepareCommit=false}
   [junit4]   2> 67552 INFO  (TEST-TestJsonFacets.testStats-seed#[1D8FDD545C59321]) [    ] o.a.s.u.SolrIndexWriter Calling setCommitData with IW:org.apache.solr.update.SolrIndexWriter@1165f2c
   [junit4]   2> 67556 INFO  (TEST-TestJsonFacets.testStats-seed#[1D8FDD545C59321]) [    ] o.a.s.s.SolrIndexSearcher Opening [Searcher@150a6c[collection1] main]
   [junit4]   2> 67557 INFO  (TEST-TestJsonFacets.testStats-seed#[1D8FDD545C59321]) [    ] o.a.s.u.DirectUpdateHandler2 end_commit_flush
   [junit4]   2> 67571 INFO  (searcherExecutor-213-thread-1) [    ] o.a.s.c.SolrCore [collection1] Registered new searcher Searcher@150a6c[collection1] main{ExitableDirectoryReader(UninvertingDirectoryReader(Uninverting(_3(6.3.0):C5/2:delGen=1)))}
   [junit4]   2> 67572 INFO  (TEST-TestJsonFacets.testStats-seed#[1D8FDD545C59321]) [    ] o.a.s.u.p.LogUpdateProcessorFactory [collection1]  webapp=null path=null params={}{commit=} 0 20
   [junit4]   2> 67574 INFO  (TEST-TestJsonFacets.testStats-seed#[1D8FDD545C59321]) [    ] o.a.s.u.p.LogUpdateProcessorFactory [collection1]  webapp=null path=null params={versions=true&wt=json&indent=true}{add=[4 (1549281022672109568)]} 0 1
   [junit4]   2> 67575 INFO  (TEST-TestJsonFacets.testStats-seed#[1D8FDD545C59321]) [    ] o.a.s.u.p.LogUpdateProcessorFactory [collection1]  webapp=null path=null params={versions=true&wt=json&indent=true}{add=[5 (1549281022674206720)]} 0 0
   [junit4]   2> 67575 INFO  (TEST-TestJsonFacets.testStats-seed#[1D8FDD545C59321]) [    ] o.a.s.u.DirectUpdateHandler2 start commit{,optimize=false,openSearcher=true,waitSearcher=true,expungeDeletes=false,softCommit=false,prepareCommit=false}
   [junit4]   2> 67576 INFO  (TEST-TestJsonFacets.testStats-seed#[1D8FDD545C59321]) [    ] o.a.s.u.SolrIndexWriter Calling setCommitData with IW:org.apache.solr.update.SolrIndexWriter@1165f2c
   [junit4]   2> 67579 INFO  (TEST-TestJsonFacets.testStats-seed#[1D8FDD545C59321]) [    ] o.a.s.s.SolrIndexSearcher Opening [Searcher@188a80c[collection1] main]
   [junit4]   2> 67580 INFO  (TEST-TestJsonFacets.testStats-seed#[1D8FDD545C59321]) [    ] o.a.s.u.DirectUpdateHandler2 end_commit_flush
   [junit4]   2> 67583 INFO  (searcherExecutor-213-thread-1) [    ] o.a.s.c.SolrCore [collection1] Registered new searcher Searcher@188a80c[collection1] main{ExitableDirectoryReader(UninvertingDirectoryReader(Uninverting(_3(6.3.0):C5/2:delGen=1) Uninverting(_4(6.3.0):C2)))}
   [junit4]   2> 67584 INFO  (TEST-TestJsonFacets.testStats-seed#[1D8FDD545C59321]) [    ] o.a.s.u.p.LogUpdateProcessorFactory [collection1]  webapp=null path=null params={}{commit=} 0 8
   [junit4]   2> 67586 INFO  (TEST-TestJsonFacets.testStats-seed#[1D8FDD545C59321]) [    ] o.a.s.u.p.LogUpdateProcessorFactory [collection1]  webapp=null path=null params={versions=true&wt=json&indent=true}{add=[6 (1549281022684692480)]} 0 1
   [junit4]   2> 67586 INFO  (TEST-TestJsonFacets.testStats-seed#[1D8FDD545C59321]) [    ] o.a.s.u.DirectUpdateHandler2 start commit{,optimize=false,openSearcher=true,waitSearcher=true,expungeDeletes=false,softCommit=false,prepareCommit=false}
   [junit4]   2> 67586 INFO  (TEST-TestJsonFacets.testStats-seed#[1D8FDD545C59321]) [    ] o.a.s.u.SolrIndexWriter Calling setCommitData with IW:org.apache.solr.update.SolrIndexWriter@1165f2c
   [junit4]   2> 67590 INFO  (TEST-TestJsonFacets.testStats-seed#[1D8FDD545C59321]) [    ] o.a.s.s.SolrIndexSearcher Opening [Searcher@17b0dc1[collection1] main]
   [junit4]   2> 67590 INFO  (TEST-TestJsonFacets.testStats-seed#[1D8FDD545C59321]) [    ] o.a.s.u.DirectUpdateHandler2 end_commit_flush
   [junit4]   2> 67594 INFO  (searcherExecutor-213-thread-1) [    ] o.a.s.c.SolrCore [collection1] Registered new searcher Searcher@17b0dc1[collection1] main{ExitableDirectoryReader(UninvertingDirectoryReader(Uninverting(_3(6.3.0):C5/2:delGen=1) Uninverting(_4(6.3.0):C2) Uninverting(_5(6.3.0):C1)))}
   [junit4]   2> 67595 INFO  (TEST-TestJsonFacets.testStats-seed#[1D8FDD545C59321]) [    ] o.a.s.u.p.LogUpdateProcessorFactory [collection1]  webapp=null path=null params={}{commit=} 0 8
   [junit4]   2> 67596 INFO  (TEST-TestJsonFacets.testStats-seed#[1D8FDD545C59321]) [    ] o.a.s.c.S.Request [collection1]  webapp=null path=null params={debugQuery=true&facet=true&rows=0&noexist=noexist_ss&cat_s=cat_ss&where_s=where_ss&num_d=num_f&num_i=num_l&num_is=num_ls&num_fs=num_ds&super_s=super_ss&val_b=val_b&date=date_dt&sparse_s=sparse_ss&multi_ss=multi_ss&Z_num_i=Z_num_l&q=*:*&json.facet={catA:{query:{q:'${cat_s}:A'}},++catA2:{query:{query:'${cat_s}:A'}},++catA3:{query:'${cat_s}:A'}++++}&wt=json&indent=true} hits=6 status=0 QTime=0
   [junit4]   2> 67597 INFO  (TEST-TestJsonFacets.testStats-seed#[1D8FDD545C59321]) [    ] o.a.s.c.S.Request [collection1]  webapp=null path=null params={debugQuery=false&facet=true&rows=0&noexist=noexist_ss&cat_s=cat_ss&where_s=where_ss&num_d=num_f&num_i=num_l&num_is=num_ls&num_fs=num_ds&super_s=super_ss&val_b=val_b&date=date_dt&sparse_s=sparse_ss&multi_ss=multi_ss&Z_num_i=Z_num_l&q=*:*&json.facet={catA:{query:{q:'${cat_s}:A'}},++catA2:{query:{query:'${cat_s}:A'}},++catA3:{query:'${cat_s}:A'}++++}&wt=json&indent=true} hits=6 status=0 QTime=0
   [junit4]   2> 67598 INFO  (TEST-TestJsonFacets.testStats-seed#[1D8FDD545C59321]) [    ] o.a.s.c.S.Request [collection1]  webapp=null path=null params={debugQuery=false&facet=true&rows=0&noexist=noexist_ss&cat_s=cat_ss&where_s=where_ss&num_d=num_f&num_i=num_l&num_is=num_ls&num_fs=num_ds&super_s=super_ss&val_b=val_b&date=date_dt&sparse_s=sparse_ss&multi_ss=multi_ss&Z_num_i=Z_num_l&q=*:*&json.facet={+catB:{type:query,+q:'${cat_s}:B',+facet:{nj:{query:'${where_s}:NJ'},+ny:{query:'${where_s}:NY'}}+}}&wt=json&indent=true} hits=6 status=0 QTime=0
   [junit4]   2> 67599 INFO  (TEST-TestJsonFacets.testStats-seed#[1D8FDD545C59321]) [    ] o.a.s.c.S.Request [collection1]  webapp=null path=null params={debugQuery=false&facet=true&rows=0&noexist=noexist_ss&cat_s=cat_ss&where_s=where_ss&num_d=num_f&num_i=num_l&num_is=num_ls&num_fs=num_ds&super_s=super_ss&val_b=val_b&date=date_dt&sparse_s=sparse_ss&multi_ss=multi_ss&Z_num_i=Z_num_l&q=id:(2+3)&json.facet={+catB:{query:{q:'${cat_s}:B',+facet:{nj:{query:'${where_s}:NJ'},+ny:{query:'${where_s}:NY'}}+}}}&wt=json&indent=true} hits=2 status=0 QTime=0
   [junit4]   2> 67600 INFO  (TEST-TestJsonFacets.testStats-seed#[1D8FDD545C59321]) [    ] o.a.s.c.S.Request [collection1]  webapp=null path=null params={debugQuery=false&facet=true&rows=0&noexist=noexist_ss&cat_s=cat_ss&where_s=where_ss&num_d=num_f&num_i=num_l&num_is=num_ls&num_fs=num_ds&super_s=super_ss&val_b=val_b&date=date_dt&sparse_s=sparse_ss&multi_ss=multi_ss&Z_num_i=Z_num_l&q=*:*&json.facet={+catB:{query:{q:'${cat_s}:B',+facet:{nj:{query:{q:'${where_s}:NJ'}},+ny:{query:'${where_s}:NY'}}+}}}&wt=json&indent=true} hits=6 status=0 QTime=0
   [junit4]   2> 67600 INFO  (TEST-TestJsonFacets.testStats-seed#[1D8FDD545C59321]) [    ] o.a.s.s.f.UnInvertedField UnInverted multi-valued field {field=cat_ss,memSize=4515,tindexSize=41,time=0,phase1=0,nTerms=2,bigTerms=2,termInstances=0,uses=0}
   [junit4]   2> 67601 INFO  (TEST-TestJsonFacets.testStats-seed#[1D8FDD545C59321]) [    ] o.a.s.c.S.Request [collection1]  webapp=null path=null params={debugQuery=false&facet=true&rows=0&noexist=noexist_ss&cat_s=cat_ss&where_s=where_ss&num_d=num_f&num_i=num_l&num_is=num_ls&num_fs=num_ds&super_s=super_ss&val_b=val_b&date=date_dt&sparse_s=spa

[...truncated too long message...]

unit4]   2> "Reference Handler" ID=2 WAITING on java.lang.ref.Reference$Lock@169136
   [junit4]   2> 	at java.lang.Object.wait(Native Method)
   [junit4]   2> 	- waiting on java.lang.ref.Reference$Lock@169136
   [junit4]   2> 	at java.lang.Object.wait(Object.java:502)
   [junit4]   2> 	at java.lang.ref.Reference.tryHandlePending(Reference.java:191)
   [junit4]   2> 	at java.lang.ref.Reference$ReferenceHandler.run(Reference.java:153)
   [junit4]   2> 
   [junit4]   2> "main" ID=1 WAITING on com.carrotsearch.randomizedtesting.RandomizedRunner$2@aeb02c
   [junit4]   2> 	at java.lang.Object.wait(Native Method)
   [junit4]   2> 	- waiting on com.carrotsearch.randomizedtesting.RandomizedRunner$2@aeb02c
   [junit4]   2> 	at java.lang.Thread.join(Thread.java:1249)
   [junit4]   2> 	at java.lang.Thread.join(Thread.java:1323)
   [junit4]   2> 	at com.carrotsearch.randomizedtesting.RandomizedRunner.runSuite(RandomizedRunner.java:608)
   [junit4]   2> 	at com.carrotsearch.randomizedtesting.RandomizedRunner.run(RandomizedRunner.java:457)
   [junit4]   2> 	at com.carrotsearch.ant.tasks.junit4.slave.SlaveMain.execute(SlaveMain.java:243)
   [junit4]   2> 	at com.carrotsearch.ant.tasks.junit4.slave.SlaveMain.main(SlaveMain.java:354)
   [junit4]   2> 	at com.carrotsearch.ant.tasks.junit4.slave.SlaveMainSafe.main(SlaveMainSafe.java:10)
   [junit4]   2> 
   [junit4]   2> ^^==============================================
   [junit4]   2> 
   [junit4]   2> NOTE: reproduce with: ant test  -Dtestcase=TestFieldCacheVsDocValues -Dtests.method=testIntMissingVsFieldCache -Dtests.seed=1D8FDD545C59321 -Dtests.multiplier=3 -Dtests.slow=true -Dtests.locale=ro -Dtests.timezone=Asia/Taipei -Dtests.asserts=true -Dtests.file.encoding=UTF-8
   [junit4] ERROR   7195s J2 | TestFieldCacheVsDocValues.testIntMissingVsFieldCache <<<
   [junit4]    > Throwable #1: java.lang.Exception: Test abandoned because suite timeout was reached.
   [junit4]    > 	at __randomizedtesting.SeedInfo.seed([1D8FDD545C59321]:0)
   [junit4]   2> Oct 27, 2016 5:19:14 AM com.carrotsearch.randomizedtesting.ThreadLeakControl checkThreadLeaks
   [junit4]   2> WARNING: Will linger awaiting termination of 1 leaked thread(s).
   [junit4]   2> Oct 27, 2016 5:19:34 AM com.carrotsearch.randomizedtesting.ThreadLeakControl checkThreadLeaks
   [junit4]   2> SEVERE: 1 thread leaked from SUITE scope at org.apache.solr.uninverting.TestFieldCacheVsDocValues: 
   [junit4]   2>    1) Thread[id=605, name=TEST-TestFieldCacheVsDocValues.testIntMissingVsFieldCache-seed#[1D8FDD545C59321], state=TIMED_WAITING, group=TGRP-TestFieldCacheVsDocValues]
   [junit4]   2>         at java.lang.Object.wait(Native Method)
   [junit4]   2>         at org.apache.lucene.index.IndexWriter.doWait(IndexWriter.java:4541)
   [junit4]   2>         at org.apache.lucene.index.IndexWriter.forceMerge(IndexWriter.java:1908)
   [junit4]   2>         at org.apache.lucene.index.IndexWriter.forceMerge(IndexWriter.java:1842)
   [junit4]   2>         at org.apache.lucene.index.RandomIndexWriter.forceMerge(RandomIndexWriter.java:429)
   [junit4]   2>         at org.apache.solr.uninverting.TestFieldCacheVsDocValues.doTestMissingVsFieldCache(TestFieldCacheVsDocValues.java:453)
   [junit4]   2>         at org.apache.solr.uninverting.TestFieldCacheVsDocValues.doTestMissingVsFieldCache(TestFieldCacheVsDocValues.java:470)
   [junit4]   2>         at org.apache.solr.uninverting.TestFieldCacheVsDocValues.testIntMissingVsFieldCache(TestFieldCacheVsDocValues.java:81)
   [junit4]   2>         at sun.reflect.NativeMethodAccessorImpl.invoke0(Native Method)
   [junit4]   2>         at sun.reflect.NativeMethodAccessorImpl.invoke(NativeMethodAccessorImpl.java:62)
   [junit4]   2>         at sun.reflect.DelegatingMethodAccessorImpl.invoke(DelegatingMethodAccessorImpl.java:43)
   [junit4]   2>         at java.lang.reflect.Method.invoke(Method.java:498)
   [junit4]   2>         at com.carrotsearch.randomizedtesting.RandomizedRunner.invoke(RandomizedRunner.java:1713)
   [junit4]   2>         at com.carrotsearch.randomizedtesting.RandomizedRunner$8.evaluate(RandomizedRunner.java:907)
   [junit4]   2>         at com.carrotsearch.randomizedtesting.RandomizedRunner$9.evaluate(RandomizedRunner.java:943)
   [junit4]   2>         at com.carrotsearch.randomizedtesting.RandomizedRunner$10.evaluate(RandomizedRunner.java:957)
   [junit4]   2>         at org.apache.lucene.util.TestRuleSetupTeardownChained$1.evaluate(TestRuleSetupTeardownChained.java:49)
   [junit4]   2>         at org.apache.lucene.util.AbstractBeforeAfterRule$1.evaluate(AbstractBeforeAfterRule.java:45)
   [junit4]   2>         at org.apache.lucene.util.TestRuleThreadAndTestName$1.evaluate(TestRuleThreadAndTestName.java:48)
   [junit4]   2>         at org.apache.lucene.util.TestRuleIgnoreAfterMaxFailures$1.evaluate(TestRuleIgnoreAfterMaxFailures.java:64)
   [junit4]   2>         at org.apache.lucene.util.TestRuleMarkFailure$1.evaluate(TestRuleMarkFailure.java:47)
   [junit4]   2>         at com.carrotsearch.randomizedtesting.rules.StatementAdapter.evaluate(StatementAdapter.java:36)
   [junit4]   2>         at com.carrotsearch.randomizedtesting.ThreadLeakControl$StatementRunner.run(ThreadLeakControl.java:367)
   [junit4]   2>         at com.carrotsearch.randomizedtesting.ThreadLeakControl.forkTimeoutingTask(ThreadLeakControl.java:811)
   [junit4]   2>         at com.carrotsearch.randomizedtesting.ThreadLeakControl$3.evaluate(ThreadLeakControl.java:462)
   [junit4]   2>         at com.carrotsearch.randomizedtesting.RandomizedRunner.runSingleTest(RandomizedRunner.java:916)
   [junit4]   2>         at com.carrotsearch.randomizedtesting.RandomizedRunner$5.evaluate(RandomizedRunner.java:802)
   [junit4]   2>         at com.carrotsearch.randomizedtesting.RandomizedRunner$6.evaluate(RandomizedRunner.java:852)
   [junit4]   2>         at com.carrotsearch.randomizedtesting.RandomizedRunner$7.evaluate(RandomizedRunner.java:863)
   [junit4]   2>         at org.apache.lucene.util.AbstractBeforeAfterRule$1.evaluate(AbstractBeforeAfterRule.java:45)
   [junit4]   2>         at com.carrotsearch.randomizedtesting.rules.StatementAdapter.evaluate(StatementAdapter.java:36)
   [junit4]   2>         at org.apache.lucene.util.TestRuleStoreClassName$1.evaluate(TestRuleStoreClassName.java:41)
   [junit4]   2>         at com.carrotsearch.randomizedtesting.rules.NoShadowingOrOverridesOnMethodsRule$1.evaluate(NoShadowingOrOverridesOnMethodsRule.java:40)
   [junit4]   2>         at com.carrotsearch.randomizedtesting.rules.NoShadowingOrOverridesOnMethodsRule$1.evaluate(NoShadowingOrOverridesOnMethodsRule.java:40)
   [junit4]   2>         at com.carrotsearch.randomizedtesting.rules.StatementAdapter.evaluate(StatementAdapter.java:36)
   [junit4]   2>         at com.carrotsearch.randomizedtesting.rules.StatementAdapter.evaluate(StatementAdapter.java:36)
   [junit4]   2>         at com.carrotsearch.randomizedtesting.rules.StatementAdapter.evaluate(StatementAdapter.java:36)
   [junit4]   2>         at org.apache.lucene.util.TestRuleAssertionsRequired$1.evaluate(TestRuleAssertionsRequired.java:53)
   [junit4]   2>         at org.apache.lucene.util.TestRuleMarkFailure$1.evaluate(TestRuleMarkFailure.java:47)
   [junit4]   2>         at org.apache.lucene.util.TestRuleIgnoreAfterMaxFailures$1.evaluate(TestRuleIgnoreAfterMaxFailures.java:64)
   [junit4]   2>         at org.apache.lucene.util.TestRuleIgnoreTestSuites$1.evaluate(TestRuleIgnoreTestSuites.java:54)
   [junit4]   2>         at com.carrotsearch.randomizedtesting.rules.StatementAdapter.evaluate(StatementAdapter.java:36)
   [junit4]   2>         at com.carrotsearch.randomizedtesting.ThreadLeakControl$StatementRunner.run(ThreadLeakControl.java:367)
   [junit4]   2>         at java.lang.Thread.run(Thread.java:745)
   [junit4]   2> Oct 27, 2016 5:19:34 AM com.carrotsearch.randomizedtesting.ThreadLeakControl tryToInterruptAll
   [junit4]   2> INFO: Starting to interrupt leaked threads:
   [junit4]   2>    1) Thread[id=605, name=TEST-TestFieldCacheVsDocValues.testIntMissingVsFieldCache-seed#[1D8FDD545C59321], state=TIMED_WAITING, group=TGRP-TestFieldCacheVsDocValues]
   [junit4]   2> NOTE: leaving temporary files on disk at: /home/jenkins/workspace/Lucene-Solr-6.x-Linux/solr/build/solr-core/test/J2/temp/solr.uninverting.TestFieldCacheVsDocValues_1D8FDD545C59321-001
   [junit4]   2> Oct 26, 2016 9:19:34 PM com.carrotsearch.randomizedtesting.ThreadLeakControl tryToInterruptAll
   [junit4]   2> INFO: All leaked threads terminated.
   [junit4]   2> NOTE: test params are: codec=Lucene62, sim=RandomSimilarity(queryNorm=false,coord=no): {}, locale=ro, timezone=Asia/Taipei
   [junit4]   2> NOTE: Linux 4.4.0-42-generic i386/Oracle Corporation 1.8.0_102 (32-bit)/cpus=12,threads=1,free=48572576,total=99495936
   [junit4]   2> NOTE: All tests run in this JVM: [CoreAdminHandlerTest, TestDynamicFieldCollectionResource, TestTrackingShardHandlerFactory, SecurityConfHandlerTest, BlockJoinFacetSimpleTest, LeaderFailureAfterFreshStartTest, TestIndexSearcher, HdfsTlogReplayBufferedWhileIndexingTest, DataDrivenBlockJoinTest, CoreAdminRequestStatusTest, HdfsChaosMonkeyNothingIsSafeTest, TestCollationFieldDocValues, TestSizeLimitedDistributedMap, TestStressUserVersions, StatsComponentTest, DOMUtilTest, TestFieldResource, SolrTestCaseJ4Test, BinaryUpdateRequestHandlerTest, TestFieldCacheVsDocValues]
   [junit4]   2> NOTE: reproduce with: ant test  -Dtestcase=TestFieldCacheVsDocValues -Dtests.seed=1D8FDD545C59321 -Dtests.multiplier=3 -Dtests.slow=true -Dtests.locale=ro -Dtests.timezone=Asia/Taipei -Dtests.asserts=true -Dtests.file.encoding=UTF-8
   [junit4] ERROR   0.00s J2 | TestFieldCacheVsDocValues (suite) <<<
   [junit4]    > Throwable #1: java.lang.Exception: Suite timeout exceeded (>= 7200000 msec).
   [junit4]    > 	at __randomizedtesting.SeedInfo.seed([1D8FDD545C59321]:0)
   [junit4] Completed [559/645 (2!)] on J2 in 7220.09s, 8 tests, 2 errors, 1 skipped <<< FAILURES!

[...truncated 52971 lines...]


Mime
View raw message