lucene-dev mailing list archives

Site index · List index
Message view « Date » · « Thread »
Top « Date » · « Thread »
From Policeman Jenkins Server <jenk...@thetaphi.de>
Subject [JENKINS-EA] Lucene-Solr-master-Linux (64bit/jdk-9-ea+140) - Build # 18147 - Still Unstable!
Date Wed, 26 Oct 2016 18:44:09 GMT
Build: https://jenkins.thetaphi.de/job/Lucene-Solr-master-Linux/18147/
Java: 64bit/jdk-9-ea+140 -XX:+UseCompressedOops -XX:+UseG1GC

6 tests failed.
FAILED:  org.apache.solr.search.facet.TestJsonFacets.testStatsDistrib {p0=DV}

Error Message:
mismatch: 'A'!='B' @ facets/cat0/buckets/[0]/val

Stack Trace:
java.lang.RuntimeException: mismatch: 'A'!='B' @ facets/cat0/buckets/[0]/val
	at __randomizedtesting.SeedInfo.seed([7AB5CCD1A6FA4C6D:A67565A7CB7BE8A7]:0)
	at org.apache.solr.SolrTestCaseHS.matchJSON(SolrTestCaseHS.java:161)
	at org.apache.solr.SolrTestCaseHS.assertJQ(SolrTestCaseHS.java:143)
	at org.apache.solr.SolrTestCaseHS$Client$Tester.assertJQ(SolrTestCaseHS.java:255)
	at org.apache.solr.SolrTestCaseHS$Client.testJQ(SolrTestCaseHS.java:296)
	at org.apache.solr.search.facet.TestJsonFacets.doStatsTemplated(TestJsonFacets.java:1152)
	at org.apache.solr.search.facet.TestJsonFacets.doStats(TestJsonFacets.java:361)
	at org.apache.solr.search.facet.TestJsonFacets.testStatsDistrib(TestJsonFacets.java:322)
	at jdk.internal.reflect.NativeMethodAccessorImpl.invoke0(java.base@9-ea/Native Method)
	at jdk.internal.reflect.NativeMethodAccessorImpl.invoke(java.base@9-ea/NativeMethodAccessorImpl.java:62)
	at jdk.internal.reflect.DelegatingMethodAccessorImpl.invoke(java.base@9-ea/DelegatingMethodAccessorImpl.java:43)
	at java.lang.reflect.Method.invoke(java.base@9-ea/Method.java:535)
	at com.carrotsearch.randomizedtesting.RandomizedRunner.invoke(RandomizedRunner.java:1713)
	at com.carrotsearch.randomizedtesting.RandomizedRunner$8.evaluate(RandomizedRunner.java:907)
	at com.carrotsearch.randomizedtesting.RandomizedRunner$9.evaluate(RandomizedRunner.java:943)
	at com.carrotsearch.randomizedtesting.RandomizedRunner$10.evaluate(RandomizedRunner.java:957)
	at com.carrotsearch.randomizedtesting.rules.SystemPropertiesRestoreRule$1.evaluate(SystemPropertiesRestoreRule.java:57)
	at org.apache.lucene.util.TestRuleSetupTeardownChained$1.evaluate(TestRuleSetupTeardownChained.java:49)
	at org.apache.lucene.util.AbstractBeforeAfterRule$1.evaluate(AbstractBeforeAfterRule.java:45)
	at org.apache.lucene.util.TestRuleThreadAndTestName$1.evaluate(TestRuleThreadAndTestName.java:48)
	at org.apache.lucene.util.TestRuleIgnoreAfterMaxFailures$1.evaluate(TestRuleIgnoreAfterMaxFailures.java:64)
	at org.apache.lucene.util.TestRuleMarkFailure$1.evaluate(TestRuleMarkFailure.java:47)
	at com.carrotsearch.randomizedtesting.rules.StatementAdapter.evaluate(StatementAdapter.java:36)
	at com.carrotsearch.randomizedtesting.ThreadLeakControl$StatementRunner.run(ThreadLeakControl.java:367)
	at com.carrotsearch.randomizedtesting.ThreadLeakControl.forkTimeoutingTask(ThreadLeakControl.java:811)
	at com.carrotsearch.randomizedtesting.ThreadLeakControl$3.evaluate(ThreadLeakControl.java:462)
	at com.carrotsearch.randomizedtesting.RandomizedRunner.runSingleTest(RandomizedRunner.java:916)
	at com.carrotsearch.randomizedtesting.RandomizedRunner$5.evaluate(RandomizedRunner.java:802)
	at com.carrotsearch.randomizedtesting.RandomizedRunner$6.evaluate(RandomizedRunner.java:852)
	at com.carrotsearch.randomizedtesting.RandomizedRunner$7.evaluate(RandomizedRunner.java:863)
	at com.carrotsearch.randomizedtesting.rules.StatementAdapter.evaluate(StatementAdapter.java:36)
	at com.carrotsearch.randomizedtesting.rules.SystemPropertiesRestoreRule$1.evaluate(SystemPropertiesRestoreRule.java:57)
	at org.apache.lucene.util.AbstractBeforeAfterRule$1.evaluate(AbstractBeforeAfterRule.java:45)
	at com.carrotsearch.randomizedtesting.rules.StatementAdapter.evaluate(StatementAdapter.java:36)
	at org.apache.lucene.util.TestRuleStoreClassName$1.evaluate(TestRuleStoreClassName.java:41)
	at com.carrotsearch.randomizedtesting.rules.NoShadowingOrOverridesOnMethodsRule$1.evaluate(NoShadowingOrOverridesOnMethodsRule.java:40)
	at com.carrotsearch.randomizedtesting.rules.NoShadowingOrOverridesOnMethodsRule$1.evaluate(NoShadowingOrOverridesOnMethodsRule.java:40)
	at com.carrotsearch.randomizedtesting.rules.StatementAdapter.evaluate(StatementAdapter.java:36)
	at com.carrotsearch.randomizedtesting.rules.StatementAdapter.evaluate(StatementAdapter.java:36)
	at com.carrotsearch.randomizedtesting.rules.StatementAdapter.evaluate(StatementAdapter.java:36)
	at org.apache.lucene.util.TestRuleAssertionsRequired$1.evaluate(TestRuleAssertionsRequired.java:53)
	at org.apache.lucene.util.TestRuleMarkFailure$1.evaluate(TestRuleMarkFailure.java:47)
	at org.apache.lucene.util.TestRuleIgnoreAfterMaxFailures$1.evaluate(TestRuleIgnoreAfterMaxFailures.java:64)
	at org.apache.lucene.util.TestRuleIgnoreTestSuites$1.evaluate(TestRuleIgnoreTestSuites.java:54)
	at com.carrotsearch.randomizedtesting.rules.StatementAdapter.evaluate(StatementAdapter.java:36)
	at com.carrotsearch.randomizedtesting.ThreadLeakControl$StatementRunner.run(ThreadLeakControl.java:367)
	at java.lang.Thread.run(java.base@9-ea/Thread.java:843)


FAILED:  org.apache.solr.search.facet.TestJsonFacets.testStatsDistrib {p0=SMART}

Error Message:
mismatch: 'A'!='B' @ facets/cat0/buckets/[0]/val

Stack Trace:
java.lang.RuntimeException: mismatch: 'A'!='B' @ facets/cat0/buckets/[0]/val
	at __randomizedtesting.SeedInfo.seed([7AB5CCD1A6FA4C6D:A67565A7CB7BE8A7]:0)
	at org.apache.solr.SolrTestCaseHS.matchJSON(SolrTestCaseHS.java:161)
	at org.apache.solr.SolrTestCaseHS.assertJQ(SolrTestCaseHS.java:143)
	at org.apache.solr.SolrTestCaseHS$Client$Tester.assertJQ(SolrTestCaseHS.java:255)
	at org.apache.solr.SolrTestCaseHS$Client.testJQ(SolrTestCaseHS.java:296)
	at org.apache.solr.search.facet.TestJsonFacets.doStatsTemplated(TestJsonFacets.java:1152)
	at org.apache.solr.search.facet.TestJsonFacets.doStats(TestJsonFacets.java:361)
	at org.apache.solr.search.facet.TestJsonFacets.testStatsDistrib(TestJsonFacets.java:322)
	at jdk.internal.reflect.NativeMethodAccessorImpl.invoke0(java.base@9-ea/Native Method)
	at jdk.internal.reflect.NativeMethodAccessorImpl.invoke(java.base@9-ea/NativeMethodAccessorImpl.java:62)
	at jdk.internal.reflect.DelegatingMethodAccessorImpl.invoke(java.base@9-ea/DelegatingMethodAccessorImpl.java:43)
	at java.lang.reflect.Method.invoke(java.base@9-ea/Method.java:535)
	at com.carrotsearch.randomizedtesting.RandomizedRunner.invoke(RandomizedRunner.java:1713)
	at com.carrotsearch.randomizedtesting.RandomizedRunner$8.evaluate(RandomizedRunner.java:907)
	at com.carrotsearch.randomizedtesting.RandomizedRunner$9.evaluate(RandomizedRunner.java:943)
	at com.carrotsearch.randomizedtesting.RandomizedRunner$10.evaluate(RandomizedRunner.java:957)
	at com.carrotsearch.randomizedtesting.rules.SystemPropertiesRestoreRule$1.evaluate(SystemPropertiesRestoreRule.java:57)
	at org.apache.lucene.util.TestRuleSetupTeardownChained$1.evaluate(TestRuleSetupTeardownChained.java:49)
	at org.apache.lucene.util.AbstractBeforeAfterRule$1.evaluate(AbstractBeforeAfterRule.java:45)
	at org.apache.lucene.util.TestRuleThreadAndTestName$1.evaluate(TestRuleThreadAndTestName.java:48)
	at org.apache.lucene.util.TestRuleIgnoreAfterMaxFailures$1.evaluate(TestRuleIgnoreAfterMaxFailures.java:64)
	at org.apache.lucene.util.TestRuleMarkFailure$1.evaluate(TestRuleMarkFailure.java:47)
	at com.carrotsearch.randomizedtesting.rules.StatementAdapter.evaluate(StatementAdapter.java:36)
	at com.carrotsearch.randomizedtesting.ThreadLeakControl$StatementRunner.run(ThreadLeakControl.java:367)
	at com.carrotsearch.randomizedtesting.ThreadLeakControl.forkTimeoutingTask(ThreadLeakControl.java:811)
	at com.carrotsearch.randomizedtesting.ThreadLeakControl$3.evaluate(ThreadLeakControl.java:462)
	at com.carrotsearch.randomizedtesting.RandomizedRunner.runSingleTest(RandomizedRunner.java:916)
	at com.carrotsearch.randomizedtesting.RandomizedRunner$5.evaluate(RandomizedRunner.java:802)
	at com.carrotsearch.randomizedtesting.RandomizedRunner$6.evaluate(RandomizedRunner.java:852)
	at com.carrotsearch.randomizedtesting.RandomizedRunner$7.evaluate(RandomizedRunner.java:863)
	at com.carrotsearch.randomizedtesting.rules.StatementAdapter.evaluate(StatementAdapter.java:36)
	at com.carrotsearch.randomizedtesting.rules.SystemPropertiesRestoreRule$1.evaluate(SystemPropertiesRestoreRule.java:57)
	at org.apache.lucene.util.AbstractBeforeAfterRule$1.evaluate(AbstractBeforeAfterRule.java:45)
	at com.carrotsearch.randomizedtesting.rules.StatementAdapter.evaluate(StatementAdapter.java:36)
	at org.apache.lucene.util.TestRuleStoreClassName$1.evaluate(TestRuleStoreClassName.java:41)
	at com.carrotsearch.randomizedtesting.rules.NoShadowingOrOverridesOnMethodsRule$1.evaluate(NoShadowingOrOverridesOnMethodsRule.java:40)
	at com.carrotsearch.randomizedtesting.rules.NoShadowingOrOverridesOnMethodsRule$1.evaluate(NoShadowingOrOverridesOnMethodsRule.java:40)
	at com.carrotsearch.randomizedtesting.rules.StatementAdapter.evaluate(StatementAdapter.java:36)
	at com.carrotsearch.randomizedtesting.rules.StatementAdapter.evaluate(StatementAdapter.java:36)
	at com.carrotsearch.randomizedtesting.rules.StatementAdapter.evaluate(StatementAdapter.java:36)
	at org.apache.lucene.util.TestRuleAssertionsRequired$1.evaluate(TestRuleAssertionsRequired.java:53)
	at org.apache.lucene.util.TestRuleMarkFailure$1.evaluate(TestRuleMarkFailure.java:47)
	at org.apache.lucene.util.TestRuleIgnoreAfterMaxFailures$1.evaluate(TestRuleIgnoreAfterMaxFailures.java:64)
	at org.apache.lucene.util.TestRuleIgnoreTestSuites$1.evaluate(TestRuleIgnoreTestSuites.java:54)
	at com.carrotsearch.randomizedtesting.rules.StatementAdapter.evaluate(StatementAdapter.java:36)
	at com.carrotsearch.randomizedtesting.ThreadLeakControl$StatementRunner.run(ThreadLeakControl.java:367)
	at java.lang.Thread.run(java.base@9-ea/Thread.java:843)


FAILED:  org.apache.solr.search.facet.TestJsonFacets.testStatsDistrib {p0=STREAM}

Error Message:
mismatch: 'A'!='B' @ facets/cat0/buckets/[0]/val

Stack Trace:
java.lang.RuntimeException: mismatch: 'A'!='B' @ facets/cat0/buckets/[0]/val
	at __randomizedtesting.SeedInfo.seed([7AB5CCD1A6FA4C6D:A67565A7CB7BE8A7]:0)
	at org.apache.solr.SolrTestCaseHS.matchJSON(SolrTestCaseHS.java:161)
	at org.apache.solr.SolrTestCaseHS.assertJQ(SolrTestCaseHS.java:143)
	at org.apache.solr.SolrTestCaseHS$Client$Tester.assertJQ(SolrTestCaseHS.java:255)
	at org.apache.solr.SolrTestCaseHS$Client.testJQ(SolrTestCaseHS.java:296)
	at org.apache.solr.search.facet.TestJsonFacets.doStatsTemplated(TestJsonFacets.java:1152)
	at org.apache.solr.search.facet.TestJsonFacets.doStats(TestJsonFacets.java:361)
	at org.apache.solr.search.facet.TestJsonFacets.testStatsDistrib(TestJsonFacets.java:322)
	at jdk.internal.reflect.NativeMethodAccessorImpl.invoke0(java.base@9-ea/Native Method)
	at jdk.internal.reflect.NativeMethodAccessorImpl.invoke(java.base@9-ea/NativeMethodAccessorImpl.java:62)
	at jdk.internal.reflect.DelegatingMethodAccessorImpl.invoke(java.base@9-ea/DelegatingMethodAccessorImpl.java:43)
	at java.lang.reflect.Method.invoke(java.base@9-ea/Method.java:535)
	at com.carrotsearch.randomizedtesting.RandomizedRunner.invoke(RandomizedRunner.java:1713)
	at com.carrotsearch.randomizedtesting.RandomizedRunner$8.evaluate(RandomizedRunner.java:907)
	at com.carrotsearch.randomizedtesting.RandomizedRunner$9.evaluate(RandomizedRunner.java:943)
	at com.carrotsearch.randomizedtesting.RandomizedRunner$10.evaluate(RandomizedRunner.java:957)
	at com.carrotsearch.randomizedtesting.rules.SystemPropertiesRestoreRule$1.evaluate(SystemPropertiesRestoreRule.java:57)
	at org.apache.lucene.util.TestRuleSetupTeardownChained$1.evaluate(TestRuleSetupTeardownChained.java:49)
	at org.apache.lucene.util.AbstractBeforeAfterRule$1.evaluate(AbstractBeforeAfterRule.java:45)
	at org.apache.lucene.util.TestRuleThreadAndTestName$1.evaluate(TestRuleThreadAndTestName.java:48)
	at org.apache.lucene.util.TestRuleIgnoreAfterMaxFailures$1.evaluate(TestRuleIgnoreAfterMaxFailures.java:64)
	at org.apache.lucene.util.TestRuleMarkFailure$1.evaluate(TestRuleMarkFailure.java:47)
	at com.carrotsearch.randomizedtesting.rules.StatementAdapter.evaluate(StatementAdapter.java:36)
	at com.carrotsearch.randomizedtesting.ThreadLeakControl$StatementRunner.run(ThreadLeakControl.java:367)
	at com.carrotsearch.randomizedtesting.ThreadLeakControl.forkTimeoutingTask(ThreadLeakControl.java:811)
	at com.carrotsearch.randomizedtesting.ThreadLeakControl$3.evaluate(ThreadLeakControl.java:462)
	at com.carrotsearch.randomizedtesting.RandomizedRunner.runSingleTest(RandomizedRunner.java:916)
	at com.carrotsearch.randomizedtesting.RandomizedRunner$5.evaluate(RandomizedRunner.java:802)
	at com.carrotsearch.randomizedtesting.RandomizedRunner$6.evaluate(RandomizedRunner.java:852)
	at com.carrotsearch.randomizedtesting.RandomizedRunner$7.evaluate(RandomizedRunner.java:863)
	at com.carrotsearch.randomizedtesting.rules.StatementAdapter.evaluate(StatementAdapter.java:36)
	at com.carrotsearch.randomizedtesting.rules.SystemPropertiesRestoreRule$1.evaluate(SystemPropertiesRestoreRule.java:57)
	at org.apache.lucene.util.AbstractBeforeAfterRule$1.evaluate(AbstractBeforeAfterRule.java:45)
	at com.carrotsearch.randomizedtesting.rules.StatementAdapter.evaluate(StatementAdapter.java:36)
	at org.apache.lucene.util.TestRuleStoreClassName$1.evaluate(TestRuleStoreClassName.java:41)
	at com.carrotsearch.randomizedtesting.rules.NoShadowingOrOverridesOnMethodsRule$1.evaluate(NoShadowingOrOverridesOnMethodsRule.java:40)
	at com.carrotsearch.randomizedtesting.rules.NoShadowingOrOverridesOnMethodsRule$1.evaluate(NoShadowingOrOverridesOnMethodsRule.java:40)
	at com.carrotsearch.randomizedtesting.rules.StatementAdapter.evaluate(StatementAdapter.java:36)
	at com.carrotsearch.randomizedtesting.rules.StatementAdapter.evaluate(StatementAdapter.java:36)
	at com.carrotsearch.randomizedtesting.rules.StatementAdapter.evaluate(StatementAdapter.java:36)
	at org.apache.lucene.util.TestRuleAssertionsRequired$1.evaluate(TestRuleAssertionsRequired.java:53)
	at org.apache.lucene.util.TestRuleMarkFailure$1.evaluate(TestRuleMarkFailure.java:47)
	at org.apache.lucene.util.TestRuleIgnoreAfterMaxFailures$1.evaluate(TestRuleIgnoreAfterMaxFailures.java:64)
	at org.apache.lucene.util.TestRuleIgnoreTestSuites$1.evaluate(TestRuleIgnoreTestSuites.java:54)
	at com.carrotsearch.randomizedtesting.rules.StatementAdapter.evaluate(StatementAdapter.java:36)
	at com.carrotsearch.randomizedtesting.ThreadLeakControl$StatementRunner.run(ThreadLeakControl.java:367)
	at java.lang.Thread.run(java.base@9-ea/Thread.java:843)


FAILED:  org.apache.solr.search.facet.TestJsonFacets.testStatsDistrib {p0=ENUM}

Error Message:
mismatch: 'A'!='B' @ facets/cat0/buckets/[0]/val

Stack Trace:
java.lang.RuntimeException: mismatch: 'A'!='B' @ facets/cat0/buckets/[0]/val
	at __randomizedtesting.SeedInfo.seed([7AB5CCD1A6FA4C6D:A67565A7CB7BE8A7]:0)
	at org.apache.solr.SolrTestCaseHS.matchJSON(SolrTestCaseHS.java:161)
	at org.apache.solr.SolrTestCaseHS.assertJQ(SolrTestCaseHS.java:143)
	at org.apache.solr.SolrTestCaseHS$Client$Tester.assertJQ(SolrTestCaseHS.java:255)
	at org.apache.solr.SolrTestCaseHS$Client.testJQ(SolrTestCaseHS.java:296)
	at org.apache.solr.search.facet.TestJsonFacets.doStatsTemplated(TestJsonFacets.java:1152)
	at org.apache.solr.search.facet.TestJsonFacets.doStats(TestJsonFacets.java:361)
	at org.apache.solr.search.facet.TestJsonFacets.testStatsDistrib(TestJsonFacets.java:322)
	at jdk.internal.reflect.NativeMethodAccessorImpl.invoke0(java.base@9-ea/Native Method)
	at jdk.internal.reflect.NativeMethodAccessorImpl.invoke(java.base@9-ea/NativeMethodAccessorImpl.java:62)
	at jdk.internal.reflect.DelegatingMethodAccessorImpl.invoke(java.base@9-ea/DelegatingMethodAccessorImpl.java:43)
	at java.lang.reflect.Method.invoke(java.base@9-ea/Method.java:535)
	at com.carrotsearch.randomizedtesting.RandomizedRunner.invoke(RandomizedRunner.java:1713)
	at com.carrotsearch.randomizedtesting.RandomizedRunner$8.evaluate(RandomizedRunner.java:907)
	at com.carrotsearch.randomizedtesting.RandomizedRunner$9.evaluate(RandomizedRunner.java:943)
	at com.carrotsearch.randomizedtesting.RandomizedRunner$10.evaluate(RandomizedRunner.java:957)
	at com.carrotsearch.randomizedtesting.rules.SystemPropertiesRestoreRule$1.evaluate(SystemPropertiesRestoreRule.java:57)
	at org.apache.lucene.util.TestRuleSetupTeardownChained$1.evaluate(TestRuleSetupTeardownChained.java:49)
	at org.apache.lucene.util.AbstractBeforeAfterRule$1.evaluate(AbstractBeforeAfterRule.java:45)
	at org.apache.lucene.util.TestRuleThreadAndTestName$1.evaluate(TestRuleThreadAndTestName.java:48)
	at org.apache.lucene.util.TestRuleIgnoreAfterMaxFailures$1.evaluate(TestRuleIgnoreAfterMaxFailures.java:64)
	at org.apache.lucene.util.TestRuleMarkFailure$1.evaluate(TestRuleMarkFailure.java:47)
	at com.carrotsearch.randomizedtesting.rules.StatementAdapter.evaluate(StatementAdapter.java:36)
	at com.carrotsearch.randomizedtesting.ThreadLeakControl$StatementRunner.run(ThreadLeakControl.java:367)
	at com.carrotsearch.randomizedtesting.ThreadLeakControl.forkTimeoutingTask(ThreadLeakControl.java:811)
	at com.carrotsearch.randomizedtesting.ThreadLeakControl$3.evaluate(ThreadLeakControl.java:462)
	at com.carrotsearch.randomizedtesting.RandomizedRunner.runSingleTest(RandomizedRunner.java:916)
	at com.carrotsearch.randomizedtesting.RandomizedRunner$5.evaluate(RandomizedRunner.java:802)
	at com.carrotsearch.randomizedtesting.RandomizedRunner$6.evaluate(RandomizedRunner.java:852)
	at com.carrotsearch.randomizedtesting.RandomizedRunner$7.evaluate(RandomizedRunner.java:863)
	at com.carrotsearch.randomizedtesting.rules.StatementAdapter.evaluate(StatementAdapter.java:36)
	at com.carrotsearch.randomizedtesting.rules.SystemPropertiesRestoreRule$1.evaluate(SystemPropertiesRestoreRule.java:57)
	at org.apache.lucene.util.AbstractBeforeAfterRule$1.evaluate(AbstractBeforeAfterRule.java:45)
	at com.carrotsearch.randomizedtesting.rules.StatementAdapter.evaluate(StatementAdapter.java:36)
	at org.apache.lucene.util.TestRuleStoreClassName$1.evaluate(TestRuleStoreClassName.java:41)
	at com.carrotsearch.randomizedtesting.rules.NoShadowingOrOverridesOnMethodsRule$1.evaluate(NoShadowingOrOverridesOnMethodsRule.java:40)
	at com.carrotsearch.randomizedtesting.rules.NoShadowingOrOverridesOnMethodsRule$1.evaluate(NoShadowingOrOverridesOnMethodsRule.java:40)
	at com.carrotsearch.randomizedtesting.rules.StatementAdapter.evaluate(StatementAdapter.java:36)
	at com.carrotsearch.randomizedtesting.rules.StatementAdapter.evaluate(StatementAdapter.java:36)
	at com.carrotsearch.randomizedtesting.rules.StatementAdapter.evaluate(StatementAdapter.java:36)
	at org.apache.lucene.util.TestRuleAssertionsRequired$1.evaluate(TestRuleAssertionsRequired.java:53)
	at org.apache.lucene.util.TestRuleMarkFailure$1.evaluate(TestRuleMarkFailure.java:47)
	at org.apache.lucene.util.TestRuleIgnoreAfterMaxFailures$1.evaluate(TestRuleIgnoreAfterMaxFailures.java:64)
	at org.apache.lucene.util.TestRuleIgnoreTestSuites$1.evaluate(TestRuleIgnoreTestSuites.java:54)
	at com.carrotsearch.randomizedtesting.rules.StatementAdapter.evaluate(StatementAdapter.java:36)
	at com.carrotsearch.randomizedtesting.ThreadLeakControl$StatementRunner.run(ThreadLeakControl.java:367)
	at java.lang.Thread.run(java.base@9-ea/Thread.java:843)


FAILED:  org.apache.solr.search.facet.TestJsonFacets.testStatsDistrib {p0=DVHASH}

Error Message:
mismatch: 'A'!='B' @ facets/cat0/buckets/[0]/val

Stack Trace:
java.lang.RuntimeException: mismatch: 'A'!='B' @ facets/cat0/buckets/[0]/val
	at __randomizedtesting.SeedInfo.seed([7AB5CCD1A6FA4C6D:A67565A7CB7BE8A7]:0)
	at org.apache.solr.SolrTestCaseHS.matchJSON(SolrTestCaseHS.java:161)
	at org.apache.solr.SolrTestCaseHS.assertJQ(SolrTestCaseHS.java:143)
	at org.apache.solr.SolrTestCaseHS$Client$Tester.assertJQ(SolrTestCaseHS.java:255)
	at org.apache.solr.SolrTestCaseHS$Client.testJQ(SolrTestCaseHS.java:296)
	at org.apache.solr.search.facet.TestJsonFacets.doStatsTemplated(TestJsonFacets.java:1152)
	at org.apache.solr.search.facet.TestJsonFacets.doStats(TestJsonFacets.java:361)
	at org.apache.solr.search.facet.TestJsonFacets.testStatsDistrib(TestJsonFacets.java:322)
	at jdk.internal.reflect.NativeMethodAccessorImpl.invoke0(java.base@9-ea/Native Method)
	at jdk.internal.reflect.NativeMethodAccessorImpl.invoke(java.base@9-ea/NativeMethodAccessorImpl.java:62)
	at jdk.internal.reflect.DelegatingMethodAccessorImpl.invoke(java.base@9-ea/DelegatingMethodAccessorImpl.java:43)
	at java.lang.reflect.Method.invoke(java.base@9-ea/Method.java:535)
	at com.carrotsearch.randomizedtesting.RandomizedRunner.invoke(RandomizedRunner.java:1713)
	at com.carrotsearch.randomizedtesting.RandomizedRunner$8.evaluate(RandomizedRunner.java:907)
	at com.carrotsearch.randomizedtesting.RandomizedRunner$9.evaluate(RandomizedRunner.java:943)
	at com.carrotsearch.randomizedtesting.RandomizedRunner$10.evaluate(RandomizedRunner.java:957)
	at com.carrotsearch.randomizedtesting.rules.SystemPropertiesRestoreRule$1.evaluate(SystemPropertiesRestoreRule.java:57)
	at org.apache.lucene.util.TestRuleSetupTeardownChained$1.evaluate(TestRuleSetupTeardownChained.java:49)
	at org.apache.lucene.util.AbstractBeforeAfterRule$1.evaluate(AbstractBeforeAfterRule.java:45)
	at org.apache.lucene.util.TestRuleThreadAndTestName$1.evaluate(TestRuleThreadAndTestName.java:48)
	at org.apache.lucene.util.TestRuleIgnoreAfterMaxFailures$1.evaluate(TestRuleIgnoreAfterMaxFailures.java:64)
	at org.apache.lucene.util.TestRuleMarkFailure$1.evaluate(TestRuleMarkFailure.java:47)
	at com.carrotsearch.randomizedtesting.rules.StatementAdapter.evaluate(StatementAdapter.java:36)
	at com.carrotsearch.randomizedtesting.ThreadLeakControl$StatementRunner.run(ThreadLeakControl.java:367)
	at com.carrotsearch.randomizedtesting.ThreadLeakControl.forkTimeoutingTask(ThreadLeakControl.java:811)
	at com.carrotsearch.randomizedtesting.ThreadLeakControl$3.evaluate(ThreadLeakControl.java:462)
	at com.carrotsearch.randomizedtesting.RandomizedRunner.runSingleTest(RandomizedRunner.java:916)
	at com.carrotsearch.randomizedtesting.RandomizedRunner$5.evaluate(RandomizedRunner.java:802)
	at com.carrotsearch.randomizedtesting.RandomizedRunner$6.evaluate(RandomizedRunner.java:852)
	at com.carrotsearch.randomizedtesting.RandomizedRunner$7.evaluate(RandomizedRunner.java:863)
	at com.carrotsearch.randomizedtesting.rules.StatementAdapter.evaluate(StatementAdapter.java:36)
	at com.carrotsearch.randomizedtesting.rules.SystemPropertiesRestoreRule$1.evaluate(SystemPropertiesRestoreRule.java:57)
	at org.apache.lucene.util.AbstractBeforeAfterRule$1.evaluate(AbstractBeforeAfterRule.java:45)
	at com.carrotsearch.randomizedtesting.rules.StatementAdapter.evaluate(StatementAdapter.java:36)
	at org.apache.lucene.util.TestRuleStoreClassName$1.evaluate(TestRuleStoreClassName.java:41)
	at com.carrotsearch.randomizedtesting.rules.NoShadowingOrOverridesOnMethodsRule$1.evaluate(NoShadowingOrOverridesOnMethodsRule.java:40)
	at com.carrotsearch.randomizedtesting.rules.NoShadowingOrOverridesOnMethodsRule$1.evaluate(NoShadowingOrOverridesOnMethodsRule.java:40)
	at com.carrotsearch.randomizedtesting.rules.StatementAdapter.evaluate(StatementAdapter.java:36)
	at com.carrotsearch.randomizedtesting.rules.StatementAdapter.evaluate(StatementAdapter.java:36)
	at com.carrotsearch.randomizedtesting.rules.StatementAdapter.evaluate(StatementAdapter.java:36)
	at org.apache.lucene.util.TestRuleAssertionsRequired$1.evaluate(TestRuleAssertionsRequired.java:53)
	at org.apache.lucene.util.TestRuleMarkFailure$1.evaluate(TestRuleMarkFailure.java:47)
	at org.apache.lucene.util.TestRuleIgnoreAfterMaxFailures$1.evaluate(TestRuleIgnoreAfterMaxFailures.java:64)
	at org.apache.lucene.util.TestRuleIgnoreTestSuites$1.evaluate(TestRuleIgnoreTestSuites.java:54)
	at com.carrotsearch.randomizedtesting.rules.StatementAdapter.evaluate(StatementAdapter.java:36)
	at com.carrotsearch.randomizedtesting.ThreadLeakControl$StatementRunner.run(ThreadLeakControl.java:367)
	at java.lang.Thread.run(java.base@9-ea/Thread.java:843)


FAILED:  org.apache.solr.search.facet.TestJsonFacets.testStatsDistrib {p0=UIF}

Error Message:
mismatch: 'A'!='B' @ facets/cat0/buckets/[0]/val

Stack Trace:
java.lang.RuntimeException: mismatch: 'A'!='B' @ facets/cat0/buckets/[0]/val
	at __randomizedtesting.SeedInfo.seed([7AB5CCD1A6FA4C6D:A67565A7CB7BE8A7]:0)
	at org.apache.solr.SolrTestCaseHS.matchJSON(SolrTestCaseHS.java:161)
	at org.apache.solr.SolrTestCaseHS.assertJQ(SolrTestCaseHS.java:143)
	at org.apache.solr.SolrTestCaseHS$Client$Tester.assertJQ(SolrTestCaseHS.java:255)
	at org.apache.solr.SolrTestCaseHS$Client.testJQ(SolrTestCaseHS.java:296)
	at org.apache.solr.search.facet.TestJsonFacets.doStatsTemplated(TestJsonFacets.java:1152)
	at org.apache.solr.search.facet.TestJsonFacets.doStats(TestJsonFacets.java:361)
	at org.apache.solr.search.facet.TestJsonFacets.testStatsDistrib(TestJsonFacets.java:322)
	at jdk.internal.reflect.NativeMethodAccessorImpl.invoke0(java.base@9-ea/Native Method)
	at jdk.internal.reflect.NativeMethodAccessorImpl.invoke(java.base@9-ea/NativeMethodAccessorImpl.java:62)
	at jdk.internal.reflect.DelegatingMethodAccessorImpl.invoke(java.base@9-ea/DelegatingMethodAccessorImpl.java:43)
	at java.lang.reflect.Method.invoke(java.base@9-ea/Method.java:535)
	at com.carrotsearch.randomizedtesting.RandomizedRunner.invoke(RandomizedRunner.java:1713)
	at com.carrotsearch.randomizedtesting.RandomizedRunner$8.evaluate(RandomizedRunner.java:907)
	at com.carrotsearch.randomizedtesting.RandomizedRunner$9.evaluate(RandomizedRunner.java:943)
	at com.carrotsearch.randomizedtesting.RandomizedRunner$10.evaluate(RandomizedRunner.java:957)
	at com.carrotsearch.randomizedtesting.rules.SystemPropertiesRestoreRule$1.evaluate(SystemPropertiesRestoreRule.java:57)
	at org.apache.lucene.util.TestRuleSetupTeardownChained$1.evaluate(TestRuleSetupTeardownChained.java:49)
	at org.apache.lucene.util.AbstractBeforeAfterRule$1.evaluate(AbstractBeforeAfterRule.java:45)
	at org.apache.lucene.util.TestRuleThreadAndTestName$1.evaluate(TestRuleThreadAndTestName.java:48)
	at org.apache.lucene.util.TestRuleIgnoreAfterMaxFailures$1.evaluate(TestRuleIgnoreAfterMaxFailures.java:64)
	at org.apache.lucene.util.TestRuleMarkFailure$1.evaluate(TestRuleMarkFailure.java:47)
	at com.carrotsearch.randomizedtesting.rules.StatementAdapter.evaluate(StatementAdapter.java:36)
	at com.carrotsearch.randomizedtesting.ThreadLeakControl$StatementRunner.run(ThreadLeakControl.java:367)
	at com.carrotsearch.randomizedtesting.ThreadLeakControl.forkTimeoutingTask(ThreadLeakControl.java:811)
	at com.carrotsearch.randomizedtesting.ThreadLeakControl$3.evaluate(ThreadLeakControl.java:462)
	at com.carrotsearch.randomizedtesting.RandomizedRunner.runSingleTest(RandomizedRunner.java:916)
	at com.carrotsearch.randomizedtesting.RandomizedRunner$5.evaluate(RandomizedRunner.java:802)
	at com.carrotsearch.randomizedtesting.RandomizedRunner$6.evaluate(RandomizedRunner.java:852)
	at com.carrotsearch.randomizedtesting.RandomizedRunner$7.evaluate(RandomizedRunner.java:863)
	at com.carrotsearch.randomizedtesting.rules.StatementAdapter.evaluate(StatementAdapter.java:36)
	at com.carrotsearch.randomizedtesting.rules.SystemPropertiesRestoreRule$1.evaluate(SystemPropertiesRestoreRule.java:57)
	at org.apache.lucene.util.AbstractBeforeAfterRule$1.evaluate(AbstractBeforeAfterRule.java:45)
	at com.carrotsearch.randomizedtesting.rules.StatementAdapter.evaluate(StatementAdapter.java:36)
	at org.apache.lucene.util.TestRuleStoreClassName$1.evaluate(TestRuleStoreClassName.java:41)
	at com.carrotsearch.randomizedtesting.rules.NoShadowingOrOverridesOnMethodsRule$1.evaluate(NoShadowingOrOverridesOnMethodsRule.java:40)
	at com.carrotsearch.randomizedtesting.rules.NoShadowingOrOverridesOnMethodsRule$1.evaluate(NoShadowingOrOverridesOnMethodsRule.java:40)
	at com.carrotsearch.randomizedtesting.rules.StatementAdapter.evaluate(StatementAdapter.java:36)
	at com.carrotsearch.randomizedtesting.rules.StatementAdapter.evaluate(StatementAdapter.java:36)
	at com.carrotsearch.randomizedtesting.rules.StatementAdapter.evaluate(StatementAdapter.java:36)
	at org.apache.lucene.util.TestRuleAssertionsRequired$1.evaluate(TestRuleAssertionsRequired.java:53)
	at org.apache.lucene.util.TestRuleMarkFailure$1.evaluate(TestRuleMarkFailure.java:47)
	at org.apache.lucene.util.TestRuleIgnoreAfterMaxFailures$1.evaluate(TestRuleIgnoreAfterMaxFailures.java:64)
	at org.apache.lucene.util.TestRuleIgnoreTestSuites$1.evaluate(TestRuleIgnoreTestSuites.java:54)
	at com.carrotsearch.randomizedtesting.rules.StatementAdapter.evaluate(StatementAdapter.java:36)
	at com.carrotsearch.randomizedtesting.ThreadLeakControl$StatementRunner.run(ThreadLeakControl.java:367)
	at java.lang.Thread.run(java.base@9-ea/Thread.java:843)




Build Log:
[...truncated 11465 lines...]
   [junit4] Suite: org.apache.solr.search.facet.TestJsonFacets
   [junit4]   2> Creating dataDir: /home/jenkins/workspace/Lucene-Solr-master-Linux/solr/build/solr-core/test/J2/temp/solr.search.facet.TestJsonFacets_7AB5CCD1A6FA4C6D-001/init-core-data-001
   [junit4]   2> 825184 INFO  (SUITE-TestJsonFacets-seed#[7AB5CCD1A6FA4C6D]-worker) [    ] o.a.s.SolrTestCaseJ4 Randomized ssl (false) and clientAuth (false) via: @org.apache.solr.SolrTestCaseJ4$SuppressSSL(bugUrl="None")
   [junit4]   2> 825190 INFO  (SUITE-TestJsonFacets-seed#[7AB5CCD1A6FA4C6D]-worker) [    ] o.a.s.SolrTestCaseJ4 ####initCore
   [junit4]   2> 825191 INFO  (SUITE-TestJsonFacets-seed#[7AB5CCD1A6FA4C6D]-worker) [    ] o.a.s.c.SolrResourceLoader [null] Added 2 libs to classloader, from paths: [/home/jenkins/workspace/Lucene-Solr-master-Linux/solr/core/src/test-files/solr/collection1/lib, /home/jenkins/workspace/Lucene-Solr-master-Linux/solr/core/src/test-files/solr/collection1/lib/classes]
   [junit4]   2> 825262 WARN  (SUITE-TestJsonFacets-seed#[7AB5CCD1A6FA4C6D]-worker) [    ] o.a.s.c.Config Beginning with Solr 5.5, <mergePolicy> is deprecated, use <mergePolicyFactory> instead.
   [junit4]   2> 825263 INFO  (SUITE-TestJsonFacets-seed#[7AB5CCD1A6FA4C6D]-worker) [    ] o.a.s.c.SolrConfig Using Lucene MatchVersion: 7.0.0
   [junit4]   2> 825272 INFO  (SUITE-TestJsonFacets-seed#[7AB5CCD1A6FA4C6D]-worker) [    ] o.a.s.s.IndexSchema [null] Schema name=example
   [junit4]   2> 825316 INFO  (SUITE-TestJsonFacets-seed#[7AB5CCD1A6FA4C6D]-worker) [    ] o.a.s.s.IndexSchema Loaded schema example/1.6 with uniqueid field id
   [junit4]   2> 825350 INFO  (coreLoadExecutor-2906-thread-1) [    ] o.a.s.c.SolrResourceLoader [null] Added 2 libs to classloader, from paths: [/home/jenkins/workspace/Lucene-Solr-master-Linux/solr/core/src/test-files/solr/collection1/lib, /home/jenkins/workspace/Lucene-Solr-master-Linux/solr/core/src/test-files/solr/collection1/lib/classes]
   [junit4]   2> 825416 WARN  (coreLoadExecutor-2906-thread-1) [    ] o.a.s.c.Config Beginning with Solr 5.5, <mergePolicy> is deprecated, use <mergePolicyFactory> instead.
   [junit4]   2> 825417 INFO  (coreLoadExecutor-2906-thread-1) [    ] o.a.s.c.SolrConfig Using Lucene MatchVersion: 7.0.0
   [junit4]   2> 825428 INFO  (coreLoadExecutor-2906-thread-1) [    ] o.a.s.s.IndexSchema [collection1] Schema name=example
   [junit4]   2> 825472 INFO  (coreLoadExecutor-2906-thread-1) [    ] o.a.s.s.IndexSchema Loaded schema example/1.6 with uniqueid field id
   [junit4]   2> 825500 INFO  (coreLoadExecutor-2906-thread-1) [    ] o.a.s.c.CoreContainer Creating SolrCore 'collection1' using configuration from instancedir /home/jenkins/workspace/Lucene-Solr-master-Linux/solr/core/src/test-files/solr/collection1
   [junit4]   2> 825500 INFO  (coreLoadExecutor-2906-thread-1) [    ] o.a.s.c.SolrCore [[collection1] ] Opening new SolrCore at [/home/jenkins/workspace/Lucene-Solr-master-Linux/solr/core/src/test-files/solr/collection1], dataDir=[/home/jenkins/workspace/Lucene-Solr-master-Linux/solr/build/solr-core/test/J2/temp/solr.search.facet.TestJsonFacets_7AB5CCD1A6FA4C6D-001/init-core-data-001/]
   [junit4]   2> 825500 INFO  (coreLoadExecutor-2906-thread-1) [    ] o.a.s.c.JmxMonitoredMap JMX monitoring is enabled. Adding Solr mbeans to JMX Server: com.sun.jmx.mbeanserver.JmxMBeanServer@6db824f1
   [junit4]   2> 825501 INFO  (coreLoadExecutor-2906-thread-1) [    ] o.a.s.u.RandomMergePolicy RandomMergePolicy wrapping class org.apache.lucene.index.LogDocMergePolicy: [LogDocMergePolicy: minMergeSize=1000, mergeFactor=42, maxMergeSize=9223372036854775807, maxMergeSizeForForcedMerge=9223372036854775807, calibrateSizeByDeletes=true, maxMergeDocs=2147483647, maxCFSSegmentSizeMB=8.796093022207999E12, noCFSRatio=0.8481246078004825]
   [junit4]   2> 825503 WARN  (coreLoadExecutor-2906-thread-1) [    ] o.a.s.c.RequestHandlers INVALID paramSet a in requestHandler {type = requestHandler,name = /dump,class = DumpRequestHandler,args = {defaults={a=A,b=B}}}
   [junit4]   2> 825508 INFO  (coreLoadExecutor-2906-thread-1) [    ] o.a.s.u.UpdateHandler Using UpdateLog implementation: org.apache.solr.update.UpdateLog
   [junit4]   2> 825508 INFO  (coreLoadExecutor-2906-thread-1) [    ] o.a.s.u.UpdateLog Initializing UpdateLog: dataDir= defaultSyncLevel=FLUSH numRecordsToKeep=100 maxNumLogsToKeep=10 numVersionBuckets=65536
   [junit4]   2> 825509 INFO  (coreLoadExecutor-2906-thread-1) [    ] o.a.s.u.CommitTracker Hard AutoCommit: disabled
   [junit4]   2> 825509 INFO  (coreLoadExecutor-2906-thread-1) [    ] o.a.s.u.CommitTracker Soft AutoCommit: disabled
   [junit4]   2> 825509 INFO  (coreLoadExecutor-2906-thread-1) [    ] o.a.s.u.RandomMergePolicy RandomMergePolicy wrapping class org.apache.lucene.index.LogDocMergePolicy: [LogDocMergePolicy: minMergeSize=1000, mergeFactor=37, maxMergeSize=9223372036854775807, maxMergeSizeForForcedMerge=9223372036854775807, calibrateSizeByDeletes=true, maxMergeDocs=2147483647, maxCFSSegmentSizeMB=8.796093022207999E12, noCFSRatio=0.0]
   [junit4]   2> 825509 INFO  (coreLoadExecutor-2906-thread-1) [    ] o.a.s.s.SolrIndexSearcher Opening [Searcher@24cf5042[collection1] main]
   [junit4]   2> 825509 WARN  (coreLoadExecutor-2906-thread-1) [    ] o.a.s.r.ManagedResourceStorage Cannot write to config directory /home/jenkins/workspace/Lucene-Solr-master-Linux/solr/core/src/test-files/solr/collection1/conf; switching to use InMemory storage instead.
   [junit4]   2> 825510 INFO  (coreLoadExecutor-2906-thread-1) [    ] o.a.s.h.ReplicationHandler Commits will be reserved for  10000
   [junit4]   2> 825510 INFO  (searcherExecutor-2907-thread-1) [    ] o.a.s.c.SolrCore [collection1] Registered new searcher Searcher@24cf5042[collection1] main{ExitableDirectoryReader(UninvertingDirectoryReader())}
   [junit4]   2> 825511 INFO  (coreLoadExecutor-2906-thread-1) [    ] o.a.s.u.UpdateLog Could not find max version in index or recent updates, using new clock 1549277144873435136
   [junit4]   2> 825514 INFO  (SUITE-TestJsonFacets-seed#[7AB5CCD1A6FA4C6D]-worker) [    ] o.a.s.SolrTestCaseJ4 ####initCore end
   [junit4]   2> 825515 INFO  (TEST-TestJsonFacets.testBigger-seed#[7AB5CCD1A6FA4C6D]) [    ] o.a.s.SolrTestCaseJ4 ###Starting testBigger {p0=DV}
   [junit4]   2> 825569 INFO  (TEST-TestJsonFacets.testBigger-seed#[7AB5CCD1A6FA4C6D]) [    ] o.e.j.s.Server jetty-9.3.8.v20160314
   [junit4]   2> 825570 INFO  (TEST-TestJsonFacets.testBigger-seed#[7AB5CCD1A6FA4C6D]) [    ] o.e.j.s.h.ContextHandler Started o.e.j.s.ServletContextHandler@6942f2c0{/solr,null,AVAILABLE}
   [junit4]   2> 825571 INFO  (TEST-TestJsonFacets.testBigger-seed#[7AB5CCD1A6FA4C6D]) [    ] o.e.j.s.ServerConnector Started ServerConnector@5afc34ed{HTTP/1.1,[http/1.1]}{127.0.0.1:33092}
   [junit4]   2> 825571 INFO  (TEST-TestJsonFacets.testBigger-seed#[7AB5CCD1A6FA4C6D]) [    ] o.e.j.s.Server Started @827756ms
   [junit4]   2> 825571 INFO  (TEST-TestJsonFacets.testBigger-seed#[7AB5CCD1A6FA4C6D]) [    ] o.a.s.c.s.e.JettySolrRunner Jetty properties: {schema=schema_latest.xml, hostContext=/solr, solrconfig=solrconfig-tlog.xml, hostPort=33092}
   [junit4]   2> 825572 ERROR (TEST-TestJsonFacets.testBigger-seed#[7AB5CCD1A6FA4C6D]) [    ] o.a.s.s.StartupLoggingUtils Missing Java Option solr.log.dir. Logging may be missing or incomplete.
   [junit4]   2> 825572 INFO  (TEST-TestJsonFacets.testBigger-seed#[7AB5CCD1A6FA4C6D]) [    ] o.a.s.s.SolrDispatchFilter  ___      _       Welcome to Apache Solr™ version 7.0.0
   [junit4]   2> 825572 INFO  (TEST-TestJsonFacets.testBigger-seed#[7AB5CCD1A6FA4C6D]) [    ] o.a.s.s.SolrDispatchFilter / __| ___| |_ _   Starting in standalone mode on port null
   [junit4]   2> 825572 INFO  (TEST-TestJsonFacets.testBigger-seed#[7AB5CCD1A6FA4C6D]) [    ] o.a.s.s.SolrDispatchFilter \__ \/ _ \ | '_|  Install dir: null
   [junit4]   2> 825572 INFO  (TEST-TestJsonFacets.testBigger-seed#[7AB5CCD1A6FA4C6D]) [    ] o.a.s.s.SolrDispatchFilter |___/\___/_|_|    Start time: 2016-10-26T18:17:02.122479Z
   [junit4]   2> 825572 INFO  (TEST-TestJsonFacets.testBigger-seed#[7AB5CCD1A6FA4C6D]) [    ] o.a.s.c.SolrXmlConfig Loading container configuration from /home/jenkins/workspace/Lucene-Solr-master-Linux/solr/build/solr-core/test/J2/temp/solr.search.facet.TestJsonFacets_7AB5CCD1A6FA4C6D-001/s0-001/solr.xml
   [junit4]   2> 825587 INFO  (TEST-TestJsonFacets.testBigger-seed#[7AB5CCD1A6FA4C6D]) [    ] o.a.s.c.CorePropertiesLocator Found 1 core definitions underneath /home/jenkins/workspace/Lucene-Solr-master-Linux/solr/build/solr-core/test/J2/temp/solr.search.facet.TestJsonFacets_7AB5CCD1A6FA4C6D-001/s0-001/.
   [junit4]   2> 825587 INFO  (TEST-TestJsonFacets.testBigger-seed#[7AB5CCD1A6FA4C6D]) [    ] o.a.s.c.CorePropertiesLocator Cores are: [collection1]
   [junit4]   2> 825595 WARN  (coreLoadExecutor-2917-thread-1) [    ] o.a.s.c.Config Beginning with Solr 5.5, <mergePolicy> is deprecated, use <mergePolicyFactory> instead.
   [junit4]   2> 825596 INFO  (coreLoadExecutor-2917-thread-1) [    ] o.a.s.c.SolrConfig Using Lucene MatchVersion: 7.0.0
   [junit4]   2> 825605 INFO  (coreLoadExecutor-2917-thread-1) [    ] o.a.s.s.IndexSchema [collection1] Schema name=example
   [junit4]   2> 825654 INFO  (coreLoadExecutor-2917-thread-1) [    ] o.a.s.s.IndexSchema Loaded schema example/1.6 with uniqueid field id
   [junit4]   2> 825680 INFO  (coreLoadExecutor-2917-thread-1) [    ] o.a.s.c.CoreContainer Creating SolrCore 'collection1' using configuration from instancedir /home/jenkins/workspace/Lucene-Solr-master-Linux/solr/build/solr-core/test/J2/temp/solr.search.facet.TestJsonFacets_7AB5CCD1A6FA4C6D-001/s0-001/./collection1
   [junit4]   2> 825680 INFO  (coreLoadExecutor-2917-thread-1) [    ] o.a.s.c.SolrCore [[collection1] ] Opening new SolrCore at [/home/jenkins/workspace/Lucene-Solr-master-Linux/solr/build/solr-core/test/J2/temp/solr.search.facet.TestJsonFacets_7AB5CCD1A6FA4C6D-001/s0-001/collection1], dataDir=[/home/jenkins/workspace/Lucene-Solr-master-Linux/solr/build/solr-core/test/J2/temp/solr.search.facet.TestJsonFacets_7AB5CCD1A6FA4C6D-001/s0-001/./collection1/data/]
   [junit4]   2> 825680 INFO  (coreLoadExecutor-2917-thread-1) [    ] o.a.s.c.JmxMonitoredMap JMX monitoring is enabled. Adding Solr mbeans to JMX Server: com.sun.jmx.mbeanserver.JmxMBeanServer@6db824f1
   [junit4]   2> 825681 INFO  (coreLoadExecutor-2917-thread-1) [    ] o.a.s.u.RandomMergePolicy RandomMergePolicy wrapping class org.apache.lucene.index.LogDocMergePolicy: [LogDocMergePolicy: minMergeSize=1000, mergeFactor=42, maxMergeSize=9223372036854775807, maxMergeSizeForForcedMerge=9223372036854775807, calibrateSizeByDeletes=true, maxMergeDocs=2147483647, maxCFSSegmentSizeMB=8.796093022207999E12, noCFSRatio=0.8481246078004825]
   [junit4]   2> 825683 WARN  (coreLoadExecutor-2917-thread-1) [    ] o.a.s.c.RequestHandlers INVALID paramSet a in requestHandler {type = requestHandler,name = /dump,class = DumpRequestHandler,args = {defaults={a=A,b=B}}}
   [junit4]   2> 825689 INFO  (coreLoadExecutor-2917-thread-1) [    ] o.a.s.u.UpdateHandler Using UpdateLog implementation: org.apache.solr.update.UpdateLog
   [junit4]   2> 825689 INFO  (coreLoadExecutor-2917-thread-1) [    ] o.a.s.u.UpdateLog Initializing UpdateLog: dataDir= defaultSyncLevel=FLUSH numRecordsToKeep=100 maxNumLogsToKeep=10 numVersionBuckets=65536
   [junit4]   2> 825690 INFO  (coreLoadExecutor-2917-thread-1) [    ] o.a.s.u.CommitTracker Hard AutoCommit: disabled
   [junit4]   2> 825690 INFO  (coreLoadExecutor-2917-thread-1) [    ] o.a.s.u.CommitTracker Soft AutoCommit: disabled
   [junit4]   2> 825691 INFO  (coreLoadExecutor-2917-thread-1) [    ] o.a.s.u.RandomMergePolicy RandomMergePolicy wrapping class org.apache.lucene.index.LogDocMergePolicy: [LogDocMergePolicy: minMergeSize=1000, mergeFactor=37, maxMergeSize=9223372036854775807, maxMergeSizeForForcedMerge=9223372036854775807, calibrateSizeByDeletes=true, maxMergeDocs=2147483647, maxCFSSegmentSizeMB=8.796093022207999E12, noCFSRatio=0.0]
   [junit4]   2> 825691 INFO  (coreLoadExecutor-2917-thread-1) [    ] o.a.s.s.SolrIndexSearcher Opening [Searcher@5d79b4be[collection1] main]
   [junit4]   2> 825692 INFO  (coreLoadExecutor-2917-thread-1) [    ] o.a.s.r.ManagedResourceStorage File-based storage initialized to use dir: /home/jenkins/workspace/Lucene-Solr-master-Linux/solr/build/solr-core/test/J2/temp/solr.search.facet.TestJsonFacets_7AB5CCD1A6FA4C6D-001/s0-001/collection1/conf
   [junit4]   2> 825692 INFO  (coreLoadExecutor-2917-thread-1) [    ] o.a.s.h.ReplicationHandler Commits will be reserved for  10000
   [junit4]   2> 825693 INFO  (searcherExecutor-2918-thread-1) [    ] o.a.s.c.SolrCore [collection1] Registered new searcher Searcher@5d79b4be[collection1] main{ExitableDirectoryReader(UninvertingDirectoryReader())}
   [junit4]   2> 825693 INFO  (coreLoadExecutor-2917-thread-1) [    ] o.a.s.u.UpdateLog Could not find max version in index or recent updates, using new clock 1549277145064275968
   [junit4]   2> 826088 INFO  (TEST-TestJsonFacets.testBigger-seed#[7AB5CCD1A6FA4C6D]) [    ] o.a.s.SolrTestCaseHS ===> Started solr server port=33092 home=/home/jenkins/workspace/Lucene-Solr-master-Linux/solr/build/solr-core/test/J2/temp/solr.search.facet.TestJsonFacets_7AB5CCD1A6FA4C6D-001/s0-001
   [junit4]   2> 826175 INFO  (TEST-TestJsonFacets.testBigger-seed#[7AB5CCD1A6FA4C6D]) [    ] o.e.j.s.Server jetty-9.3.8.v20160314
   [junit4]   2> 826175 INFO  (TEST-TestJsonFacets.testBigger-seed#[7AB5CCD1A6FA4C6D]) [    ] o.e.j.s.h.ContextHandler Started o.e.j.s.ServletContextHandler@c8466ae{/solr,null,AVAILABLE}
   [junit4]   2> 826176 INFO  (TEST-TestJsonFacets.testBigger-seed#[7AB5CCD1A6FA4C6D]) [    ] o.e.j.s.ServerConnector Started ServerConnector@4cf44595{HTTP/1.1,[http/1.1]}{127.0.0.1:42257}
   [junit4]   2> 826176 INFO  (TEST-TestJsonFacets.testBigger-seed#[7AB5CCD1A6FA4C6D]) [    ] o.e.j.s.Server Started @828360ms
   [junit4]   2> 826176 INFO  (TEST-TestJsonFacets.testBigger-seed#[7AB5CCD1A6FA4C6D]) [    ] o.a.s.c.s.e.JettySolrRunner Jetty properties: {schema=schema_latest.xml, hostContext=/solr, solrconfig=solrconfig-tlog.xml, hostPort=42257}
   [junit4]   2> 826176 ERROR (TEST-TestJsonFacets.testBigger-seed#[7AB5CCD1A6FA4C6D]) [    ] o.a.s.s.StartupLoggingUtils Missing Java Option solr.log.dir. Logging may be missing or incomplete.
   [junit4]   2> 826176 INFO  (TEST-TestJsonFacets.testBigger-seed#[7AB5CCD1A6FA4C6D]) [    ] o.a.s.s.SolrDispatchFilter  ___      _       Welcome to Apache Solr™ version 7.0.0
   [junit4]   2> 826176 INFO  (TEST-TestJsonFacets.testBigger-seed#[7AB5CCD1A6FA4C6D]) [    ] o.a.s.s.SolrDispatchFilter / __| ___| |_ _   Starting in standalone mode on port null
   [junit4]   2> 826176 INFO  (TEST-TestJsonFacets.testBigger-seed#[7AB5CCD1A6FA4C6D]) [    ] o.a.s.s.SolrDispatchFilter \__ \/ _ \ | '_|  Install dir: null
   [junit4]   2> 826176 INFO  (TEST-TestJsonFacets.testBigger-seed#[7AB5CCD1A6FA4C6D]) [    ] o.a.s.s.SolrDispatchFilter |___/\___/_|_|    Start time: 2016-10-26T18:17:02.726799Z
   [junit4]   2> 826177 INFO  (TEST-TestJsonFacets.testBigger-seed#[7AB5CCD1A6FA4C6D]) [    ] o.a.s.c.SolrXmlConfig Loading container configuration from /home/jenkins/workspace/Lucene-Solr-master-Linux/solr/build/solr-core/test/J2/temp/solr.search.facet.TestJsonFacets_7AB5CCD1A6FA4C6D-001/s1-001/solr.xml
   [junit4]   2> 826191 INFO  (TEST-TestJsonFacets.testBigger-seed#[7AB5CCD1A6FA4C6D]) [    ] o.a.s.c.CorePropertiesLocator Found 1 core definitions underneath /home/jenkins/workspace/Lucene-Solr-master-Linux/solr/build/solr-core/test/J2/temp/solr.search.facet.TestJsonFacets_7AB5CCD1A6FA4C6D-001/s1-001/.
   [junit4]   2> 826192 INFO  (TEST-TestJsonFacets.testBigger-seed#[7AB5CCD1A6FA4C6D]) [    ] o.a.s.c.CorePropertiesLocator Cores are: [collection1]
   [junit4]   2> 826199 WARN  (coreLoadExecutor-2928-thread-1) [    ] o.a.s.c.Config Beginning with Solr 5.5, <mergePolicy> is deprecated, use <mergePolicyFactory> instead.
   [junit4]   2> 826200 INFO  (coreLoadExecutor-2928-thread-1) [    ] o.a.s.c.SolrConfig Using Lucene MatchVersion: 7.0.0
   [junit4]   2> 826210 INFO  (coreLoadExecutor-2928-thread-1) [    ] o.a.s.s.IndexSchema [collection1] Schema name=example
   [junit4]   2> 826257 INFO  (coreLoadExecutor-2928-thread-1) [    ] o.a.s.s.IndexSchema Loaded schema example/1.6 with uniqueid field id
   [junit4]   2> 826277 INFO  (coreLoadExecutor-2928-thread-1) [    ] o.a.s.c.CoreContainer Creating SolrCore 'collection1' using configuration from instancedir /home/jenkins/workspace/Lucene-Solr-master-Linux/solr/build/solr-core/test/J2/temp/solr.search.facet.TestJsonFacets_7AB5CCD1A6FA4C6D-001/s1-001/./collection1
   [junit4]   2> 826278 INFO  (coreLoadExecutor-2928-thread-1) [    ] o.a.s.c.SolrCore [[collection1] ] Opening new SolrCore at [/home/jenkins/workspace/Lucene-Solr-master-Linux/solr/build/solr-core/test/J2/temp/solr.search.facet.TestJsonFacets_7AB5CCD1A6FA4C6D-001/s1-001/collection1], dataDir=[/home/jenkins/workspace/Lucene-Solr-master-Linux/solr/build/solr-core/test/J2/temp/solr.search.facet.TestJsonFacets_7AB5CCD1A6FA4C6D-001/s1-001/./collection1/data/]
   [junit4]   2> 826278 INFO  (coreLoadExecutor-2928-thread-1) [    ] o.a.s.c.JmxMonitoredMap JMX monitoring is enabled. Adding Solr mbeans to JMX Server: com.sun.jmx.mbeanserver.JmxMBeanServer@6db824f1
   [junit4]   2> 826279 INFO  (coreLoadExecutor-2928-thread-1) [    ] o.a.s.u.RandomMergePolicy RandomMergePolicy wrapping class org.apache.lucene.index.LogDocMergePolicy: [LogDocMergePolicy: minMergeSize=1000, mergeFactor=42, maxMergeSize=9223372036854775807, maxMergeSizeForForcedMerge=9223372036854775807, calibrateSizeByDeletes=true, maxMergeDocs=2147483647, maxCFSSegmentSizeMB=8.796093022207999E12, noCFSRatio=0.8481246078004825]
   [junit4]   2> 826284 WARN  (coreLoadExecutor-2928-thread-1) [    ] o.a.s.c.RequestHandlers INVALID paramSet a in requestHandler {type = requestHandler,name = /dump,class = DumpRequestHandler,args = {defaults={a=A,b=B}}}
   [junit4]   2> 826294 INFO  (coreLoadExecutor-2928-thread-1) [    ] o.a.s.u.UpdateHandler Using UpdateLog implementation: org.apache.solr.update.UpdateLog
   [junit4]   2> 826294 INFO  (coreLoadExecutor-2928-thread-1) [    ] o.a.s.u.UpdateLog Initializing UpdateLog: dataDir= defaultSyncLevel=FLUSH numRecordsToKeep=100 maxNumLogsToKeep=10 numVersionBuckets=65536
   [junit4]   2> 826296 INFO  (coreLoadExecutor-2928-thread-1) [    ] o.a.s.u.CommitTracker Hard AutoCommit: disabled
   [junit4]   2> 826296 INFO  (coreLoadExecutor-2928-thread-1) [    ] o.a.s.u.CommitTracker Soft AutoCommit: disabled
   [junit4]   2> 826297 INFO  (coreLoadExecutor-2928-thread-1) [    ] o.a.s.u.RandomMergePolicy RandomMergePolicy wrapping class org.apache.lucene.index.LogDocMergePolicy: [LogDocMergePolicy: minMergeSize=1000, mergeFactor=37, maxMergeSize=9223372036854775807, maxMergeSizeForForcedMerge=9223372036854775807, calibrateSizeByDeletes=true, maxMergeDocs=2147483647, maxCFSSegmentSizeMB=8.796093022207999E12, noCFSRatio=0.0]
   [junit4]   2> 826297 INFO  (coreLoadExecutor-2928-thread-1) [    ] o.a.s.s.SolrIndexSearcher Opening [Searcher@64dd4066[collection1] main]
   [junit4]   2> 826298 INFO  (coreLoadExecutor-2928-thread-1) [    ] o.a.s.r.ManagedResourceStorage File-based storage initialized to use dir: /home/jenkins/workspace/Lucene-Solr-master-Linux/solr/build/solr-core/test/J2/temp/solr.search.facet.TestJsonFacets_7AB5CCD1A6FA4C6D-001/s1-001/collection1/conf
   [junit4]   2> 826299 INFO  (coreLoadExecutor-2928-thread-1) [    ] o.a.s.h.ReplicationHandler Commits will be reserved for  10000
   [junit4]   2> 826299 INFO  (searcherExecutor-2929-thread-1) [    ] o.a.s.c.SolrCore [collection1] Registered new searcher Searcher@64dd4066[collection1] main{ExitableDirectoryReader(UninvertingDirectoryReader())}
   [junit4]   2> 826300 INFO  (coreLoadExecutor-2928-thread-1) [    ] o.a.s.u.UpdateLog Could not find max version in index or recent updates, using new clock 1549277145700761600
   [junit4]   2> 826696 INFO  (TEST-TestJsonFacets.testBigger-seed#[7AB5CCD1A6FA4C6D]) [    ] o.a.s.SolrTestCaseHS ===> Started solr server port=42257 home=/home/jenkins/workspace/Lucene-Solr-master-Linux/solr/build/solr-core/test/J2/temp/solr.search.facet.TestJsonFacets_7AB5CCD1A6FA4C6D-001/s1-001
   [junit4]   2> 826779 INFO  (TEST-TestJsonFacets.testBigger-seed#[7AB5CCD1A6FA4C6D]) [    ] o.e.j.s.Server jetty-9.3.8.v20160314
   [junit4]   2> 826780 INFO  (TEST-TestJsonFacets.testBigger-seed#[7AB5CCD1A6FA4C6D]) [    ] o.e.j.s.h.ContextHandler Started o.e.j.s.ServletContextHandler@704efae8{/solr,null,AVAILABLE}
   [junit4]   2> 826780 INFO  (TEST-TestJsonFacets.testBigger-seed#[7AB5CCD1A6FA4C6D]) [    ] o.e.j.s.ServerConnector Started ServerConnector@a643fe7{HTTP/1.1,[http/1.1]}{127.0.0.1:39087}
   [junit4]   2> 826780 INFO  (TEST-TestJsonFacets.testBigger-seed#[7AB5CCD1A6FA4C6D]) [    ] o.e.j.s.Server Started @828965ms
   [junit4]   2> 826780 INFO  (TEST-TestJsonFacets.testBigger-seed#[7AB5CCD1A6FA4C6D]) [    ] o.a.s.c.s.e.JettySolrRunner Jetty properties: {schema=schema_latest.xml, hostContext=/solr, solrconfig=solrconfig-tlog.xml, hostPort=39087}
   [junit4]   2> 826781 ERROR (TEST-TestJsonFacets.testBigger-seed#[7AB5CCD1A6FA4C6D]) [    ] o.a.s.s.StartupLoggingUtils Missing Java Option solr.log.dir. Logging may be missing or incomplete.
   [junit4]   2> 826781 INFO  (TEST-TestJsonFacets.testBigger-seed#[7AB5CCD1A6FA4C6D]) [    ] o.a.s.s.SolrDispatchFilter  ___      _       Welcome to Apache Solr™ version 7.0.0
   [junit4]   2> 826781 INFO  (TEST-TestJsonFacets.testBigger-seed#[7AB5CCD1A6FA4C6D]) [    ] o.a.s.s.SolrDispatchFilter / __| ___| |_ _   Starting in standalone mode on port null
   [junit4]   2> 826781 INFO  (TEST-TestJsonFacets.testBigger-seed#[7AB5CCD1A6FA4C6D]) [    ] o.a.s.s.SolrDispatchFilter \__ \/ _ \ | '_|  Install dir: null
   [junit4]   2> 826781 INFO  (TEST-TestJsonFacets.testBigger-seed#[7AB5CCD1A6FA4C6D]) [    ] o.a.s.s.SolrDispatchFilter |___/\___/_|_|    Start time: 2016-10-26T18:17:03.331564Z
   [junit4]   2> 826782 INFO  (TEST-TestJsonFacets.testBigger-seed#[7AB5CCD1A6FA4C6D]) [    ] o.a.s.c.SolrXmlConfig Loading container configuration from /home/jenkins/workspace/Lucene-Solr-master-Linux/solr/build/solr-core/test/J2/temp/solr.search.facet.TestJsonFacets_7AB5CCD1A6FA4C6D-001/s2-001/solr.xml
   [junit4]   2> 826807 INFO  (TEST-TestJsonFacets.testBigger-seed#[7AB5CCD1A6FA4C6D]) [    ] o.a.s.c.CorePropertiesLocator Found 1 core definitions underneath /home/jenkins/workspace/Lucene-Solr-master-Linux/solr/build/solr-core/test/J2/temp/solr.search.facet.TestJsonFacets_7AB5CCD1A6FA4C6D-001/s2-001/.
   [junit4]   2> 826807 INFO  (TEST-TestJsonFacets.testBigger-seed#[7AB5CCD1A6FA4C6D]) [    ] o.a.s.c.CorePropertiesLocator Cores are: [collection1]
   [junit4]   2> 826818 WARN  (coreLoadExecutor-2939-thread-1) [    ] o.a.s.c.Config Beginning with Solr 5.5, <mergePolicy> is deprecated, use <mergePolicyFactory> instead.
   [junit4]   2> 826820 INFO  (coreLoadExecutor-2939-thread-1) [    ] o.a.s.c.SolrConfig Using Lucene MatchVersion: 7.0.0
   [junit4]   2> 826834 INFO  (coreLoadExecutor-2939-thread-1) [    ] o.a.s.s.IndexSchema [collection1] Schema name=example
   [junit4]   2> 826915 INFO  (coreLoadExecutor-2939-thread-1) [    ] o.a.s.s.IndexSchema Loaded schema example/1.6 with uniqueid field id
   [junit4]   2> 826933 INFO  (coreLoadExecutor-2939-thread-1) [    ] o.a.s.c.CoreContainer Creating SolrCore 'collection1' using configuration from instancedir /home/jenkins/workspace/Lucene-Solr-master-Linux/solr/build/solr-core/test/J2/temp/solr.search.facet.TestJsonFacets_7AB5CCD1A6FA4C6D-001/s2-001/./collection1
   [junit4]   2> 826933 INFO  (coreLoadExecutor-2939-thread-1) [    ] o.a.s.c.SolrCore [[collection1] ] Opening new SolrCore at [/home/jenkins/workspace/Lucene-Solr-master-Linux/solr/build/solr-core/test/J2/temp/solr.search.facet.TestJsonFacets_7AB5CCD1A6FA4C6D-001/s2-001/collection1], dataDir=[/home/jenkins/workspace/Lucene-Solr-master-Linux/solr/build/solr-core/test/J2/temp/solr.search.facet.TestJsonFacets_7AB5CCD1A6FA4C6D-001/s2-001/./collection1/data/]
   [junit4]   2> 826934 INFO  (coreLoadExecutor-2939-thread-1) [    ] o.a.s.c.JmxMonitoredMap JMX monitoring is enabled. Adding Solr mbeans to JMX Server: com.sun.jmx.mbeanserver.JmxMBeanServer@6db824f1
   [junit4]   2> 826934 INFO  (coreLoadExecutor-2939-thread-1) [    ] o.a.s.u.RandomMergePolicy RandomMergePolicy wrapping class org.apache.lucene.index.LogDocMergePolicy: [LogDocMergePolicy: minMergeSize=1000, mergeFactor=42, maxMergeSize=9223372036854775807, maxMergeSizeForForcedMerge=9223372036854775807, calibrateSizeByDeletes=true, maxMergeDocs=2147483647, maxCFSSegmentSizeMB=8.796093022207999E12, noCFSRatio=0.8481246078004825]
   [junit4]   2> 826937 WARN  (coreLoadExecutor-2939-thread-1) [    ] o.a.s.c.RequestHandlers INVALID paramSet a in requestHandler {type = requestHandler,name = /dump,class = DumpRequestHandler,args = {defaults={a=A,b=B}}}
   [junit4]   2> 826943 INFO  (coreLoadExecutor-2939-thread-1) [    ] o.a.s.u.UpdateHandler Using UpdateLog implementation: org.apache.solr.update.UpdateLog
   [junit4]   2> 826943 INFO  (coreLoadExecutor-2939-thread-1) [    ] o.a.s.u.UpdateLog Initializing UpdateLog: dataDir= defaultSyncLevel=FLUSH numRecordsToKeep=100 maxNumLogsToKeep=10 numVersionBuckets=65536
   [junit4]   2> 826944 INFO  (coreLoadExecutor-2939-thread-1) [    ] o.a.s.u.CommitTracker Hard AutoCommit: disabled
   [junit4]   2> 826944 INFO  (coreLoadExecutor-2939-thread-1) [    ] o.a.s.u.CommitTracker Soft AutoCommit: disabled
   [junit4]   2> 826945 INFO  (coreLoadExecutor-2939-thread-1) [    ] o.a.s.u.RandomMergePolicy RandomMergePolicy wrapping class org.apache.lucene.index.LogDocMergePolicy: [LogDocMergePolicy: minMergeSize=1000, mergeFactor=37, maxMergeSize=9223372036854775807, maxMergeSizeForForcedMerge=9223372036854775807, calibrateSizeByDeletes=true, maxMergeDocs=2147483647, maxCFSSegmentSizeMB=8.796093022207999E12, noCFSRatio=0.0]
   [junit4]   2> 826945 INFO  (coreLoadExecutor-2939-thread-1) [    ] o.a.s.s.SolrIndexSearcher Opening [Searcher@4756910[collection1] main]
   [junit4]   2> 826945 INFO  (coreLoadExecutor-2939-thread-1) [    ] o.a.s.r.ManagedResourceStorage File-based storage initialized to use dir: /home/jenkins/workspace/Lucene-Solr-master-Linux/solr/build/solr-core/test/J2/temp/solr.search.facet.TestJsonFacets_7AB5CCD1A6FA4C6D-001/s2-001/collection1/conf
   [junit4]   2> 826946 INFO  (coreLoadExecutor-2939-thread-1) [    ] o.a.s.h.ReplicationHandler Commits will be reserved for  10000
   [junit4]   2> 826946 INFO  (searcherExecutor-2940-thread-1) [    ] o.a.s.c.SolrCore [collection1] Registered new searcher Searcher@4756910[collection1] main{ExitableDirectoryReader(UninvertingDirectoryReader())}
   [junit4]   2> 826947 INFO  (coreLoadExecutor-2939-thread-1) [    ] o.a.s.u.UpdateLog Could not find max version in index or recent updates, using new clock 1549277146379190272
   [junit4]   2> 827311 INFO  (TEST-TestJsonFacets.testBigger-seed#[7AB5CCD1A6FA4C6D]) [    ] o.a.s.SolrTestCaseHS ===> Started solr server port=39087 home=/home/jenkins/workspace/Lucene-Solr-master-Linux/solr/build/solr-core/test/J2/temp/solr.search.facet.TestJsonFacets_7AB5CCD1A6FA4C6D-001/s2-001
   [junit4]   2> 827321 INFO  (qtp1695755482-7135) [    ] o.a.s.u.p.LogUpdateProcessorFactory [collection1]  webapp=/solr path=/update params={wt=javabin&version=2}{deleteByQuery=*:* (-1549277146768211968)} 0 2
   [junit4]   2> 827323 INFO  (qtp1765772251-7151) [    ] o.a.s.u.p.LogUpdateProcessorFactory [collection1]  webapp=/solr path=/update params={wt=javabin&version=2}{deleteByQuery=*:* (-1549277146771357696)} 0 1
   [junit4]   2> 827325 INFO  (qtp1930404505-7167) [    ] o.a.s.u.p.LogUpdateProcessorFactory [collection1]  webapp=/solr path=/update params={wt=javabin&version=2}{deleteByQuery=*:* (-1549277146774503424)} 0 1
   [junit4]   2> 827326 INFO  (qtp1765772251-7152) [    ] o.a.s.u.p.LogUpdateProcessorFactory [collection1]  webapp=/solr path=/update params={wt=javabin&version=2}{add=[0 (1549277146776600576)]} 0 0
   [junit4]   2> 827327 INFO  (qtp1930404505-7168) [    ] o.a.s.u.p.LogUpdateProcessorFactory [collection1]  webapp=/solr path=/update params={wt=javabin&version=2}{add=[1 (1549277146776600576)]} 0 0
   [junit4]   2> 827327 INFO  (qtp1695755482-7136) [    ] o.a.s.u.p.LogUpdateProcessorFactory [collection1]  webapp=/solr path=/update params={wt=javabin&version=2}{add=[2 (1549277146777649152)]} 0 0
   [junit4]   2> 827328 INFO  (qtp1765772251-7153) [    ] o.a.s.u.p.LogUpdateProcessorFactory [collection1]  webapp=/solr path=/update params={wt=javabin&version=2}{add=[3 (1549277146778697728)]} 0 0
   [junit4]   2> 827328 INFO  (qtp1930404505-7169) [    ] o.a.s.u.p.LogUpdateProcessorFactory [collection1]  webapp=/solr path=/update params={wt=javabin&version=2}{add=[4 (1549277146778697728)]} 0 0
   [junit4]   2> 827329 INFO  (qtp1695755482-7137) [    ] o.a.s.u.p.LogUpdateProcessorFactory [collection1]  webapp=/solr path=/update params={wt=javabin&version=2}{add=[5 (1549277146779746304)]} 0 0
   [junit4]   2> 827329 INFO  (qtp1765772251-7146) [    ] o.a.s.u.p.LogUpdateProcessorFactory [collection1]  webapp=/solr path=/update params={wt=javabin&version=2}{add=[6 (1549277146779746304)]} 0 0
   [junit4]   2> 827329 INFO  (qtp1930404505-7162) [    ] o.a.s.u.p.LogUpdateProcessorFactory [collection1]  webapp=/solr path=/update params={wt=javabin&version=2}{add=[7 (1549277146779746304)]} 0 0
   [junit4]   2> 827330 INFO  (qtp1695755482-7130) [    ] o.a.s.u.p.LogUpdateProcessorFactory [collection1]  webapp=/solr path=/update params={wt=javabin&version=2}{add=[8 (1549277146780794880)]} 0 0
   [junit4]   2> 827330 INFO  (qtp1695755482-7135) [    ] o.a.s.u.DirectUpdateHandler2 start commit{,optimize=false,openSearcher=true,waitSearcher=true,expungeDeletes=false,softCommit=false,prepareCommit=false}
   [junit4]   2> 827330 INFO  (qtp1695755482-7135) [    ] o.a.s.u.SolrIndexWriter Calling setCommitData with IW:org.apache.solr.update.SolrIndexWriter@23a46954
   [junit4]   2> 827332 INFO  (qtp1695755482-7135) [    ] o.a.s.s.SolrIndexSearcher Opening [Searcher@3ff95814[collection1] main]
   [junit4]   2> 827332 INFO  (qtp1695755482-7135) [    ] o.a.s.u.DirectUpdateHandler2 end_commit_flush
   [junit4]   2> 827333 INFO  (searcherExecutor-2918-thread-1) [    ] o.a.s.c.SolrCore [collection1] Registered new searcher Searcher@3ff95814[collection1] main{ExitableDirectoryReader(UninvertingDirectoryReader(Uninverting(_0(7.0.0):C3)))}
   [junit4]   2> 827333 INFO  (qtp1695755482-7135) [    ] o.a.s.u.p.LogUpdateProcessorFactory [collection1]  webapp=/solr path=/update params={waitSearcher=true&commit=true&softCommit=false&wt=javabin&version=2}{commit=} 0 2
   [junit4]   2> 827333 INFO  (qtp1765772251-7151) [    ] o.a.s.u.DirectUpdateHandler2 start commit{,optimize=false,openSearcher=true,waitSearcher=true,expungeDeletes=false,softCommit=false,prepareCommit=false}
   [junit4]   2> 827333 INFO  (qtp1765772251-7151) [    ] o.a.s.u.SolrIndexWriter Calling setCommitData with IW:org.apache.solr.update.SolrIndexWriter@650930c7
   [junit4]   2> 827334 INFO  (qtp1765772251-7151) [    ] o.a.s.s.SolrIndexSearcher Opening [Searcher@1509116d[collection1] main]
   [junit4]   2> 827334 INFO  (qtp1765772251-7151) [    ] o.a.s.u.DirectUpdateHandler2 end_commit_flush
   [junit4]   2> 827335 INFO  (searcherExecutor-2929-thread-1) [    ] o.a.s.c.SolrCore [collection1] Registered new searcher Searcher@1509116d[collection1] main{ExitableDirectoryReader(UninvertingDirectoryReader(Uninverting(_0(7.0.0):C3)))}
   [junit4]   2> 827335 INFO  (qtp1765772251-7151) [    ] o.a.s.u.p.LogUpdateProcessorFactory [collection1]  webapp=/solr path=/update params={waitSearcher=true&commit=true&softCommit=false&wt=javabin&version=2}{commit=} 0 1
   [junit4]   2> 827336 INFO  (qtp1930404505-7167) [    ] o.a.s.u.DirectUpdateHandler2 start commit{,optimize=false,openSearcher=true,waitSearcher=true,expungeDeletes=false,softCommit=false,prepareCommit=false}
   [junit4]   2> 827336 INFO  (qtp1930404505-7167) [    ] o.a.s.u.SolrIndexWriter Calling setCommitData with IW:org.apache.solr.update.SolrIndexWriter@718d27e
   [junit4]   2> 827337 INFO  (qtp1930404505-7167) [    ] o.a.s.s.SolrIndexSearcher Opening [Searcher@3978d318[collection1] main]
   [junit4]   2> 827337 INFO  (qtp1930404505-7167) [    ] o.a.s.u.DirectUpdateHandler2 end_commit_flush
   [junit4]   2> 827338 INFO  (searcherExecutor-2940-thread-1) [    ] o.a.s.c.SolrCore [collection1] Registered new searcher Searcher@3978d318[collection1] main{ExitableDirectoryReader(UninvertingDirectoryReader(Uninverting(_0(7.0.0):C3)))}
   [junit4]   2> 827338 INFO  (qtp1930404505-7167) [    ] o.a.s.u.p.LogUpdateProcessorFactory [collection1]  webapp=/solr path=/update params={waitSearcher=true&commit=true&softCommit=false&wt=javabin&version=2}{commit=} 0 1
   [junit4]   2> 827340 INFO  (qtp1765772251-7152) [    ] o.a.s.u.p.LogUpdateProcessorFactory [collection1]  webapp=/solr path=/update params={wt=javabin&version=2}{add=[9 (1549277146789183488)]} 0 1
   [junit4]   2> 827340 INFO  (qtp1765772251-7153) [    ] o.a.s.u.p.LogUpdateProcessorFactory [collection1]  webapp=/solr path=/update params={wt=javabin&version=2}{add=[10 (1549277146791280640)]} 0 0
   [junit4]   2> 827340 INFO  (qtp1765772251-7146) [    ] o.a.s.u.p.LogUpdateProcessorFactory [collection1]  webapp=/solr path=/update params={wt=javabin&version=2}{add=[11 (1549277146791280641)]} 0 0
   [junit4]   2> 827342 INFO  (qtp1930404505-7168) [    ] o.a.s.u.p.LogUpdateProcessorFactory [collection1]  webapp=/solr path=/update params={wt=javabin&version=2}{add=[12 (1549277146792329216)]} 0 0
   [junit4]   2> 827343 INFO  (qtp1695755482-7136) [    ] o.a.s.u.p.LogUpdateProcessorFactory [collection1]  webapp=/solr path=/update params={wt=javabin&version=2}{add=[13 (1549277146793377792)]} 0 0
   [junit4]   2> 827343 INFO  (qtp1765772251-7151) [    ] o.a.s.u.p.LogUpdateProcessorFactory [collection1]  webapp=/solr path=/update params={wt=javabin&version=2}{add=[14 (1549277146794426368)]} 0 0
   [junit4]   2> 827343 INFO  (qtp1930404505-7169) [    ] o.a.s.u.p.LogUpdateProcessorFactory [collection1]  webapp=/solr path=/update params={wt=javabin&version=2}{add=[15 (1549277146794426368)]} 0 0
   [junit4]   2> 827344 INFO  (qtp1695755482-7137) [    ] o.a.s.u.p.LogUpdateProcessorFactory [collection1]  webapp=/solr path=/update params={wt=javabin&version=2}{add=[16 (1549277146795474944)]} 0 0
   [junit4]   2> 827344 INFO  (qtp1765772251-7152) [    ] o.a.s.u.p.LogUpdateProcessorFactory [collection1]  webapp=/solr path=/update params={wt=javabin&version=2}{add=[17 (1549277146795474944)]} 0 0
   [junit4]   2> 827344 INFO  (qtp1695755482-7130) [    ] o.a.s.u.DirectUpdateHandler2 start commit{,optimize=false,openSearcher=true,waitSearcher=true,expungeDeletes=false,softCommit=false,prepareCommit=false}
   [junit4]   2> 827344 INFO  (qtp1695755482-7130) [    ] o.a.s.u.SolrIndexWriter Calling setCommitData with IW:org.apache.solr.update.SolrIndexWriter@23a46954
   [junit4]   2> 827346 INFO  (qtp1695755482-7130) [    ] o.a.s.s.SolrIndexSearcher Opening [Searcher@7a2de0a5[collection1] main]
   [junit4]   2> 827346 INFO  (qtp1695755482-7130) [    ] o.a.s.u.DirectUpdateHandler2 end_commit_flush
   [junit4]   2> 827346 INFO  (searcherExecutor-2918-thread-1) [    ] o.a.s.c.SolrCore [collection1] Registered new searcher Searcher@7a2de0a5[collection1] main{ExitableDirectoryReader(UninvertingDirectoryReader(Uninverting(_0(7.0.0):C3) Uninverting(_1(7.0.0):C2)))}
   [junit4]   2> 827346 INFO  (qtp1695755482-7130) [    ] o.a.s.u.p.LogUpdateProcessorFactory [collection1]  webapp=/solr path=/update params={waitSearcher=true&commit=true&softCommit=false&wt=javabin&version=2}{commit=} 0 1
   [junit4]   2> 827347 INFO  (qtp1765772251-7153) [    ] o.a.s.u.DirectUpdateHandler2 start commit{,optimize=false,openSearcher=true,waitSearcher=true,expungeDeletes=false,softCommit=false,prepareCommit=false}
   [junit4]   2> 827347 INFO  (qtp1765772251-7153) [    ] o.a.s.u.SolrIndexWriter Calling setCommitData with IW:org.apache.solr.update.SolrIndexWriter@650930c7
   [junit4]   2> 827349 INFO  (qtp1765772251-7153) [    ] o.a.s.s.SolrIndexSearcher Opening [Searcher@2e3ed25c[collection1] main]
   [junit4]   2> 827349 INFO  (qtp1765772251-7153) [    ] o.a.s.u.DirectUpdateHandler2 end_commit_flush
   [junit4]   2> 827349 INFO  (searcherExecutor-2929-thread-1) [    ] o.a.s.c.SolrCore [collection1] Registered new searcher Searcher@2e3ed25c[collection1] main{ExitableDirectoryReader(UninvertingDirectoryReader(Uninverting(_0(7.0.0):C3) Uninverting(_1(7.0.0):C5)))}
   [junit4]   2> 827349 INFO  (qtp1765772251-7153) [    ] o.a.s.u.p.LogUpdateProcessorFactory [collection1]  webapp=/solr path=/update params={waitSearcher=true&commit=true&softCommit=false&wt=javabin&version=2}{commit=} 0 2
   [junit4]   2> 827349 INFO  (qtp1930404505-7162) [    ] o.a.s.u.DirectUpdateHandler2 start commit{,optimize=false,openSearcher=true,waitSearcher=true,expungeDeletes=false,softCommit=false,prepareCommit=false}
   [junit4]   2> 827350 INFO  (qtp1930404505-7162) [    ] o.a.s.u.SolrIndexWriter Calling setCommitData with IW:org.apache.solr.update.SolrIndexWriter@718d27e
   [junit4]   2> 827350 INFO  (qtp1930404505-7162) [    ] o.a.s.s.SolrIndexSearcher Opening [Searcher@4de96d17[collection1] main]
   [junit4]   2> 827350 INFO  (qtp1930404505-7162) [    ] o.a.s.u.DirectUpdateHandler2 end_commit_flush
   [junit4]   2> 827351 INFO  (searcherExecutor-2940-thread-1) [    ] o.a.s.c.SolrCore [collection1] Registered new searcher Searcher@4de96d17[collection1] main{ExitableDirectoryReader(UninvertingDirectoryReader(Uninverting(_0(7.0.0):C3) Uninverting(_1(7.0.0):C2)))}
   [junit4]   2> 827351 INFO  (qtp1930404505-7162) [    ] o.a.s.u.p.LogUpdateProcessorFactory [collection1]  webapp=/solr path=/update params={waitSearcher=true&commit=true&softCommit=false&wt=javabin&version=2}{commit=} 0 1
   [junit4]   2> 827353 INFO  (qtp1930404505-7167) [    ] o.a.s.u.p.LogUpdateProcessorFactory [collection1]  webapp=/solr path=/update params={wt=javabin&version=2}{add=[18 (1549277146803863552)]} 0 1
   [junit4]   2> 827354 INFO  (qtp1695755482-7135) [    ] o.a.s.u.p.LogUpdateProcessorFactory [collection1]  webapp=/solr path=/update params={wt=javabin&version=2}{add=[19 (1549277146804912128)]} 0 1
   [junit4]   2> 827356 INFO  (qtp1765772251-7146) [    ] o.a.s.u.p.LogUpdateProcessorFactory [collection1]  webapp=/solr path=/update params={wt=javabin&version=2}{add=[20 (1549277146807009280)]} 0 1
   [junit4]   2> 827356 INFO  (qtp1930404505-7168) [    ] o.a.s.u.p.LogUpdateProcessorFactory [collection1]  webapp=/solr path=/update params={wt=javabin&version=2}{add=[21 (1549277146808057856)]} 0 0
   [junit4]   2> 827357 INFO  (qtp1765772251-7151) [    ] o.a.s.u.p.LogUpdateProcessorFactory [collection1]  webapp=/solr path=/update params={wt=javabin&version=2}{add=[22 (1549277146808057856)]} 0 0
   [junit4]   2> 827357 INFO  (qtp1930404505-7169) [    ] o.a.s.u.p.LogUpdateProcessorFactory [collection1]  webapp=/solr path=/update params={wt=javabin&version=2}{add=[23 (1549277146809106432)]} 0 0
   [junit4]   2> 827357 INFO  (qtp1695755482-7136) [    ] o.a.s.u.p.LogUpdateProcessorFactory [collection1]  webapp=/solr path=/update params={wt=javabin&version=2}{add=[24 (1549277146809106432)]} 0 0
   [junit4]   2> 827357 INFO  (qtp1765772251-7152) [    ] o.a.s.u.p.LogUpdateProcessorFactory [collection1]  webapp=/solr path=/update params={wt=javabin&version=2}{add=[25 (1549277146809106432)]} 0 0
   [junit4]   2> 827358 INFO  (qtp1930404505-7162) [    ] o.a.s.u.p.LogUpdateProcessorFactory [collection1]  webapp=/solr path=/update params={wt=javabin&version=2}{add=[26 (1549277146810155008)]} 0 0
   [junit4]   2> 827358 INFO  (qtp1695755482-7137) [    ] o.a.s.u.p.LogUpdateProcessorFactory [collection1]  webapp=/solr path=/update params={wt=javabin&version=2}{add=[27 (1549277146810155008)]} 0 0
   [junit4]   2> 827358 INFO  (qtp1765772251-7153) [    ] o.a.s.u.p.LogUpdateProcessorFactory [collection1]  webapp=/solr path=/update params={wt=javabin&version=2}{add=[28 (1549277146810155008)]} 0 0
   [junit4]   2> 827358 INFO  (qtp1695755482-7130) [    ] o.a.s.u.DirectUpdateHandler2 start commit{,optimize=false,openSearcher=true,waitSearcher=true,expungeDeletes=false,softCommit=false,prepareCommit=false}
   [junit4]   2> 827359 INFO  (qtp1695755482-7130) [    ] o.a.s.u.SolrIndexWriter Calling setCommitData with IW:org.apache.solr.update.SolrIndexWriter@23a46954
   [junit4]   2> 827361 INFO  (qtp1695755482-7130) [    ] o.a.s.s.SolrIndexSearcher Opening [Searcher@9bde95c[collection1] main]
   [junit4]   2> 827361 INFO  (qtp1695755482-7130) [    ] o.a.s.u.DirectUpdateHandler2 end_commit_flush
   [junit4]   2> 827361 INFO  (searcherExecutor-2918-thread-1) [    ] o.a.s.c.SolrCore [collection1] Registered new searcher Searcher@9bde95c[collection1] main{ExitableDirectoryReader(UninvertingDirectoryReader(Uninverting(_0(7.0.0):C3) Uninverting(_1(7.0.0):C2) Uninverting(_2(7.0.0):C3)))}
   [junit4]   2> 827361 INFO  (qtp1695755482-7130) [    ] o.a.s.u.p.LogUpdateProcessorFactory [collection1]  webapp=/solr path=/update params={waitSearcher=true&commit=true&softCommit=false&wt=javabin&version=2}{commit=} 0 2
   [junit4]   2> 827362 INFO  (qtp1765772251-7146) [    ] o.a.s.u.DirectUpdateHandler2 start commit{,optimize=false,openSearcher=true,waitSearcher=true,expungeDeletes=false,softCommit=false,prepareCommit=false}
   [junit4]   2> 827362 INFO  (qtp1765772251-7146) [    ] o.a.s.u.SolrIndexWriter Calling setCommitData with IW:org.apache.solr.update.SolrIndexWriter@650930c7
   [junit4]   2> 827363 INFO  (qtp1765772251-7146) [    ] o.a.s.s.SolrIndexSearcher Opening [Searcher@2bbda722[collection1] main]
   [junit4]   2> 827363 INFO  (qtp1765772251-7146) [    ] o.a.s.u.DirectUpdateHandler2 end_commit_flush
   [junit4]   2> 827364 INFO  (searcherExecutor-2929-thread-1) [    ] o.a.s.c.SolrCore [collection1] Registered new searcher Searcher@2bbda722[collection1] main{ExitableDirectoryReader(UninvertingDirectoryReader(Uninverting(_0(7.0.0):C3) Uninverting(_1(7.0.0):C5) Uninverting(_2(7.0.0):C4)))}
   [junit4]   2> 827364 INFO  (qtp1765772251-7146) [    ] o.a.s.u.p.LogUpdateProcessorFactory [collection1]  webapp=/solr path=/update params={waitSearcher=true&commit=true&softCommit=false&wt=javabin&version=2}{commit=} 0 2
   [junit4]   2> 827364 INFO  (qtp1930404505-7167) [    ] o.a.s.u.DirectUpdateHandler2 start commit{,optimize=false,openSearcher=true,waitSearcher=true,expungeDeletes=false,softCommit=false,prepareCommit=false}
   [junit4]   2> 827364 INFO  (qtp1930404505-7167) [    ] o.a.s.u.SolrIndexWriter Calling setCommitData with IW:org.apache.solr.update.SolrIndexWriter@718d27e
   [junit4]   2> 827365 INFO  (qtp1930404505-7167) [    ] o.a.s.s.SolrIndexSearcher Opening [Searcher@3bb2f7e8[collection1] main]
   [junit4]   2> 827365 INFO  (qtp1930404505-7167) [    ] o.a.s.u.DirectUpdateHandler2 end_commit_flush
   [junit4]   2> 827366 INFO  (searcherExecutor-2940-thread-1) [    ] o.a.s.c.SolrCore [collection1] Registered new searcher Searcher@3bb2f7e8[collection1] main{ExitableDirectoryReader(UninvertingDirectoryReader(Uninverting(_0(7.0.0):C3) Uninverting(_1(7.0.0):C2) Uninverting(_2(7.0.0):C4)))}
   [junit4]   2> 827366 INFO  (qtp1930404505-7167) [    ] o.a.s.u.p.LogUpdateProcessorFactory [collection1]  webapp=/solr path=/update params={waitSearcher=true&commit=true&softCommit=false&wt=javabin&version=2}{commit=} 0 1
   [junit4]   2> 827367 INFO  (qtp1930404505-7168) [    ] o.a.s.u.p.LogUpdateProcessorFactory [collection1]  webapp=/solr path=/update params={wt=javabin&version=2}{add=[29 (1549277146818543616)]} 0 1
   [junit4]   2> 827368 INFO  (qtp1695755482-7135) [    ] o.a.s.u.p.LogUpdateProcessorFactory [collection1]  webapp=/solr path=/update params={wt=javabin&version=2}{add=[30 (1549277146819592192)]} 0 0
   [junit4]   2> 827369 INFO  (qtp1765772251-7151) [    ] o.a.s.u.p.LogUpdateProcessorFactory [collection1]  webapp=/solr path=/update params={wt=javabin&version=2}{add=[31 (1549277146821689344)]} 0 0
   [junit4]   2> 827370 INFO  (qtp1930404505-7169) [    ] o.a.s.u.p.LogUpdateProcessorFactory [collection1]  webapp=/solr path=/update params={wt=javabin&version=2}{add=[32 (1549277146822737920)]} 0 0
   [junit4]   2> 827370 INFO  (qtp1930404505-7162) [    ] o.a.s.u.p.LogUpdateProcessorFactory [collection1]  webapp=/solr path=/update params={wt=javabin&version=2}{add=[33 (1549277146822737921)]} 0 0
   [junit4]   2> 827371 INFO  (qtp1695755482-7136) [    ] o.a.s.u.p.LogUpdateProcessorFactory [collection1]  webapp=/solr path=/update params={wt=javabin&version=2}{add=[34 (1549277146822737920)]} 0 0
   [junit4]   2> 827371 INFO  (qtp1765772251-7152) [    ] o.a.s.u.p.LogUpdateProcessorFactory [collection1]  webapp=/solr path=/update params={wt=javabin&version=2}{add=[35 (1549277146823786496)]} 0 0
   [junit4]   2> 827371 INFO  (qtp1930404505-7167) [    ] o.a.s.u.p.LogUpdateProcessorFactory [collection1]  webapp=/solr path=/update params={wt=javabin&version=2}{add=[36 (1549277146823786496)]} 0 0
   [junit4]   2> 827372 INFO  (qtp1695755482-7137) [    ] o.a.s.u.p.LogUpdateProcessorFactory [collection1]  webapp=/solr path=/update params={wt=javabin&version=2}{add=[37 (1549277146824835072)]} 0 0
   [junit4]   2> 827372 INFO  (qtp1765772251-7153) [    ] o.a.s.u.p.LogUpdateProcessorFactory [collection1]  webapp=/solr path=/update params={wt=javabin&version=2}{add=[38 (1549277146824835072)]} 0 0
   [junit4]   2> 827372 INFO  (qtp1930404505-7168) [    ] o.a.s.u.p.LogUpdateProcessorFactory [collection1]  webapp=/solr path=/update params={wt=javabin&version=2}{add=[39 (1549277146824835072)]} 0 0
   [junit4]   2> 827372 INFO  (qtp1695755482-7130) [    ] o.a.s.u.p.LogUpdateProcessorFactory [collection1]  webapp=/solr path=/update params={wt=javabin&version=2}{add=[40 (1549277146824835073)]} 0 0
   [junit4]   2> 827373 INFO  (qtp1695755482-7135) [    ] o.a.s.u.DirectUpdateHandler2 start commit{,optimize=false,openSearcher=true,waitSearcher=true,expungeDeletes=false,softCommit=false,prepareCommit=false}
   [junit4]   2> 827373 INFO  (qtp1695755482-7135) [    ] o.a.s.u.SolrIndexWriter Calling setCommitData with IW:org.apache.solr.update.SolrIndexWriter@23a46954
   [junit4]   2> 827374 INFO  (qtp1695755482-7135) [    ] o.a.s.s.SolrIndexSearcher Opening [Searcher@4abf6531[collection1] main]
   [junit4]   2> 827374 INFO  (qtp1695755482-7135) [    ] o.a.s.u.DirectUpdateHandler2 end_commit_flush
   [junit4]   2> 827374 INFO  (searcherExecutor-2918-thread-1) [    ] o.a.s.c.SolrCore [collection1] Registered new searcher Searcher@4abf6531[collection1] main{ExitableDirectoryReader(UninvertingDirectoryReader(Uninverting(_0(7.0.0):C3) Uninverting(_1(7.0.0):C2) Uninverting(_2(7.0.0):C3) Uninverting(_3(7.0.0):C4)))}
   [junit4]   2> 827375 INFO  (qtp1695755482-7135) [    ] o.a.s.u.p.LogUpdateProcessorFactory [collection1]  webapp=/solr path=/update params={waitSearcher=true&commit=true&softCommit=false&wt=javabin&version=2}{commit=} 0 2
   [junit4]   2> 827375 INFO  (qtp1765772251-7146) [    ] o.a.s.u.DirectUpdateHandler2 start commit{,optimize=false,openSearcher=true,waitSearcher=true,expungeDeletes=false,softCommit=false,prepareCommit=false}
   [junit4]   2> 827375 INFO  (qtp1765772251-7146) [    ] o.a.s.u.SolrIndexWriter Calling setCommitData with IW:org.apache.solr.update.SolrIndexWriter@650930c7
   [junit4]   2> 827377 INFO  (qtp1765772251-7146) [    ] o.a.s.s.SolrIndexSearcher Opening [Searcher@f7436b4[collection1] main]
   [junit4]   2> 827377 INFO  (qtp1765772251-7146) [    ] o.a.s.u.DirectUpdateHandler2 end_commit_flush
   [junit4]   2> 827377 INFO  (searcherExecutor-2929-thread-1) [    ] o.a.s.c.SolrCore [collection1] Registered new searcher Searcher@f7436b4[collection1] main{ExitableDirectoryReader(UninvertingDirectoryReader(Uninverting(_0(7.0.0):C3) Uninverting(_1(7.0.0):C5) Uninverting(_2(7.0.0):C4) Uninverting(_3(7.0.0):C3)))}
   [junit4]   2> 827378 INFO  (qtp1765772251-7146) [    ] o.a.s.u.p.LogUpdateProcessorFactory [collection1]  webapp=/solr path=/update params={waitSearcher=true&commit=true&softCommit=false&wt=javabin&version=2}{commit=} 0 2
   [junit4]   2> 827378 INFO  (qtp1930404505-7169) [    ] o.a.s.u.DirectUpdateHandler2 start commit{,optimize=false,openSearcher=true,waitSearcher=true,expungeDeletes=false,softCommit=false,prepareCommit=false}
   [junit4]   2> 827378 INFO  (qtp1930404505-7169) [    ] o.a.s.u.SolrIndexWriter Calling setCommitData with IW:org.apache.solr.update.SolrIndexWriter@718d27e
   [junit4]   2> 827379 INFO  (qtp1930404505-7169) [    ] o.a.s.s.SolrIndexSearcher Opening [Searcher@556baf04[collection1] main]
   [junit4]   2> 827379 INFO  (qtp1930404505-7169) [    ] o.a.s.u.DirectUpdateHandler2 end_commit_flush
   [junit4]   2> 827379 INFO  (searcherExecutor-2940-thread-1) [    ] o.a.s.c.SolrCore [collection1] Registered new searcher Searcher@556baf04[collection1] main{ExitableDirectoryReader(UninvertingDirectoryReader(Uninverting(_0(7.0.0):C3) Uninverting(_1(7.0.0):C2) Uninverting(_2(7.0.0):C4) Uninverting(_3(7.0.0):C5)))}
   [junit4]   2> 827380 INFO  (qtp1930404505-7169) [    ] o.a.s.u.p.LogUpdateProcessorFactory [collection1]  webapp=/solr path=/update params={waitSearcher=true&commit=true&softCommit=false&wt=javabin&version=2}{commit=} 0 1
   [junit4]   2> 827381 INFO  (qtp1765772251-7151) [    ] o.a.s.u.p.LogUpdateProcessorFactory [collection1]  webapp=/solr path=/update params={wt=javabin&version=2}{add=[41 (1549277146833223680)]} 0 1
   [junit4]   2> 827382 INFO  (qtp1930404505-7162) [    ] o.a.s.u.p.LogUpdateProcessorFactory [collection1]  webapp=/solr path=/update params={wt=javabin&version=2}{add=[42 (1549277146834272256)]} 0 0
   [junit4]   2> 827384 INFO  (qtp1695755482-7136) [    ] o.a.s.u.p.LogUpdateProcessorFactory [collection1]  webapp=/solr path=/update params={wt=javabin&version=2}{add=[43 (1549277146835320832)]} 0 1
   [junit4]   2> 827385 INFO  (qtp1765772251-7152) [    ] o.a.s.u.p.LogUpdateProcessorFactory [collection1]  webapp=/solr path=/update params={wt=javabin&version=2}{add=[44 (1549277146838466560)]} 0 0
   [junit4]   2> 827385 INFO  (qtp1930404505-7167) [    ] o.a.s.u.p.LogUpdateProcessorFactory [collection1]  webapp=/solr path=/update params={wt=javabin&version=2}{add=[45 (1549277146838466560)]} 0 0
   [junit4]   2> 827385 INFO  (qtp1695755482-7137) [    ] o.a.s.u.p.LogUpdateProcessorFactory [collection1]  webapp=/solr path=/update params={wt=javabin&version=2}{add=[46 (1549277146838466560)]} 0 0
   [junit4]   2> 827386 INFO  (qtp1765772251-7153) [    ] o.a.s.u.p.LogUpdateProcessorFactory [collection1]  webapp=/solr path=/update params={wt=javabin&version=2}{add=[47 (1549277146839515136)]} 0 0
   [junit4]   2> 827386 INFO  (qtp1930404505-7168) [    ] o.a.s.u.p.LogUpdateProcessorFactory [collection1]  webapp=/solr path=/update params={wt=javabin&version=2}{add=[48 (1549277146839515136)]} 0 0
   [junit4]   2> 827387 INFO  (qtp1695755482-7130) [    ] o.a.s.u.p.LogUpdateProcessorFactory [collection1]  webapp=/solr path=/update params={wt=javabin&version=2}{add=[49 (1549277146840563712)]} 0 0
   [junit4]   2> 827387 INFO  (qtp1765772251-7146) [    ] o.a.s.u.p.LogUpdateProcessorFactory [collection1]  webapp=/solr path=/update params={wt=javabin&version=2}{add=[50 (1549277146840563712)]} 0 0
   [junit4]   2> 827388 INFO  (qtp1930404505-7168) [    ] o.a.s.u.p.LogUpdateProcessorFactory [collection1]  webapp=/solr path=/update params={wt=javabin&version=2}{add=[51 (1549277146841612288)]} 0 0
   [junit4]   2> 827388 INFO  (qtp1695755482-7130) [    ] o.a.s.u.p.LogUpdateProcessorFactory [collection1]  webapp=/solr path=/update params={wt=javabin&version=2}{add=[52 (1549277146841612288)]} 0 0
   [junit4]   2> 827388 INFO  (qtp1765772251-7151) [    ] o.a.s.u.p.LogUpdateProcessorFactory [collection1]  webapp=/solr path=/update params={wt=javabin&version=2}{add=[53 (1549277146841612288)]} 0 0
   [junit4]   2> 827389 INFO  (qtp1930404505-7162) [    ] o.a.s.u.p.LogUpdateProcessorFactory [collection1]  webapp=/solr path=/update params={wt=javabin&version=2}{add=[54 (1549277146842660864)]} 0 0
   [junit4]   2> 827389 INFO  (qtp1695755482-7136) [    ] o.a.s.u.DirectUpdateHandler2 start commit{,optimize=false,openSearcher=true,waitSearcher=true,expungeDeletes=false,softCommit=false,prepareCommit=false}
   [junit4]   2> 827389 INFO  (qtp1695755482-7136) [    ] o.a.s.u.SolrIndexWriter Calling setCommitData with IW:org.apache.solr.update.SolrIndexWriter@23a46954
   [junit4]   2> 827390 INFO  (qtp1695755482-7136) [    ] o.a.s.s.SolrIndexSearcher Opening [Searcher@194dbe02[collection1] main]
   [junit4]   2> 827391 INFO  (qtp1695755482-7136) [    ] o.a.s.u.DirectUpdateHandler2 end_commit_flush
   [junit4]   2> 827391 INFO  (searcherExecutor-2918-thread-1) [    ] o.a.s.c.SolrCore [collection1] Registered new searcher Searcher@194dbe02[collection1] main{ExitableDirectoryReader(UninvertingDirectoryReader(Uninverting(_0(7.0.0):C3) Uninverting(_1(7.0.0):C2) Uninverting(_2(7.0.0):C3) Uninverting(_3(7.0.0):C4) Uninverting(_4(7.0.0):C4)))}
   [junit4]   2> 827391 INFO  (qtp1695755482-7136) [    ] o.a.s.u.p.LogUpdateProcessorFactory [collection1]  webapp=/solr path=/update params={waitSearcher=true&commit=true&softCommit=false&wt=javabin&version=2}{commit=} 0 2
   [junit4]   2> 827392 INFO  (qtp1765772251-7152) [    ] o.a.s.u.DirectUpdateHandler2 start commit{,optimize=false,openSearcher=true,waitSearcher=true,expungeDeletes=false,softCommit=false,prepareCommit=false}
   [junit4]   2> 827392 INFO  (qtp1765772251-7152) [    ] o.a.s.u.SolrIndexWriter Calling setCommitData with IW:org.apache.solr.update.SolrIndexWriter@650930c7
   [junit4]   2> 827393 INFO  (qtp1765772251-7152) [    ] o.a.s.s.SolrIndexSearcher Opening [Searcher@709a108c[collection1] main]
   [junit4]   2> 827393 INFO  (qtp1765772251-7152) [    ] o.a.s.u.DirectUpdateHandler2 end_commit_flush
   [junit4]   2> 827394 INFO  (searcherExecutor-2929-thread-1) [    ] o.a.s.c.SolrCore [collection1] Registered new searcher Searcher@709a108c[collection1] main{ExitableDirectoryReader(UninvertingDirectoryReader(Uninverting(_0(7.0.0):C3) Uninverting(_1(7.0.0):C5) Uninverting(_2(7.0.0):C4) Uninverting(_3(7.0.0):C3) Uninverting(_4(7.0.0):C5)))}
   [junit4]   2> 827394 INFO  (qtp1765772251-7152) [    ] o.a.s.u.p.LogUpdateProcessorFactory [collection1]  webapp=/solr path=/update params={waitSearcher=true&commit=true&softCommit=false&wt=javabin&version=2}{commit=} 0 2
   [junit4]   2> 827394 INFO  (qtp1930404505-7167) [    ] o.a.s.u.DirectUpdateHandler2 start commit{,optimize=false,openSearcher=true,waitSearcher=true,expungeDeletes=false,softCommit=false,prepareCommit=false}
   [junit4]   2> 827394 INFO  (qtp1930404505-7167) [    ] o.a.s.u.SolrIndexWriter Calling setCommitData with IW:org.apache.solr.update.SolrIndexWriter@718d27e
   [junit4]   2> 827396 INFO  (qtp1930404505-7167) [    ] o.a.s.s.SolrIndexSearcher Opening [Searcher@6a41f12f[collection1] main]
   [junit4]   2> 827397 INFO  (qtp1930404505-7167) [    ] o.a.s.u.DirectUpdateHandler2 end_commit_flush
   [junit4]   2> 827397 INFO  (searcherExecutor-2940-thread-1) [    ] o.a.s.c.SolrCore [collection1] Registered new searcher Searcher@6a41f12f[collection1] main{ExitableDirectoryReader(UninvertingDirectoryReader(Uninverting(_0(7.0.0):C3) Uninverting(_1(7.0.0):C2) Uninverting(_2(7.0.0):C4) Uninverting(_3(7.0.0):C5) Uninverting(_4(7.0.0):C5)))}
   [junit4]   2> 827397 INFO  (qtp1930404505-7167) [    ] o.a.s.u.p.LogUpdateProcessorFactory [collection1]  webapp=/solr path=/update params={waitSearcher=true&commit=true&softCommit=false&wt=javabin&version=2}{commit=} 0 2
   [junit4]   2> 827399 INFO  (qtp1930404505-7169) [    ] o.a.s.u.p.LogUpdateProcessorFactory [collection1]  webapp=/solr path=/update params={wt=javabin&version=2}{add=[55 (1549277146852098048)]} 0 1
   [junit4]   2> 827400 INFO  (qtp1695755482-7137) [    ] o.a.s.u.p.LogUpdateProcessorFactory [collection1]  webapp=/solr path=/update params={wt=javabin&version=2}{add=[56 (1549277146853146624)]} 0 0
   [junit4]   2> 827401 INFO  (qtp1765772251-7153) [    ] o.a.s.u.p.LogUpdateProcessorFactory [collection1]  webapp=/solr path=/update params={wt=javabin&version=2}{add=[57 (1549277146854195200)]} 0 0
   [junit4]   2> 827401 INFO  (qtp1695755482-7135) [    ] o.a.s.u.DirectUpdateHandler2 start commit{,optimize=false,openSearcher=true,waitSearcher=true,expungeDeletes=false,softCommit=false,prepareCommit=false}
   [junit4]   2> 827401 INFO  (qtp1695755482-7135) [    ] o.a.s.u.SolrIndexWriter Calling setCommitData with IW:org.apache.solr.update.SolrIndexWriter@23a46954
   [junit4]   2> 827403 INFO  (qtp1695755482-7135) [    ] o.a.s.s.SolrIndexSearcher Opening [Searcher@2449c49d[collection1] main]
   [junit4]   2> 827403 INFO  (qtp1695755482-7135) [    ] o.a.s.u.DirectUpdateHandler2 end_commit_flush
   [junit4]   2> 827403 INFO  (searcherExecutor-2918-thread-1) [    ] o.a.s.c.SolrCore [collection1] Registered new searcher Searcher@2449c49d[collection1] main{ExitableDirectoryReader(UninvertingDirectoryReader(Uninverting(_0(7.0.0):C3) Uninverting(_1(7.0.0):C2) Uninverting(_2(7.0.0):C3) Uninverting(_3(7.0.0):C4) Uninverting(_4(7.0.0):C4) Uninverting(_5(7.0.0):C1)))}
   [junit4]   2> 827403 INFO  (qtp1695755482-7135) [    ] o.a.s.u.p.LogUpdateProcessorFactory [collection1]  webapp=/solr path=/update params={waitSearcher=true&commit=true&softCommit=false&wt=javabin&version=2}{commit=} 0 2
   [junit4]   2> 827404 INFO  (qtp1765772251-7146) [    ] o.a.s.u.DirectUpdateHandler2 start commit{,optimize=false,openSearcher=true,waitSearcher=true,expungeDeletes=false,softCommit=false,prepareCommit=false}
   [junit4]   2> 827404 INFO  (qtp1765772251-7146) [    ] o.a.s.u.SolrIndexWriter Calling setCommitData with IW:org.apache.solr.update.SolrIndexWriter@650930c7
   [junit4]   2> 827405 INFO  (qtp1765772251-7146) [    ] o.a.s.s.SolrIndexSearcher Opening [Searcher@45520b0a[collection1] main]
   [junit4]   2> 827405 INFO  (qtp1765772251-7146) [    ] o.a.s.u.DirectUpdateHandler2 end_commit_flush
   [junit4]   2> 827406 INFO  (searcherExecutor-2929-thread-1) [    ] o.a.s.c.SolrCore [collection1] Registered new searcher Searcher@45520b0a[collection1] main{ExitableDirectoryReader(UninvertingDirectoryReader(Uninverting(_0(7.0.0):C3) Uninverting(_1(7.0.0):C5) Uninverting(_2(7.0.0):C4) Uninverting(_3(7.0.0):C3) Uninverting(_4(7.0.0):C5) Uninverting(_5(7.0.0):C1)))}
   [junit4]   2> 827406 INFO  (qtp1765772251-7146) [    ] o.a.s.u.p.LogUpdateProcessorFactory [collection1]  webapp=/solr path=/update params={waitSearcher=true&commit=true&softCommit=false&wt=javabin&version=2}{commit=} 0 2
   [junit4]   2> 827406 INFO  (qtp1930404505-7168) [    ] o.a.s.u.DirectUpdateHandler2 start commit{,optimize=false,openSearcher=true,waitSearcher=true,expungeDeletes=false,softCommit=false,prepareCommit=false}
   [junit4]   2> 827406 INFO  (qtp1930404505-7168) [    ] o.a.s.u.SolrIndexWriter Calling setCommitData with IW:org.apache.solr.update.SolrIndexWriter@718d27e
   [junit4]   2> 827408 INFO  (qtp1930404505-7168) [    ] o.a.s.s.SolrIndexSearcher Opening [Searcher@7936d186[collection1] main]
   [junit4]   2> 827408 INFO  (qtp1930404505-7168) [    ] o.a.s.u.DirectUpdateHandler2 end_commit_flush
   [junit4]   2> 827408 INFO  (searcherExecutor-2940-thread-1) [    ] o.a.s.c.SolrCore [collection1] Registered new searcher Searcher@7936d186[collection1] main{ExitableDirectoryReader(UninvertingDirectoryReader(Uninverting(_0(7.0.0):C3) Uninverting(_1(7.0.0):C2) Uninverting(_2(7.0.0):C4) Uninverting(_3(7.0.0):C5) Uninverting(_4(7.0.0):C5) Uninverting(_5(7.0.0):C1)))}
   [junit4]   2> 827408 INFO  (qtp1930404505-7168) [    ] o.a.s.u.p.LogUpdateProcessorFactory [collection1]  webapp=/solr path=/update params={waitSearcher=true&commit=true&softCommit=false&wt=javabin&version=2}{commit=} 0 2
   [junit4]   2> 827410 INFO  (qtp1930404505-7162) [    ] o.a.s.u.p.LogUpdateProcessorFactory [collection1]  webapp=/solr path=/update params={wt=javabin&version=2}{add=[58 (1549277146863632384)]} 0 1
   [junit4]   2> 827411 INFO  (qtp1695755482-7130) [    ] o.a.s.u.p.LogUpdateProcessorFactory [collection1]  webapp=/solr path=/update params={wt=javabin&version=2}{add=[59 (1549277146864680960)]} 0 0
   [junit4]   2> 827412 INFO  (qtp1765772251-7151) [    ] o.a.s.u.p.LogUpdateProcessorFactory [collection1]  webapp=/solr path=/update params={wt=javabin&version=2}{add=[60 (1549277146865729536)]} 0 0
   [junit4]   2> 827413 INFO  (qtp1930404505-7167) [    ] o.a.s.u.p.LogUpdateProcessorFactory [collection1]  webapp=/solr path=/update params={wt=javabin&version=2}{add=[61 (1549277146867826688)]} 0 0
   [junit4]   2> 827413 INFO  (qtp1695755482-7136) [    ] o.a.s.u.p.LogUpdateProcessorFactory [collection1]  webapp=/solr path=/update params={wt=javabin&version=2}{add=[62 (1549277146867826688)]} 0 0
   [junit4]   2> 827413 INFO  (qtp1765772251-7152) [    ] o.a.s.u.p.LogUpdateProcessorFactory [collection1]  webapp=/solr path=/update params={wt=javabin&version=2}{add=[63 (1549277146867826688)]} 0 0
   [junit4]   2> 827414 INFO  (qtp1930404505-7169) [    ] o.a.s.u.p.LogUpdateProcessorFactory [collection1]  webapp=/solr path=/update p

[...truncated too long message...]

{date=date_dt&super_s=super_s&distrib=false&fl=id&fl=score&shards.purpose=1048580&noexist=noexist_s&fsv=true&shard.url=127.0.0.1:39087/solr/collection1&where_s=where_s&Z_num_i=Z_num_i&num_is=num_is&wt=javabin&multi_ss=multi_ss&_facet_={}&val_b=val_b&start=0&cat_s=cat_s&rows=0&version=2&num_d=num_d&q=*:*&json.facet={cat0:{type:terms,+field:cat_s,+sort:'count+desc',+limit:1,+overrequest:0},cat1:{type:terms,+field:cat_s,+sort:'count+desc',+limit:1,+overrequest:1},catDef:{type:terms,+field:cat_s,+sort:'count+desc',+limit:1,+overrequest:-1},catBig:{type:terms,+field:cat_s,+sort:'count+desc',+offset:1,+limit:2147483647,+overrequest:2147483647}}&num_i=num_i&sparse_s=sparse_s&NOW=1477505843986&isShard=true&num_fs=num_fs} hits=2 status=0 QTime=0
   [junit4]   2> 847438 INFO  (qtp1695755482-7135) [    ] o.a.s.c.S.Request [collection1]  webapp=/solr path=/select params={date=date_dt&super_s=super_s&indent=true&noexist=noexist_s&val_b=val_b&cat_s=cat_s&rows=0&version=2.2&num_d=num_d&shards=127.0.0.1:33092/solr/collection1,127.0.0.1:42257/solr/collection1,127.0.0.1:39087/solr/collection1&shards=debugQuery&shards=false&q=*:*&json.facet={cat0:{type:terms,+field:${cat_s},+sort:'count+desc',+limit:1,+overrequest:0},cat1:{type:terms,+field:${cat_s},+sort:'count+desc',+limit:1,+overrequest:1},catDef:{type:terms,+field:${cat_s},+sort:'count+desc',+limit:1,+overrequest:-1},catBig:{type:terms,+field:${cat_s},+sort:'count+desc',+offset:1,+limit:2147483647,+overrequest:2147483647}}&num_i=num_i&sparse_s=sparse_s&where_s=where_s&Z_num_i=Z_num_i&num_is=num_is&wt=json&multi_ss=multi_ss&num_fs=num_fs} hits=6 status=0 QTime=1
   [junit4]   2> 847438 ERROR (TEST-TestJsonFacets.testStatsDistrib-seed#[7AB5CCD1A6FA4C6D]) [    ] o.a.s.SolrTestCaseHS query failed JSON validation. error=mismatch: 'A'!='B' @ facets/cat0/buckets/[0]/val
   [junit4]   2>  expected =facets=={ count:6, cat0:{ buckets:[ {val:A,count:2} ] }, cat1:{ buckets:[ {val:B,count:3} ] }, catDef:{ buckets:[ {val:B,count:3} ] }, catBig:{ buckets:[ {val:A,count:2} ] }}
   [junit4]   2>  response = {
   [junit4]   2>   "responseHeader":{
   [junit4]   2>     "status":0,
   [junit4]   2>     "QTime":1},
   [junit4]   2>   "response":{"numFound":6,"start":0,"maxScore":1.0,"docs":[]
   [junit4]   2>   },
   [junit4]   2>   "facets":{
   [junit4]   2>     "count":6,
   [junit4]   2>     "catDef":{
   [junit4]   2>       "buckets":[{
   [junit4]   2>           "val":"B",
   [junit4]   2>           "count":3}]},
   [junit4]   2>     "cat0":{
   [junit4]   2>       "buckets":[{
   [junit4]   2>           "val":"B",
   [junit4]   2>           "count":3}]},
   [junit4]   2>     "cat1":{
   [junit4]   2>       "buckets":[{
   [junit4]   2>           "val":"B",
   [junit4]   2>           "count":3}]},
   [junit4]   2>     "catBig":{
   [junit4]   2>       "buckets":[{
   [junit4]   2>           "val":"A",
   [junit4]   2>           "count":2}]}}}
   [junit4]   2> 
   [junit4]   2> 847438 INFO  (TEST-TestJsonFacets.testStatsDistrib-seed#[7AB5CCD1A6FA4C6D]) [    ] o.a.s.SolrTestCaseJ4 ###Ending testStatsDistrib {p0=UIF}
   [junit4]   2> NOTE: reproduce with: ant test  -Dtestcase=TestJsonFacets -Dtests.method=testStatsDistrib -Dtests.seed=7AB5CCD1A6FA4C6D -Dtests.multiplier=3 -Dtests.slow=true -Dtests.locale=fr-MR -Dtests.timezone=Etc/GMT+1 -Dtests.asserts=true -Dtests.file.encoding=UTF-8
   [junit4] ERROR   0.33s J2 | TestJsonFacets.testStatsDistrib {p0=UIF} <<<
   [junit4]    > Throwable #1: java.lang.RuntimeException: mismatch: 'A'!='B' @ facets/cat0/buckets/[0]/val
   [junit4]    > 	at __randomizedtesting.SeedInfo.seed([7AB5CCD1A6FA4C6D:A67565A7CB7BE8A7]:0)
   [junit4]    > 	at org.apache.solr.SolrTestCaseHS.matchJSON(SolrTestCaseHS.java:161)
   [junit4]    > 	at org.apache.solr.SolrTestCaseHS.assertJQ(SolrTestCaseHS.java:143)
   [junit4]    > 	at org.apache.solr.SolrTestCaseHS$Client$Tester.assertJQ(SolrTestCaseHS.java:255)
   [junit4]    > 	at org.apache.solr.SolrTestCaseHS$Client.testJQ(SolrTestCaseHS.java:296)
   [junit4]    > 	at org.apache.solr.search.facet.TestJsonFacets.doStatsTemplated(TestJsonFacets.java:1152)
   [junit4]    > 	at org.apache.solr.search.facet.TestJsonFacets.doStats(TestJsonFacets.java:361)
   [junit4]    > 	at org.apache.solr.search.facet.TestJsonFacets.testStatsDistrib(TestJsonFacets.java:322)
   [junit4]    > 	at jdk.internal.reflect.NativeMethodAccessorImpl.invoke0(java.base@9-ea/Native Method)
   [junit4]    > 	at jdk.internal.reflect.NativeMethodAccessorImpl.invoke(java.base@9-ea/NativeMethodAccessorImpl.java:62)
   [junit4]    > 	at jdk.internal.reflect.DelegatingMethodAccessorImpl.invoke(java.base@9-ea/DelegatingMethodAccessorImpl.java:43)
   [junit4]    > 	at java.lang.Thread.run(java.base@9-ea/Thread.java:843)
   [junit4]   2> 847440 INFO  (SUITE-TestJsonFacets-seed#[7AB5CCD1A6FA4C6D]-worker) [    ] o.e.j.s.ServerConnector Stopped ServerConnector@5afc34ed{HTTP/1.1,[http/1.1]}{127.0.0.1:0}
   [junit4]   2> 847441 INFO  (SUITE-TestJsonFacets-seed#[7AB5CCD1A6FA4C6D]-worker) [    ] o.a.s.c.CoreContainer Shutting down CoreContainer instance=1203540890
   [junit4]   2> 847461 INFO  (coreCloseExecutor-2945-thread-1) [    ] o.a.s.c.SolrCore [collection1]  CLOSING SolrCore org.apache.solr.core.SolrCore@1ed0c689
   [junit4]   2> 847475 INFO  (SUITE-TestJsonFacets-seed#[7AB5CCD1A6FA4C6D]-worker) [    ] o.e.j.s.h.ContextHandler Stopped o.e.j.s.ServletContextHandler@6942f2c0{/solr,null,UNAVAILABLE}
   [junit4]   2> 847476 INFO  (SUITE-TestJsonFacets-seed#[7AB5CCD1A6FA4C6D]-worker) [    ] o.e.j.s.ServerConnector Stopped ServerConnector@4cf44595{HTTP/1.1,[http/1.1]}{127.0.0.1:0}
   [junit4]   2> 847476 INFO  (SUITE-TestJsonFacets-seed#[7AB5CCD1A6FA4C6D]-worker) [    ] o.a.s.c.CoreContainer Shutting down CoreContainer instance=1063705791
   [junit4]   2> 847477 INFO  (coreCloseExecutor-2947-thread-1) [    ] o.a.s.c.SolrCore [collection1]  CLOSING SolrCore org.apache.solr.core.SolrCore@303a0bf9
   [junit4]   2> 847500 INFO  (SUITE-TestJsonFacets-seed#[7AB5CCD1A6FA4C6D]-worker) [    ] o.e.j.s.h.ContextHandler Stopped o.e.j.s.ServletContextHandler@c8466ae{/solr,null,UNAVAILABLE}
   [junit4]   2> 847501 INFO  (SUITE-TestJsonFacets-seed#[7AB5CCD1A6FA4C6D]-worker) [    ] o.e.j.s.ServerConnector Stopped ServerConnector@a643fe7{HTTP/1.1,[http/1.1]}{127.0.0.1:0}
   [junit4]   2> 847501 INFO  (SUITE-TestJsonFacets-seed#[7AB5CCD1A6FA4C6D]-worker) [    ] o.a.s.c.CoreContainer Shutting down CoreContainer instance=595389083
   [junit4]   2> 847520 INFO  (coreCloseExecutor-2949-thread-1) [    ] o.a.s.c.SolrCore [collection1]  CLOSING SolrCore org.apache.solr.core.SolrCore@2c8a0b80
   [junit4]   2> 847551 INFO  (SUITE-TestJsonFacets-seed#[7AB5CCD1A6FA4C6D]-worker) [    ] o.e.j.s.h.ContextHandler Stopped o.e.j.s.ServletContextHandler@704efae8{/solr,null,UNAVAILABLE}
   [junit4]   2> 847552 INFO  (SUITE-TestJsonFacets-seed#[7AB5CCD1A6FA4C6D]-worker) [    ] o.a.s.SolrTestCaseJ4 ###deleteCore
   [junit4]   2> 847552 INFO  (SUITE-TestJsonFacets-seed#[7AB5CCD1A6FA4C6D]-worker) [    ] o.a.s.c.CoreContainer Shutting down CoreContainer instance=1181109647
   [junit4]   2> 847552 INFO  (coreCloseExecutor-2951-thread-1) [    ] o.a.s.c.SolrCore [collection1]  CLOSING SolrCore org.apache.solr.core.SolrCore@6e854797
   [junit4]   2> NOTE: leaving temporary files on disk at: /home/jenkins/workspace/Lucene-Solr-master-Linux/solr/build/solr-core/test/J2/temp/solr.search.facet.TestJsonFacets_7AB5CCD1A6FA4C6D-001
   [junit4]   2> NOTE: test params are: codec=Lucene70, sim=RandomSimilarity(queryNorm=false): {}, locale=fr-MR, timezone=Etc/GMT+1
   [junit4]   2> NOTE: Linux 4.4.0-42-generic amd64/Oracle Corporation 9-ea (64-bit)/cpus=12,threads=1,free=89188496,total=530579456
   [junit4]   2> NOTE: All tests run in this JVM: [TestUseDocValuesAsStored2, TestOverriddenPrefixQueryForCustomFieldType, TestMiniSolrCloudCluster, ClassificationUpdateProcessorFactoryTest, FullSolrCloudDistribCmdsTest, PrimitiveFieldTypeTest, SuggesterTSTTest, DocValuesMultiTest, TestMergePolicyConfig, HardAutoCommitTest, CursorMarkTest, TestConfigSetsAPIExclusivity, SynonymTokenizerTest, TestDistribDocBasedVersion, TestScoreJoinQPNoScore, DirectUpdateHandlerOptimizeTest, XmlUpdateRequestHandlerTest, TestPHPSerializedResponseWriter, DateFieldTest, ShowFileRequestHandlerTest, TestWriterPerf, FieldAnalysisRequestHandlerTest, TestTolerantUpdateProcessorCloud, UpdateParamsTest, ChangedSchemaMergeTest, BlockJoinFacetRandomTest, NoCacheHeaderTest, RuleEngineTest, PreAnalyzedFieldTest, DebugComponentTest, TestCollapseQParserPlugin, TestReloadDeadlock, TermVectorComponentDistributedTest, BadIndexSchemaTest, TestCloudManagedSchema, DistributedFacetPivotSmallAdvancedTest, FieldMutatingUpdateProcessorTest, JSONWriterTest, TestStandardQParsers, TestReloadAndDeleteDocs, UUIDUpdateProcessorFallbackTest, TestCloudInspectUtil, HttpPartitionTest, TestManagedSynonymFilterFactory, IgnoreCommitOptimizeUpdateProcessorFactoryTest, TestAnalyzeInfixSuggestions, CollectionsAPISolrJTest, CleanupOldIndexTest, TestLMDirichletSimilarityFactory, LeaderElectionTest, TestSolrDynamicMBean, TestHashQParserPlugin, CdcrRequestHandlerTest, TestCoreDiscovery, DistributedQueueTest, DirectoryFactoryTest, SolrXmlInZkTest, TestManagedResourceStorage, TestSortingResponseWriter, TestDistributedMissingSort, OverseerTest, CollectionStateFormat2Test, TestHdfsCloudBackupRestore, ConnectionManagerTest, VersionInfoTest, HdfsRecoveryZkTest, TestSQLHandlerNonCloud, SliceStateTest, RAMDirectoryFactoryTest, ExternalFileFieldSortTest, LeaderFailureAfterFreshStartTest, HdfsCollectionsAPIDistributedZkTest, TestRebalanceLeaders, TestCloudRecovery, OverriddenZkACLAndCredentialsProvidersTest, TestDocBasedVersionConstraints, TestGroupingSearch, CloudMLTQParserTest, DeleteInactiveReplicaTest, BasicDistributedZk2Test, TestFastOutputStream, EnumFieldTest, TestUtils, TestJsonFacets]
   [junit4] Completed [269/644 (1!)] on J2 in 22.39s, 48 tests, 6 errors <<< FAILURES!

[...truncated 51103 lines...]


Mime
View raw message