lucene-dev mailing list archives

Site index · List index
Message view « Date » · « Thread »
Top « Date » · « Thread »
From Policeman Jenkins Server <jenk...@thetaphi.de>
Subject [JENKINS] Lucene-Solr-6.x-Windows (32bit/jdk1.8.0_102) - Build # 541 - Unstable!
Date Wed, 26 Oct 2016 20:09:01 GMT
Build: https://jenkins.thetaphi.de/job/Lucene-Solr-6.x-Windows/541/
Java: 32bit/jdk1.8.0_102 -server -XX:+UseParallelGC

6 tests failed.
FAILED:  org.apache.solr.search.facet.TestJsonFacets.testStatsDistrib {p0=DVHASH}

Error Message:
mismatch: 'A'!='B' @ facets/cat0/buckets/[0]/val

Stack Trace:
java.lang.RuntimeException: mismatch: 'A'!='B' @ facets/cat0/buckets/[0]/val
	at __randomizedtesting.SeedInfo.seed([ED73C296F172D5DE:31B36BE09CF37114]:0)
	at org.apache.solr.SolrTestCaseHS.matchJSON(SolrTestCaseHS.java:161)
	at org.apache.solr.SolrTestCaseHS.assertJQ(SolrTestCaseHS.java:143)
	at org.apache.solr.SolrTestCaseHS$Client$Tester.assertJQ(SolrTestCaseHS.java:255)
	at org.apache.solr.SolrTestCaseHS$Client.testJQ(SolrTestCaseHS.java:296)
	at org.apache.solr.search.facet.TestJsonFacets.doStatsTemplated(TestJsonFacets.java:1152)
	at org.apache.solr.search.facet.TestJsonFacets.doStats(TestJsonFacets.java:361)
	at org.apache.solr.search.facet.TestJsonFacets.testStatsDistrib(TestJsonFacets.java:322)
	at sun.reflect.NativeMethodAccessorImpl.invoke0(Native Method)
	at sun.reflect.NativeMethodAccessorImpl.invoke(NativeMethodAccessorImpl.java:62)
	at sun.reflect.DelegatingMethodAccessorImpl.invoke(DelegatingMethodAccessorImpl.java:43)
	at java.lang.reflect.Method.invoke(Method.java:498)
	at com.carrotsearch.randomizedtesting.RandomizedRunner.invoke(RandomizedRunner.java:1713)
	at com.carrotsearch.randomizedtesting.RandomizedRunner$8.evaluate(RandomizedRunner.java:907)
	at com.carrotsearch.randomizedtesting.RandomizedRunner$9.evaluate(RandomizedRunner.java:943)
	at com.carrotsearch.randomizedtesting.RandomizedRunner$10.evaluate(RandomizedRunner.java:957)
	at com.carrotsearch.randomizedtesting.rules.SystemPropertiesRestoreRule$1.evaluate(SystemPropertiesRestoreRule.java:57)
	at org.apache.lucene.util.TestRuleSetupTeardownChained$1.evaluate(TestRuleSetupTeardownChained.java:49)
	at org.apache.lucene.util.AbstractBeforeAfterRule$1.evaluate(AbstractBeforeAfterRule.java:45)
	at org.apache.lucene.util.TestRuleThreadAndTestName$1.evaluate(TestRuleThreadAndTestName.java:48)
	at org.apache.lucene.util.TestRuleIgnoreAfterMaxFailures$1.evaluate(TestRuleIgnoreAfterMaxFailures.java:64)
	at org.apache.lucene.util.TestRuleMarkFailure$1.evaluate(TestRuleMarkFailure.java:47)
	at com.carrotsearch.randomizedtesting.rules.StatementAdapter.evaluate(StatementAdapter.java:36)
	at com.carrotsearch.randomizedtesting.ThreadLeakControl$StatementRunner.run(ThreadLeakControl.java:367)
	at com.carrotsearch.randomizedtesting.ThreadLeakControl.forkTimeoutingTask(ThreadLeakControl.java:811)
	at com.carrotsearch.randomizedtesting.ThreadLeakControl$3.evaluate(ThreadLeakControl.java:462)
	at com.carrotsearch.randomizedtesting.RandomizedRunner.runSingleTest(RandomizedRunner.java:916)
	at com.carrotsearch.randomizedtesting.RandomizedRunner$5.evaluate(RandomizedRunner.java:802)
	at com.carrotsearch.randomizedtesting.RandomizedRunner$6.evaluate(RandomizedRunner.java:852)
	at com.carrotsearch.randomizedtesting.RandomizedRunner$7.evaluate(RandomizedRunner.java:863)
	at com.carrotsearch.randomizedtesting.rules.StatementAdapter.evaluate(StatementAdapter.java:36)
	at com.carrotsearch.randomizedtesting.rules.SystemPropertiesRestoreRule$1.evaluate(SystemPropertiesRestoreRule.java:57)
	at org.apache.lucene.util.AbstractBeforeAfterRule$1.evaluate(AbstractBeforeAfterRule.java:45)
	at com.carrotsearch.randomizedtesting.rules.StatementAdapter.evaluate(StatementAdapter.java:36)
	at org.apache.lucene.util.TestRuleStoreClassName$1.evaluate(TestRuleStoreClassName.java:41)
	at com.carrotsearch.randomizedtesting.rules.NoShadowingOrOverridesOnMethodsRule$1.evaluate(NoShadowingOrOverridesOnMethodsRule.java:40)
	at com.carrotsearch.randomizedtesting.rules.NoShadowingOrOverridesOnMethodsRule$1.evaluate(NoShadowingOrOverridesOnMethodsRule.java:40)
	at com.carrotsearch.randomizedtesting.rules.StatementAdapter.evaluate(StatementAdapter.java:36)
	at com.carrotsearch.randomizedtesting.rules.StatementAdapter.evaluate(StatementAdapter.java:36)
	at com.carrotsearch.randomizedtesting.rules.StatementAdapter.evaluate(StatementAdapter.java:36)
	at org.apache.lucene.util.TestRuleAssertionsRequired$1.evaluate(TestRuleAssertionsRequired.java:53)
	at org.apache.lucene.util.TestRuleMarkFailure$1.evaluate(TestRuleMarkFailure.java:47)
	at org.apache.lucene.util.TestRuleIgnoreAfterMaxFailures$1.evaluate(TestRuleIgnoreAfterMaxFailures.java:64)
	at org.apache.lucene.util.TestRuleIgnoreTestSuites$1.evaluate(TestRuleIgnoreTestSuites.java:54)
	at com.carrotsearch.randomizedtesting.rules.StatementAdapter.evaluate(StatementAdapter.java:36)
	at com.carrotsearch.randomizedtesting.ThreadLeakControl$StatementRunner.run(ThreadLeakControl.java:367)
	at java.lang.Thread.run(Thread.java:745)


FAILED:  org.apache.solr.search.facet.TestJsonFacets.testStatsDistrib {p0=DV}

Error Message:
mismatch: 'A'!='B' @ facets/cat0/buckets/[0]/val

Stack Trace:
java.lang.RuntimeException: mismatch: 'A'!='B' @ facets/cat0/buckets/[0]/val
	at __randomizedtesting.SeedInfo.seed([ED73C296F172D5DE:31B36BE09CF37114]:0)
	at org.apache.solr.SolrTestCaseHS.matchJSON(SolrTestCaseHS.java:161)
	at org.apache.solr.SolrTestCaseHS.assertJQ(SolrTestCaseHS.java:143)
	at org.apache.solr.SolrTestCaseHS$Client$Tester.assertJQ(SolrTestCaseHS.java:255)
	at org.apache.solr.SolrTestCaseHS$Client.testJQ(SolrTestCaseHS.java:296)
	at org.apache.solr.search.facet.TestJsonFacets.doStatsTemplated(TestJsonFacets.java:1152)
	at org.apache.solr.search.facet.TestJsonFacets.doStats(TestJsonFacets.java:361)
	at org.apache.solr.search.facet.TestJsonFacets.testStatsDistrib(TestJsonFacets.java:322)
	at sun.reflect.NativeMethodAccessorImpl.invoke0(Native Method)
	at sun.reflect.NativeMethodAccessorImpl.invoke(NativeMethodAccessorImpl.java:62)
	at sun.reflect.DelegatingMethodAccessorImpl.invoke(DelegatingMethodAccessorImpl.java:43)
	at java.lang.reflect.Method.invoke(Method.java:498)
	at com.carrotsearch.randomizedtesting.RandomizedRunner.invoke(RandomizedRunner.java:1713)
	at com.carrotsearch.randomizedtesting.RandomizedRunner$8.evaluate(RandomizedRunner.java:907)
	at com.carrotsearch.randomizedtesting.RandomizedRunner$9.evaluate(RandomizedRunner.java:943)
	at com.carrotsearch.randomizedtesting.RandomizedRunner$10.evaluate(RandomizedRunner.java:957)
	at com.carrotsearch.randomizedtesting.rules.SystemPropertiesRestoreRule$1.evaluate(SystemPropertiesRestoreRule.java:57)
	at org.apache.lucene.util.TestRuleSetupTeardownChained$1.evaluate(TestRuleSetupTeardownChained.java:49)
	at org.apache.lucene.util.AbstractBeforeAfterRule$1.evaluate(AbstractBeforeAfterRule.java:45)
	at org.apache.lucene.util.TestRuleThreadAndTestName$1.evaluate(TestRuleThreadAndTestName.java:48)
	at org.apache.lucene.util.TestRuleIgnoreAfterMaxFailures$1.evaluate(TestRuleIgnoreAfterMaxFailures.java:64)
	at org.apache.lucene.util.TestRuleMarkFailure$1.evaluate(TestRuleMarkFailure.java:47)
	at com.carrotsearch.randomizedtesting.rules.StatementAdapter.evaluate(StatementAdapter.java:36)
	at com.carrotsearch.randomizedtesting.ThreadLeakControl$StatementRunner.run(ThreadLeakControl.java:367)
	at com.carrotsearch.randomizedtesting.ThreadLeakControl.forkTimeoutingTask(ThreadLeakControl.java:811)
	at com.carrotsearch.randomizedtesting.ThreadLeakControl$3.evaluate(ThreadLeakControl.java:462)
	at com.carrotsearch.randomizedtesting.RandomizedRunner.runSingleTest(RandomizedRunner.java:916)
	at com.carrotsearch.randomizedtesting.RandomizedRunner$5.evaluate(RandomizedRunner.java:802)
	at com.carrotsearch.randomizedtesting.RandomizedRunner$6.evaluate(RandomizedRunner.java:852)
	at com.carrotsearch.randomizedtesting.RandomizedRunner$7.evaluate(RandomizedRunner.java:863)
	at com.carrotsearch.randomizedtesting.rules.StatementAdapter.evaluate(StatementAdapter.java:36)
	at com.carrotsearch.randomizedtesting.rules.SystemPropertiesRestoreRule$1.evaluate(SystemPropertiesRestoreRule.java:57)
	at org.apache.lucene.util.AbstractBeforeAfterRule$1.evaluate(AbstractBeforeAfterRule.java:45)
	at com.carrotsearch.randomizedtesting.rules.StatementAdapter.evaluate(StatementAdapter.java:36)
	at org.apache.lucene.util.TestRuleStoreClassName$1.evaluate(TestRuleStoreClassName.java:41)
	at com.carrotsearch.randomizedtesting.rules.NoShadowingOrOverridesOnMethodsRule$1.evaluate(NoShadowingOrOverridesOnMethodsRule.java:40)
	at com.carrotsearch.randomizedtesting.rules.NoShadowingOrOverridesOnMethodsRule$1.evaluate(NoShadowingOrOverridesOnMethodsRule.java:40)
	at com.carrotsearch.randomizedtesting.rules.StatementAdapter.evaluate(StatementAdapter.java:36)
	at com.carrotsearch.randomizedtesting.rules.StatementAdapter.evaluate(StatementAdapter.java:36)
	at com.carrotsearch.randomizedtesting.rules.StatementAdapter.evaluate(StatementAdapter.java:36)
	at org.apache.lucene.util.TestRuleAssertionsRequired$1.evaluate(TestRuleAssertionsRequired.java:53)
	at org.apache.lucene.util.TestRuleMarkFailure$1.evaluate(TestRuleMarkFailure.java:47)
	at org.apache.lucene.util.TestRuleIgnoreAfterMaxFailures$1.evaluate(TestRuleIgnoreAfterMaxFailures.java:64)
	at org.apache.lucene.util.TestRuleIgnoreTestSuites$1.evaluate(TestRuleIgnoreTestSuites.java:54)
	at com.carrotsearch.randomizedtesting.rules.StatementAdapter.evaluate(StatementAdapter.java:36)
	at com.carrotsearch.randomizedtesting.ThreadLeakControl$StatementRunner.run(ThreadLeakControl.java:367)
	at java.lang.Thread.run(Thread.java:745)


FAILED:  org.apache.solr.search.facet.TestJsonFacets.testStatsDistrib {p0=UIF}

Error Message:
mismatch: 'A'!='B' @ facets/cat0/buckets/[0]/val

Stack Trace:
java.lang.RuntimeException: mismatch: 'A'!='B' @ facets/cat0/buckets/[0]/val
	at __randomizedtesting.SeedInfo.seed([ED73C296F172D5DE:31B36BE09CF37114]:0)
	at org.apache.solr.SolrTestCaseHS.matchJSON(SolrTestCaseHS.java:161)
	at org.apache.solr.SolrTestCaseHS.assertJQ(SolrTestCaseHS.java:143)
	at org.apache.solr.SolrTestCaseHS$Client$Tester.assertJQ(SolrTestCaseHS.java:255)
	at org.apache.solr.SolrTestCaseHS$Client.testJQ(SolrTestCaseHS.java:296)
	at org.apache.solr.search.facet.TestJsonFacets.doStatsTemplated(TestJsonFacets.java:1152)
	at org.apache.solr.search.facet.TestJsonFacets.doStats(TestJsonFacets.java:361)
	at org.apache.solr.search.facet.TestJsonFacets.testStatsDistrib(TestJsonFacets.java:322)
	at sun.reflect.NativeMethodAccessorImpl.invoke0(Native Method)
	at sun.reflect.NativeMethodAccessorImpl.invoke(NativeMethodAccessorImpl.java:62)
	at sun.reflect.DelegatingMethodAccessorImpl.invoke(DelegatingMethodAccessorImpl.java:43)
	at java.lang.reflect.Method.invoke(Method.java:498)
	at com.carrotsearch.randomizedtesting.RandomizedRunner.invoke(RandomizedRunner.java:1713)
	at com.carrotsearch.randomizedtesting.RandomizedRunner$8.evaluate(RandomizedRunner.java:907)
	at com.carrotsearch.randomizedtesting.RandomizedRunner$9.evaluate(RandomizedRunner.java:943)
	at com.carrotsearch.randomizedtesting.RandomizedRunner$10.evaluate(RandomizedRunner.java:957)
	at com.carrotsearch.randomizedtesting.rules.SystemPropertiesRestoreRule$1.evaluate(SystemPropertiesRestoreRule.java:57)
	at org.apache.lucene.util.TestRuleSetupTeardownChained$1.evaluate(TestRuleSetupTeardownChained.java:49)
	at org.apache.lucene.util.AbstractBeforeAfterRule$1.evaluate(AbstractBeforeAfterRule.java:45)
	at org.apache.lucene.util.TestRuleThreadAndTestName$1.evaluate(TestRuleThreadAndTestName.java:48)
	at org.apache.lucene.util.TestRuleIgnoreAfterMaxFailures$1.evaluate(TestRuleIgnoreAfterMaxFailures.java:64)
	at org.apache.lucene.util.TestRuleMarkFailure$1.evaluate(TestRuleMarkFailure.java:47)
	at com.carrotsearch.randomizedtesting.rules.StatementAdapter.evaluate(StatementAdapter.java:36)
	at com.carrotsearch.randomizedtesting.ThreadLeakControl$StatementRunner.run(ThreadLeakControl.java:367)
	at com.carrotsearch.randomizedtesting.ThreadLeakControl.forkTimeoutingTask(ThreadLeakControl.java:811)
	at com.carrotsearch.randomizedtesting.ThreadLeakControl$3.evaluate(ThreadLeakControl.java:462)
	at com.carrotsearch.randomizedtesting.RandomizedRunner.runSingleTest(RandomizedRunner.java:916)
	at com.carrotsearch.randomizedtesting.RandomizedRunner$5.evaluate(RandomizedRunner.java:802)
	at com.carrotsearch.randomizedtesting.RandomizedRunner$6.evaluate(RandomizedRunner.java:852)
	at com.carrotsearch.randomizedtesting.RandomizedRunner$7.evaluate(RandomizedRunner.java:863)
	at com.carrotsearch.randomizedtesting.rules.StatementAdapter.evaluate(StatementAdapter.java:36)
	at com.carrotsearch.randomizedtesting.rules.SystemPropertiesRestoreRule$1.evaluate(SystemPropertiesRestoreRule.java:57)
	at org.apache.lucene.util.AbstractBeforeAfterRule$1.evaluate(AbstractBeforeAfterRule.java:45)
	at com.carrotsearch.randomizedtesting.rules.StatementAdapter.evaluate(StatementAdapter.java:36)
	at org.apache.lucene.util.TestRuleStoreClassName$1.evaluate(TestRuleStoreClassName.java:41)
	at com.carrotsearch.randomizedtesting.rules.NoShadowingOrOverridesOnMethodsRule$1.evaluate(NoShadowingOrOverridesOnMethodsRule.java:40)
	at com.carrotsearch.randomizedtesting.rules.NoShadowingOrOverridesOnMethodsRule$1.evaluate(NoShadowingOrOverridesOnMethodsRule.java:40)
	at com.carrotsearch.randomizedtesting.rules.StatementAdapter.evaluate(StatementAdapter.java:36)
	at com.carrotsearch.randomizedtesting.rules.StatementAdapter.evaluate(StatementAdapter.java:36)
	at com.carrotsearch.randomizedtesting.rules.StatementAdapter.evaluate(StatementAdapter.java:36)
	at org.apache.lucene.util.TestRuleAssertionsRequired$1.evaluate(TestRuleAssertionsRequired.java:53)
	at org.apache.lucene.util.TestRuleMarkFailure$1.evaluate(TestRuleMarkFailure.java:47)
	at org.apache.lucene.util.TestRuleIgnoreAfterMaxFailures$1.evaluate(TestRuleIgnoreAfterMaxFailures.java:64)
	at org.apache.lucene.util.TestRuleIgnoreTestSuites$1.evaluate(TestRuleIgnoreTestSuites.java:54)
	at com.carrotsearch.randomizedtesting.rules.StatementAdapter.evaluate(StatementAdapter.java:36)
	at com.carrotsearch.randomizedtesting.ThreadLeakControl$StatementRunner.run(ThreadLeakControl.java:367)
	at java.lang.Thread.run(Thread.java:745)


FAILED:  org.apache.solr.search.facet.TestJsonFacets.testStatsDistrib {p0=ENUM}

Error Message:
mismatch: 'A'!='B' @ facets/cat0/buckets/[0]/val

Stack Trace:
java.lang.RuntimeException: mismatch: 'A'!='B' @ facets/cat0/buckets/[0]/val
	at __randomizedtesting.SeedInfo.seed([ED73C296F172D5DE:31B36BE09CF37114]:0)
	at org.apache.solr.SolrTestCaseHS.matchJSON(SolrTestCaseHS.java:161)
	at org.apache.solr.SolrTestCaseHS.assertJQ(SolrTestCaseHS.java:143)
	at org.apache.solr.SolrTestCaseHS$Client$Tester.assertJQ(SolrTestCaseHS.java:255)
	at org.apache.solr.SolrTestCaseHS$Client.testJQ(SolrTestCaseHS.java:296)
	at org.apache.solr.search.facet.TestJsonFacets.doStatsTemplated(TestJsonFacets.java:1152)
	at org.apache.solr.search.facet.TestJsonFacets.doStats(TestJsonFacets.java:361)
	at org.apache.solr.search.facet.TestJsonFacets.testStatsDistrib(TestJsonFacets.java:322)
	at sun.reflect.NativeMethodAccessorImpl.invoke0(Native Method)
	at sun.reflect.NativeMethodAccessorImpl.invoke(NativeMethodAccessorImpl.java:62)
	at sun.reflect.DelegatingMethodAccessorImpl.invoke(DelegatingMethodAccessorImpl.java:43)
	at java.lang.reflect.Method.invoke(Method.java:498)
	at com.carrotsearch.randomizedtesting.RandomizedRunner.invoke(RandomizedRunner.java:1713)
	at com.carrotsearch.randomizedtesting.RandomizedRunner$8.evaluate(RandomizedRunner.java:907)
	at com.carrotsearch.randomizedtesting.RandomizedRunner$9.evaluate(RandomizedRunner.java:943)
	at com.carrotsearch.randomizedtesting.RandomizedRunner$10.evaluate(RandomizedRunner.java:957)
	at com.carrotsearch.randomizedtesting.rules.SystemPropertiesRestoreRule$1.evaluate(SystemPropertiesRestoreRule.java:57)
	at org.apache.lucene.util.TestRuleSetupTeardownChained$1.evaluate(TestRuleSetupTeardownChained.java:49)
	at org.apache.lucene.util.AbstractBeforeAfterRule$1.evaluate(AbstractBeforeAfterRule.java:45)
	at org.apache.lucene.util.TestRuleThreadAndTestName$1.evaluate(TestRuleThreadAndTestName.java:48)
	at org.apache.lucene.util.TestRuleIgnoreAfterMaxFailures$1.evaluate(TestRuleIgnoreAfterMaxFailures.java:64)
	at org.apache.lucene.util.TestRuleMarkFailure$1.evaluate(TestRuleMarkFailure.java:47)
	at com.carrotsearch.randomizedtesting.rules.StatementAdapter.evaluate(StatementAdapter.java:36)
	at com.carrotsearch.randomizedtesting.ThreadLeakControl$StatementRunner.run(ThreadLeakControl.java:367)
	at com.carrotsearch.randomizedtesting.ThreadLeakControl.forkTimeoutingTask(ThreadLeakControl.java:811)
	at com.carrotsearch.randomizedtesting.ThreadLeakControl$3.evaluate(ThreadLeakControl.java:462)
	at com.carrotsearch.randomizedtesting.RandomizedRunner.runSingleTest(RandomizedRunner.java:916)
	at com.carrotsearch.randomizedtesting.RandomizedRunner$5.evaluate(RandomizedRunner.java:802)
	at com.carrotsearch.randomizedtesting.RandomizedRunner$6.evaluate(RandomizedRunner.java:852)
	at com.carrotsearch.randomizedtesting.RandomizedRunner$7.evaluate(RandomizedRunner.java:863)
	at com.carrotsearch.randomizedtesting.rules.StatementAdapter.evaluate(StatementAdapter.java:36)
	at com.carrotsearch.randomizedtesting.rules.SystemPropertiesRestoreRule$1.evaluate(SystemPropertiesRestoreRule.java:57)
	at org.apache.lucene.util.AbstractBeforeAfterRule$1.evaluate(AbstractBeforeAfterRule.java:45)
	at com.carrotsearch.randomizedtesting.rules.StatementAdapter.evaluate(StatementAdapter.java:36)
	at org.apache.lucene.util.TestRuleStoreClassName$1.evaluate(TestRuleStoreClassName.java:41)
	at com.carrotsearch.randomizedtesting.rules.NoShadowingOrOverridesOnMethodsRule$1.evaluate(NoShadowingOrOverridesOnMethodsRule.java:40)
	at com.carrotsearch.randomizedtesting.rules.NoShadowingOrOverridesOnMethodsRule$1.evaluate(NoShadowingOrOverridesOnMethodsRule.java:40)
	at com.carrotsearch.randomizedtesting.rules.StatementAdapter.evaluate(StatementAdapter.java:36)
	at com.carrotsearch.randomizedtesting.rules.StatementAdapter.evaluate(StatementAdapter.java:36)
	at com.carrotsearch.randomizedtesting.rules.StatementAdapter.evaluate(StatementAdapter.java:36)
	at org.apache.lucene.util.TestRuleAssertionsRequired$1.evaluate(TestRuleAssertionsRequired.java:53)
	at org.apache.lucene.util.TestRuleMarkFailure$1.evaluate(TestRuleMarkFailure.java:47)
	at org.apache.lucene.util.TestRuleIgnoreAfterMaxFailures$1.evaluate(TestRuleIgnoreAfterMaxFailures.java:64)
	at org.apache.lucene.util.TestRuleIgnoreTestSuites$1.evaluate(TestRuleIgnoreTestSuites.java:54)
	at com.carrotsearch.randomizedtesting.rules.StatementAdapter.evaluate(StatementAdapter.java:36)
	at com.carrotsearch.randomizedtesting.ThreadLeakControl$StatementRunner.run(ThreadLeakControl.java:367)
	at java.lang.Thread.run(Thread.java:745)


FAILED:  org.apache.solr.search.facet.TestJsonFacets.testStatsDistrib {p0=STREAM}

Error Message:
mismatch: 'A'!='B' @ facets/cat0/buckets/[0]/val

Stack Trace:
java.lang.RuntimeException: mismatch: 'A'!='B' @ facets/cat0/buckets/[0]/val
	at __randomizedtesting.SeedInfo.seed([ED73C296F172D5DE:31B36BE09CF37114]:0)
	at org.apache.solr.SolrTestCaseHS.matchJSON(SolrTestCaseHS.java:161)
	at org.apache.solr.SolrTestCaseHS.assertJQ(SolrTestCaseHS.java:143)
	at org.apache.solr.SolrTestCaseHS$Client$Tester.assertJQ(SolrTestCaseHS.java:255)
	at org.apache.solr.SolrTestCaseHS$Client.testJQ(SolrTestCaseHS.java:296)
	at org.apache.solr.search.facet.TestJsonFacets.doStatsTemplated(TestJsonFacets.java:1152)
	at org.apache.solr.search.facet.TestJsonFacets.doStats(TestJsonFacets.java:361)
	at org.apache.solr.search.facet.TestJsonFacets.testStatsDistrib(TestJsonFacets.java:322)
	at sun.reflect.NativeMethodAccessorImpl.invoke0(Native Method)
	at sun.reflect.NativeMethodAccessorImpl.invoke(NativeMethodAccessorImpl.java:62)
	at sun.reflect.DelegatingMethodAccessorImpl.invoke(DelegatingMethodAccessorImpl.java:43)
	at java.lang.reflect.Method.invoke(Method.java:498)
	at com.carrotsearch.randomizedtesting.RandomizedRunner.invoke(RandomizedRunner.java:1713)
	at com.carrotsearch.randomizedtesting.RandomizedRunner$8.evaluate(RandomizedRunner.java:907)
	at com.carrotsearch.randomizedtesting.RandomizedRunner$9.evaluate(RandomizedRunner.java:943)
	at com.carrotsearch.randomizedtesting.RandomizedRunner$10.evaluate(RandomizedRunner.java:957)
	at com.carrotsearch.randomizedtesting.rules.SystemPropertiesRestoreRule$1.evaluate(SystemPropertiesRestoreRule.java:57)
	at org.apache.lucene.util.TestRuleSetupTeardownChained$1.evaluate(TestRuleSetupTeardownChained.java:49)
	at org.apache.lucene.util.AbstractBeforeAfterRule$1.evaluate(AbstractBeforeAfterRule.java:45)
	at org.apache.lucene.util.TestRuleThreadAndTestName$1.evaluate(TestRuleThreadAndTestName.java:48)
	at org.apache.lucene.util.TestRuleIgnoreAfterMaxFailures$1.evaluate(TestRuleIgnoreAfterMaxFailures.java:64)
	at org.apache.lucene.util.TestRuleMarkFailure$1.evaluate(TestRuleMarkFailure.java:47)
	at com.carrotsearch.randomizedtesting.rules.StatementAdapter.evaluate(StatementAdapter.java:36)
	at com.carrotsearch.randomizedtesting.ThreadLeakControl$StatementRunner.run(ThreadLeakControl.java:367)
	at com.carrotsearch.randomizedtesting.ThreadLeakControl.forkTimeoutingTask(ThreadLeakControl.java:811)
	at com.carrotsearch.randomizedtesting.ThreadLeakControl$3.evaluate(ThreadLeakControl.java:462)
	at com.carrotsearch.randomizedtesting.RandomizedRunner.runSingleTest(RandomizedRunner.java:916)
	at com.carrotsearch.randomizedtesting.RandomizedRunner$5.evaluate(RandomizedRunner.java:802)
	at com.carrotsearch.randomizedtesting.RandomizedRunner$6.evaluate(RandomizedRunner.java:852)
	at com.carrotsearch.randomizedtesting.RandomizedRunner$7.evaluate(RandomizedRunner.java:863)
	at com.carrotsearch.randomizedtesting.rules.StatementAdapter.evaluate(StatementAdapter.java:36)
	at com.carrotsearch.randomizedtesting.rules.SystemPropertiesRestoreRule$1.evaluate(SystemPropertiesRestoreRule.java:57)
	at org.apache.lucene.util.AbstractBeforeAfterRule$1.evaluate(AbstractBeforeAfterRule.java:45)
	at com.carrotsearch.randomizedtesting.rules.StatementAdapter.evaluate(StatementAdapter.java:36)
	at org.apache.lucene.util.TestRuleStoreClassName$1.evaluate(TestRuleStoreClassName.java:41)
	at com.carrotsearch.randomizedtesting.rules.NoShadowingOrOverridesOnMethodsRule$1.evaluate(NoShadowingOrOverridesOnMethodsRule.java:40)
	at com.carrotsearch.randomizedtesting.rules.NoShadowingOrOverridesOnMethodsRule$1.evaluate(NoShadowingOrOverridesOnMethodsRule.java:40)
	at com.carrotsearch.randomizedtesting.rules.StatementAdapter.evaluate(StatementAdapter.java:36)
	at com.carrotsearch.randomizedtesting.rules.StatementAdapter.evaluate(StatementAdapter.java:36)
	at com.carrotsearch.randomizedtesting.rules.StatementAdapter.evaluate(StatementAdapter.java:36)
	at org.apache.lucene.util.TestRuleAssertionsRequired$1.evaluate(TestRuleAssertionsRequired.java:53)
	at org.apache.lucene.util.TestRuleMarkFailure$1.evaluate(TestRuleMarkFailure.java:47)
	at org.apache.lucene.util.TestRuleIgnoreAfterMaxFailures$1.evaluate(TestRuleIgnoreAfterMaxFailures.java:64)
	at org.apache.lucene.util.TestRuleIgnoreTestSuites$1.evaluate(TestRuleIgnoreTestSuites.java:54)
	at com.carrotsearch.randomizedtesting.rules.StatementAdapter.evaluate(StatementAdapter.java:36)
	at com.carrotsearch.randomizedtesting.ThreadLeakControl$StatementRunner.run(ThreadLeakControl.java:367)
	at java.lang.Thread.run(Thread.java:745)


FAILED:  org.apache.solr.search.facet.TestJsonFacets.testStatsDistrib {p0=SMART}

Error Message:
mismatch: 'A'!='B' @ facets/cat0/buckets/[0]/val

Stack Trace:
java.lang.RuntimeException: mismatch: 'A'!='B' @ facets/cat0/buckets/[0]/val
	at __randomizedtesting.SeedInfo.seed([ED73C296F172D5DE:31B36BE09CF37114]:0)
	at org.apache.solr.SolrTestCaseHS.matchJSON(SolrTestCaseHS.java:161)
	at org.apache.solr.SolrTestCaseHS.assertJQ(SolrTestCaseHS.java:143)
	at org.apache.solr.SolrTestCaseHS$Client$Tester.assertJQ(SolrTestCaseHS.java:255)
	at org.apache.solr.SolrTestCaseHS$Client.testJQ(SolrTestCaseHS.java:296)
	at org.apache.solr.search.facet.TestJsonFacets.doStatsTemplated(TestJsonFacets.java:1152)
	at org.apache.solr.search.facet.TestJsonFacets.doStats(TestJsonFacets.java:361)
	at org.apache.solr.search.facet.TestJsonFacets.testStatsDistrib(TestJsonFacets.java:322)
	at sun.reflect.NativeMethodAccessorImpl.invoke0(Native Method)
	at sun.reflect.NativeMethodAccessorImpl.invoke(NativeMethodAccessorImpl.java:62)
	at sun.reflect.DelegatingMethodAccessorImpl.invoke(DelegatingMethodAccessorImpl.java:43)
	at java.lang.reflect.Method.invoke(Method.java:498)
	at com.carrotsearch.randomizedtesting.RandomizedRunner.invoke(RandomizedRunner.java:1713)
	at com.carrotsearch.randomizedtesting.RandomizedRunner$8.evaluate(RandomizedRunner.java:907)
	at com.carrotsearch.randomizedtesting.RandomizedRunner$9.evaluate(RandomizedRunner.java:943)
	at com.carrotsearch.randomizedtesting.RandomizedRunner$10.evaluate(RandomizedRunner.java:957)
	at com.carrotsearch.randomizedtesting.rules.SystemPropertiesRestoreRule$1.evaluate(SystemPropertiesRestoreRule.java:57)
	at org.apache.lucene.util.TestRuleSetupTeardownChained$1.evaluate(TestRuleSetupTeardownChained.java:49)
	at org.apache.lucene.util.AbstractBeforeAfterRule$1.evaluate(AbstractBeforeAfterRule.java:45)
	at org.apache.lucene.util.TestRuleThreadAndTestName$1.evaluate(TestRuleThreadAndTestName.java:48)
	at org.apache.lucene.util.TestRuleIgnoreAfterMaxFailures$1.evaluate(TestRuleIgnoreAfterMaxFailures.java:64)
	at org.apache.lucene.util.TestRuleMarkFailure$1.evaluate(TestRuleMarkFailure.java:47)
	at com.carrotsearch.randomizedtesting.rules.StatementAdapter.evaluate(StatementAdapter.java:36)
	at com.carrotsearch.randomizedtesting.ThreadLeakControl$StatementRunner.run(ThreadLeakControl.java:367)
	at com.carrotsearch.randomizedtesting.ThreadLeakControl.forkTimeoutingTask(ThreadLeakControl.java:811)
	at com.carrotsearch.randomizedtesting.ThreadLeakControl$3.evaluate(ThreadLeakControl.java:462)
	at com.carrotsearch.randomizedtesting.RandomizedRunner.runSingleTest(RandomizedRunner.java:916)
	at com.carrotsearch.randomizedtesting.RandomizedRunner$5.evaluate(RandomizedRunner.java:802)
	at com.carrotsearch.randomizedtesting.RandomizedRunner$6.evaluate(RandomizedRunner.java:852)
	at com.carrotsearch.randomizedtesting.RandomizedRunner$7.evaluate(RandomizedRunner.java:863)
	at com.carrotsearch.randomizedtesting.rules.StatementAdapter.evaluate(StatementAdapter.java:36)
	at com.carrotsearch.randomizedtesting.rules.SystemPropertiesRestoreRule$1.evaluate(SystemPropertiesRestoreRule.java:57)
	at org.apache.lucene.util.AbstractBeforeAfterRule$1.evaluate(AbstractBeforeAfterRule.java:45)
	at com.carrotsearch.randomizedtesting.rules.StatementAdapter.evaluate(StatementAdapter.java:36)
	at org.apache.lucene.util.TestRuleStoreClassName$1.evaluate(TestRuleStoreClassName.java:41)
	at com.carrotsearch.randomizedtesting.rules.NoShadowingOrOverridesOnMethodsRule$1.evaluate(NoShadowingOrOverridesOnMethodsRule.java:40)
	at com.carrotsearch.randomizedtesting.rules.NoShadowingOrOverridesOnMethodsRule$1.evaluate(NoShadowingOrOverridesOnMethodsRule.java:40)
	at com.carrotsearch.randomizedtesting.rules.StatementAdapter.evaluate(StatementAdapter.java:36)
	at com.carrotsearch.randomizedtesting.rules.StatementAdapter.evaluate(StatementAdapter.java:36)
	at com.carrotsearch.randomizedtesting.rules.StatementAdapter.evaluate(StatementAdapter.java:36)
	at org.apache.lucene.util.TestRuleAssertionsRequired$1.evaluate(TestRuleAssertionsRequired.java:53)
	at org.apache.lucene.util.TestRuleMarkFailure$1.evaluate(TestRuleMarkFailure.java:47)
	at org.apache.lucene.util.TestRuleIgnoreAfterMaxFailures$1.evaluate(TestRuleIgnoreAfterMaxFailures.java:64)
	at org.apache.lucene.util.TestRuleIgnoreTestSuites$1.evaluate(TestRuleIgnoreTestSuites.java:54)
	at com.carrotsearch.randomizedtesting.rules.StatementAdapter.evaluate(StatementAdapter.java:36)
	at com.carrotsearch.randomizedtesting.ThreadLeakControl$StatementRunner.run(ThreadLeakControl.java:367)
	at java.lang.Thread.run(Thread.java:745)




Build Log:
[...truncated 12617 lines...]
   [junit4] Suite: org.apache.solr.search.facet.TestJsonFacets
   [junit4]   2> Creating dataDir: C:\Users\jenkins\workspace\Lucene-Solr-6.x-Windows\solr\build\solr-core\test\J0\temp\solr.search.facet.TestJsonFacets_ED73C296F172D5DE-001\init-core-data-001
   [junit4]   2> 2536134 INFO  (SUITE-TestJsonFacets-seed#[ED73C296F172D5DE]-worker) [    ] o.a.s.SolrTestCaseJ4 Randomized ssl (false) and clientAuth (false) via: @org.apache.solr.SolrTestCaseJ4$SuppressSSL(bugUrl=None)
   [junit4]   2> 2536135 INFO  (SUITE-TestJsonFacets-seed#[ED73C296F172D5DE]-worker) [    ] o.a.s.SolrTestCaseJ4 ####initCore
   [junit4]   2> 2536136 INFO  (SUITE-TestJsonFacets-seed#[ED73C296F172D5DE]-worker) [    ] o.a.s.c.SolrResourceLoader [null] Added 2 libs to classloader, from paths: [/C:/Users/jenkins/workspace/Lucene-Solr-6.x-Windows/solr/core/src/test-files/solr/collection1/lib, /C:/Users/jenkins/workspace/Lucene-Solr-6.x-Windows/solr/core/src/test-files/solr/collection1/lib/classes]
   [junit4]   2> 2536181 WARN  (SUITE-TestJsonFacets-seed#[ED73C296F172D5DE]-worker) [    ] o.a.s.c.Config Beginning with Solr 5.5, <mergePolicy> is deprecated, use <mergePolicyFactory> instead.
   [junit4]   2> 2536182 INFO  (SUITE-TestJsonFacets-seed#[ED73C296F172D5DE]-worker) [    ] o.a.s.c.SolrConfig Using Lucene MatchVersion: 6.3.0
   [junit4]   2> 2536198 INFO  (SUITE-TestJsonFacets-seed#[ED73C296F172D5DE]-worker) [    ] o.a.s.s.IndexSchema [null] Schema name=example
   [junit4]   2> 2536264 INFO  (SUITE-TestJsonFacets-seed#[ED73C296F172D5DE]-worker) [    ] o.a.s.s.IndexSchema Loaded schema example/1.6 with uniqueid field id
   [junit4]   2> 2536276 INFO  (SUITE-TestJsonFacets-seed#[ED73C296F172D5DE]-worker) [    ] o.a.s.u.UpdateShardHandler Creating UpdateShardHandler HTTP client with params: socketTimeout=30000&connTimeout=30000&retry=true
   [junit4]   2> 2536280 INFO  (coreLoadExecutor-11183-thread-1) [    ] o.a.s.c.SolrResourceLoader [null] Added 2 libs to classloader, from paths: [/C:/Users/jenkins/workspace/Lucene-Solr-6.x-Windows/solr/core/src/test-files/solr/collection1/lib, /C:/Users/jenkins/workspace/Lucene-Solr-6.x-Windows/solr/core/src/test-files/solr/collection1/lib/classes]
   [junit4]   2> 2536299 WARN  (coreLoadExecutor-11183-thread-1) [    ] o.a.s.c.Config Beginning with Solr 5.5, <mergePolicy> is deprecated, use <mergePolicyFactory> instead.
   [junit4]   2> 2536299 INFO  (coreLoadExecutor-11183-thread-1) [    ] o.a.s.c.SolrConfig Using Lucene MatchVersion: 6.3.0
   [junit4]   2> 2536310 INFO  (coreLoadExecutor-11183-thread-1) [    ] o.a.s.s.IndexSchema [collection1] Schema name=example
   [junit4]   2> 2536356 INFO  (coreLoadExecutor-11183-thread-1) [    ] o.a.s.s.IndexSchema Loaded schema example/1.6 with uniqueid field id
   [junit4]   2> 2536372 INFO  (coreLoadExecutor-11183-thread-1) [    ] o.a.s.c.CoreContainer Creating SolrCore 'collection1' using configuration from instancedir C:\Users\jenkins\workspace\Lucene-Solr-6.x-Windows\solr\core\src\test-files\solr\collection1
   [junit4]   2> 2536372 INFO  (coreLoadExecutor-11183-thread-1) [    x:collection1] o.a.s.c.SolrCore [[collection1] ] Opening new SolrCore at [C:\Users\jenkins\workspace\Lucene-Solr-6.x-Windows\solr\core\src\test-files\solr\collection1], dataDir=[C:\Users\jenkins\workspace\Lucene-Solr-6.x-Windows\solr\build\solr-core\test\J0\temp\solr.search.facet.TestJsonFacets_ED73C296F172D5DE-001\init-core-data-001\]
   [junit4]   2> 2536372 INFO  (coreLoadExecutor-11183-thread-1) [    x:collection1] o.a.s.c.JmxMonitoredMap JMX monitoring is enabled. Adding Solr mbeans to JMX Server: com.sun.jmx.mbeanserver.JmxMBeanServer@d98ea9
   [junit4]   2> 2536375 INFO  (coreLoadExecutor-11183-thread-1) [    x:collection1] o.a.s.u.RandomMergePolicy RandomMergePolicy wrapping class org.apache.lucene.index.LogDocMergePolicy: [LogDocMergePolicy: minMergeSize=1000, mergeFactor=32, maxMergeSize=9223372036854775807, maxMergeSizeForForcedMerge=9223372036854775807, calibrateSizeByDeletes=true, maxMergeDocs=2147483647, maxCFSSegmentSizeMB=8.796093022207999E12, noCFSRatio=0.0]
   [junit4]   2> 2536378 WARN  (coreLoadExecutor-11183-thread-1) [    x:collection1] o.a.s.c.RequestHandlers INVALID paramSet a in requestHandler {type = requestHandler,name = /dump,class = DumpRequestHandler,args = {defaults={a=A,b=B}}}
   [junit4]   2> 2536389 INFO  (coreLoadExecutor-11183-thread-1) [    x:collection1] o.a.s.u.UpdateHandler Using UpdateLog implementation: org.apache.solr.update.UpdateLog
   [junit4]   2> 2536389 INFO  (coreLoadExecutor-11183-thread-1) [    x:collection1] o.a.s.u.UpdateLog Initializing UpdateLog: dataDir= defaultSyncLevel=FLUSH numRecordsToKeep=100 maxNumLogsToKeep=10 numVersionBuckets=65536
   [junit4]   2> 2536390 INFO  (coreLoadExecutor-11183-thread-1) [    x:collection1] o.a.s.u.CommitTracker Hard AutoCommit: disabled
   [junit4]   2> 2536390 INFO  (coreLoadExecutor-11183-thread-1) [    x:collection1] o.a.s.u.CommitTracker Soft AutoCommit: disabled
   [junit4]   2> 2536391 INFO  (coreLoadExecutor-11183-thread-1) [    x:collection1] o.a.s.u.RandomMergePolicy RandomMergePolicy wrapping class org.apache.lucene.index.LogDocMergePolicy: [LogDocMergePolicy: minMergeSize=1000, mergeFactor=40, maxMergeSize=9223372036854775807, maxMergeSizeForForcedMerge=9223372036854775807, calibrateSizeByDeletes=false, maxMergeDocs=2147483647, maxCFSSegmentSizeMB=8.796093022207999E12, noCFSRatio=0.0]
   [junit4]   2> 2536393 INFO  (coreLoadExecutor-11183-thread-1) [    x:collection1] o.a.s.s.SolrIndexSearcher Opening [Searcher@eb0c2[collection1] main]
   [junit4]   2> 2536393 WARN  (coreLoadExecutor-11183-thread-1) [    x:collection1] o.a.s.r.ManagedResourceStorage Cannot write to config directory C:\Users\jenkins\workspace\Lucene-Solr-6.x-Windows\solr\core\src\test-files\solr\collection1\conf; switching to use InMemory storage instead.
   [junit4]   2> 2536394 INFO  (coreLoadExecutor-11183-thread-1) [    x:collection1] o.a.s.h.ReplicationHandler Commits will be reserved for  10000
   [junit4]   2> 2536394 INFO  (searcherExecutor-11184-thread-1-processing-x:collection1) [    x:collection1] o.a.s.c.SolrCore [collection1] Registered new searcher Searcher@eb0c2[collection1] main{ExitableDirectoryReader(UninvertingDirectoryReader())}
   [junit4]   2> 2536394 INFO  (coreLoadExecutor-11183-thread-1) [    x:collection1] o.a.s.u.UpdateLog Could not find max version in index or recent updates, using new clock 1549282818941517824
   [junit4]   2> 2536398 INFO  (SUITE-TestJsonFacets-seed#[ED73C296F172D5DE]-worker) [    ] o.a.s.SolrTestCaseJ4 ####initCore end
   [junit4]   2> 2536401 INFO  (TEST-TestJsonFacets.testMethodStream-seed#[ED73C296F172D5DE]) [    ] o.a.s.SolrTestCaseJ4 ###Starting testMethodStream {p0=DVHASH}
   [junit4]   2> 2536404 INFO  (TEST-TestJsonFacets.testMethodStream-seed#[ED73C296F172D5DE]) [    ] o.a.s.u.p.LogUpdateProcessorFactory [collection1]  webapp=null path=null params={}{deleteByQuery=*:* (-1549282818948857856)} 0 3
   [junit4]   2> 2536406 INFO  (TEST-TestJsonFacets.testMethodStream-seed#[ED73C296F172D5DE]) [    ] o.a.s.u.p.LogUpdateProcessorFactory [collection1]  webapp=null path=null params={versions=true&wt=json&indent=true}{add=[1 (1549282818954100736)]} 0 0
   [junit4]   2> 2536406 INFO  (TEST-TestJsonFacets.testMethodStream-seed#[ED73C296F172D5DE]) [    ] o.a.s.u.p.LogUpdateProcessorFactory [collection1]  webapp=null path=null params={versions=true&wt=json&indent=true}{add=[2 (1549282818954100737)]} 0 0
   [junit4]   2> 2536407 INFO  (TEST-TestJsonFacets.testMethodStream-seed#[ED73C296F172D5DE]) [    ] o.a.s.u.p.LogUpdateProcessorFactory [collection1]  webapp=null path=null params={versions=true&wt=json&indent=true}{add=[3 (1549282818955149312)]} 0 0
   [junit4]   2> 2536407 INFO  (TEST-TestJsonFacets.testMethodStream-seed#[ED73C296F172D5DE]) [    ] o.a.s.u.DirectUpdateHandler2 start commit{,optimize=false,openSearcher=true,waitSearcher=true,expungeDeletes=false,softCommit=false,prepareCommit=false}
   [junit4]   2> 2536407 INFO  (TEST-TestJsonFacets.testMethodStream-seed#[ED73C296F172D5DE]) [    ] o.a.s.u.SolrIndexWriter Calling setCommitData with IW:org.apache.solr.update.SolrIndexWriter@acd1be
   [junit4]   2> 2536411 INFO  (TEST-TestJsonFacets.testMethodStream-seed#[ED73C296F172D5DE]) [    ] o.a.s.s.SolrIndexSearcher Opening [Searcher@b2406f[collection1] main]
   [junit4]   2> 2536412 INFO  (searcherExecutor-11184-thread-1) [    ] o.a.s.c.SolrCore [collection1] Registered new searcher Searcher@b2406f[collection1] main{ExitableDirectoryReader(UninvertingDirectoryReader(Uninverting(_0(6.3.0):C3)))}
   [junit4]   2> 2536412 INFO  (TEST-TestJsonFacets.testMethodStream-seed#[ED73C296F172D5DE]) [    ] o.a.s.u.DirectUpdateHandler2 end_commit_flush
   [junit4]   2> 2536412 INFO  (TEST-TestJsonFacets.testMethodStream-seed#[ED73C296F172D5DE]) [    ] o.a.s.u.p.LogUpdateProcessorFactory [collection1]  webapp=null path=null params={}{commit=} 0 5
   [junit4]   2> 2536414 INFO  (TEST-TestJsonFacets.testMethodStream-seed#[ED73C296F172D5DE]) [    ] o.a.s.u.p.LogUpdateProcessorFactory [collection1]  webapp=null path=null params={versions=true&wt=json&indent=true}{add=[4 (1549282818961440768)]} 0 1
   [junit4]   2> 2536415 INFO  (TEST-TestJsonFacets.testMethodStream-seed#[ED73C296F172D5DE]) [    ] o.a.s.u.p.LogUpdateProcessorFactory [collection1]  webapp=null path=null params={versions=true&wt=json&indent=true}{add=[5 (1549282818962489344)]} 0 0
   [junit4]   2> 2536415 INFO  (TEST-TestJsonFacets.testMethodStream-seed#[ED73C296F172D5DE]) [    ] o.a.s.u.DirectUpdateHandler2 start commit{,optimize=false,openSearcher=true,waitSearcher=true,expungeDeletes=false,softCommit=false,prepareCommit=false}
   [junit4]   2> 2536415 INFO  (TEST-TestJsonFacets.testMethodStream-seed#[ED73C296F172D5DE]) [    ] o.a.s.u.SolrIndexWriter Calling setCommitData with IW:org.apache.solr.update.SolrIndexWriter@acd1be
   [junit4]   2> 2536419 INFO  (TEST-TestJsonFacets.testMethodStream-seed#[ED73C296F172D5DE]) [    ] o.a.s.s.SolrIndexSearcher Opening [Searcher@1573376[collection1] main]
   [junit4]   2> 2536419 INFO  (searcherExecutor-11184-thread-1) [    ] o.a.s.c.SolrCore [collection1] Registered new searcher Searcher@1573376[collection1] main{ExitableDirectoryReader(UninvertingDirectoryReader(Uninverting(_0(6.3.0):C3) Uninverting(_1(6.3.0):C2)))}
   [junit4]   2> 2536420 INFO  (TEST-TestJsonFacets.testMethodStream-seed#[ED73C296F172D5DE]) [    ] o.a.s.u.DirectUpdateHandler2 end_commit_flush
   [junit4]   2> 2536420 INFO  (TEST-TestJsonFacets.testMethodStream-seed#[ED73C296F172D5DE]) [    ] o.a.s.u.p.LogUpdateProcessorFactory [collection1]  webapp=null path=null params={}{commit=} 0 5
   [junit4]   2> 2536422 INFO  (TEST-TestJsonFacets.testMethodStream-seed#[ED73C296F172D5DE]) [    ] o.a.s.u.p.LogUpdateProcessorFactory [collection1]  webapp=null path=null params={versions=true&wt=json&indent=true}{add=[6 (1549282818968780800)]} 0 1
   [junit4]   2> 2536422 INFO  (TEST-TestJsonFacets.testMethodStream-seed#[ED73C296F172D5DE]) [    ] o.a.s.u.DirectUpdateHandler2 start commit{,optimize=false,openSearcher=true,waitSearcher=true,expungeDeletes=false,softCommit=false,prepareCommit=false}
   [junit4]   2> 2536422 INFO  (TEST-TestJsonFacets.testMethodStream-seed#[ED73C296F172D5DE]) [    ] o.a.s.u.SolrIndexWriter Calling setCommitData with IW:org.apache.solr.update.SolrIndexWriter@acd1be
   [junit4]   2> 2536426 INFO  (TEST-TestJsonFacets.testMethodStream-seed#[ED73C296F172D5DE]) [    ] o.a.s.s.SolrIndexSearcher Opening [Searcher@1dd9241[collection1] main]
   [junit4]   2> 2536427 INFO  (searcherExecutor-11184-thread-1) [    ] o.a.s.c.SolrCore [collection1] Registered new searcher Searcher@1dd9241[collection1] main{ExitableDirectoryReader(UninvertingDirectoryReader(Uninverting(_0(6.3.0):C3) Uninverting(_1(6.3.0):C2) Uninverting(_2(6.3.0):C1)))}
   [junit4]   2> 2536427 INFO  (TEST-TestJsonFacets.testMethodStream-seed#[ED73C296F172D5DE]) [    ] o.a.s.u.DirectUpdateHandler2 end_commit_flush
   [junit4]   2> 2536427 INFO  (TEST-TestJsonFacets.testMethodStream-seed#[ED73C296F172D5DE]) [    ] o.a.s.u.p.LogUpdateProcessorFactory [collection1]  webapp=null path=null params={}{commit=} 0 4
   [junit4]   2> 2536428 INFO  (TEST-TestJsonFacets.testMethodStream-seed#[ED73C296F172D5DE]) [    ] o.a.s.c.S.Request [collection1]  webapp=null path=null params={q=*:*&json.facet={x:'sum(num_d)'}&json.facet={y:'min(num_d)'}&rows=0&wt=xml} hits=6 status=0 QTime=0
   [junit4]   2> 2536435 INFO  (TEST-TestJsonFacets.testMethodStream-seed#[ED73C296F172D5DE]) [    ] o.a.s.c.S.Request [collection1]  webapp=null path=null params={q=*:*&json.facet={+++cat:{terms:{field:'cat_s',+method:stream+}},+cat2:{terms:{field:'cat_s',+method:stream,+sort:'index+asc'+}},+cat3:{terms:{field:'cat_s',+method:stream,+sort:'index+asc',+mincount:3+}},+cat4:{terms:{field:'cat_s',+method:stream,+sort:'index+asc',+prefix:B+}},+cat5:{terms:{field:'cat_s',+method:stream,+sort:'index+asc',+offset:1+}}+}&rows=0&wt=xml} hits=6 status=0 QTime=7
   [junit4]   2> 2536439 INFO  (TEST-TestJsonFacets.testMethodStream-seed#[ED73C296F172D5DE]) [    ] o.a.s.c.S.Request [collection1]  webapp=null path=null params={q=*:*&json.facet={+++cat:{terms:{field:'cat_s',+sort:'index+asc',+facet:{where:{terms:{field:where_s,method:stream,sort:'index+asc'}}}+++}}}&rows=0&wt=xml} hits=6 status=0 QTime=3
   [junit4]   2> 2536440 INFO  (TEST-TestJsonFacets.testMethodStream-seed#[ED73C296F172D5DE]) [    ] o.a.s.c.S.Request [collection1]  webapp=null path=null params={q=*:*&json.facet={+++cat:{terms:{field:'cat_s',+method:stream,sort:'index+asc',+facet:{where:{terms:{field:where_s,method:stream,sort:'index+asc'}}}+++}}}&rows=0&wt=xml} hits=6 status=0 QTime=0
   [junit4]   2> 2536440 INFO  (TEST-TestJsonFacets.testMethodStream-seed#[ED73C296F172D5DE]) [    ] o.a.s.c.S.Request [collection1]  webapp=null path=null params={q=*:*&json.facet={+++cat:{terms:{field:'cat_s',+method:stream,sort:'index+asc',+facet:{++where:{terms:{field:where_s,method:stream,sort:'index+asc',sort:'index+asc',+facet:{x:'max(num_d)'}+++++}}}+++}}}&rows=0&wt=xml} hits=6 status=0 QTime=0
   [junit4]   2> 2536442 INFO  (TEST-TestJsonFacets.testMethodStream-seed#[ED73C296F172D5DE]) [    ] o.a.s.c.S.Request [collection1]  webapp=null path=null params={q=*:*&json.facet={+++cat:{terms:{field:'cat_s',+method:stream,sort:'index+asc',+facet:{+y:'min(num_d)',++where:{terms:{field:where_s,method:stream,sort:'index+asc',+facet:{x:'max(num_d)'}+++++}}}+++}}}&rows=0&facet=true&wt=xml} hits=6 status=0 QTime=0
   [junit4]   2> 2536442 INFO  (TEST-TestJsonFacets.testMethodStream-seed#[ED73C296F172D5DE]) [    ] o.a.s.c.S.Request [collection1]  webapp=null path=null params={q=*:*&fq=cat_s:A&wt=xml} hits=2 status=0 QTime=0
   [junit4]   2> 2536443 INFO  (TEST-TestJsonFacets.testMethodStream-seed#[ED73C296F172D5DE]) [    ] o.a.s.SolrTestCaseJ4 ###Ending testMethodStream {p0=DVHASH}
   [junit4]   2> 2536445 INFO  (TEST-TestJsonFacets.testErrors-seed#[ED73C296F172D5DE]) [    ] o.a.s.SolrTestCaseJ4 ###Starting testErrors {p0=DVHASH}
   [junit4]   2> 2536447 INFO  (TEST-TestJsonFacets.testErrors-seed#[ED73C296F172D5DE]) [    ] o.a.s.s.SolrIndexSearcher Opening [Searcher@1a14bea[collection1] realtime]
   [junit4]   2> 2536447 INFO  (TEST-TestJsonFacets.testErrors-seed#[ED73C296F172D5DE]) [    ] o.a.s.u.p.LogUpdateProcessorFactory [collection1]  webapp=null path=null params={}{deleteByQuery=*:* (-1549282818994995200)} 0 1
   [junit4]   2> 2536448 INFO  (TEST-TestJsonFacets.testErrors-seed#[ED73C296F172D5DE]) [    ] o.a.s.h.RequestHandlerBase Ignoring exception matching ignore_exception
   [junit4]   2> 2536448 INFO  (TEST-TestJsonFacets.testErrors-seed#[ED73C296F172D5DE]) [    ] o.a.s.c.S.Request [collection1]  webapp=null path=null params={ignore_exception=true&q=*:*&json.facet={f:{type:ignore_exception_aaa,+field:bbbbbb}}&wt=json&indent=true} status=400 QTime=0
   [junit4]   2> 2536448 INFO  (TEST-TestJsonFacets.testErrors-seed#[ED73C296F172D5DE]) [    ] o.a.s.SolrTestCaseJ4 ###Ending testErrors {p0=DVHASH}
   [junit4]   2> 2536450 INFO  (TEST-TestJsonFacets.testTolerant-seed#[ED73C296F172D5DE]) [    ] o.a.s.SolrTestCaseJ4 ###Starting testTolerant {p0=DVHASH}
   [junit4]   2> 2536478 INFO  (TEST-TestJsonFacets.testTolerant-seed#[ED73C296F172D5DE]) [    ] o.e.j.s.Server jetty-9.3.8.v20160314
   [junit4]   2> 2536480 INFO  (TEST-TestJsonFacets.testTolerant-seed#[ED73C296F172D5DE]) [    ] o.e.j.s.h.ContextHandler Started o.e.j.s.ServletContextHandler@19110a{/solr,null,AVAILABLE}
   [junit4]   2> 2536480 INFO  (TEST-TestJsonFacets.testTolerant-seed#[ED73C296F172D5DE]) [    ] o.e.j.s.ServerConnector Started ServerConnector@c1e0be{HTTP/1.1,[http/1.1]}{127.0.0.1:61216}
   [junit4]   2> 2536480 INFO  (TEST-TestJsonFacets.testTolerant-seed#[ED73C296F172D5DE]) [    ] o.e.j.s.Server Started @2541780ms
   [junit4]   2> 2536480 INFO  (TEST-TestJsonFacets.testTolerant-seed#[ED73C296F172D5DE]) [    ] o.a.s.c.s.e.JettySolrRunner Jetty properties: {schema=schema_latest.xml, solrconfig=solrconfig-tlog.xml, hostContext=/solr, hostPort=61216}
   [junit4]   2> 2536480 ERROR (TEST-TestJsonFacets.testTolerant-seed#[ED73C296F172D5DE]) [    ] o.a.s.s.StartupLoggingUtils Missing Java Option solr.log.dir. Logging may be missing or incomplete.
   [junit4]   2> 2536481 INFO  (TEST-TestJsonFacets.testTolerant-seed#[ED73C296F172D5DE]) [    ] o.a.s.s.SolrDispatchFilter  ___      _       Welcome to Apache Solr? version 6.3.0
   [junit4]   2> 2536481 INFO  (TEST-TestJsonFacets.testTolerant-seed#[ED73C296F172D5DE]) [    ] o.a.s.s.SolrDispatchFilter / __| ___| |_ _   Starting in standalone mode on port null
   [junit4]   2> 2536481 INFO  (TEST-TestJsonFacets.testTolerant-seed#[ED73C296F172D5DE]) [    ] o.a.s.s.SolrDispatchFilter \__ \/ _ \ | '_|  Install dir: null
   [junit4]   2> 2536481 INFO  (TEST-TestJsonFacets.testTolerant-seed#[ED73C296F172D5DE]) [    ] o.a.s.s.SolrDispatchFilter |___/\___/_|_|    Start time: 2016-10-26T19:47:13.361Z
   [junit4]   2> 2536482 INFO  (TEST-TestJsonFacets.testTolerant-seed#[ED73C296F172D5DE]) [    ] o.a.s.c.SolrXmlConfig Loading container configuration from C:\Users\jenkins\workspace\Lucene-Solr-6.x-Windows\solr\build\solr-core\test\J0\temp\solr.search.facet.TestJsonFacets_ED73C296F172D5DE-001\s0-001\solr.xml
   [junit4]   2> 2536487 INFO  (TEST-TestJsonFacets.testTolerant-seed#[ED73C296F172D5DE]) [    ] o.a.s.u.UpdateShardHandler Creating UpdateShardHandler HTTP client with params: socketTimeout=340000&connTimeout=45000&retry=true
   [junit4]   2> 2536493 INFO  (TEST-TestJsonFacets.testTolerant-seed#[ED73C296F172D5DE]) [    ] o.a.s.c.CorePropertiesLocator Found 1 core definitions underneath C:\Users\jenkins\workspace\Lucene-Solr-6.x-Windows\solr\build\solr-core\test\J0\temp\solr.search.facet.TestJsonFacets_ED73C296F172D5DE-001\s0-001\.
   [junit4]   2> 2536493 INFO  (TEST-TestJsonFacets.testTolerant-seed#[ED73C296F172D5DE]) [    ] o.a.s.c.CorePropertiesLocator Cores are: [collection1]
   [junit4]   2> 2536527 WARN  (coreLoadExecutor-11194-thread-1) [    ] o.a.s.c.Config Beginning with Solr 5.5, <mergePolicy> is deprecated, use <mergePolicyFactory> instead.
   [junit4]   2> 2536528 INFO  (coreLoadExecutor-11194-thread-1) [    ] o.a.s.c.SolrConfig Using Lucene MatchVersion: 6.3.0
   [junit4]   2> 2536562 INFO  (coreLoadExecutor-11194-thread-1) [    ] o.a.s.s.IndexSchema [collection1] Schema name=example
   [junit4]   2> 2536613 INFO  (coreLoadExecutor-11194-thread-1) [    ] o.a.s.s.IndexSchema Loaded schema example/1.6 with uniqueid field id
   [junit4]   2> 2536623 INFO  (coreLoadExecutor-11194-thread-1) [    ] o.a.s.c.CoreContainer Creating SolrCore 'collection1' using configuration from instancedir C:\Users\jenkins\workspace\Lucene-Solr-6.x-Windows\solr\build\solr-core\test\J0\temp\solr.search.facet.TestJsonFacets_ED73C296F172D5DE-001\s0-001\.\collection1
   [junit4]   2> 2536624 INFO  (coreLoadExecutor-11194-thread-1) [    x:collection1] o.a.s.c.SolrCore [[collection1] ] Opening new SolrCore at [C:\Users\jenkins\workspace\Lucene-Solr-6.x-Windows\solr\build\solr-core\test\J0\temp\solr.search.facet.TestJsonFacets_ED73C296F172D5DE-001\s0-001\collection1], dataDir=[C:\Users\jenkins\workspace\Lucene-Solr-6.x-Windows\solr\build\solr-core\test\J0\temp\solr.search.facet.TestJsonFacets_ED73C296F172D5DE-001\s0-001\.\collection1\data\]
   [junit4]   2> 2536624 INFO  (coreLoadExecutor-11194-thread-1) [    x:collection1] o.a.s.c.JmxMonitoredMap JMX monitoring is enabled. Adding Solr mbeans to JMX Server: com.sun.jmx.mbeanserver.JmxMBeanServer@d98ea9
   [junit4]   2> 2536627 INFO  (coreLoadExecutor-11194-thread-1) [    x:collection1] o.a.s.u.RandomMergePolicy RandomMergePolicy wrapping class org.apache.lucene.index.LogDocMergePolicy: [LogDocMergePolicy: minMergeSize=1000, mergeFactor=32, maxMergeSize=9223372036854775807, maxMergeSizeForForcedMerge=9223372036854775807, calibrateSizeByDeletes=true, maxMergeDocs=2147483647, maxCFSSegmentSizeMB=8.796093022207999E12, noCFSRatio=0.0]
   [junit4]   2> 2536630 WARN  (coreLoadExecutor-11194-thread-1) [    x:collection1] o.a.s.c.RequestHandlers INVALID paramSet a in requestHandler {type = requestHandler,name = /dump,class = DumpRequestHandler,args = {defaults={a=A,b=B}}}
   [junit4]   2> 2536642 INFO  (coreLoadExecutor-11194-thread-1) [    x:collection1] o.a.s.u.UpdateHandler Using UpdateLog implementation: org.apache.solr.update.UpdateLog
   [junit4]   2> 2536642 INFO  (coreLoadExecutor-11194-thread-1) [    x:collection1] o.a.s.u.UpdateLog Initializing UpdateLog: dataDir= defaultSyncLevel=FLUSH numRecordsToKeep=100 maxNumLogsToKeep=10 numVersionBuckets=65536
   [junit4]   2> 2536644 INFO  (coreLoadExecutor-11194-thread-1) [    x:collection1] o.a.s.u.CommitTracker Hard AutoCommit: disabled
   [junit4]   2> 2536644 INFO  (coreLoadExecutor-11194-thread-1) [    x:collection1] o.a.s.u.CommitTracker Soft AutoCommit: disabled
   [junit4]   2> 2536645 INFO  (coreLoadExecutor-11194-thread-1) [    x:collection1] o.a.s.u.RandomMergePolicy RandomMergePolicy wrapping class org.apache.lucene.index.LogDocMergePolicy: [LogDocMergePolicy: minMergeSize=1000, mergeFactor=40, maxMergeSize=9223372036854775807, maxMergeSizeForForcedMerge=9223372036854775807, calibrateSizeByDeletes=false, maxMergeDocs=2147483647, maxCFSSegmentSizeMB=8.796093022207999E12, noCFSRatio=0.0]
   [junit4]   2> 2536646 INFO  (coreLoadExecutor-11194-thread-1) [    x:collection1] o.a.s.s.SolrIndexSearcher Opening [Searcher@ec7d85[collection1] main]
   [junit4]   2> 2536647 INFO  (coreLoadExecutor-11194-thread-1) [    x:collection1] o.a.s.r.ManagedResourceStorage File-based storage initialized to use dir: C:\Users\jenkins\workspace\Lucene-Solr-6.x-Windows\solr\build\solr-core\test\J0\temp\solr.search.facet.TestJsonFacets_ED73C296F172D5DE-001\s0-001\collection1\conf
   [junit4]   2> 2536647 INFO  (coreLoadExecutor-11194-thread-1) [    x:collection1] o.a.s.h.ReplicationHandler Commits will be reserved for  10000
   [junit4]   2> 2536648 INFO  (searcherExecutor-11195-thread-1-processing-x:collection1) [    x:collection1] o.a.s.c.SolrCore [collection1] Registered new searcher Searcher@ec7d85[collection1] main{ExitableDirectoryReader(UninvertingDirectoryReader())}
   [junit4]   2> 2536649 INFO  (coreLoadExecutor-11194-thread-1) [    x:collection1] o.a.s.u.UpdateLog Could not find max version in index or recent updates, using new clock 1549282819208904704
   [junit4]   2> 2536998 INFO  (TEST-TestJsonFacets.testTolerant-seed#[ED73C296F172D5DE]) [    ] o.a.s.SolrTestCaseHS ===> Started solr server port=61216 home=C:\Users\jenkins\workspace\Lucene-Solr-6.x-Windows\solr\build\solr-core\test\J0\temp\solr.search.facet.TestJsonFacets_ED73C296F172D5DE-001\s0-001
   [junit4]   2> 2537024 INFO  (TEST-TestJsonFacets.testTolerant-seed#[ED73C296F172D5DE]) [    ] o.e.j.s.Server jetty-9.3.8.v20160314
   [junit4]   2> 2537025 INFO  (TEST-TestJsonFacets.testTolerant-seed#[ED73C296F172D5DE]) [    ] o.e.j.s.h.ContextHandler Started o.e.j.s.ServletContextHandler@1b0e190{/solr,null,AVAILABLE}
   [junit4]   2> 2537026 INFO  (TEST-TestJsonFacets.testTolerant-seed#[ED73C296F172D5DE]) [    ] o.e.j.s.ServerConnector Started ServerConnector@1a38f5b{HTTP/1.1,[http/1.1]}{127.0.0.1:61219}
   [junit4]   2> 2537026 INFO  (TEST-TestJsonFacets.testTolerant-seed#[ED73C296F172D5DE]) [    ] o.e.j.s.Server Started @2542326ms
   [junit4]   2> 2537026 INFO  (TEST-TestJsonFacets.testTolerant-seed#[ED73C296F172D5DE]) [    ] o.a.s.c.s.e.JettySolrRunner Jetty properties: {schema=schema_latest.xml, solrconfig=solrconfig-tlog.xml, hostContext=/solr, hostPort=61219}
   [junit4]   2> 2537026 ERROR (TEST-TestJsonFacets.testTolerant-seed#[ED73C296F172D5DE]) [    ] o.a.s.s.StartupLoggingUtils Missing Java Option solr.log.dir. Logging may be missing or incomplete.
   [junit4]   2> 2537027 INFO  (TEST-TestJsonFacets.testTolerant-seed#[ED73C296F172D5DE]) [    ] o.a.s.s.SolrDispatchFilter  ___      _       Welcome to Apache Solr? version 6.3.0
   [junit4]   2> 2537027 INFO  (TEST-TestJsonFacets.testTolerant-seed#[ED73C296F172D5DE]) [    ] o.a.s.s.SolrDispatchFilter / __| ___| |_ _   Starting in standalone mode on port null
   [junit4]   2> 2537027 INFO  (TEST-TestJsonFacets.testTolerant-seed#[ED73C296F172D5DE]) [    ] o.a.s.s.SolrDispatchFilter \__ \/ _ \ | '_|  Install dir: null
   [junit4]   2> 2537027 INFO  (TEST-TestJsonFacets.testTolerant-seed#[ED73C296F172D5DE]) [    ] o.a.s.s.SolrDispatchFilter |___/\___/_|_|    Start time: 2016-10-26T19:47:13.907Z
   [junit4]   2> 2537028 INFO  (TEST-TestJsonFacets.testTolerant-seed#[ED73C296F172D5DE]) [    ] o.a.s.c.SolrXmlConfig Loading container configuration from C:\Users\jenkins\workspace\Lucene-Solr-6.x-Windows\solr\build\solr-core\test\J0\temp\solr.search.facet.TestJsonFacets_ED73C296F172D5DE-001\s1-001\solr.xml
   [junit4]   2> 2537035 INFO  (TEST-TestJsonFacets.testTolerant-seed#[ED73C296F172D5DE]) [    ] o.a.s.u.UpdateShardHandler Creating UpdateShardHandler HTTP client with params: socketTimeout=340000&connTimeout=45000&retry=true
   [junit4]   2> 2537041 INFO  (TEST-TestJsonFacets.testTolerant-seed#[ED73C296F172D5DE]) [    ] o.a.s.c.CorePropertiesLocator Found 1 core definitions underneath C:\Users\jenkins\workspace\Lucene-Solr-6.x-Windows\solr\build\solr-core\test\J0\temp\solr.search.facet.TestJsonFacets_ED73C296F172D5DE-001\s1-001\.
   [junit4]   2> 2537041 INFO  (TEST-TestJsonFacets.testTolerant-seed#[ED73C296F172D5DE]) [    ] o.a.s.c.CorePropertiesLocator Cores are: [collection1]
   [junit4]   2> 2537056 WARN  (coreLoadExecutor-11205-thread-1) [    ] o.a.s.c.Config Beginning with Solr 5.5, <mergePolicy> is deprecated, use <mergePolicyFactory> instead.
   [junit4]   2> 2537057 INFO  (coreLoadExecutor-11205-thread-1) [    ] o.a.s.c.SolrConfig Using Lucene MatchVersion: 6.3.0
   [junit4]   2> 2537067 INFO  (coreLoadExecutor-11205-thread-1) [    ] o.a.s.s.IndexSchema [collection1] Schema name=example
   [junit4]   2> 2537127 INFO  (coreLoadExecutor-11205-thread-1) [    ] o.a.s.s.IndexSchema Loaded schema example/1.6 with uniqueid field id
   [junit4]   2> 2537145 INFO  (coreLoadExecutor-11205-thread-1) [    ] o.a.s.c.CoreContainer Creating SolrCore 'collection1' using configuration from instancedir C:\Users\jenkins\workspace\Lucene-Solr-6.x-Windows\solr\build\solr-core\test\J0\temp\solr.search.facet.TestJsonFacets_ED73C296F172D5DE-001\s1-001\.\collection1
   [junit4]   2> 2537145 INFO  (coreLoadExecutor-11205-thread-1) [    x:collection1] o.a.s.c.SolrCore [[collection1] ] Opening new SolrCore at [C:\Users\jenkins\workspace\Lucene-Solr-6.x-Windows\solr\build\solr-core\test\J0\temp\solr.search.facet.TestJsonFacets_ED73C296F172D5DE-001\s1-001\collection1], dataDir=[C:\Users\jenkins\workspace\Lucene-Solr-6.x-Windows\solr\build\solr-core\test\J0\temp\solr.search.facet.TestJsonFacets_ED73C296F172D5DE-001\s1-001\.\collection1\data\]
   [junit4]   2> 2537145 INFO  (coreLoadExecutor-11205-thread-1) [    x:collection1] o.a.s.c.JmxMonitoredMap JMX monitoring is enabled. Adding Solr mbeans to JMX Server: com.sun.jmx.mbeanserver.JmxMBeanServer@d98ea9
   [junit4]   2> 2537147 INFO  (coreLoadExecutor-11205-thread-1) [    x:collection1] o.a.s.u.RandomMergePolicy RandomMergePolicy wrapping class org.apache.lucene.index.LogDocMergePolicy: [LogDocMergePolicy: minMergeSize=1000, mergeFactor=32, maxMergeSize=9223372036854775807, maxMergeSizeForForcedMerge=9223372036854775807, calibrateSizeByDeletes=true, maxMergeDocs=2147483647, maxCFSSegmentSizeMB=8.796093022207999E12, noCFSRatio=0.0]
   [junit4]   2> 2537153 WARN  (coreLoadExecutor-11205-thread-1) [    x:collection1] o.a.s.c.RequestHandlers INVALID paramSet a in requestHandler {type = requestHandler,name = /dump,class = DumpRequestHandler,args = {defaults={a=A,b=B}}}
   [junit4]   2> 2537169 INFO  (coreLoadExecutor-11205-thread-1) [    x:collection1] o.a.s.u.UpdateHandler Using UpdateLog implementation: org.apache.solr.update.UpdateLog
   [junit4]   2> 2537169 INFO  (coreLoadExecutor-11205-thread-1) [    x:collection1] o.a.s.u.UpdateLog Initializing UpdateLog: dataDir= defaultSyncLevel=FLUSH numRecordsToKeep=100 maxNumLogsToKeep=10 numVersionBuckets=65536
   [junit4]   2> 2537171 INFO  (coreLoadExecutor-11205-thread-1) [    x:collection1] o.a.s.u.CommitTracker Hard AutoCommit: disabled
   [junit4]   2> 2537171 INFO  (coreLoadExecutor-11205-thread-1) [    x:collection1] o.a.s.u.CommitTracker Soft AutoCommit: disabled
   [junit4]   2> 2537172 INFO  (coreLoadExecutor-11205-thread-1) [    x:collection1] o.a.s.u.RandomMergePolicy RandomMergePolicy wrapping class org.apache.lucene.index.LogDocMergePolicy: [LogDocMergePolicy: minMergeSize=1000, mergeFactor=40, maxMergeSize=9223372036854775807, maxMergeSizeForForcedMerge=9223372036854775807, calibrateSizeByDeletes=false, maxMergeDocs=2147483647, maxCFSSegmentSizeMB=8.796093022207999E12, noCFSRatio=0.0]
   [junit4]   2> 2537173 INFO  (coreLoadExecutor-11205-thread-1) [    x:collection1] o.a.s.s.SolrIndexSearcher Opening [Searcher@1628b75[collection1] main]
   [junit4]   2> 2537173 INFO  (coreLoadExecutor-11205-thread-1) [    x:collection1] o.a.s.r.ManagedResourceStorage File-based storage initialized to use dir: C:\Users\jenkins\workspace\Lucene-Solr-6.x-Windows\solr\build\solr-core\test\J0\temp\solr.search.facet.TestJsonFacets_ED73C296F172D5DE-001\s1-001\collection1\conf
   [junit4]   2> 2537174 INFO  (coreLoadExecutor-11205-thread-1) [    x:collection1] o.a.s.h.ReplicationHandler Commits will be reserved for  10000
   [junit4]   2> 2537174 INFO  (searcherExecutor-11206-thread-1-processing-x:collection1) [    x:collection1] o.a.s.c.SolrCore [collection1] Registered new searcher Searcher@1628b75[collection1] main{ExitableDirectoryReader(UninvertingDirectoryReader())}
   [junit4]   2> 2537175 INFO  (coreLoadExecutor-11205-thread-1) [    x:collection1] o.a.s.u.UpdateLog Could not find max version in index or recent updates, using new clock 1549282819760455680
   [junit4]   2> 2537543 INFO  (TEST-TestJsonFacets.testTolerant-seed#[ED73C296F172D5DE]) [    ] o.a.s.SolrTestCaseHS ===> Started solr server port=61219 home=C:\Users\jenkins\workspace\Lucene-Solr-6.x-Windows\solr\build\solr-core\test\J0\temp\solr.search.facet.TestJsonFacets_ED73C296F172D5DE-001\s1-001
   [junit4]   2> 2537566 INFO  (TEST-TestJsonFacets.testTolerant-seed#[ED73C296F172D5DE]) [    ] o.e.j.s.Server jetty-9.3.8.v20160314
   [junit4]   2> 2537567 INFO  (TEST-TestJsonFacets.testTolerant-seed#[ED73C296F172D5DE]) [    ] o.e.j.s.h.ContextHandler Started o.e.j.s.ServletContextHandler@2db055{/solr,null,AVAILABLE}
   [junit4]   2> 2537567 INFO  (TEST-TestJsonFacets.testTolerant-seed#[ED73C296F172D5DE]) [    ] o.e.j.s.ServerConnector Started ServerConnector@52b2e7{HTTP/1.1,[http/1.1]}{127.0.0.1:61222}
   [junit4]   2> 2537568 INFO  (TEST-TestJsonFacets.testTolerant-seed#[ED73C296F172D5DE]) [    ] o.e.j.s.Server Started @2542868ms
   [junit4]   2> 2537568 INFO  (TEST-TestJsonFacets.testTolerant-seed#[ED73C296F172D5DE]) [    ] o.a.s.c.s.e.JettySolrRunner Jetty properties: {schema=schema_latest.xml, solrconfig=solrconfig-tlog.xml, hostContext=/solr, hostPort=61222}
   [junit4]   2> 2537568 ERROR (TEST-TestJsonFacets.testTolerant-seed#[ED73C296F172D5DE]) [    ] o.a.s.s.StartupLoggingUtils Missing Java Option solr.log.dir. Logging may be missing or incomplete.
   [junit4]   2> 2537568 INFO  (TEST-TestJsonFacets.testTolerant-seed#[ED73C296F172D5DE]) [    ] o.a.s.s.SolrDispatchFilter  ___      _       Welcome to Apache Solr? version 6.3.0
   [junit4]   2> 2537568 INFO  (TEST-TestJsonFacets.testTolerant-seed#[ED73C296F172D5DE]) [    ] o.a.s.s.SolrDispatchFilter / __| ___| |_ _   Starting in standalone mode on port null
   [junit4]   2> 2537568 INFO  (TEST-TestJsonFacets.testTolerant-seed#[ED73C296F172D5DE]) [    ] o.a.s.s.SolrDispatchFilter \__ \/ _ \ | '_|  Install dir: null
   [junit4]   2> 2537568 INFO  (TEST-TestJsonFacets.testTolerant-seed#[ED73C296F172D5DE]) [    ] o.a.s.s.SolrDispatchFilter |___/\___/_|_|    Start time: 2016-10-26T19:47:14.448Z
   [junit4]   2> 2537571 INFO  (TEST-TestJsonFacets.testTolerant-seed#[ED73C296F172D5DE]) [    ] o.a.s.c.SolrXmlConfig Loading container configuration from C:\Users\jenkins\workspace\Lucene-Solr-6.x-Windows\solr\build\solr-core\test\J0\temp\solr.search.facet.TestJsonFacets_ED73C296F172D5DE-001\s2-001\solr.xml
   [junit4]   2> 2537578 INFO  (TEST-TestJsonFacets.testTolerant-seed#[ED73C296F172D5DE]) [    ] o.a.s.u.UpdateShardHandler Creating UpdateShardHandler HTTP client with params: socketTimeout=340000&connTimeout=45000&retry=true
   [junit4]   2> 2537584 INFO  (TEST-TestJsonFacets.testTolerant-seed#[ED73C296F172D5DE]) [    ] o.a.s.c.CorePropertiesLocator Found 1 core definitions underneath C:\Users\jenkins\workspace\Lucene-Solr-6.x-Windows\solr\build\solr-core\test\J0\temp\solr.search.facet.TestJsonFacets_ED73C296F172D5DE-001\s2-001\.
   [junit4]   2> 2537584 INFO  (TEST-TestJsonFacets.testTolerant-seed#[ED73C296F172D5DE]) [    ] o.a.s.c.CorePropertiesLocator Cores are: [collection1]
   [junit4]   2> 2537613 WARN  (coreLoadExecutor-11216-thread-1) [    ] o.a.s.c.Config Beginning with Solr 5.5, <mergePolicy> is deprecated, use <mergePolicyFactory> instead.
   [junit4]   2> 2537614 INFO  (coreLoadExecutor-11216-thread-1) [    ] o.a.s.c.SolrConfig Using Lucene MatchVersion: 6.3.0
   [junit4]   2> 2537628 INFO  (coreLoadExecutor-11216-thread-1) [    ] o.a.s.s.IndexSchema [collection1] Schema name=example
   [junit4]   2> 2537685 INFO  (coreLoadExecutor-11216-thread-1) [    ] o.a.s.s.IndexSchema Loaded schema example/1.6 with uniqueid field id
   [junit4]   2> 2537695 INFO  (coreLoadExecutor-11216-thread-1) [    ] o.a.s.c.CoreContainer Creating SolrCore 'collection1' using configuration from instancedir C:\Users\jenkins\workspace\Lucene-Solr-6.x-Windows\solr\build\solr-core\test\J0\temp\solr.search.facet.TestJsonFacets_ED73C296F172D5DE-001\s2-001\.\collection1
   [junit4]   2> 2537696 INFO  (coreLoadExecutor-11216-thread-1) [    x:collection1] o.a.s.c.SolrCore [[collection1] ] Opening new SolrCore at [C:\Users\jenkins\workspace\Lucene-Solr-6.x-Windows\solr\build\solr-core\test\J0\temp\solr.search.facet.TestJsonFacets_ED73C296F172D5DE-001\s2-001\collection1], dataDir=[C:\Users\jenkins\workspace\Lucene-Solr-6.x-Windows\solr\build\solr-core\test\J0\temp\solr.search.facet.TestJsonFacets_ED73C296F172D5DE-001\s2-001\.\collection1\data\]
   [junit4]   2> 2537696 INFO  (coreLoadExecutor-11216-thread-1) [    x:collection1] o.a.s.c.JmxMonitoredMap JMX monitoring is enabled. Adding Solr mbeans to JMX Server: com.sun.jmx.mbeanserver.JmxMBeanServer@d98ea9
   [junit4]   2> 2537702 INFO  (coreLoadExecutor-11216-thread-1) [    x:collection1] o.a.s.u.RandomMergePolicy RandomMergePolicy wrapping class org.apache.lucene.index.LogDocMergePolicy: [LogDocMergePolicy: minMergeSize=1000, mergeFactor=32, maxMergeSize=9223372036854775807, maxMergeSizeForForcedMerge=9223372036854775807, calibrateSizeByDeletes=true, maxMergeDocs=2147483647, maxCFSSegmentSizeMB=8.796093022207999E12, noCFSRatio=0.0]
   [junit4]   2> 2537707 WARN  (coreLoadExecutor-11216-thread-1) [    x:collection1] o.a.s.c.RequestHandlers INVALID paramSet a in requestHandler {type = requestHandler,name = /dump,class = DumpRequestHandler,args = {defaults={a=A,b=B}}}
   [junit4]   2> 2537717 INFO  (coreLoadExecutor-11216-thread-1) [    x:collection1] o.a.s.u.UpdateHandler Using UpdateLog implementation: org.apache.solr.update.UpdateLog
   [junit4]   2> 2537717 INFO  (coreLoadExecutor-11216-thread-1) [    x:collection1] o.a.s.u.UpdateLog Initializing UpdateLog: dataDir= defaultSyncLevel=FLUSH numRecordsToKeep=100 maxNumLogsToKeep=10 numVersionBuckets=65536
   [junit4]   2> 2537719 INFO  (coreLoadExecutor-11216-thread-1) [    x:collection1] o.a.s.u.CommitTracker Hard AutoCommit: disabled
   [junit4]   2> 2537719 INFO  (coreLoadExecutor-11216-thread-1) [    x:collection1] o.a.s.u.CommitTracker Soft AutoCommit: disabled
   [junit4]   2> 2537720 INFO  (coreLoadExecutor-11216-thread-1) [    x:collection1] o.a.s.u.RandomMergePolicy RandomMergePolicy wrapping class org.apache.lucene.index.LogDocMergePolicy: [LogDocMergePolicy: minMergeSize=1000, mergeFactor=40, maxMergeSize=9223372036854775807, maxMergeSizeForForcedMerge=9223372036854775807, calibrateSizeByDeletes=false, maxMergeDocs=2147483647, maxCFSSegmentSizeMB=8.796093022207999E12, noCFSRatio=0.0]
   [junit4]   2> 2537721 INFO  (coreLoadExecutor-11216-thread-1) [    x:collection1] o.a.s.s.SolrIndexSearcher Opening [Searcher@12bbc8a[collection1] main]
   [junit4]   2> 2537722 INFO  (coreLoadExecutor-11216-thread-1) [    x:collection1] o.a.s.r.ManagedResourceStorage File-based storage initialized to use dir: C:\Users\jenkins\workspace\Lucene-Solr-6.x-Windows\solr\build\solr-core\test\J0\temp\solr.search.facet.TestJsonFacets_ED73C296F172D5DE-001\s2-001\collection1\conf
   [junit4]   2> 2537722 INFO  (coreLoadExecutor-11216-thread-1) [    x:collection1] o.a.s.h.ReplicationHandler Commits will be reserved for  10000
   [junit4]   2> 2537723 INFO  (searcherExecutor-11217-thread-1-processing-x:collection1) [    x:collection1] o.a.s.c.SolrCore [collection1] Registered new searcher Searcher@12bbc8a[collection1] main{ExitableDirectoryReader(UninvertingDirectoryReader())}
   [junit4]   2> 2537723 INFO  (coreLoadExecutor-11216-thread-1) [    x:collection1] o.a.s.u.UpdateLog Could not find max version in index or recent updates, using new clock 1549282820335075328
   [junit4]   2> 2538085 INFO  (TEST-TestJsonFacets.testTolerant-seed#[ED73C296F172D5DE]) [    ] o.a.s.SolrTestCaseHS ===> Started solr server port=61222 home=C:\Users\jenkins\workspace\Lucene-Solr-6.x-Windows\solr\build\solr-core\test\J0\temp\solr.search.facet.TestJsonFacets_ED73C296F172D5DE-001\s2-001
   [junit4]   2> 2538102 INFO  (qtp12275332-22269) [    x:collection1] o.a.s.u.p.LogUpdateProcessorFactory [collection1]  webapp=/solr path=/update params={wt=javabin&version=2}{deleteByQuery=*:* (-1549282820729339904)} 0 3
   [junit4]   2> 2538110 INFO  (qtp22735213-22289) [    x:collection1] o.a.s.u.p.LogUpdateProcessorFactory [collection1]  webapp=/solr path=/update params={wt=javabin&version=2}{deleteByQuery=*:* (-1549282820736679936)} 0 4
   [junit4]   2> 2538117 INFO  (qtp4819077-22294) [    x:collection1] o.a.s.u.p.LogUpdateProcessorFactory [collection1]  webapp=/solr path=/update params={wt=javabin&version=2}{deleteByQuery=*:* (-1549282820744019968)} 0 4
   [junit4]   2> 2538119 INFO  (qtp4819077-22304) [    x:collection1] o.a.s.u.p.LogUpdateProcessorFactory [collection1]  webapp=/solr path=/update params={wt=javabin&version=2}{add=[1 (1549282820750311424)]} 0 0
   [junit4]   2> 2538120 INFO  (qtp12275332-22261) [    x:collection1] o.a.s.u.p.LogUpdateProcessorFactory [collection1]  webapp=/solr path=/update params={wt=javabin&version=2}{add=[2 (1549282820751360000)]} 0 0
   [junit4]   2> 2538122 INFO  (qtp22735213-22281) [    x:collection1] o.a.s.u.p.LogUpdateProcessorFactory [collection1]  webapp=/solr path=/update params={wt=javabin&version=2}{add=[3 (1549282820753457152)]} 0 0
   [junit4]   2> 2538123 INFO  (qtp12275332-22260) [    x:collection1] o.a.s.u.DirectUpdateHandler2 start commit{,optimize=false,openSearcher=true,waitSearcher=true,expungeDeletes=false,softCommit=false,prepareCommit=false}
   [junit4]   2> 2538123 INFO  (qtp12275332-22260) [    x:collection1] o.a.s.u.SolrIndexWriter Calling setCommitData with IW:org.apache.solr.update.SolrIndexWriter@1f84b5b
   [junit4]   2> 2538125 INFO  (qtp12275332-22260) [    x:collection1] o.a.s.s.SolrIndexSearcher Opening [Searcher@63acce[collection1] main]
   [junit4]   2> 2538125 INFO  (qtp12275332-22260) [    x:collection1] o.a.s.u.DirectUpdateHandler2 end_commit_flush
   [junit4]   2> 2538125 INFO  (searcherExecutor-11195-thread-1-processing-x:collection1) [    x:collection1] o.a.s.c.SolrCore [collection1] Registered new searcher Searcher@63acce[collection1] main{ExitableDirectoryReader(UninvertingDirectoryReader(Uninverting(_0(6.3.0):C1)))}
   [junit4]   2> 2538127 INFO  (qtp12275332-22260) [    x:collection1] o.a.s.u.p.LogUpdateProcessorFactory [collection1]  webapp=/solr path=/update params={waitSearcher=true&commit=true&softCommit=false&wt=javabin&version=2}{commit=} 0 3
   [junit4]   2> 2538128 INFO  (qtp22735213-22280) [    x:collection1] o.a.s.u.DirectUpdateHandler2 start commit{,optimize=false,openSearcher=true,waitSearcher=true,expungeDeletes=false,softCommit=false,prepareCommit=false}
   [junit4]   2> 2538128 INFO  (qtp22735213-22280) [    x:collection1] o.a.s.u.SolrIndexWriter Calling setCommitData with IW:org.apache.solr.update.SolrIndexWriter@34acc0
   [junit4]   2> 2538129 INFO  (qtp22735213-22280) [    x:collection1] o.a.s.s.SolrIndexSearcher Opening [Searcher@12346ea[collection1] main]
   [junit4]   2> 2538129 INFO  (qtp22735213-22280) [    x:collection1] o.a.s.u.DirectUpdateHandler2 end_commit_flush
   [junit4]   2> 2538130 INFO  (searcherExecutor-11206-thread-1-processing-x:collection1) [    x:collection1] o.a.s.c.SolrCore [collection1] Registered new searcher Searcher@12346ea[collection1] main{ExitableDirectoryReader(UninvertingDirectoryReader(Uninverting(_0(6.3.0):C1)))}
   [junit4]   2> 2538130 INFO  (qtp22735213-22280) [    x:collection1] o.a.s.u.p.LogUpdateProcessorFactory [collection1]  webapp=/solr path=/update params={waitSearcher=true&commit=true&softCommit=false&wt=javabin&version=2}{commit=} 0 2
   [junit4]   2> 2538131 INFO  (qtp4819077-22300) [    x:collection1] o.a.s.u.DirectUpdateHandler2 start commit{,optimize=false,openSearcher=true,waitSearcher=true,expungeDeletes=false,softCommit=false,prepareCommit=false}
   [junit4]   2> 2538131 INFO  (qtp4819077-22300) [    x:collection1] o.a.s.u.SolrIndexWriter Calling setCommitData with IW:org.apache.solr.update.SolrIndexWriter@c3821a
   [junit4]   2> 2538132 INFO  (qtp4819077-22300) [    x:collection1] o.a.s.s.SolrIndexSearcher Opening [Searcher@1c73d43[collection1] main]
   [junit4]   2> 2538133 INFO  (qtp4819077-22300) [    x:collection1] o.a.s.u.DirectUpdateHandler2 end_commit_flush
   [junit4]   2> 2538133 INFO  (searcherExecutor-11217-thread-1-processing-x:collection1) [    x:collection1] o.a.s.c.SolrCore [collection1] Registered new searcher Searcher@1c73d43[collection1] main{ExitableDirectoryReader(UninvertingDirectoryReader(Uninverting(_0(6.3.0):C1)))}
   [junit4]   2> 2538133 INFO  (qtp4819077-22300) [    x:collection1] o.a.s.u.p.LogUpdateProcessorFactory [collection1]  webapp=/solr path=/update params={waitSearcher=true&commit=true&softCommit=false&wt=javabin&version=2}{commit=} 0 3
   [junit4]   2> 2538138 INFO  (qtp4819077-22301) [    x:collection1] o.a.s.u.p.LogUpdateProcessorFactory [collection1]  webapp=/solr path=/update params={wt=javabin&version=2}{add=[4 (1549282820767088640)]} 0 2
   [junit4]   2> 2538141 INFO  (qtp12275332-22259) [    x:collection1] o.a.s.u.p.LogUpdateProcessorFactory [collection1]  webapp=/solr path=/update params={wt=javabin&version=2}{add=[5 (1549282820771282944)]} 0 2
   [junit4]   2> 2538142 INFO  (qtp12275332-22258) [    x:collection1] o.a.s.u.DirectUpdateHandler2 start commit{,optimize=false,openSearcher=true,waitSearcher=true,expungeDeletes=false,softCommit=false,prepareCommit=false}
   [junit4]   2> 2538142 INFO  (qtp12275332-22258) [    x:collection1] o.a.s.u.SolrIndexWriter Calling setCommitData with IW:org.apache.solr.update.SolrIndexWriter@1f84b5b
   [junit4]   2> 2538143 INFO  (qtp12275332-22258) [    x:collection1] o.a.s.s.SolrIndexSearcher Opening [Searcher@e8fcf7[collection1] main]
   [junit4]   2> 2538144 INFO  (qtp12275332-22258) [    x:collection1] o.a.s.u.DirectUpdateHandler2 end_commit_flush
   [junit4]   2> 2538144 INFO  (searcherExecutor-11195-thread-1-processing-x:collection1) [    x:collection1] o.a.s.c.SolrCore [collection1] Registered new searcher Searcher@e8fcf7[collection1] main{ExitableDirectoryReader(UninvertingDirectoryReader(Uninverting(_0(6.3.0):C1) Uninverting(_1(6.3.0):C1)))}
   [junit4]   2> 2538144 INFO  (qtp12275332-22258) [    x:collection1] o.a.s.u.p.LogUpdateProcessorFactory [collection1]  webapp=/solr path=/update params={waitSearcher=true&commit=true&softCommit=false&wt=javabin&version=2}{commit=} 0 2
   [junit4]   2> 2538145 INFO  (qtp22735213-22279) [    x:collection1] o.a.s.u.DirectUpdateHandler2 start commit{,optimize=false,openSearcher=true,waitSearcher=true,expungeDeletes=false,softCommit=false,prepareCommit=false}
   [junit4]   2> 2538145 INFO  (qtp22735213-22279) [    x:collection1] o.a.s.u.DirectUpdateHandler2 No uncommitted changes. Skipping IW.commit.
   [junit4]   2> 2538145 INFO  (qtp22735213-22279) [    x:collection1] o.a.s.u.DirectUpdateHandler2 end_commit_flush
   [junit4]   2> 2538145 INFO  (qtp22735213-22279) [    x:collection1] o.a.s.u.p.LogUpdateProcessorFactory [collection1]  webapp=/solr path=/update params={waitSearcher=true&commit=true&softCommit=false&wt=javabin&version=2}{commit=} 0 0
   [junit4]   2> 2538146 INFO  (qtp4819077-22299) [    x:collection1] o.a.s.u.DirectUpdateHandler2 start commit{,optimize=false,openSearcher=true,waitSearcher=true,expungeDeletes=false,softCommit=false,prepareCommit=false}
   [junit4]   2> 2538146 INFO  (qtp4819077-22299) [    x:collection1] o.a.s.u.SolrIndexWriter Calling setCommitData with IW:org.apache.solr.update.SolrIndexWriter@c3821a
   [junit4]   2> 2538148 INFO  (qtp4819077-22299) [    x:collection1] o.a.s.s.SolrIndexSearcher Opening [Searcher@4a133f[collection1] main]
   [junit4]   2> 2538148 INFO  (qtp4819077-22299) [    x:collection1] o.a.s.u.DirectUpdateHandler2 end_commit_flush
   [junit4]   2> 2538148 INFO  (searcherExecutor-11217-thread-1-processing-x:collection1) [    x:collection1] o.a.s.c.SolrCore [collection1] Registered new searcher Searcher@4a133f[collection1] main{ExitableDirectoryReader(UninvertingDirectoryReader(Uninverting(_0(6.3.0):C1) Uninverting(_1(6.3.0):C1)))}
   [junit4]   2> 2538149 INFO  (qtp4819077-22299) [    x:collection1] o.a.s.u.p.LogUpdateProcessorFactory [collection1]  webapp=/solr path=/update params={waitSearcher=true&commit=true&softCommit=false&wt=javabin&version=2}{commit=} 0 2
   [junit4]   2> 2538153 INFO  (qtp22735213-22278) [    x:collection1] o.a.s.u.p.LogUpdateProcessorFactory [collection1]  webapp=/solr path=/update params={wt=javabin&version=2}{add=[6 (1549282820782817280)]} 0 3
   [junit4]   2> 2538154 INFO  (qtp12275332-22257) [    x:collection1] o.a.s.u.DirectUpdateHandler2 start commit{,optimize=false,openSearcher=true,waitSearcher=true,expungeDeletes=false,softCommit=false,prepareCommit=false}
   [junit4]   2> 2538154 INFO  (qtp12275332-22257) [    x:collection1] o.a.s.u.DirectUpdateHandler2 No uncommitted changes. Skipping IW.commit.
   [junit4]   2> 2538154 INFO  (qtp12275332-22257) [    x:collection1] o.a.s.u.DirectUpdateHandler2 end_commit_flush
   [junit4]   2> 2538154 INFO  (qtp12275332-22257) [    x:collection1] o.a.s.u.p.LogUpdateProcessorFactory [collection1]  webapp=/solr path=/update params={waitSearcher=true&commit=true&softCommit=false&wt=javabin&version=2}{commit=} 0 0
   [junit4]   2> 2538156 INFO  (qtp22735213-22277) [    x:collection1] o.a.s.u.DirectUpdateHandler2 start commit{,optimize=false,openSearcher=true,waitSearcher=true,expungeDeletes=false,softCommit=false,prepareCommit=false}
   [junit4]   2> 2538156 INFO  (qtp22735213-22277) [    x:collection1] o.a.s.u.SolrIndexWriter Calling setCommitData with IW:org.apache.solr.update.SolrIndexWriter@34acc0
   [junit4]   2> 2538158 INFO  (qtp22735213-22277) [    x:collection1] o.a.s.s.SolrIndexSearcher Opening [Searcher@1966e6b[collection1] main]
   [junit4]   2> 2538158 INFO  (qtp22735213-22277) [    x:collection1] o.a.s.u.DirectUpdateHandler2 end_commit_flush
   [junit4]   2> 2538159 INFO  (searcherExecutor-11206-thread-1-processing-x:collection1) [    x:collection1] o.a.s.c.SolrCore [collection1] Registered new searcher Searcher@1966e6b[collection1] main{ExitableDirectoryReader(UninvertingDirectoryReader(Uninverting(_0(6.3.0):C1) Uninverting(_1(6.3.0):C1)))}
   [junit4]   2> 2538159 INFO  (qtp22735213-22277) [    x:collection1] o.a.s.u.p.LogUpdateProcessorFactory [collection1]  webapp=/solr path=/update params={waitSearcher=true&commit=true&softCommit=false&wt=javabin&version=2}{commit=} 0 3
   [junit4]   2> 2538160 INFO  (qtp4819077-22298) [    x:collection1] o.a.s.u.DirectUpdateHandler2 start commit{,optimize=false,openSearcher=true,waitSearcher=true,expungeDeletes=false,softCommit=false,prepareCommit=false}
   [junit4]   2> 2538160 INFO  (qtp4819077-22298) [    x:collection1] o.a.s.u.DirectUpdateHandler2 No uncommitted changes. Skipping IW.commit.
   [junit4]   2> 2538160 INFO  (qtp4819077-22298) [    x:collection1] o.a.s.u.DirectUpdateHandler2 end_commit_flush
   [junit4]   2> 2538160 INFO  (qtp4819077-22298) [    x:collection1] o.a.s.u.p.LogUpdateProcessorFactory [collection1]  webapp=/solr path=/update params={waitSearcher=true&commit=true&softCommit=false&wt=javabin&version=2}{commit=} 0 0
   [junit4]   2> 2538163 INFO  (qtp12275332-22271) [    x:collection1] o.a.s.c.S.Request [collection1]  webapp=/solr path=/select params={distrib=false&_facet_={}&fl=id&fl=score&shards.purpose=1048580&start=0&fsv=true&shard.url=127.0.0.1:61216/solr/collection1&rows=10&version=2&q=*:*&json.facet={f:{type:terms,+field:cat_s}}&shards.tolerant=false&NOW=1477511235041&isShard=true&ignore_exception=true&wt=javabin} hits=2 status=0 QTime=0
   [junit4]   2> 2538164 INFO  (qtp22735213-22291) [    x:collection1] o.a.s.c.S.Request [collection1]  webapp=/solr path=/select params={distrib=false&_facet_={}&fl=id&fl=score&shards.purpose=1048580&start=0&fsv=true&shard.url=127.0.0.1:61219/solr/collection1&rows=10&version=2&q=*:*&json.facet={f:{type:terms,+field:cat_s}}&shards.tolerant=false&NOW=1477511235041&isShard=true&ignore_exception=true&wt=javabin} hits=2 status=0 QTime=0
   [junit4]   2> 2538167 INFO  (qtp4819077-22296) [    x:collection1] o.a.s.c.S.Request [collection1]  webapp=/solr path=/select params={distrib=false&_facet_={}&fl=id&fl=score&shards.purpose=1048580&start=0&fsv=true&shard.url=127.0.0.1:61222/solr/collection1&rows=10&version=2&q=*:*&json.facet={f:{type:terms,+field:cat_s}}&shards.tolerant=false&NOW=1477511235041&isShard=true&ignore_exception=true&wt=javabin} hits=2 status=0 QTime=0
   [junit4]   2> 2538173 INFO  (qtp4819077-22297) [    x:collection1] o.a.s.h.RequestHandlerBase Ignoring exception matching ignore_exception
   [junit4]   2> 2538173 INFO  (qtp4819077-22297) [    x:collection1] o.a.s.c.S.Request [collection1]  webapp=/solr path=/select params={shards=127.0.0.1:61216/solr/collection1,127.0.0.1:61219/solr/collection1,127.0.0.1:61222/solr/collection1,[ff01::114]:33332:/ignore_exception&q=*:*&json.facet={f:{type:terms,+field:cat_s}}&shards.tolerant=false&indent=true&ignore_exception=true&wt=json&version=2.2} status=500 QTime=11
   [junit4]   2> 2538173 INFO  (qtp4819077-22297) [    x:collection1] o.a.s.s.HttpSolrCall Ignoring exception matching ignore_exception
   [junit4]   2> 2538178 INFO  (qtp12275332-22269) [    x:collection1] o.a.s.c.S.Request [collection1]  webapp=/solr path=/select params={distrib=false&_facet_={}&fl=id&fl=score&shards.purpose=1048580&start=0&fsv=true&shard.url=127.0.0.1:61216/solr/collection1&rows=10&version=2&q=*:*&json.facet={f:{type:terms,+field:cat_s}}&shards.tolerant=true&NOW=1477511235055&isShard=true&ignore_exception=true&wt=javabin} hits=2 status=0 QTime=0
   [junit4]   2> 2538180 INFO  (qtp22735213-22281) [    x:collection1] o.a.s.c.S.Request [collection1]  webapp=/solr path=/select params={distrib=false&_facet_={}&fl=id&fl=score&shards.purpose=1048580&start=0&fsv=true&shard.url=127.0.0.1:61219/solr/collection1&rows=10&version=2&q=*:*&json.facet={f:{type:terms,+field:cat_s}}&shards.tolerant=true&NOW=1477511235055&isShard=true&ignore_exception=true&wt=javabin} hits=2 status=0 QTime=0
   [junit4]   2> 2538181 INFO  (qtp4819077-22294) [    x:collection1] o.a.s.c.S.Request [collection1]  webapp=/solr path=/select params={distrib=false&_facet_={}&fl=id&fl=score&shards.purpose=1048580&start=0&fsv=true&shard.url=127.0.0.1:61222/solr/collection1&rows=10&version=2&q=*:*&json.facet={f:{type:terms,+field:cat_s}}&shards.tolerant=true&NOW=1477511235055&isShard=true&ignore_exception=true&wt=javabin} hits=2 status=0 QTime=0
   [junit4]   2> 2538184 INFO  (qtp22735213-22280) [    x:collection1] o.a.s.c.S.Request [collection1]  webapp=/solr path=/select params={q=*:*&distrib=false&shards.tolerant=true&shards.purpose=64&NOW=1477511235055&ids=3,6&isShard=true&shard.url=127.0.0.1:61219/solr/collection1&ignore_exception=true&wt=javabin&version=2} status=0 QTime=0
   [junit4]   2> 2538196 INFO  (qtp12275332-22261) [    x:collection1] o.a.s.c.S.Request [collection1]  webapp=/solr path=/select params={q=*:*&distrib=false&shards.tolerant=true&shards.purpose=64&NOW=1477511235055&ids=2,5&isShard=true&shard.url=127.0.0.1:61216/solr/collection1&ignore_exception=true&wt=javabin&version=2} status=0 QTime=0
   [junit4]   2> 2538197 INFO  (qtp4819077-22304) [    x:collection1] o.a.s.c.S.Request [collection1]  webapp=/solr path=/select params={q=*:*&distrib=false&shards.tolerant=true&shards.purpose=64&NOW=1477511235055&ids=1,4&isShard=true&shard.url=127.0.0.1:61222/solr/collection1&ignore_exception=true&wt=javabin&version=2} status=0 QTime=0
   [junit4]   2> 2538197 INFO  (qtp22735213-22274) [    x:collection1] o.a.s.c.S.Request [collection1]  webapp=/solr path=/select params={shards=127.0.0.1:61216/solr/collection1,127.0.0.1:61219/solr/collection1,127.0.0.1:61222/solr/collection1,[ff01::114]:33332:/ignore_exception&q=*:*&json.facet={f:{type:terms,+field:cat_s}}&shards.tolerant=true&indent=true&ignore_exception=true&wt=json&version=2.2} hits=6 status=0 QTime=23
   [junit4]   2> 2538198 INFO  (TEST-TestJsonFacets.testTolerant-seed#[ED73C296F172D5DE]) [    ] o.a.s.SolrTestCaseJ4 ###Ending testTolerant {p0=DVHASH}
   [junit4]   2> 2538225 INFO  (TEST-TestJsonFacets.testBigger-seed#[ED73C296F172D5DE]) [    ] o.a.s.SolrTestCaseJ4 ###Starting testBigger {p0=DVHASH}
   [junit4]   2> 2538229 INFO  (qtp12275332-22260) [    x:collection1] o.a.s.s.SolrIndexSearcher Opening [Searcher@1d7d985[collection1] realtime]
   [junit4]   2> 2538230 INFO  (qtp12275332-22260) [    x:collection1] o.a.s.u.p.LogUpdateProcessorFactory [collection1]  webapp=/solr path=/update params={wt=javabin&version=2}{deleteByQuery=*:* (-1549282820862509056)} 0 3
   [junit4]   2> 2538233 INFO  (qtp22735213-22280) [    x:collection1] o.a.s.s.SolrIndexSearcher Opening [Searcher@1d7480d[collection1] realtime]
   [junit4]   2> 2538233 INFO  (qtp22735213-22280) [    x:collection1] o.a.s.u.p.LogUpdateProcessorFactory [collection1]  webapp=/solr path=/update params={wt=javabin&version=2}{deleteByQuery=*:* (-1549282820867751936)} 0 2
   [junit4]   2> 2538236 INFO  (qtp4819077-22304) [    x:collection1] o.a.s.s.SolrIndexSearcher Opening [Searcher@62e461[collection1] realtime]
   [junit4]   2> 2538237 INFO  (qtp4819077-22304) [    x:collection1] o.a.s.u.p.LogUpdateProcessorFactory [collection1]  webapp=/solr path=/update params={wt=javabin&version=2}{deleteByQuery=*:* (-1549282820871946240)} 0 1
   [junit4]   2> 2538241 INFO  (qtp22735213-22278) [    x:collection1] o.a.s.u.p.LogUpdateProcessorFactory [collection1]  webapp=/solr path=/update params={wt=javabin&version=2}{add=[0 (1549282820876140544)]} 0 2
   [junit4]   2> 2538242 INFO  (qtp4819077-22304) [    x:collection1] o.a.s.u.p.LogUpdateProcessorFactory [collection1]  webapp=/solr path=/update params={wt=javabin&version=2}{add=[1 (1549282820879286272)]} 0 0
   [junit4]   2> 2538244 INFO  (qtp12275332-22259) [    x:collection1] o.a.s.u.p.LogUpdateProcessorFactory [collection1]  webapp=/solr path=/update params={wt=javabin&version=2}{add=[2 (1549282820881383424)]} 0 0
   [junit4]   2> 2538245 INFO  (qtp22735213-22277) [    x:collection1] o.a.s.u.p.LogUpdateProcessorFactory [collection1]  webapp=/solr path=/update params={wt=javabin&version=2}{add=[3 (1549282820882432000)]} 0 0
   [junit4]   2> 2538246 INFO  (qtp4819077-22299) [    x:collection1] o.a.s.u.p.LogUpdateProcessorFactory [collection1]  webapp=/solr path=/update params={wt=javabin&version=2}{add=[4 (1549282820883480576)]} 0 0
   [junit4]   2> 2538248 INFO  (qtp12275332-22258) [    x:collection1] o.a.s.u.p.LogUpdateProcessorFactory [collection1]  webapp=/solr path=/update params={wt=javabin&version=2}{add=[5 (1549282820885577728)]} 0 0
   [junit4]   2> 2538250 INFO  (qtp22735213-22277) [    x:collection1] o.a.s.u.p.LogUpdateProcessorFactory [collection1]  webapp=/solr path=/update params={wt=javabin&version=2}{add=[6 (1549282820887674880)]} 0 0
   [junit4]   2> 2538251 INFO  (qtp4819077-22299) [    x:collection1] o.a.s.u.p.LogUpdateProcessorFactory [collection1]  webapp=/solr path=/update params={wt=javabin&version=2}{add=[7 (1549282820888723456)]} 0 0
   [junit4]   2> 2538253 INFO  (qtp12275332-22258) [    x:collection1] o.a.s.u.p.LogUpdateProcessorFactory [collection1]  webapp=/solr path=/update params={wt=javabin&version=2}{add=[8 (1549282820890820608)]} 0 0
   [junit4]   2> 2538255 INFO  (qtp12275332-22258) [    x:collection1] o.a.s.u.DirectUpdateHandler2 start commit{,optimize=false,openSearcher=true,waitSearcher=true,expungeDeletes=false,softCommit=false,prepareCommit=false}
   [junit4]   2> 2538255 INFO  (qtp12275332-22258) [    x:collection1] o.a.s.u.SolrIndexWriter Calling setCommitData with IW:org.apache.solr.update.SolrIndexWriter@1f84b5b
   [junit4]   2> 2538294 INFO  (qtp12275332-22258) [    x:collection1] o.a.s.s.SolrIndexSearcher Opening [Searcher@17711e6[collection1] main]
   [junit4]   2> 2538295 INFO  (qtp12275332-22258) [    x:collection1] o.a.s.u.DirectUpdateHandler2 end_commit_flush
   [junit4]   2> 2538295 INFO  (searcherExecutor-11195-thread-1-processing-x:collection1) [    x:collection1] o.a.s.c.SolrCore [collection1] Registered new searcher Searcher@17711e6[collection1] main{ExitableDirectoryReader(UninvertingDirectoryReader(Uninverting(_2(6.3.0):C3)))}
   [junit4]   2> 2538295 INFO  (qtp12275332-22258) [    x:collection1] o.a.s.u.p.LogUpdateProcessorFactory [collection1]  webapp=/solr path=/update params={waitSearcher=true&commit=true&softCommit=false&wt=javabin&version=2}{commit=} 0 41
   [junit4]   2> 2538297 INFO  (qtp22735213-22277) [    x:collection1] o.a.s.u.DirectUpdateHandler2 start commit{,optimize=false,openSearcher=true,waitSearcher=true,expungeDeletes=false,softCommit=false,prepareCommit=false}
   [junit4]   2> 2538297 INFO  (qtp22735213-22277) [    x:collection1] o.a.s.u.SolrIndexWriter Calling setCommitData with IW:org.apache.solr.update.SolrIndexWriter@34acc0
   [junit4]   2> 2538316 INFO  (qtp22735213-22277) [    x:collection1] o.a.s.s.SolrIndexSearcher Opening [Searcher@184adb[collection1] main]
   [junit4]   2> 2538317 INFO  (searcherExecutor-11206-thread-1-processing-x:collection1) [    x:collection1] o.a.s.c.SolrCore [collection1] Registered new searcher Searcher@184adb[collection1] main{ExitableDirectoryReader(UninvertingDirectoryReader(Uninverting(_2(6.3.0):C3)))}
   [junit4]   2> 2538317 INFO  (qtp22735213-22277) [    x:collection1] o.a.s.u.DirectUpdateHandler2 end_commit_flush
   [junit4]   2> 2538318 INFO  (qtp22735213-22277) [    x:collection1] o.a.s.u.p.LogUpdateProcessorFactory [collection1]  webapp=/solr path=/update params={waitSearcher=true&commit=true&softCommit=false&wt=javabin&version=2}{commit=} 0 20
   [junit4]   2> 2538319 INFO  (qtp4819077-22299) [    x:collection1] o.a.s.u.DirectUpdateHandler2 start commit{,optimize=false,openSearcher=true,waitSearcher=true,expungeDeletes=false,softCommit=false,prepareCommit=false}
   [junit4]   2> 2538319 INFO  (qtp4819077-22299) [    x:collection1] o.a.s.u.SolrIndexWriter Calling setCommitData with IW:org.apache.solr.update.SolrIndexWriter@c3821a
   [junit4]   2> 2538325 INFO  (qtp4819077-22299) [    x:collection1] o.a.s.s.SolrIndexSearcher Opening [Searcher@e4bb22[collection1] main]
   [junit4]   2> 2538326 INFO  (searcherExecutor-11217-thread-1-processing-x:collection1) [    x:collection1] o.a.s.c.SolrCore [collection1] Registered new searcher Searcher@e4bb22[collection1] main{ExitableDirectoryReader(UninvertingDirectoryReader(Uninverting(_2(6.3.0):C3)))}
   [junit4]   2> 2538327 INFO  (qtp4819077-22299) [    x:collection1] o.a.s.u.DirectUpdateHandler2 end_commit_flush
   [junit4]   2> 2538327 INFO  (qtp4819077-22299) [    x:collection1] o.a.s.u.p.LogUpdateProcessorFactory [collection1]  webapp=/solr path=/update params={waitSearcher=true&commit=true&softCommit=false&wt=javabin&version=2}{commit=} 0 7
   [junit4]   2> 2538331 INFO  (qtp22735213-22289) [    x:collection1] o.a.s.u.p.LogUpdateProcessorFactory [collec

[...truncated too long message...]

tingsFormat(name=Asserting), super_sd=BlockTreeOrds(blocksize=128), book_s=BlockTreeOrds(blocksize=128), where_s=PostingsFormat(name=Asserting), Z_num_i=PostingsFormat(name=Asserting), sparse_sd=PostingsFormat(name=LuceneFixedGap), id=PostingsFormat(name=Asserting), num_is=PostingsFormat(name=Asserting), Z_num_l=PostingsFormat(name=LuceneFixedGap), multi_ss=PostingsFormat(name=LuceneFixedGap), type_s=Lucene50(blocksize=128), date_dtd=PostingsFormat(name=Asserting), sparse_sds=PostingsFormat(name=Asserting), page_s=PostingsFormat(name=Asserting), cat_sd=Lucene50(blocksize=128), super_ss=PostingsFormat(name=LuceneFixedGap), val_b=Lucene50(blocksize=128), multi_sds=PostingsFormat(name=LuceneFixedGap), _root_=Lucene50(blocksize=128), num_f=BlockTreeOrds(blocksize=128), cat_s=PostingsFormat(name=LuceneFixedGap), where_sd=BlockTreeOrds(blocksize=128), v_t=PostingsFormat(name=Asserting), make_s=Lucene50(blocksize=128), num_id=PostingsFormat(name=LuceneFixedGap), num_d=PostingsFormat(name=Asserting), num_ds=PostingsFormat(name=LuceneFixedGap), date_dtds=PostingsFormat(name=LuceneFixedGap), num_i=Lucene50(blocksize=128), cost_f=PostingsFormat(name=LuceneFixedGap), sparse_s=Lucene50(blocksize=128), num_l=PostingsFormat(name=Asserting), num_ls=PostingsFormat(name=LuceneFixedGap), where_ss=Lucene50(blocksize=128), num_dds=Lucene50(blocksize=128), model_s=BlockTreeOrds(blocksize=128), num_fds=PostingsFormat(name=LuceneFixedGap), num_fs=Lucene50(blocksize=128), num_ids=PostingsFormat(name=Asserting)}, docValues:{num_dd=DocValuesFormat(name=Lucene54), num_lds=DocValuesFormat(name=Direct), date_dtd=DocValuesFormat(name=Lucene54), sparse_sds=DocValuesFormat(name=Lucene54), cat_sd=DocValuesFormat(name=Direct), cat_sds=DocValuesFormat(name=Lucene54), multi_sds=DocValuesFormat(name=Asserting), where_sds=DocValuesFormat(name=Direct), where_sd=DocValuesFormat(name=Lucene54), Z_num_id=DocValuesFormat(name=Lucene54), num_id=DocValuesFormat(name=Asserting), super_sds=DocValuesFormat(name=Direct), date_dtds=DocValuesFormat(name=Asserting), _version_=DocValuesFormat(name=Direct), cat_ss=DocValuesFormat(name=Lucene54), super_sd=DocValuesFormat(name=Lucene54), sparse_sd=DocValuesFormat(name=Asserting), id=DocValuesFormat(name=Lucene54), where_ss=DocValuesFormat(name=Direct), num_dds=DocValuesFormat(name=Direct), num_fds=DocValuesFormat(name=Asserting), num_ids=DocValuesFormat(name=Lucene54)}, maxPointsInLeafNode=251, maxMBSortInHeap=5.601363652598619, sim=RandomSimilarity(queryNorm=true,coord=crazy): {}, locale=es-EC, timezone=US/Eastern
   [junit4]   2> NOTE: Windows 10 10.0 x86/Oracle Corporation 1.8.0_102 (32-bit)/cpus=3,threads=1,free=90679456,total=433848320
   [junit4]   2> NOTE: All tests run in this JVM: [OverriddenZkACLAndCredentialsProvidersTest, TestPartialUpdateDeduplication, VersionInfoTest, TestPostingsSolrHighlighter, DistribDocExpirationUpdateProcessorTest, TestFaceting, ChangedSchemaMergeTest, DateFieldTest, TestLeaderElectionZkExpiry, TestCollapseQParserPlugin, DistributedFacetPivotSmallAdvancedTest, RankQueryTest, TestSortingResponseWriter, SpatialFilterTest, CoreAdminCreateDiscoverTest, TestScoreJoinQPNoScore, SolrCoreTest, TestReqParamsAPI, TestFieldCacheSort, SmileWriterTest, TestWordDelimiterFilterFactory, TestBulkSchemaAPI, BlockJoinFacetDistribTest, DirectSolrSpellCheckerTest, SyncSliceTest, TestLocalFSCloudBackupRestore, QueryEqualityTest, PingRequestHandlerTest, TestCopyFieldCollectionResource, TestSizeLimitedDistributedMap, RemoteQueryErrorTest, TestCloudInspectUtil, IgnoreCommitOptimizeUpdateProcessorFactoryTest, TestRandomDVFaceting, SaslZkACLProviderTest, DistributedExpandComponentTest, PluginInfoTest, CoreMergeIndexesAdminHandlerTest, TestLRUCache, TestBinaryResponseWriter, SchemaVersionSpecificBehaviorTest, DistributedFacetPivotLargeTest, TestInitParams, JSONWriterTest, DocValuesMissingTest, CursorMarkTest, ActionThrottleTest, UUIDUpdateProcessorFallbackTest, TestFunctionQuery, AssignTest, CdcrUpdateLogTest, TestSolrCloudWithKerberosAlt, TestSlowCompositeReaderWrapper, TestFastLRUCache, HdfsChaosMonkeyNothingIsSafeTest, TestGraphMLResponseWriter, TestFieldCollectionResource, ClusterStateUpdateTest, TestSolrDeletionPolicy1, TestCloudManagedSchema, TestCoreContainer, TestXIncludeConfig, AlternateDirectoryTest, StressHdfsTest, SoftAutoCommitTest, CheckHdfsIndexTest, TestSolrXml, TestDocTermOrds, PeerSyncTest, CoreSorterTest, TestElisionMultitermQuery, TestSurroundQueryParser, PrimUtilsTest, CollectionStateFormat2Test, SharedFSAutoReplicaFailoverTest, TestGroupingSearch, BadComponentTest, TestHashQParserPlugin, TestSubQueryTransformerDistrib, TestExceedMaxTermLength, DistributedQueryElevationComponentTest, TestCloudSchemaless, DistributedMLTComponentTest, AtomicUpdatesTest, BigEndianAscendingWordSerializerTest, TermsComponentTest, TestFileDictionaryLookup, DOMUtilTest, TestSchemaNameResource, XmlUpdateRequestHandlerTest, SolrRequestParserTest, PathHierarchyTokenizerFactoryTest, TestPseudoReturnFields, TestHdfsBackupRestoreCore, SpatialRPTFieldTypeTest, TestCloudPseudoReturnFields, TestCSVLoader, SmileWriterTest, TestDistribIDF, TestManagedResourceStorage, IndexBasedSpellCheckerTest, SimpleMLTQParserTest, LeaderInitiatedRecoveryOnShardRestartTest, TestAuthorizationFramework, TestStressUserVersions, TestCharFilters, CustomCollectionTest, TestBinaryField, SystemInfoHandlerTest, TestNamedUpdateProcessors, TestManagedSchemaThreadSafety, TestReplicationHandler, TestPerFieldSimilarity, ShardRoutingTest, TestFilteredDocIdSet, TestAnalyzeInfixSuggestions, TestSolrConfigHandler, NumericFieldsTest, TestJsonRequest, ConnectionManagerTest, UnloadDistributedZkTest, DisMaxRequestHandlerTest, DocumentBuilderTest, DistributedQueueTest, CdcrRequestHandlerTest, TestPerFieldSimilarityClassic, TestSchemaSimilarityResource, CloneFieldUpdateProcessorFactoryTest, TestAnalyzedSuggestions, ExitableDirectoryReaderTest, MoreLikeThisHandlerTest, TestSSLRandomization, RulesTest, TestRandomFlRTGCloud, MultiThreadedOCPTest, OverseerModifyCollectionTest, TestHdfsCloudBackupRestore, TestSearcherReuse, TestRebalanceLeaders, SynonymTokenizerTest, TestSolrQueryParserResource, LeaderFailureAfterFreshStartTest, TestCollationField, TestJsonFacetRefinement, TestQueryWrapperFilter, CloudExitableDirectoryReaderTest, TestJettySolrRunner, BasicDistributedZkTest, TestSweetSpotSimilarityFactory, TestConfigSetsAPIExclusivity, FileUtilsTest, ForceLeaderTest, DirectSolrConnectionTest, HdfsCollectionsAPIDistributedZkTest, TestManagedStopFilterFactory, FacetPivotSmallTest, TestRuleBasedAuthorizationPlugin, TestExtendedDismaxParser, ChaosMonkeySafeLeaderTest, BasicDistributedZk2Test, OverseerTest, RecoveryZkTest, FullSolrCloudDistribCmdsTest, ZkSolrClientTest, TestZkChroot, TestDistributedSearch, SpellCheckComponentTest, TestSort, DirectUpdateHandlerTest, TestIndexSearcher, ShowFileRequestHandlerTest, CurrencyFieldOpenExchangeTest, SimplePostToolTest, AnalysisAfterCoreReloadTest, SuggesterFSTTest, DocValuesTest, DirectUpdateHandlerOptimizeTest, StatelessScriptUpdateProcessorFactoryTest, DebugComponentTest, TestWriterPerf, TestOmitPositions, TestSolrQueryParser, FastVectorHighlighterTest, SolrPluginUtilsTest, TestJmxIntegration, MBeansHandlerTest, JsonLoaderTest, TestComponentsName, HighlighterConfigTest, SOLR749Test, TestQuerySenderListener, UpdateParamsTest, TestSolrIndexConfig, ResponseLogComponentTest, SolrIndexConfigTest, TestStressRecovery, TestMergePolicyConfig, MultiTermTest, SampleTest, TestSearchPerf, TestConfig, OutputWriterTest, ExternalFileFieldSortTest, NotRequiredUniqueKeyTest, TestPhraseSuggestions, SpellPossibilityIteratorTest, TestCodecSupport, TestLMJelinekMercerSimilarityFactory, TestIBSimilarityFactory, TestBM25SimilarityFactory, TestFastWriter, TimeZoneUtilsTest, TestFastOutputStream, OpenExchangeRatesOrgProviderTest, URLClassifyProcessorTest, DateMathParserTest, ChaosMonkeyNothingIsSafeTest, CollectionsAPISolrJTest, DeleteLastCustomShardedReplicaTest, DeleteReplicaTest, LeaderElectionContextKeyTest, LeaderFailoverAfterPartitionTest, ReplaceNodeTest, ReplicationFactorTest, RestartWhileUpdatingTest, RollingRestartTest, SSLMigrationTest, SharedFSAutoReplicaFailoverUtilsTest, SimpleCollectionCreateDeleteTest, SolrXmlInZkTest, TestAuthenticationFramework, TestCloudDeleteByQuery, TestCloudRecovery, TestCryptoKeys, TestDownShardTolerantSearch, TestMiniSolrCloudCluster, TestOnReconnectListenerSupport, TestTolerantUpdateProcessorCloud, TestTolerantUpdateProcessorRandomCloud, TlogReplayBufferedWhileIndexingTest, TriLevelCompositeIdRoutingTest, CachingDirectoryFactoryTest, TestImplicitCoreProperties, TestInfoStreamLogging, TestReloadAndDeleteDocs, TestSolrDynamicMBean, TestSolrCloudSnapshots, TestConfigReload, TestSQLHandler, CoreAdminRequestStatusTest, SecurityConfHandlerTest, SegmentsInfoRequestHandlerTest, StatsReloadRaceTest, DistributedFacetPivotLongTailTest, DistributedFacetPivotSmallTest, DistributedQueryComponentOptimizationTest, SuggestComponentContextFilterQueryTest, SuggestComponentTest, TestExpandComponent, TestPivotHelperCode, JavabinLoaderTest, WrapperMergePolicyFactoryTest, TestIntervalFaceting, TestMacroExpander, TestMacros, TestBinaryResponseWriter, TestCustomDocTransformer, TestRawResponseWriter, TestRawTransformer, TestSolrQueryResponse, TestChildDocTransformer, TestSubQueryTransformer, TestSubQueryTransformerCrossCore, TestRestManager, TestDynamicFieldCollectionResource, TestDynamicFieldResource, TestFieldTypeCollectionResource, TestFieldTypeResource, TestSchemaVersionResource, TestSerializedLuceneMatchVersion, BadCopyFieldTest, BooleanFieldTest, TestBulkSchemaConcurrent, TestManagedSchema, TestManagedSchemaAPI, TestUseDocValuesAsStored, AnalyticsMergeStrategyTest, TestAddFieldRealTimeGet, TestComplexPhraseQParserPlugin, TestFieldSortValues, TestInitQParser, TestMissingGroups, TestSmileRequest, TestJsonFacets]
   [junit4] Completed [611/645 (1!)] on J0 in 39.86s, 48 tests, 6 errors <<< FAILURES!

[...truncated 52803 lines...]


Mime
View raw message