lucene-dev mailing list archives

Site index · List index
Message view « Date » · « Thread »
Top « Date » · « Thread »
From Policeman Jenkins Server <jenk...@thetaphi.de>
Subject [JENKINS] Lucene-Solr-6.x-Windows (64bit/jdk1.8.0_102) - Build # 511 - Unstable!
Date Tue, 11 Oct 2016 18:29:12 GMT
Build: https://jenkins.thetaphi.de/job/Lucene-Solr-6.x-Windows/511/
Java: 64bit/jdk1.8.0_102 -XX:-UseCompressedOops -XX:+UseParallelGC

1 tests failed.
FAILED:  org.apache.solr.handler.TestSQLHandlerNonCloud.testSQLHandler

Error Message:


Stack Trace:
java.lang.AssertionError
	at __randomizedtesting.SeedInfo.seed([FD567CC985486C20:590D19D78F0F77FF]:0)
	at org.junit.Assert.fail(Assert.java:92)
	at org.junit.Assert.assertTrue(Assert.java:43)
	at org.junit.Assert.assertTrue(Assert.java:54)
	at org.apache.solr.handler.TestSQLHandlerNonCloud.testSQLHandler(TestSQLHandlerNonCloud.java:61)
	at sun.reflect.NativeMethodAccessorImpl.invoke0(Native Method)
	at sun.reflect.NativeMethodAccessorImpl.invoke(NativeMethodAccessorImpl.java:62)
	at sun.reflect.DelegatingMethodAccessorImpl.invoke(DelegatingMethodAccessorImpl.java:43)
	at java.lang.reflect.Method.invoke(Method.java:498)
	at com.carrotsearch.randomizedtesting.RandomizedRunner.invoke(RandomizedRunner.java:1764)
	at com.carrotsearch.randomizedtesting.RandomizedRunner$8.evaluate(RandomizedRunner.java:871)
	at com.carrotsearch.randomizedtesting.RandomizedRunner$9.evaluate(RandomizedRunner.java:907)
	at com.carrotsearch.randomizedtesting.RandomizedRunner$10.evaluate(RandomizedRunner.java:921)
	at com.carrotsearch.randomizedtesting.rules.SystemPropertiesRestoreRule$1.evaluate(SystemPropertiesRestoreRule.java:57)
	at org.apache.lucene.util.TestRuleSetupTeardownChained$1.evaluate(TestRuleSetupTeardownChained.java:49)
	at org.apache.lucene.util.AbstractBeforeAfterRule$1.evaluate(AbstractBeforeAfterRule.java:45)
	at org.apache.lucene.util.TestRuleThreadAndTestName$1.evaluate(TestRuleThreadAndTestName.java:48)
	at org.apache.lucene.util.TestRuleIgnoreAfterMaxFailures$1.evaluate(TestRuleIgnoreAfterMaxFailures.java:64)
	at org.apache.lucene.util.TestRuleMarkFailure$1.evaluate(TestRuleMarkFailure.java:47)
	at com.carrotsearch.randomizedtesting.rules.StatementAdapter.evaluate(StatementAdapter.java:36)
	at com.carrotsearch.randomizedtesting.ThreadLeakControl$StatementRunner.run(ThreadLeakControl.java:367)
	at com.carrotsearch.randomizedtesting.ThreadLeakControl.forkTimeoutingTask(ThreadLeakControl.java:809)
	at com.carrotsearch.randomizedtesting.ThreadLeakControl$3.evaluate(ThreadLeakControl.java:460)
	at com.carrotsearch.randomizedtesting.RandomizedRunner.runSingleTest(RandomizedRunner.java:880)
	at com.carrotsearch.randomizedtesting.RandomizedRunner$5.evaluate(RandomizedRunner.java:781)
	at com.carrotsearch.randomizedtesting.RandomizedRunner$6.evaluate(RandomizedRunner.java:816)
	at com.carrotsearch.randomizedtesting.RandomizedRunner$7.evaluate(RandomizedRunner.java:827)
	at com.carrotsearch.randomizedtesting.rules.StatementAdapter.evaluate(StatementAdapter.java:36)
	at com.carrotsearch.randomizedtesting.rules.SystemPropertiesRestoreRule$1.evaluate(SystemPropertiesRestoreRule.java:57)
	at org.apache.lucene.util.AbstractBeforeAfterRule$1.evaluate(AbstractBeforeAfterRule.java:45)
	at com.carrotsearch.randomizedtesting.rules.StatementAdapter.evaluate(StatementAdapter.java:36)
	at org.apache.lucene.util.TestRuleStoreClassName$1.evaluate(TestRuleStoreClassName.java:41)
	at com.carrotsearch.randomizedtesting.rules.NoShadowingOrOverridesOnMethodsRule$1.evaluate(NoShadowingOrOverridesOnMethodsRule.java:40)
	at com.carrotsearch.randomizedtesting.rules.NoShadowingOrOverridesOnMethodsRule$1.evaluate(NoShadowingOrOverridesOnMethodsRule.java:40)
	at com.carrotsearch.randomizedtesting.rules.StatementAdapter.evaluate(StatementAdapter.java:36)
	at com.carrotsearch.randomizedtesting.rules.StatementAdapter.evaluate(StatementAdapter.java:36)
	at com.carrotsearch.randomizedtesting.rules.StatementAdapter.evaluate(StatementAdapter.java:36)
	at org.apache.lucene.util.TestRuleAssertionsRequired$1.evaluate(TestRuleAssertionsRequired.java:53)
	at org.apache.lucene.util.TestRuleMarkFailure$1.evaluate(TestRuleMarkFailure.java:47)
	at org.apache.lucene.util.TestRuleIgnoreAfterMaxFailures$1.evaluate(TestRuleIgnoreAfterMaxFailures.java:64)
	at org.apache.lucene.util.TestRuleIgnoreTestSuites$1.evaluate(TestRuleIgnoreTestSuites.java:54)
	at com.carrotsearch.randomizedtesting.rules.StatementAdapter.evaluate(StatementAdapter.java:36)
	at com.carrotsearch.randomizedtesting.ThreadLeakControl$StatementRunner.run(ThreadLeakControl.java:367)
	at java.lang.Thread.run(Thread.java:745)




Build Log:
[...truncated 12379 lines...]
   [junit4] Suite: org.apache.solr.handler.TestSQLHandlerNonCloud
   [junit4]   2> Creating dataDir: C:\Users\jenkins\workspace\Lucene-Solr-6.x-Windows\solr\build\solr-core\test\J1\temp\solr.handler.TestSQLHandlerNonCloud_FD567CC985486C20-001\init-core-data-001
   [junit4]   2> 2794994 INFO  (SUITE-TestSQLHandlerNonCloud-seed#[FD567CC985486C20]-worker)
[    ] o.a.s.SolrTestCaseJ4 Randomized ssl (true) and clientAuth (false) via: @org.apache.solr.util.RandomizeSSL(reason=,
value=NaN, ssl=NaN, clientAuth=NaN)
   [junit4]   2> 2795028 INFO  (SUITE-TestSQLHandlerNonCloud-seed#[FD567CC985486C20]-worker)
[    ] o.a.s.SolrTestCaseJ4 ####initCore
   [junit4]   2> 2795028 INFO  (SUITE-TestSQLHandlerNonCloud-seed#[FD567CC985486C20]-worker)
[    ] o.a.s.SolrTestCaseJ4 ####initCore end
   [junit4]   2> 2795029 INFO  (SUITE-TestSQLHandlerNonCloud-seed#[FD567CC985486C20]-worker)
[    ] o.a.s.SolrTestCaseJ4 Writing core.properties file to C:\Users\jenkins\workspace\Lucene-Solr-6.x-Windows\solr\build\solr-core\test\J1\temp\solr.handler.TestSQLHandlerNonCloud_FD567CC985486C20-001\tempDir-002\cores\core
   [junit4]   2> 2795041 INFO  (SUITE-TestSQLHandlerNonCloud-seed#[FD567CC985486C20]-worker)
[    ] o.e.j.s.Server jetty-9.3.8.v20160314
   [junit4]   2> 2795042 INFO  (SUITE-TestSQLHandlerNonCloud-seed#[FD567CC985486C20]-worker)
[    ] o.e.j.s.h.ContextHandler Started o.e.j.s.ServletContextHandler@3c4a2a76{/solr,null,AVAILABLE}
   [junit4]   2> 2795046 INFO  (SUITE-TestSQLHandlerNonCloud-seed#[FD567CC985486C20]-worker)
[    ] o.e.j.s.ServerConnector Started ServerConnector@12ae8476{SSL,[ssl, http/1.1]}{127.0.0.1:55564}
   [junit4]   2> 2795047 INFO  (SUITE-TestSQLHandlerNonCloud-seed#[FD567CC985486C20]-worker)
[    ] o.e.j.s.Server Started @2799098ms
   [junit4]   2> 2795048 INFO  (SUITE-TestSQLHandlerNonCloud-seed#[FD567CC985486C20]-worker)
[    ] o.a.s.c.s.e.JettySolrRunner Jetty properties: {hostContext=/solr, hostPort=55564, configSetBaseDir=C:\Users\jenkins\workspace\Lucene-Solr-6.x-Windows\solr\build\solr-core\test\J1\temp\solr.handler.TestSQLHandlerNonCloud_FD567CC985486C20-001\tempDir-001,
coreRootDirectory=C:\Users\jenkins\workspace\Lucene-Solr-6.x-Windows\solr\build\solr-core\test\J1\temp\solr.handler.TestSQLHandlerNonCloud_FD567CC985486C20-001\tempDir-002\cores}
   [junit4]   2> 2795048 INFO  (SUITE-TestSQLHandlerNonCloud-seed#[FD567CC985486C20]-worker)
[    ] o.a.s.s.SolrDispatchFilter  ___      _       Welcome to Apache Solr™ version 6.3.0
   [junit4]   2> 2795048 INFO  (SUITE-TestSQLHandlerNonCloud-seed#[FD567CC985486C20]-worker)
[    ] o.a.s.s.SolrDispatchFilter / __| ___| |_ _   Starting in standalone mode on port null
   [junit4]   2> 2795048 INFO  (SUITE-TestSQLHandlerNonCloud-seed#[FD567CC985486C20]-worker)
[    ] o.a.s.s.SolrDispatchFilter \__ \/ _ \ | '_|  Install dir: null
   [junit4]   2> 2795048 INFO  (SUITE-TestSQLHandlerNonCloud-seed#[FD567CC985486C20]-worker)
[    ] o.a.s.s.SolrDispatchFilter |___/\___/_|_|    Start time: 2016-10-11T17:58:54.501Z
   [junit4]   2> 2795049 INFO  (SUITE-TestSQLHandlerNonCloud-seed#[FD567CC985486C20]-worker)
[    ] o.a.s.c.SolrXmlConfig Loading container configuration from C:\Users\jenkins\workspace\Lucene-Solr-6.x-Windows\solr\build\solr-core\test\J1\temp\solr.handler.TestSQLHandlerNonCloud_FD567CC985486C20-001\tempDir-001\solr.xml
   [junit4]   2> 2795059 INFO  (SUITE-TestSQLHandlerNonCloud-seed#[FD567CC985486C20]-worker)
[    ] o.a.s.u.UpdateShardHandler Creating UpdateShardHandler HTTP client with params: socketTimeout=340000&connTimeout=45000&retry=true
   [junit4]   2> 2795063 INFO  (SUITE-TestSQLHandlerNonCloud-seed#[FD567CC985486C20]-worker)
[    ] o.a.s.c.CorePropertiesLocator Found 1 core definitions underneath C:\Users\jenkins\workspace\Lucene-Solr-6.x-Windows\solr\build\solr-core\test\J1\temp\solr.handler.TestSQLHandlerNonCloud_FD567CC985486C20-001\tempDir-002\cores
   [junit4]   2> 2795064 INFO  (SUITE-TestSQLHandlerNonCloud-seed#[FD567CC985486C20]-worker)
[    ] o.a.s.c.CorePropertiesLocator Cores are: [collection1]
   [junit4]   2> 2795104 INFO  (coreLoadExecutor-11818-thread-1) [    ] o.a.s.c.SolrConfig
Using Lucene MatchVersion: 6.3.0
   [junit4]   2> 2795131 INFO  (coreLoadExecutor-11818-thread-1) [    ] o.a.s.s.IndexSchema
[collection1] Schema name=test
   [junit4]   2> 2795244 WARN  (coreLoadExecutor-11818-thread-1) [    ] o.a.s.s.IndexSchema
[collection1] default search field in schema is text. WARNING: Deprecated, please use 'df'
on request instead.
   [junit4]   2> 2795246 INFO  (coreLoadExecutor-11818-thread-1) [    ] o.a.s.s.IndexSchema
Loaded schema test/1.0 with uniqueid field id
   [junit4]   2> 2795270 INFO  (coreLoadExecutor-11818-thread-1) [    ] o.a.s.c.CoreContainer
Creating SolrCore 'collection1' using configuration from configset C:\Users\jenkins\workspace\Lucene-Solr-6.x-Windows\solr\build\solr-core\test\J1\temp\solr.handler.TestSQLHandlerNonCloud_FD567CC985486C20-001\tempDir-001\collection1
   [junit4]   2> 2795270 INFO  (coreLoadExecutor-11818-thread-1) [    x:collection1] o.a.s.c.SolrCore
[[collection1] ] Opening new SolrCore at [C:\Users\jenkins\workspace\Lucene-Solr-6.x-Windows\solr\build\solr-core\test\J1\temp\solr.handler.TestSQLHandlerNonCloud_FD567CC985486C20-001\tempDir-001\collection1],
dataDir=[C:\Users\jenkins\workspace\Lucene-Solr-6.x-Windows\solr\build\solr-core\test\J1\temp\solr.handler.TestSQLHandlerNonCloud_FD567CC985486C20-001\tempDir-002\cores\core\data\]
   [junit4]   2> 2795270 INFO  (coreLoadExecutor-11818-thread-1) [    x:collection1] o.a.s.c.JmxMonitoredMap
JMX monitoring is enabled. Adding Solr mbeans to JMX Server: com.sun.jmx.mbeanserver.JmxMBeanServer@58372c06
   [junit4]   2> 2795274 INFO  (coreLoadExecutor-11818-thread-1) [    x:collection1] o.a.s.u.RandomMergePolicy
RandomMergePolicy wrapping class org.apache.lucene.index.TieredMergePolicy: [TieredMergePolicy:
maxMergeAtOnce=37, maxMergeAtOnceExplicit=13, maxMergedSegmentMB=9.3017578125, floorSegmentMB=0.8583984375,
forceMergeDeletesPctAllowed=28.18577610129638, segmentsPerTier=30.0, maxCFSSegmentSizeMB=8.796093022207999E12,
noCFSRatio=0.6835262939769794
   [junit4]   2> 2795295 INFO  (coreLoadExecutor-11818-thread-1) [    x:collection1] o.a.s.u.UpdateHandler
Using UpdateLog implementation: org.apache.solr.update.UpdateLog
   [junit4]   2> 2795296 INFO  (coreLoadExecutor-11818-thread-1) [    x:collection1] o.a.s.u.UpdateLog
Initializing UpdateLog: dataDir= defaultSyncLevel=FLUSH numRecordsToKeep=100 maxNumLogsToKeep=10
numVersionBuckets=65536
   [junit4]   2> 2795297 INFO  (coreLoadExecutor-11818-thread-1) [    x:collection1] o.a.s.u.CommitTracker
Hard AutoCommit: disabled
   [junit4]   2> 2795297 INFO  (coreLoadExecutor-11818-thread-1) [    x:collection1] o.a.s.u.CommitTracker
Soft AutoCommit: disabled
   [junit4]   2> 2795297 INFO  (coreLoadExecutor-11818-thread-1) [    x:collection1] o.a.s.u.RandomMergePolicy
RandomMergePolicy wrapping class org.apache.lucene.index.TieredMergePolicy: [TieredMergePolicy:
maxMergeAtOnce=33, maxMergeAtOnceExplicit=13, maxMergedSegmentMB=89.22265625, floorSegmentMB=1.7861328125,
forceMergeDeletesPctAllowed=10.538941477563531, segmentsPerTier=32.0, maxCFSSegmentSizeMB=8.796093022207999E12,
noCFSRatio=0.2513069782582427
   [junit4]   2> 2795298 INFO  (coreLoadExecutor-11818-thread-1) [    x:collection1] o.a.s.s.SolrIndexSearcher
Opening [Searcher@40646840[collection1] main]
   [junit4]   2> 2795298 INFO  (coreLoadExecutor-11818-thread-1) [    x:collection1] o.a.s.h.c.SpellCheckComponent
Initializing spell checkers
   [junit4]   2> 2795317 INFO  (coreLoadExecutor-11818-thread-1) [    x:collection1] o.a.s.s.DirectSolrSpellChecker
init: {name=direct,classname=DirectSolrSpellChecker,field=lowerfilt,minQueryLength=3}
   [junit4]   2> 2795395 INFO  (coreLoadExecutor-11818-thread-1) [    x:collection1] o.a.s.h.ReplicationHandler
Commits will be reserved for  10000
   [junit4]   2> 2795395 INFO  (searcherExecutor-11819-thread-1-processing-x:collection1)
[    x:collection1] o.a.s.h.c.SpellCheckComponent Loading spell index for spellchecker: default
   [junit4]   2> 2795397 INFO  (searcherExecutor-11819-thread-1-processing-x:collection1)
[    x:collection1] o.a.s.h.c.SpellCheckComponent Loading spell index for spellchecker: direct
   [junit4]   2> 2795397 INFO  (coreLoadExecutor-11818-thread-1) [    x:collection1] o.a.s.u.UpdateLog
Could not find max version in index or recent updates, using new clock 1547917050354073600
   [junit4]   2> 2795397 INFO  (searcherExecutor-11819-thread-1-processing-x:collection1)
[    x:collection1] o.a.s.h.c.SpellCheckComponent Loading spell index for spellchecker: wordbreak
   [junit4]   2> 2795399 INFO  (searcherExecutor-11819-thread-1-processing-x:collection1)
[    x:collection1] o.a.s.h.c.SpellCheckComponent Loading spell index for spellchecker: multipleFields
   [junit4]   2> 2795400 INFO  (searcherExecutor-11819-thread-1-processing-x:collection1)
[    x:collection1] o.a.s.h.c.SpellCheckComponent Loading spell index for spellchecker: jarowinkler
   [junit4]   2> 2795401 INFO  (searcherExecutor-11819-thread-1-processing-x:collection1)
[    x:collection1] o.a.s.h.c.SpellCheckComponent Loading spell index for spellchecker: external
   [junit4]   2> 2795401 INFO  (searcherExecutor-11819-thread-1-processing-x:collection1)
[    x:collection1] o.a.s.h.c.SpellCheckComponent Loading spell index for spellchecker: freq
   [junit4]   2> 2795402 INFO  (searcherExecutor-11819-thread-1-processing-x:collection1)
[    x:collection1] o.a.s.h.c.SpellCheckComponent Loading spell index for spellchecker: fqcn
   [junit4]   2> 2795403 INFO  (searcherExecutor-11819-thread-1-processing-x:collection1)
[    x:collection1] o.a.s.h.c.SpellCheckComponent Loading spell index for spellchecker: perDict
   [junit4]   2> 2795404 INFO  (searcherExecutor-11819-thread-1-processing-x:collection1)
[    x:collection1] o.a.s.c.SolrCore [collection1] Registered new searcher Searcher@40646840[collection1]
main{ExitableDirectoryReader(UninvertingDirectoryReader())}
   [junit4]   2> 2795564 INFO  (SUITE-TestSQLHandlerNonCloud-seed#[FD567CC985486C20]-worker)
[    ] o.a.s.SolrJettyTestBase Jetty Assigned Port#55564
   [junit4]   2> 2795572 INFO  (TEST-TestSQLHandlerNonCloud.testSQLHandler-seed#[FD567CC985486C20])
[    ] o.a.s.SolrTestCaseJ4 ###Starting testSQLHandler
   [junit4]   2> 2796834 INFO  (qtp193563852-45202) [    x:collection1] o.a.s.c.S.Request
[collection1]  webapp=/solr path=/sql params={wt=json&version=2.2&stmt=select+id,+field_i,+str_s+from+collection1+limit+10}
status=0 QTime=1211
   [junit4]   2> 2797838 WARN  (qtp193563852-45202-SendThread(127.0.0.1:55435)) [    x:collection1]
o.a.z.ClientCnxn Session 0x0 for server null, unexpected error, closing socket connection
and attempting reconnect
   [junit4]   2> java.net.ConnectException: Connection refused: no further information
   [junit4]   2> 	at sun.nio.ch.SocketChannelImpl.checkConnect(Native Method)
   [junit4]   2> 	at sun.nio.ch.SocketChannelImpl.finishConnect(SocketChannelImpl.java:717)
   [junit4]   2> 	at org.apache.zookeeper.ClientCnxnSocketNIO.doTransport(ClientCnxnSocketNIO.java:361)
   [junit4]   2> 	at org.apache.zookeeper.ClientCnxn$SendThread.run(ClientCnxn.java:1081)
   [junit4]   2> 2799941 WARN  (qtp193563852-45202-SendThread(127.0.0.1:55435)) [    x:collection1]
o.a.z.ClientCnxn Session 0x0 for server null, unexpected error, closing socket connection
and attempting reconnect
   [junit4]   2> java.net.ConnectException: Connection refused: no further information
   [junit4]   2> 	at sun.nio.ch.SocketChannelImpl.checkConnect(Native Method)
   [junit4]   2> 	at sun.nio.ch.SocketChannelImpl.finishConnect(SocketChannelImpl.java:717)
   [junit4]   2> 	at org.apache.zookeeper.ClientCnxnSocketNIO.doTransport(ClientCnxnSocketNIO.java:361)
   [junit4]   2> 	at org.apache.zookeeper.ClientCnxn$SendThread.run(ClientCnxn.java:1081)
   [junit4]   2> 2802044 WARN  (qtp193563852-45202-SendThread(127.0.0.1:55435)) [    x:collection1]
o.a.z.ClientCnxn Session 0x0 for server null, unexpected error, closing socket connection
and attempting reconnect
   [junit4]   2> java.net.ConnectException: Connection refused: no further information
   [junit4]   2> 	at sun.nio.ch.SocketChannelImpl.checkConnect(Native Method)
   [junit4]   2> 	at sun.nio.ch.SocketChannelImpl.finishConnect(SocketChannelImpl.java:717)
   [junit4]   2> 	at org.apache.zookeeper.ClientCnxnSocketNIO.doTransport(ClientCnxnSocketNIO.java:361)
   [junit4]   2> 	at org.apache.zookeeper.ClientCnxn$SendThread.run(ClientCnxn.java:1081)
   [junit4]   2> 2804148 WARN  (qtp193563852-45202-SendThread(127.0.0.1:55435)) [    x:collection1]
o.a.z.ClientCnxn Session 0x0 for server null, unexpected error, closing socket connection
and attempting reconnect
   [junit4]   2> java.net.ConnectException: Connection refused: no further information
   [junit4]   2> 	at sun.nio.ch.SocketChannelImpl.checkConnect(Native Method)
   [junit4]   2> 	at sun.nio.ch.SocketChannelImpl.finishConnect(SocketChannelImpl.java:717)
   [junit4]   2> 	at org.apache.zookeeper.ClientCnxnSocketNIO.doTransport(ClientCnxnSocketNIO.java:361)
   [junit4]   2> 	at org.apache.zookeeper.ClientCnxn$SendThread.run(ClientCnxn.java:1081)
   [junit4]   2> 2806253 WARN  (qtp193563852-45202-SendThread(127.0.0.1:55435)) [    x:collection1]
o.a.z.ClientCnxn Session 0x0 for server null, unexpected error, closing socket connection
and attempting reconnect
   [junit4]   2> java.net.ConnectException: Connection refused: no further information
   [junit4]   2> 	at sun.nio.ch.SocketChannelImpl.checkConnect(Native Method)
   [junit4]   2> 	at sun.nio.ch.SocketChannelImpl.finishConnect(SocketChannelImpl.java:717)
   [junit4]   2> 	at org.apache.zookeeper.ClientCnxnSocketNIO.doTransport(ClientCnxnSocketNIO.java:361)
   [junit4]   2> 	at org.apache.zookeeper.ClientCnxn$SendThread.run(ClientCnxn.java:1081)
   [junit4]   2> 2808458 ERROR (qtp193563852-45202) [    x:collection1] o.a.s.c.s.i.s.ExceptionStream
org.apache.solr.common.SolrException: java.util.concurrent.TimeoutException: Could not connect
to ZooKeeper 127.0.0.1:55435/solr within 10000 ms
   [junit4]   2> 	at org.apache.solr.common.cloud.SolrZkClient.<init>(SolrZkClient.java:182)
   [junit4]   2> 	at org.apache.solr.common.cloud.SolrZkClient.<init>(SolrZkClient.java:116)
   [junit4]   2> 	at org.apache.solr.common.cloud.SolrZkClient.<init>(SolrZkClient.java:106)
   [junit4]   2> 	at org.apache.solr.common.cloud.ZkStateReader.<init>(ZkStateReader.java:226)
   [junit4]   2> 	at org.apache.solr.client.solrj.impl.CloudSolrClient.connect(CloudSolrClient.java:567)
   [junit4]   2> 	at org.apache.solr.client.solrj.io.SolrClientCache.getCloudSolrClient(SolrClientCache.java:50)
   [junit4]   2> 	at org.apache.solr.client.solrj.io.stream.CloudSolrStream.open(CloudSolrStream.java:298)
   [junit4]   2> 	at org.apache.solr.handler.SQLHandler$LimitStream.open(SQLHandler.java:1325)
   [junit4]   2> 	at org.apache.solr.client.solrj.io.stream.SelectStream.open(SelectStream.java:184)
   [junit4]   2> 	at org.apache.solr.client.solrj.io.stream.ExceptionStream.open(ExceptionStream.java:51)
   [junit4]   2> 	at org.apache.solr.handler.StreamHandler$TimerStream.open(StreamHandler.java:437)
   [junit4]   2> 	at org.apache.solr.response.TextResponseWriter.writeTupleStream(TextResponseWriter.java:308)
   [junit4]   2> 	at org.apache.solr.response.TextResponseWriter.writeVal(TextResponseWriter.java:169)
   [junit4]   2> 	at org.apache.solr.response.JSONWriter.writeNamedListAsMapWithDups(JSONResponseWriter.java:185)
   [junit4]   2> 	at org.apache.solr.response.JSONWriter.writeNamedList(JSONResponseWriter.java:301)
   [junit4]   2> 	at org.apache.solr.response.JSONWriter.writeResponse(JSONResponseWriter.java:97)
   [junit4]   2> 	at org.apache.solr.response.JSONResponseWriter.write(JSONResponseWriter.java:55)
   [junit4]   2> 	at org.apache.solr.response.QueryResponseWriterUtil.writeQueryResponse(QueryResponseWriterUtil.java:65)
   [junit4]   2> 	at org.apache.solr.servlet.HttpSolrCall.writeResponse(HttpSolrCall.java:728)
   [junit4]   2> 	at org.apache.solr.servlet.HttpSolrCall.call(HttpSolrCall.java:469)
   [junit4]   2> 	at org.apache.solr.servlet.SolrDispatchFilter.doFilter(SolrDispatchFilter.java:302)
   [junit4]   2> 	at org.apache.solr.servlet.SolrDispatchFilter.doFilter(SolrDispatchFilter.java:253)
   [junit4]   2> 	at org.eclipse.jetty.servlet.ServletHandler$CachedChain.doFilter(ServletHandler.java:1676)
   [junit4]   2> 	at org.apache.solr.client.solrj.embedded.JettySolrRunner$DebugFilter.doFilter(JettySolrRunner.java:108)
   [junit4]   2> 	at org.eclipse.jetty.servlet.ServletHandler$CachedChain.doFilter(ServletHandler.java:1676)
   [junit4]   2> 	at org.eclipse.jetty.servlet.ServletHandler.doHandle(ServletHandler.java:581)
   [junit4]   2> 	at org.eclipse.jetty.server.session.SessionHandler.doHandle(SessionHandler.java:224)
   [junit4]   2> 	at org.eclipse.jetty.server.handler.ContextHandler.doHandle(ContextHandler.java:1160)
   [junit4]   2> 	at org.eclipse.jetty.servlet.ServletHandler.doScope(ServletHandler.java:511)
   [junit4]   2> 	at org.eclipse.jetty.server.session.SessionHandler.doScope(SessionHandler.java:185)
   [junit4]   2> 	at org.eclipse.jetty.server.handler.ContextHandler.doScope(ContextHandler.java:1092)
   [junit4]   2> 	at org.eclipse.jetty.server.handler.ScopedHandler.handle(ScopedHandler.java:141)
   [junit4]   2> 	at org.eclipse.jetty.server.handler.gzip.GzipHandler.handle(GzipHandler.java:399)
   [junit4]   2> 	at org.eclipse.jetty.server.handler.HandlerWrapper.handle(HandlerWrapper.java:134)
   [junit4]   2> 	at org.eclipse.jetty.server.Server.handle(Server.java:518)
   [junit4]   2> 	at org.eclipse.jetty.server.HttpChannel.handle(HttpChannel.java:308)
   [junit4]   2> 	at org.eclipse.jetty.server.HttpConnection.onFillable(HttpConnection.java:244)
   [junit4]   2> 	at org.eclipse.jetty.io.AbstractConnection$ReadCallback.succeeded(AbstractConnection.java:273)
   [junit4]   2> 	at org.eclipse.jetty.io.FillInterest.fillable(FillInterest.java:95)
   [junit4]   2> 	at org.eclipse.jetty.io.ssl.SslConnection.onFillable(SslConnection.java:186)
   [junit4]   2> 	at org.eclipse.jetty.io.AbstractConnection$ReadCallback.succeeded(AbstractConnection.java:273)
   [junit4]   2> 	at org.eclipse.jetty.io.FillInterest.fillable(FillInterest.java:95)
   [junit4]   2> 	at org.eclipse.jetty.io.SelectChannelEndPoint$2.run(SelectChannelEndPoint.java:93)
   [junit4]   2> 	at org.eclipse.jetty.util.thread.strategy.ExecuteProduceConsume.produceAndRun(ExecuteProduceConsume.java:246)
   [junit4]   2> 	at org.eclipse.jetty.util.thread.strategy.ExecuteProduceConsume.run(ExecuteProduceConsume.java:156)
   [junit4]   2> 	at org.eclipse.jetty.util.thread.QueuedThreadPool.runJob(QueuedThreadPool.java:654)
   [junit4]   2> 	at org.eclipse.jetty.util.thread.QueuedThreadPool$3.run(QueuedThreadPool.java:572)
   [junit4]   2> 	at java.lang.Thread.run(Thread.java:745)
   [junit4]   2> Caused by: java.util.concurrent.TimeoutException: Could not connect to
ZooKeeper 127.0.0.1:55435/solr within 10000 ms
   [junit4]   2> 	at org.apache.solr.common.cloud.ConnectionManager.waitForConnected(ConnectionManager.java:233)
   [junit4]   2> 	at org.apache.solr.common.cloud.SolrZkClient.<init>(SolrZkClient.java:174)
   [junit4]   2> 	... 47 more
   [junit4]   2> 
   [junit4]   2> 2808461 INFO  (TEST-TestSQLHandlerNonCloud.testSQLHandler-seed#[FD567CC985486C20])
[    ] o.a.s.SolrTestCaseJ4 ###Ending testSQLHandler
   [junit4]   2> NOTE: reproduce with: ant test  -Dtestcase=TestSQLHandlerNonCloud -Dtests.method=testSQLHandler
-Dtests.seed=FD567CC985486C20 -Dtests.slow=true -Dtests.locale=ar-SD -Dtests.timezone=America/Dawson_Creek
-Dtests.asserts=true -Dtests.file.encoding=Cp1252
   [junit4] FAILURE 12.9s J1 | TestSQLHandlerNonCloud.testSQLHandler <<<
   [junit4]    > Throwable #1: java.lang.AssertionError
   [junit4]    > 	at __randomizedtesting.SeedInfo.seed([FD567CC985486C20:590D19D78F0F77FF]:0)
   [junit4]    > 	at org.apache.solr.handler.TestSQLHandlerNonCloud.testSQLHandler(TestSQLHandlerNonCloud.java:61)
   [junit4]    > 	at java.lang.Thread.run(Thread.java:745)
   [junit4]   2> 2808465 INFO  (SUITE-TestSQLHandlerNonCloud-seed#[FD567CC985486C20]-worker)
[    ] o.e.j.s.ServerConnector Stopped ServerConnector@12ae8476{SSL,[ssl, http/1.1]}{127.0.0.1:0}
   [junit4]   2> 2808465 INFO  (SUITE-TestSQLHandlerNonCloud-seed#[FD567CC985486C20]-worker)
[    ] o.a.s.c.CoreContainer Shutting down CoreContainer instance=822614443
   [junit4]   2> 2808465 INFO  (coreCloseExecutor-11824-thread-1) [    x:collection1] o.a.s.c.SolrCore
[collection1]  CLOSING SolrCore org.apache.solr.core.SolrCore@4c2928de
   [junit4]   2> 2808473 INFO  (SUITE-TestSQLHandlerNonCloud-seed#[FD567CC985486C20]-worker)
[    ] o.e.j.s.h.ContextHandler Stopped o.e.j.s.ServletContextHandler@3c4a2a76{/solr,null,UNAVAILABLE}
   [junit4]   2> 2808473 INFO  (SUITE-TestSQLHandlerNonCloud-seed#[FD567CC985486C20]-worker)
[    ] o.a.s.SolrTestCaseJ4 ###deleteCore
   [junit4]   2> NOTE: leaving temporary files on disk at: C:\Users\jenkins\workspace\Lucene-Solr-6.x-Windows\solr\build\solr-core\test\J1\temp\solr.handler.TestSQLHandlerNonCloud_FD567CC985486C20-001
   [junit4]   2> NOTE: test params are: codec=CheapBastard, sim=RandomSimilarity(queryNorm=false,coord=yes):
{}, locale=ar-SD, timezone=America/Dawson_Creek
   [junit4]   2> NOTE: Windows 10 10.0 amd64/Oracle Corporation 1.8.0_102 (64-bit)/cpus=3,threads=1,free=306588528,total=527958016
   [junit4]   2> NOTE: All tests run in this JVM: [SolrInfoMBeanTest, RulesTest, TestSystemIdResolver,
SaslZkACLProviderTest, AtomicUpdatesTest, CacheHeaderTest, TestHashQParserPlugin, TestCloudPseudoReturnFields,
TestSolrDeletionPolicy2, TestCrossCoreJoin, SolrIndexSplitterTest, TestSha256AuthenticationProvider,
TestStressLiveNodes, GraphQueryTest, TestFieldCollectionResource, DistanceFunctionTest, ConjunctionSolrSpellCheckerTest,
TestQueryUtils, MultiThreadedOCPTest, TestManagedStopFilterFactory, HdfsBasicDistributedZk2Test,
BlockJoinFacetRandomTest, TestInfoStreamLogging, ResourceLoaderTest, BJQParserTest, HdfsChaosMonkeyNothingIsSafeTest,
TestTestInjection, BinaryUpdateRequestHandlerTest, TestXmlQParser, TestSolrDynamicMBean, TestQuerySenderNoQuery,
MinimalSchemaTest, TestManagedSchema, TestConfigSetsAPI, BufferStoreTest, TestCopyFieldCollectionResource,
AutoCommitTest, TestSolrCoreSnapshots, SuggesterTest, TestSortingResponseWriter, TestRecovery,
MBeansHandlerTest, RequestHandlersTest, CSVRequestHandlerTest, UpdateParamsTest, TestManagedSchemaThreadSafety,
TestLeaderElectionWithEmptyReplica, LeaderElectionIntegrationTest, TestPKIAuthenticationPlugin,
CoreAdminHandlerTest, CreateCollectionCleanupTest, QueryParsingTest, SuggestComponentContextFilterQueryTest,
TestQuerySenderListener, SolrCloudExampleTest, JavabinLoaderTest, SolrIndexConfigTest, ZkStateReaderTest,
SpellPossibilityIteratorTest, TestMiniSolrCloudClusterSSL, TermVectorComponentTest, TestDocSet,
SecurityConfHandlerTest, IndexSchemaTest, TestCloudInspectUtil, CdcrBootstrapTest, TestFreeTextSuggestions,
LoggingHandlerTest, CollectionsAPISolrJTest, HLLSerializationTest, DistribJoinFromCollectionTest,
ConnectionReuseTest, TestSearcherReuse, TestSolr4Spatial, TestDistributedStatsComponentCardinality,
LukeRequestHandlerTest, TestGraphMLResponseWriter, CloneFieldUpdateProcessorFactoryTest, BadCopyFieldTest,
OverriddenZkACLAndCredentialsProvidersTest, DistributedFacetPivotLargeTest, DeleteNodeTest,
TestCloudManagedSchema, SimpleCollectionCreateDeleteTest, DeleteShardTest, TestMergePolicyConfig,
AnalyticsMergeStrategyTest, TestRealTimeGet, TestCustomDocTransformer, CopyFieldTest, TestFiltering,
TestCodecSupport, TestNonDefinedSimilarityFactory, DistributedVersionInfoTest, TestRandomFaceting,
TestAuthenticationFramework, PKIAuthenticationIntegrationTest, TestSimpleTrackingShardHandler,
TestReload, TriLevelCompositeIdRoutingTest, TestNumericTerms32, FieldAnalysisRequestHandlerTest,
TestExceedMaxTermLength, SuggesterWFSTTest, ScriptEngineTest, TestLRUStatsCache, TestDefaultStatsCache,
CollectionTooManyReplicasTest, URLClassifyProcessorTest, AsyncCallRequestStatusResponseTest,
TestLeaderInitiatedRecoveryThread, TestSuggestSpellingConverter, SignatureUpdateProcessorFactoryTest,
TestCloudSchemaless, TestSearchPerf, BlockCacheTest, SearchHandlerTest, TestFieldTypeCollectionResource,
TestSubQueryTransformerDistrib, HdfsRestartWhileUpdatingTest, CircularListTest, SliceStateTest,
DistributedTermsComponentTest, TestSmileRequest, DistributedIntervalFacetingTest, FacetPivotSmallTest,
ShardRoutingCustomTest, TestWriterPerf, TestStressUserVersions, ExitableDirectoryReaderTest,
TestClassicSimilarityFactory, TestBulkSchemaAPI, TestAtomicUpdateErrorCases, TestDistributedMissingSort,
TestSolrConfigHandlerCloud, TestLMDirichletSimilarityFactory, StatsComponentTest, TestExactSharedStatsCache,
TestTrie, TestOrdValues, NoCacheHeaderTest, ChaosMonkeySafeLeaderTest, TestPerFieldSimilarityWithDefaultOverride,
EchoParamsTest, TestIndexSearcher, TestCustomSort, SharedFSAutoReplicaFailoverTest, TestSchemaNameResource,
HdfsCollectionsAPIDistributedZkTest, TestJmxMonitoredMap, BadIndexSchemaTest, TestScoreJoinQPScore,
DistanceUnitsTest, TestMacros, ChangedSchemaMergeTest, BasicDistributedZkTest, BasicDistributedZk2Test,
UnloadDistributedZkTest, SyncSliceTest, OpenCloseCoreStressTest, OverseerTest, ShardRoutingTest,
BasicZkTest, FullSolrCloudDistribCmdsTest, ZkSolrClientTest, TestZkChroot, TestDistributedGrouping,
TermVectorComponentDistributedTest, SimpleFacetsTest, SpellCheckComponentTest, TestGroupingSearch,
QueryElevationComponentTest, PeerSyncTest, TestBadConfig, SoftAutoCommitTest, CurrencyFieldOpenExchangeTest,
CurrencyFieldXmlFileTest, TestExtendedDismaxParser, SolrRequestParserTest, TestFoldingMultitermQuery,
DocValuesTest, DisMaxRequestHandlerTest, DirectSolrSpellCheckerTest, DocumentAnalysisRequestHandlerTest,
PrimitiveFieldTypeTest, FileBasedSpellCheckerTest, PathHierarchyTokenizerFactoryTest, RequiredFieldsTest,
RegexBoostProcessorTest, ReturnFieldsTest, UniqFieldsUpdateProcessorFactoryTest, TestPHPSerializedResponseWriter,
TestComponentsName, HighlighterConfigTest, AlternateDirectoryTest, BadComponentTest, MultiTermTest,
SampleTest, TestBinaryField, TestElisionMultitermQuery, TestConfig, TestFuzzyAnalyzedSuggestions,
ExternalFileFieldSortTest, TestSolrCoreProperties, TestPostingsSolrHighlighter, DirectSolrConnectionTest,
NotRequiredUniqueKeyTest, TestLuceneMatchVersion, TestCharFilters, TestXIncludeConfig, TestDFRSimilarityFactory,
TestPerFieldSimilarity, TestLMJelinekMercerSimilarityFactory, TestIBSimilarityFactory, TestFastWriter,
TestFastOutputStream, OpenExchangeRatesOrgProviderTest, TestFastLRUCache, DateMathParserTest,
PreAnalyzedFieldTest, PrimUtilsTest, DateFieldTest, SpellingQueryConverterTest, RAMDirectoryFactoryTest,
ClusterStateTest, TestUtils, ZkNodePropsTest, SystemInfoHandlerTest, UUIDFieldTest, DistributedMLTComponentTest,
TestEmbeddedSolrServerConstructors, ActionThrottleTest, CdcrReplicationDistributedZkTest,
CdcrReplicationHandlerTest, CdcrRequestHandlerTest, CdcrVersionReplicationTest, CloudExitableDirectoryReaderTest,
CollectionReloadTest, DeleteInactiveReplicaTest, DistribDocExpirationUpdateProcessorTest,
HttpPartitionTest, RemoteQueryErrorTest, ReplicationFactorTest, RestartWhileUpdatingTest,
RollingRestartTest, SharedFSAutoReplicaFailoverUtilsTest, SolrXmlInZkTest, TestCloudDeleteByQuery,
TestConfigSetsAPIZkFailure, TestDistribDocBasedVersion, TestExclusionRuleCollectionAccess,
TestLocalFSCloudBackupRestore, TestMiniSolrCloudCluster, TestOnReconnectListenerSupport, TestRandomFlRTGCloud,
TestRebalanceLeaders, TestRequestForwarding, TestSSLRandomization, TestSizeLimitedDistributedMap,
TestSolrCloudWithDelegationTokens, TestSolrCloudWithKerberosAlt, TestStressCloudBlindAtomicUpdates,
TestTolerantUpdateProcessorRandomCloud, CoreSorterTest, DirectoryFactoryTest, QueryResultKeyTest,
TestConfigSetProperties, TestImplicitCoreProperties, TestInitParams, TestNRTOpen, TestReloadAndDeleteDocs,
TestShardHandlerFactory, TestSolrConfigHandler, RequestLoggingTest, TestBlobHandler, TestReqParamsAPI,
TestSQLHandlerNonCloud]
   [junit4] Completed [526/638 (1!)] on J1 in 13.50s, 1 test, 1 failure <<< FAILURES!

[...truncated 60712 lines...]


Mime
View raw message