lucene-dev mailing list archives

Site index · List index
Message view « Date » · « Thread »
Top « Date » · « Thread »
From Policeman Jenkins Server <jenk...@thetaphi.de>
Subject [JENKINS] Lucene-Solr-master-Windows (32bit/jdk1.8.0_102) - Build # 6215 - Unstable!
Date Sun, 30 Oct 2016 22:45:58 GMT
Build: https://jenkins.thetaphi.de/job/Lucene-Solr-master-Windows/6215/
Java: 32bit/jdk1.8.0_102 -client -XX:+UseParallelGC

1 tests failed.
FAILED:  org.apache.solr.security.BasicAuthStandaloneTest.testBasicAuth

Error Message:
Invalid json <html> <head> <meta http-equiv="Content-Type" content="text/html;charset=ISO-8859-1"/>
<title>Error 401 </title> </head> <body> <h2>HTTP ERROR: 401</h2>
<p>Problem accessing /solr/admin/authentication. Reason: <pre>    Bad credentials</pre></p>
<hr /><a href="http://eclipse.org/jetty">Powered by Jetty:// 9.3.8.v20160314</a><hr/>
</body> </html> 

Stack Trace:
java.lang.AssertionError: Invalid json <html>
<head>
<meta http-equiv="Content-Type" content="text/html;charset=ISO-8859-1"/>
<title>Error 401 </title>
</head>
<body>
<h2>HTTP ERROR: 401</h2>
<p>Problem accessing /solr/admin/authentication. Reason:
<pre>    Bad credentials</pre></p>
<hr /><a href="http://eclipse.org/jetty">Powered by Jetty:// 9.3.8.v20160314</a><hr/>
</body>
</html>

	at __randomizedtesting.SeedInfo.seed([3E3EA8B4E3ACB8C:BF8D9C99EA6948F6]:0)
	at org.junit.Assert.fail(Assert.java:93)
	at org.apache.solr.security.BasicAuthIntegrationTest.verifySecurityStatus(BasicAuthIntegrationTest.java:256)
	at org.apache.solr.security.BasicAuthIntegrationTest.verifySecurityStatus(BasicAuthIntegrationTest.java:237)
	at org.apache.solr.security.BasicAuthStandaloneTest.testBasicAuth(BasicAuthStandaloneTest.java:102)
	at sun.reflect.NativeMethodAccessorImpl.invoke0(Native Method)
	at sun.reflect.NativeMethodAccessorImpl.invoke(NativeMethodAccessorImpl.java:62)
	at sun.reflect.DelegatingMethodAccessorImpl.invoke(DelegatingMethodAccessorImpl.java:43)
	at java.lang.reflect.Method.invoke(Method.java:498)
	at com.carrotsearch.randomizedtesting.RandomizedRunner.invoke(RandomizedRunner.java:1713)
	at com.carrotsearch.randomizedtesting.RandomizedRunner$8.evaluate(RandomizedRunner.java:907)
	at com.carrotsearch.randomizedtesting.RandomizedRunner$9.evaluate(RandomizedRunner.java:943)
	at com.carrotsearch.randomizedtesting.RandomizedRunner$10.evaluate(RandomizedRunner.java:957)
	at com.carrotsearch.randomizedtesting.rules.SystemPropertiesRestoreRule$1.evaluate(SystemPropertiesRestoreRule.java:57)
	at org.apache.lucene.util.TestRuleSetupTeardownChained$1.evaluate(TestRuleSetupTeardownChained.java:49)
	at org.apache.lucene.util.AbstractBeforeAfterRule$1.evaluate(AbstractBeforeAfterRule.java:45)
	at org.apache.lucene.util.TestRuleThreadAndTestName$1.evaluate(TestRuleThreadAndTestName.java:48)
	at org.apache.lucene.util.TestRuleIgnoreAfterMaxFailures$1.evaluate(TestRuleIgnoreAfterMaxFailures.java:64)
	at org.apache.lucene.util.TestRuleMarkFailure$1.evaluate(TestRuleMarkFailure.java:47)
	at com.carrotsearch.randomizedtesting.rules.StatementAdapter.evaluate(StatementAdapter.java:36)
	at com.carrotsearch.randomizedtesting.ThreadLeakControl$StatementRunner.run(ThreadLeakControl.java:367)
	at com.carrotsearch.randomizedtesting.ThreadLeakControl.forkTimeoutingTask(ThreadLeakControl.java:811)
	at com.carrotsearch.randomizedtesting.ThreadLeakControl$3.evaluate(ThreadLeakControl.java:462)
	at com.carrotsearch.randomizedtesting.RandomizedRunner.runSingleTest(RandomizedRunner.java:916)
	at com.carrotsearch.randomizedtesting.RandomizedRunner$5.evaluate(RandomizedRunner.java:802)
	at com.carrotsearch.randomizedtesting.RandomizedRunner$6.evaluate(RandomizedRunner.java:852)
	at com.carrotsearch.randomizedtesting.RandomizedRunner$7.evaluate(RandomizedRunner.java:863)
	at com.carrotsearch.randomizedtesting.rules.StatementAdapter.evaluate(StatementAdapter.java:36)
	at com.carrotsearch.randomizedtesting.rules.SystemPropertiesRestoreRule$1.evaluate(SystemPropertiesRestoreRule.java:57)
	at org.apache.lucene.util.AbstractBeforeAfterRule$1.evaluate(AbstractBeforeAfterRule.java:45)
	at com.carrotsearch.randomizedtesting.rules.StatementAdapter.evaluate(StatementAdapter.java:36)
	at org.apache.lucene.util.TestRuleStoreClassName$1.evaluate(TestRuleStoreClassName.java:41)
	at com.carrotsearch.randomizedtesting.rules.NoShadowingOrOverridesOnMethodsRule$1.evaluate(NoShadowingOrOverridesOnMethodsRule.java:40)
	at com.carrotsearch.randomizedtesting.rules.NoShadowingOrOverridesOnMethodsRule$1.evaluate(NoShadowingOrOverridesOnMethodsRule.java:40)
	at com.carrotsearch.randomizedtesting.rules.StatementAdapter.evaluate(StatementAdapter.java:36)
	at com.carrotsearch.randomizedtesting.rules.StatementAdapter.evaluate(StatementAdapter.java:36)
	at com.carrotsearch.randomizedtesting.rules.StatementAdapter.evaluate(StatementAdapter.java:36)
	at org.apache.lucene.util.TestRuleAssertionsRequired$1.evaluate(TestRuleAssertionsRequired.java:53)
	at org.apache.lucene.util.TestRuleMarkFailure$1.evaluate(TestRuleMarkFailure.java:47)
	at org.apache.lucene.util.TestRuleIgnoreAfterMaxFailures$1.evaluate(TestRuleIgnoreAfterMaxFailures.java:64)
	at org.apache.lucene.util.TestRuleIgnoreTestSuites$1.evaluate(TestRuleIgnoreTestSuites.java:54)
	at com.carrotsearch.randomizedtesting.rules.StatementAdapter.evaluate(StatementAdapter.java:36)
	at com.carrotsearch.randomizedtesting.ThreadLeakControl$StatementRunner.run(ThreadLeakControl.java:367)
	at java.lang.Thread.run(Thread.java:745)




Build Log:
[...truncated 12615 lines...]
   [junit4] Suite: org.apache.solr.security.BasicAuthStandaloneTest
   [junit4]   2> Creating dataDir: C:\Users\jenkins\workspace\Lucene-Solr-master-Windows\solr\build\solr-core\test\J0\temp\solr.security.BasicAuthStandaloneTest_3E3EA8B4E3ACB8C-001\init-core-data-001
   [junit4]   2> 2907556 INFO  (SUITE-BasicAuthStandaloneTest-seed#[3E3EA8B4E3ACB8C]-worker)
[    ] o.a.s.SolrTestCaseJ4 Randomized ssl (true) and clientAuth (false) via: @org.apache.solr.util.RandomizeSSL(reason=,
value=NaN, ssl=NaN, clientAuth=NaN)
   [junit4]   2> 2907561 INFO  (TEST-BasicAuthStandaloneTest.testBasicAuth-seed#[3E3EA8B4E3ACB8C])
[    ] o.a.s.SolrTestCaseJ4 ###Starting testBasicAuth
   [junit4]   2> 2907575 INFO  (TEST-BasicAuthStandaloneTest.testBasicAuth-seed#[3E3EA8B4E3ACB8C])
[    ] o.e.j.s.Server jetty-9.3.8.v20160314
   [junit4]   2> 2907577 INFO  (TEST-BasicAuthStandaloneTest.testBasicAuth-seed#[3E3EA8B4E3ACB8C])
[    ] o.e.j.s.h.ContextHandler Started o.e.j.s.ServletContextHandler@1d885e8{/solr,null,AVAILABLE}
   [junit4]   2> 2907588 INFO  (TEST-BasicAuthStandaloneTest.testBasicAuth-seed#[3E3EA8B4E3ACB8C])
[    ] o.e.j.s.ServerConnector Started ServerConnector@14935f5{SSL,[ssl, http/1.1]}{127.0.0.1:58146}
   [junit4]   2> 2907588 INFO  (TEST-BasicAuthStandaloneTest.testBasicAuth-seed#[3E3EA8B4E3ACB8C])
[    ] o.e.j.s.Server Started @2911328ms
   [junit4]   2> 2907588 INFO  (TEST-BasicAuthStandaloneTest.testBasicAuth-seed#[3E3EA8B4E3ACB8C])
[    ] o.a.s.c.s.e.JettySolrRunner Jetty properties: {solr.data.dir=C:\Users\jenkins\workspace\Lucene-Solr-master-Windows\solr\build\solr-core\test\J0\temp\solr.security.BasicAuthStandaloneTest_3E3EA8B4E3ACB8C-001\inst-001\collection1\data,
hostContext=/solr, hostPort=58146}
   [junit4]   2> 2907588 ERROR (TEST-BasicAuthStandaloneTest.testBasicAuth-seed#[3E3EA8B4E3ACB8C])
[    ] o.a.s.s.StartupLoggingUtils Missing Java Option solr.log.dir. Logging may be missing
or incomplete.
   [junit4]   2> 2907590 INFO  (TEST-BasicAuthStandaloneTest.testBasicAuth-seed#[3E3EA8B4E3ACB8C])
[    ] o.a.s.s.SolrDispatchFilter  ___      _       Welcome to Apache Solr? version 7.0.0
   [junit4]   2> 2907590 INFO  (TEST-BasicAuthStandaloneTest.testBasicAuth-seed#[3E3EA8B4E3ACB8C])
[    ] o.a.s.s.SolrDispatchFilter / __| ___| |_ _   Starting in standalone mode on port null
   [junit4]   2> 2907590 INFO  (TEST-BasicAuthStandaloneTest.testBasicAuth-seed#[3E3EA8B4E3ACB8C])
[    ] o.a.s.s.SolrDispatchFilter \__ \/ _ \ | '_|  Install dir: null
   [junit4]   2> 2907590 INFO  (TEST-BasicAuthStandaloneTest.testBasicAuth-seed#[3E3EA8B4E3ACB8C])
[    ] o.a.s.s.SolrDispatchFilter |___/\___/_|_|    Start time: 2016-10-30T22:16:12.441Z
   [junit4]   2> 2907591 INFO  (TEST-BasicAuthStandaloneTest.testBasicAuth-seed#[3E3EA8B4E3ACB8C])
[    ] o.a.s.c.SolrXmlConfig Loading container configuration from C:\Users\jenkins\workspace\Lucene-Solr-master-Windows\solr\build\solr-core\test\J0\temp\solr.security.BasicAuthStandaloneTest_3E3EA8B4E3ACB8C-001\inst-001\solr.xml
   [junit4]   2> 2907622 INFO  (TEST-BasicAuthStandaloneTest.testBasicAuth-seed#[3E3EA8B4E3ACB8C])
[    ] o.a.s.c.CorePropertiesLocator Found 1 core definitions underneath C:\Users\jenkins\workspace\Lucene-Solr-master-Windows\solr\build\solr-core\test\J0\temp\solr.security.BasicAuthStandaloneTest_3E3EA8B4E3ACB8C-001\inst-001\.
   [junit4]   2> 2907622 INFO  (TEST-BasicAuthStandaloneTest.testBasicAuth-seed#[3E3EA8B4E3ACB8C])
[    ] o.a.s.c.CorePropertiesLocator Cores are: [collection1]
   [junit4]   2> 2907644 INFO  (coreLoadExecutor-12507-thread-1) [    ] o.a.s.c.SolrConfig
Using Lucene MatchVersion: 7.0.0
   [junit4]   2> 2907654 INFO  (coreLoadExecutor-12507-thread-1) [    ] o.a.s.s.IndexSchema
[collection1] Schema name=minimal
   [junit4]   2> 2907659 INFO  (coreLoadExecutor-12507-thread-1) [    ] o.a.s.s.IndexSchema
Loaded schema minimal/1.1 with uniqueid field id
   [junit4]   2> 2907668 INFO  (coreLoadExecutor-12507-thread-1) [    ] o.a.s.c.CoreContainer
Creating SolrCore 'collection1' using configuration from instancedir C:\Users\jenkins\workspace\Lucene-Solr-master-Windows\solr\build\solr-core\test\J0\temp\solr.security.BasicAuthStandaloneTest_3E3EA8B4E3ACB8C-001\inst-001\.\collection1
   [junit4]   2> 2907668 INFO  (coreLoadExecutor-12507-thread-1) [    x:collection1] o.a.s.c.SolrCore
[[collection1] ] Opening new SolrCore at [C:\Users\jenkins\workspace\Lucene-Solr-master-Windows\solr\build\solr-core\test\J0\temp\solr.security.BasicAuthStandaloneTest_3E3EA8B4E3ACB8C-001\inst-001\collection1],
dataDir=[C:\Users\jenkins\workspace\Lucene-Solr-master-Windows\solr\build\solr-core\test\J0\temp\solr.security.BasicAuthStandaloneTest_3E3EA8B4E3ACB8C-001\inst-001\.\collection1\data\]
   [junit4]   2> 2907686 INFO  (coreLoadExecutor-12507-thread-1) [    x:collection1] o.a.s.u.CommitTracker
Hard AutoCommit: disabled
   [junit4]   2> 2907686 INFO  (coreLoadExecutor-12507-thread-1) [    x:collection1] o.a.s.u.CommitTracker
Soft AutoCommit: disabled
   [junit4]   2> 2907686 INFO  (coreLoadExecutor-12507-thread-1) [    x:collection1] o.a.s.s.SolrIndexSearcher
Opening [Searcher@3d8bae[collection1] main]
   [junit4]   2> 2907687 INFO  (coreLoadExecutor-12507-thread-1) [    x:collection1] o.a.s.r.ManagedResourceStorage
File-based storage initialized to use dir: C:\Users\jenkins\workspace\Lucene-Solr-master-Windows\solr\build\solr-core\test\J0\temp\solr.security.BasicAuthStandaloneTest_3E3EA8B4E3ACB8C-001\inst-001\collection1\conf
   [junit4]   2> 2907687 INFO  (coreLoadExecutor-12507-thread-1) [    x:collection1] o.a.s.h.ReplicationHandler
Commits will be reserved for  10000
   [junit4]   2> 2907688 INFO  (searcherExecutor-12508-thread-1-processing-x:collection1)
[    x:collection1] o.a.s.c.SolrCore [collection1] Registered new searcher Searcher@3d8bae[collection1]
main{ExitableDirectoryReader(UninvertingDirectoryReader())}
   [junit4]   2> 2908208 INFO  (qtp16653199-24817) [    ] o.a.s.s.HttpSolrCall [admin]
webapp=null path=/admin/authentication params={} status=0 QTime=0
   [junit4]   2> 2908212 INFO  (TEST-BasicAuthStandaloneTest.testBasicAuth-seed#[3E3EA8B4E3ACB8C])
[    ] o.a.s.c.CoreContainer Security node changed, reloading security.json
   [junit4]   2> 2908213 INFO  (TEST-BasicAuthStandaloneTest.testBasicAuth-seed#[3E3EA8B4E3ACB8C])
[    ] o.a.s.c.CoreContainer Initializing authorization plugin: solr.RuleBasedAuthorizationPlugin
   [junit4]   2> 2908213 INFO  (TEST-BasicAuthStandaloneTest.testBasicAuth-seed#[3E3EA8B4E3ACB8C])
[    ] o.a.s.c.CoreContainer Initializing authentication plugin: solr.BasicAuthPlugin
   [junit4]   2> 2908219 INFO  (TEST-BasicAuthStandaloneTest.testBasicAuth-seed#[3E3EA8B4E3ACB8C])
[    ] o.e.j.s.ServerConnector Stopped ServerConnector@14935f5{SSL,[ssl, http/1.1]}{127.0.0.1:0}
   [junit4]   2> 2908219 INFO  (TEST-BasicAuthStandaloneTest.testBasicAuth-seed#[3E3EA8B4E3ACB8C])
[    ] o.a.s.c.CoreContainer Shutting down CoreContainer instance=3137570
   [junit4]   2> 2908220 INFO  (coreCloseExecutor-12512-thread-1) [    x:collection1] o.a.s.c.SolrCore
[collection1]  CLOSING SolrCore org.apache.solr.core.SolrCore@404676
   [junit4]   2> 2908222 INFO  (TEST-BasicAuthStandaloneTest.testBasicAuth-seed#[3E3EA8B4E3ACB8C])
[    ] o.e.j.s.h.ContextHandler Stopped o.e.j.s.ServletContextHandler@1d885e8{/solr,null,UNAVAILABLE}
   [junit4]   2> 2908222 INFO  (TEST-BasicAuthStandaloneTest.testBasicAuth-seed#[3E3EA8B4E3ACB8C])
[    ] o.a.s.SolrTestCaseJ4 ###Ending testBasicAuth
   [junit4]   2> NOTE: reproduce with: ant test  -Dtestcase=BasicAuthStandaloneTest -Dtests.method=testBasicAuth
-Dtests.seed=3E3EA8B4E3ACB8C -Dtests.slow=true -Dtests.locale=et -Dtests.timezone=Europe/Belfast
-Dtests.asserts=true -Dtests.file.encoding=US-ASCII
   [junit4] FAILURE 0.67s J0 | BasicAuthStandaloneTest.testBasicAuth <<<
   [junit4]    > Throwable #1: java.lang.AssertionError: Invalid json <html>
   [junit4]    > <head>
   [junit4]    > <meta http-equiv="Content-Type" content="text/html;charset=ISO-8859-1"/>
   [junit4]    > <title>Error 401 </title>
   [junit4]    > </head>
   [junit4]    > <body>
   [junit4]    > <h2>HTTP ERROR: 401</h2>
   [junit4]    > <p>Problem accessing /solr/admin/authentication. Reason:
   [junit4]    > <pre>    Bad credentials</pre></p>
   [junit4]    > <hr /><a href="http://eclipse.org/jetty">Powered by Jetty://
9.3.8.v20160314</a><hr/>
   [junit4]    > </body>
   [junit4]    > </html>
   [junit4]    > 	at __randomizedtesting.SeedInfo.seed([3E3EA8B4E3ACB8C:BF8D9C99EA6948F6]:0)
   [junit4]    > 	at org.apache.solr.security.BasicAuthIntegrationTest.verifySecurityStatus(BasicAuthIntegrationTest.java:256)
   [junit4]    > 	at org.apache.solr.security.BasicAuthIntegrationTest.verifySecurityStatus(BasicAuthIntegrationTest.java:237)
   [junit4]    > 	at org.apache.solr.security.BasicAuthStandaloneTest.testBasicAuth(BasicAuthStandaloneTest.java:102)
   [junit4]    > 	at java.lang.Thread.run(Thread.java:745)
   [junit4]   2> 2908227 INFO  (SUITE-BasicAuthStandaloneTest-seed#[3E3EA8B4E3ACB8C]-worker)
[    ] o.a.s.SolrTestCaseJ4 ###deleteCore
   [junit4]   2> NOTE: leaving temporary files on disk at: C:\Users\jenkins\workspace\Lucene-Solr-master-Windows\solr\build\solr-core\test\J0\temp\solr.security.BasicAuthStandaloneTest_3E3EA8B4E3ACB8C-001
   [junit4]   2> NOTE: test params are: codec=Lucene70, sim=RandomSimilarity(queryNorm=true):
{}, locale=et, timezone=Europe/Belfast
   [junit4]   2> NOTE: Windows 10 10.0 x86/Oracle Corporation 1.8.0_102 (32-bit)/cpus=3,threads=1,free=100655080,total=472907776
   [junit4]   2> NOTE: All tests run in this JVM: [TestSolrQueryResponse, TestAuthorizationFramework,
TestSlowCompositeReaderWrapper, SoftAutoCommitTest, DOMUtilTest, TestExtendedDismaxParser,
AlternateDirectoryTest, TestDefaultStatsCache, SyncSliceTest, TestBackupRepositoryFactory,
TestHdfsBackupRestoreCore, TestSSLRandomization, TestUpdate, RequiredFieldsTest, AtomicUpdatesTest,
TestXmlQParser, DistributedQueueTest, HdfsRecoveryZkTest, MergeStrategyTest, TestCollationFieldDocValues,
TestPerFieldSimilarityWithDefaultOverride, TestStressCloudBlindAtomicUpdates, TestGraphTermsQParserPlugin,
TestMergePolicyConfig, XmlUpdateRequestHandlerTest, SolrPluginUtilsTest, TestWordDelimiterFilterFactory,
LeaderElectionContextKeyTest, BlobRepositoryCloudTest, TestJsonFacetRefinement, DistributedFacetPivotLargeTest,
XsltUpdateRequestHandlerTest, TestClusterProperties, DistributedQueryElevationComponentTest,
TestSubQueryTransformerCrossCore, DistributedFacetPivotSmallAdvancedTest, TestConfigSetImmutable,
TestReplicationHandler, TestManagedSchemaAPI, TestStressUserVersions, TestFieldTypeResource,
TestAuthenticationFramework, PolyFieldTest, TestSizeLimitedDistributedMap, TestSolrFieldCacheMBean,
RuleEngineTest, TestFileDictionaryLookup, TestBM25SimilarityFactory, TestNoOpRegenerator,
CdcrReplicationDistributedZkTest, TestLeaderElectionZkExpiry, TestSolrCloudWithKerberosAlt,
CdcrRequestHandlerTest, TestDocTermOrds, PathHierarchyTokenizerFactoryTest, DateFieldTest,
SolrIndexConfigTest, TestGeoJSONResponseWriter, ForceLeaderTest, TestDeleteCollectionOnDownNodes,
SecurityConfHandlerTest, TestObjectReleaseTracker, BasicDistributedZkTest, TestPartialUpdateDeduplication,
UUIDUpdateProcessorFallbackTest, SchemaVersionSpecificBehaviorTest, TestDistributedSearch,
SpatialFilterTest, RemoteQueryErrorTest, TestFastOutputStream, SaslZkACLProviderTest, UniqFieldsUpdateProcessorFactoryTest,
TestIBSimilarityFactory, TestBlobHandler, SortSpecParsingTest, TestMacroExpander, TestHdfsCloudBackupRestore,
TimeZoneUtilsTest, TestLFUCache, TestReloadAndDeleteDocs, TestCustomStream, TestStressVersions,
TermsComponentTest, DistributedQueryComponentOptimizationTest, DirectoryFactoryTest, TestStressReorder,
AssignTest, CopyFieldTest, ShardRoutingTest, TestLocalFSCloudBackupRestore, UnloadDistributedZkTest,
TestCloudInspectUtil, TestHighFrequencyDictionaryFactory, TestRemoteStreaming, TestStressLucene,
OverseerTest, TestInitParams, PrimitiveFieldTypeTest, CoreAdminCreateDiscoverTest, ReplicationFactorTest,
SystemInfoHandlerTest, TestFaceting, TestXIncludeConfig, SharedFSAutoReplicaFailoverTest,
TestCharFilters, TestQueryWrapperFilter, DistributedMLTComponentTest, AnalyticsQueryTest,
TestJsonRequest, AddBlockUpdateTest, TestPivotHelperCode, ChaosMonkeyNothingIsSafeTest, SuggestComponentContextFilterQueryTest,
TestSolrXml, TestConfigSetsAPIZkFailure, DocValuesTest, DistributedSpellCheckComponentTest,
FacetPivotSmallTest, ZkStateWriterTest, BlockJoinFacetDistribTest, ZkControllerTest, CloneFieldUpdateProcessorFactoryTest,
TestAnalyzeInfixSuggestions, TestRTGBase, TestRandomFlRTGCloud, DistribDocExpirationUpdateProcessorTest,
TestLRUCache, BlockDirectoryTest, TestTolerantUpdateProcessorCloud, BlockJoinFacetSimpleTest,
PeerSyncWithIndexFingerprintCachingTest, TestPhraseSuggestions, TestDistributedStatsComponentCardinality,
TestFunctionQuery, BigEndianAscendingWordSerializerTest, CloudExitableDirectoryReaderTest,
SampleTest, CollectionsAPIAsyncDistributedZkTest, TestPseudoReturnFields, EnumFieldTest, TestManagedSynonymFilterFactory,
TestComplexPhraseQParserPlugin, TestPostingsSolrHighlighter, TestDownShardTolerantSearch,
TestMiniSolrCloudCluster, RecoveryZkTest, TestConfigSets, CdcrUpdateLogTest, TestHighlightDedupGrouping,
TestSurroundQueryParser, TestSolrJ, TestElisionMultitermQuery, HighlighterTest, ChaosMonkeySafeLeaderTest,
CollectionsAPIDistributedZkTest, LeaderElectionIntegrationTest, ClusterStateUpdateTest, LeaderElectionTest,
TestRandomDVFaceting, ZkCLITest, AutoCommitTest, TestDistributedGrouping, TestRecovery, TestHashPartitioner,
TestRealTimeGet, HardAutoCommitTest, TestCoreContainer, SimpleFacetsTest, SolrCoreTest, StatsComponentTest,
TestGroupingSearch, SolrCmdDistributorTest, QueryElevationComponentTest, PeerSyncTest, ConvertedLegacyTest,
TestSort, BasicFunctionalityTest, TestLazyCores, DirectUpdateHandlerTest, TestIndexSearcher,
ShowFileRequestHandlerTest, CurrencyFieldXmlFileTest, SimplePostToolTest, TestCoreDiscovery,
AnalysisAfterCoreReloadTest, SuggesterFSTTest, SolrRequestParserTest, TestTrie, TestCSVLoader,
NoCacheHeaderTest, WordBreakSolrSpellCheckerTest, SolrCoreCheckLockOnStartupTest, FieldMutatingUpdateProcessorTest,
QueryEqualityTest, DirectUpdateHandlerOptimizeTest, StatelessScriptUpdateProcessorFactoryTest,
DocValuesMultiTest, TestSolrDeletionPolicy1, CacheHeaderTest, IndexBasedSpellCheckerTest,
DisMaxRequestHandlerTest, TestQueryUtils, StandardRequestHandlerTest, TestWriterPerf, DirectSolrSpellCheckerTest,
TestReversedWildcardFilterFactory, DocumentAnalysisRequestHandlerTest, TestQueryTypes, RequestHandlersTest,
DocumentBuilderTest, TestValueSourceCache, TermVectorComponentTest, TestIndexingPerformance,
MoreLikeThisHandlerTest, FieldAnalysisRequestHandlerTest, TestSolrQueryParser, FastVectorHighlighterTest,
IndexSchemaRuntimeFieldTest, LoggingHandlerTest, IndexSchemaTest, TestJmxIntegration, TestCollationField,
ReturnFieldsTest, TestCSVResponseWriter, MBeansHandlerTest, TestAnalyzedSuggestions, BinaryUpdateRequestHandlerTest,
TestPHPSerializedResponseWriter, PingRequestHandlerTest, TestComponentsName, SearchHandlerTest,
SOLR749Test, TestQuerySenderNoQuery, MultiTermTest, TestBinaryField, TestSearchPerf, NumericFieldsTest,
MinimalSchemaTest, TestConfig, OutputWriterTest, TestFuzzyAnalyzedSuggestions, ExternalFileFieldSortTest,
DirectSolrConnectionTest, NotRequiredUniqueKeyTest, SpellPossibilityIteratorTest, TestCodecSupport,
SynonymTokenizerTest, EchoParamsTest, TestSweetSpotSimilarityFactory, TestDFRSimilarityFactory,
TestPerFieldSimilarity, TestLMJelinekMercerSimilarityFactory, TestJmxMonitoredMap, ResourceLoaderTest,
ScriptEngineTest, OpenExchangeRatesOrgProviderTest, PluginInfoTest, TestFastLRUCache, PrimUtilsTest,
SpellingQueryConverterTest, TestDocumentBuilder, ZkNodePropsTest, FileUtilsTest, CircularListTest,
CursorPagingTest, DistributedIntervalFacetingTest, SolrTestCaseJ4Test, TestCrossCoreJoin,
TestCursorMarkWithoutUniqueKey, TestTolerantSearch, TestEmbeddedSolrServerConstructors, TestJettySolrRunner,
ActionThrottleTest, BaseCdcrDistributedZkTest, CdcrBootstrapTest, CdcrReplicationHandlerTest,
CdcrVersionReplicationTest, CollectionReloadTest, CollectionStateFormat2Test, ConcurrentDeleteAndCreateCollectionTest,
ConfigSetsAPITest, ConnectionManagerTest, CustomCollectionTest, DeleteStatusTest, DistributedVersionInfoTest,
LeaderFailureAfterFreshStartTest, LeaderInitiatedRecoveryOnShardRestartTest, MigrateRouteKeyTest,
MultiThreadedOCPTest, OverseerRolesTest, RecoveryAfterSoftCommitTest, ReplaceNodeTest, RestartWhileUpdatingTest,
RollingRestartTest, SolrCloudExampleTest, TestCloudPseudoReturnFields, TestConfigSetsAPIExclusivity,
TestExclusionRuleCollectionAccess, TestLeaderElectionWithEmptyReplica, TestOnReconnectListenerSupport,
TestRebalanceLeaders, TestRequestForwarding, TestSolrCloudWithDelegationTokens, TestSolrCloudWithSecureImpersonation,
TlogReplayBufferedWhileIndexingTest, VMParamsZkACLAndCredentialsProvidersTest, HdfsBasicDistributedZkTest,
HdfsChaosMonkeyNothingIsSafeTest, HdfsChaosMonkeySafeLeaderTest, HdfsCollectionsAPIDistributedZkTest,
HdfsNNFailoverTest, HdfsRestartWhileUpdatingTest, HdfsSyncSliceTest, HdfsThreadLeakTest, HdfsTlogReplayBufferedWhileIndexingTest,
HdfsWriteToMultipleCollectionsTest, StressHdfsTest, TestClusterStateMutator, ZkStateReaderTest,
RulesTest, TestSolrCloudSnapshots, TestReqParamsAPI, TestSQLHandler, CoreAdminRequestStatusTest,
CoreMergeIndexesAdminHandlerTest, StatsReloadRaceTest, DistributedExpandComponentTest, DistributedFacetExistsSmallTest,
DistributedFacetPivotLongTailTest, DistributedFacetPivotWhiteBoxTest, DistributedSuggestComponentTest,
JavabinLoaderTest, CheckHdfsIndexTest, TestIntervalFaceting, TestMacros, JSONWriterTest, TestBinaryResponseWriter,
TestRawResponseWriter, TestRawTransformer, TestChildDocTransformer, TestSubQueryTransformer,
TestSubQueryTransformerDistrib, TestManagedResource, TestRestManager, TestCopyFieldCollectionResource,
TestDefaultSearchFieldResource, TestDynamicFieldResource, TestFieldCollectionResource, TestFieldResource,
TestFieldTypeCollectionResource, TestSchemaResource, TestSchemaVersionResource, TestSerializedLuceneMatchVersion,
TestSolrQueryParserDefaultOperatorResource, TestSolrQueryParserResource, TestUniqueKeyFieldResource,
TestManagedStopFilterFactory, SpatialRPTFieldTypeTest, TestCloudManagedSchema, TestSchemaManager,
TestUseDocValuesAsStored, TestUseDocValuesAsStored2, AnalyticsMergeStrategyTest, CursorMarkTest,
TestAddFieldRealTimeGet, TestCollapseQParserPlugin, TestCustomSort, TestFieldSortValues, TestHashQParserPlugin,
TestInitQParser, TestMaxScoreQueryParser, TestMissingGroups, TestReRankQParserPlugin, TestRecoveryHdfs,
TestReloadDeadlock, TestSearcherReuse, TestSimpleQParserPlugin, TestSmileRequest, TestSolr4Spatial2,
TestTrieFacet, TestXmlQParserPlugin, TestMinMaxOnMultiValuedField, TestOrdValues, TestSortByMinMaxFunction,
BJQParserTest, BlockJoinFacetRandomTest, TestScoreJoinQPNoScore, SimpleMLTQParserTest, TestDFISimilarityFactory,
TestExactSharedStatsCache, TestLRUStatsCache, BasicAuthIntegrationTest, BasicAuthStandaloneTest]
   [junit4] Completed [613/647 (1!)] on J0 in 0.70s, 1 test, 1 failure <<< FAILURES!

[...truncated 52817 lines...]


Mime
View raw message