lucene-dev mailing list archives

Site index · List index
Message view « Date » · « Thread »
Top « Date » · « Thread »
From Policeman Jenkins Server <jenk...@thetaphi.de>
Subject [JENKINS] Lucene-Solr-6.x-MacOSX (64bit/jdk1.8.0) - Build # 499 - Still Unstable!
Date Fri, 28 Oct 2016 05:25:45 GMT
Build: https://jenkins.thetaphi.de/job/Lucene-Solr-6.x-MacOSX/499/
Java: 64bit/jdk1.8.0 -XX:+UseCompressedOops -XX:+UseParallelGC

3 tests failed.
FAILED:  junit.framework.TestSuite.org.apache.solr.core.TestLazyCores

Error Message:
ObjectTracker found 5 object(s) that were not released!!! [SolrCore, MDCAwareThreadPoolExecutor, MockDirectoryWrapper, MockDirectoryWrapper, MockDirectoryWrapper] org.apache.solr.common.util.ObjectReleaseTracker$ObjectTrackerException  at org.apache.solr.common.util.ObjectReleaseTracker.track(ObjectReleaseTracker.java:43)  at org.apache.solr.core.SolrCore.<init>(SolrCore.java:940)  at org.apache.solr.core.SolrCore.<init>(SolrCore.java:776)  at org.apache.solr.core.CoreContainer.create(CoreContainer.java:842)  at org.apache.solr.core.CoreContainer.lambda$load$0(CoreContainer.java:498)  at java.util.concurrent.FutureTask.run(FutureTask.java:266)  at org.apache.solr.common.util.ExecutorUtil$MDCAwareThreadPoolExecutor.lambda$execute$0(ExecutorUtil.java:229)  at java.util.concurrent.ThreadPoolExecutor.runWorker(ThreadPoolExecutor.java:1142)  at java.util.concurrent.ThreadPoolExecutor$Worker.run(ThreadPoolExecutor.java:617)  at java.lang.Thread.run(Thread.java:745)  org.apache.solr.common.util.ObjectReleaseTracker$ObjectTrackerException  at org.apache.solr.common.util.ObjectReleaseTracker.track(ObjectReleaseTracker.java:43)  at org.apache.solr.core.SolrCore.<init>(SolrCore.java:799)  at org.apache.solr.core.SolrCore.<init>(SolrCore.java:776)  at org.apache.solr.core.CoreContainer.create(CoreContainer.java:842)  at org.apache.solr.core.CoreContainer.lambda$load$0(CoreContainer.java:498)  at java.util.concurrent.FutureTask.run(FutureTask.java:266)  at org.apache.solr.common.util.ExecutorUtil$MDCAwareThreadPoolExecutor.lambda$execute$0(ExecutorUtil.java:229)  at java.util.concurrent.ThreadPoolExecutor.runWorker(ThreadPoolExecutor.java:1142)  at java.util.concurrent.ThreadPoolExecutor$Worker.run(ThreadPoolExecutor.java:617)  at java.lang.Thread.run(Thread.java:745)  org.apache.solr.common.util.ObjectReleaseTracker$ObjectTrackerException  at org.apache.solr.common.util.ObjectReleaseTracker.track(ObjectReleaseTracker.java:43)  at org.apache.solr.core.CachingDirectoryFactory.get(CachingDirectoryFactory.java:347)  at org.apache.solr.core.SolrCore.getNewIndexDir(SolrCore.java:333)  at org.apache.solr.core.SolrCore.initIndex(SolrCore.java:642)  at org.apache.solr.core.SolrCore.<init>(SolrCore.java:850)  at org.apache.solr.core.SolrCore.<init>(SolrCore.java:776)  at org.apache.solr.core.CoreContainer.create(CoreContainer.java:842)  at org.apache.solr.core.CoreContainer.lambda$load$0(CoreContainer.java:498)  at java.util.concurrent.FutureTask.run(FutureTask.java:266)  at org.apache.solr.common.util.ExecutorUtil$MDCAwareThreadPoolExecutor.lambda$execute$0(ExecutorUtil.java:229)  at java.util.concurrent.ThreadPoolExecutor.runWorker(ThreadPoolExecutor.java:1142)  at java.util.concurrent.ThreadPoolExecutor$Worker.run(ThreadPoolExecutor.java:617)  at java.lang.Thread.run(Thread.java:745)  org.apache.solr.common.util.ObjectReleaseTracker$ObjectTrackerException  at org.apache.solr.common.util.ObjectReleaseTracker.track(ObjectReleaseTracker.java:43)  at org.apache.solr.core.CachingDirectoryFactory.get(CachingDirectoryFactory.java:347)  at org.apache.solr.core.SolrCore.initSnapshotMetaDataManager(SolrCore.java:435)  at org.apache.solr.core.SolrCore.<init>(SolrCore.java:844)  at org.apache.solr.core.SolrCore.<init>(SolrCore.java:776)  at org.apache.solr.core.CoreContainer.create(CoreContainer.java:842)  at org.apache.solr.core.CoreContainer.lambda$load$0(CoreContainer.java:498)  at java.util.concurrent.FutureTask.run(FutureTask.java:266)  at org.apache.solr.common.util.ExecutorUtil$MDCAwareThreadPoolExecutor.lambda$execute$0(ExecutorUtil.java:229)  at java.util.concurrent.ThreadPoolExecutor.runWorker(ThreadPoolExecutor.java:1142)  at java.util.concurrent.ThreadPoolExecutor$Worker.run(ThreadPoolExecutor.java:617)  at java.lang.Thread.run(Thread.java:745)  org.apache.solr.common.util.ObjectReleaseTracker$ObjectTrackerException  at org.apache.solr.common.util.ObjectReleaseTracker.track(ObjectReleaseTracker.java:43)  at org.apache.solr.core.CachingDirectoryFactory.get(CachingDirectoryFactory.java:347)  at org.apache.solr.update.SolrIndexWriter.create(SolrIndexWriter.java:66)  at org.apache.solr.core.SolrCore.initIndex(SolrCore.java:674)  at org.apache.solr.core.SolrCore.<init>(SolrCore.java:850)  at org.apache.solr.core.SolrCore.<init>(SolrCore.java:776)  at org.apache.solr.core.CoreContainer.create(CoreContainer.java:842)  at org.apache.solr.core.CoreContainer.lambda$load$0(CoreContainer.java:498)  at java.util.concurrent.FutureTask.run(FutureTask.java:266)  at org.apache.solr.common.util.ExecutorUtil$MDCAwareThreadPoolExecutor.lambda$execute$0(ExecutorUtil.java:229)  at java.util.concurrent.ThreadPoolExecutor.runWorker(ThreadPoolExecutor.java:1142)  at java.util.concurrent.ThreadPoolExecutor$Worker.run(ThreadPoolExecutor.java:617)  at java.lang.Thread.run(Thread.java:745)  

Stack Trace:
java.lang.AssertionError: ObjectTracker found 5 object(s) that were not released!!! [SolrCore, MDCAwareThreadPoolExecutor, MockDirectoryWrapper, MockDirectoryWrapper, MockDirectoryWrapper]
org.apache.solr.common.util.ObjectReleaseTracker$ObjectTrackerException
	at org.apache.solr.common.util.ObjectReleaseTracker.track(ObjectReleaseTracker.java:43)
	at org.apache.solr.core.SolrCore.<init>(SolrCore.java:940)
	at org.apache.solr.core.SolrCore.<init>(SolrCore.java:776)
	at org.apache.solr.core.CoreContainer.create(CoreContainer.java:842)
	at org.apache.solr.core.CoreContainer.lambda$load$0(CoreContainer.java:498)
	at java.util.concurrent.FutureTask.run(FutureTask.java:266)
	at org.apache.solr.common.util.ExecutorUtil$MDCAwareThreadPoolExecutor.lambda$execute$0(ExecutorUtil.java:229)
	at java.util.concurrent.ThreadPoolExecutor.runWorker(ThreadPoolExecutor.java:1142)
	at java.util.concurrent.ThreadPoolExecutor$Worker.run(ThreadPoolExecutor.java:617)
	at java.lang.Thread.run(Thread.java:745)

org.apache.solr.common.util.ObjectReleaseTracker$ObjectTrackerException
	at org.apache.solr.common.util.ObjectReleaseTracker.track(ObjectReleaseTracker.java:43)
	at org.apache.solr.core.SolrCore.<init>(SolrCore.java:799)
	at org.apache.solr.core.SolrCore.<init>(SolrCore.java:776)
	at org.apache.solr.core.CoreContainer.create(CoreContainer.java:842)
	at org.apache.solr.core.CoreContainer.lambda$load$0(CoreContainer.java:498)
	at java.util.concurrent.FutureTask.run(FutureTask.java:266)
	at org.apache.solr.common.util.ExecutorUtil$MDCAwareThreadPoolExecutor.lambda$execute$0(ExecutorUtil.java:229)
	at java.util.concurrent.ThreadPoolExecutor.runWorker(ThreadPoolExecutor.java:1142)
	at java.util.concurrent.ThreadPoolExecutor$Worker.run(ThreadPoolExecutor.java:617)
	at java.lang.Thread.run(Thread.java:745)

org.apache.solr.common.util.ObjectReleaseTracker$ObjectTrackerException
	at org.apache.solr.common.util.ObjectReleaseTracker.track(ObjectReleaseTracker.java:43)
	at org.apache.solr.core.CachingDirectoryFactory.get(CachingDirectoryFactory.java:347)
	at org.apache.solr.core.SolrCore.getNewIndexDir(SolrCore.java:333)
	at org.apache.solr.core.SolrCore.initIndex(SolrCore.java:642)
	at org.apache.solr.core.SolrCore.<init>(SolrCore.java:850)
	at org.apache.solr.core.SolrCore.<init>(SolrCore.java:776)
	at org.apache.solr.core.CoreContainer.create(CoreContainer.java:842)
	at org.apache.solr.core.CoreContainer.lambda$load$0(CoreContainer.java:498)
	at java.util.concurrent.FutureTask.run(FutureTask.java:266)
	at org.apache.solr.common.util.ExecutorUtil$MDCAwareThreadPoolExecutor.lambda$execute$0(ExecutorUtil.java:229)
	at java.util.concurrent.ThreadPoolExecutor.runWorker(ThreadPoolExecutor.java:1142)
	at java.util.concurrent.ThreadPoolExecutor$Worker.run(ThreadPoolExecutor.java:617)
	at java.lang.Thread.run(Thread.java:745)

org.apache.solr.common.util.ObjectReleaseTracker$ObjectTrackerException
	at org.apache.solr.common.util.ObjectReleaseTracker.track(ObjectReleaseTracker.java:43)
	at org.apache.solr.core.CachingDirectoryFactory.get(CachingDirectoryFactory.java:347)
	at org.apache.solr.core.SolrCore.initSnapshotMetaDataManager(SolrCore.java:435)
	at org.apache.solr.core.SolrCore.<init>(SolrCore.java:844)
	at org.apache.solr.core.SolrCore.<init>(SolrCore.java:776)
	at org.apache.solr.core.CoreContainer.create(CoreContainer.java:842)
	at org.apache.solr.core.CoreContainer.lambda$load$0(CoreContainer.java:498)
	at java.util.concurrent.FutureTask.run(FutureTask.java:266)
	at org.apache.solr.common.util.ExecutorUtil$MDCAwareThreadPoolExecutor.lambda$execute$0(ExecutorUtil.java:229)
	at java.util.concurrent.ThreadPoolExecutor.runWorker(ThreadPoolExecutor.java:1142)
	at java.util.concurrent.ThreadPoolExecutor$Worker.run(ThreadPoolExecutor.java:617)
	at java.lang.Thread.run(Thread.java:745)

org.apache.solr.common.util.ObjectReleaseTracker$ObjectTrackerException
	at org.apache.solr.common.util.ObjectReleaseTracker.track(ObjectReleaseTracker.java:43)
	at org.apache.solr.core.CachingDirectoryFactory.get(CachingDirectoryFactory.java:347)
	at org.apache.solr.update.SolrIndexWriter.create(SolrIndexWriter.java:66)
	at org.apache.solr.core.SolrCore.initIndex(SolrCore.java:674)
	at org.apache.solr.core.SolrCore.<init>(SolrCore.java:850)
	at org.apache.solr.core.SolrCore.<init>(SolrCore.java:776)
	at org.apache.solr.core.CoreContainer.create(CoreContainer.java:842)
	at org.apache.solr.core.CoreContainer.lambda$load$0(CoreContainer.java:498)
	at java.util.concurrent.FutureTask.run(FutureTask.java:266)
	at org.apache.solr.common.util.ExecutorUtil$MDCAwareThreadPoolExecutor.lambda$execute$0(ExecutorUtil.java:229)
	at java.util.concurrent.ThreadPoolExecutor.runWorker(ThreadPoolExecutor.java:1142)
	at java.util.concurrent.ThreadPoolExecutor$Worker.run(ThreadPoolExecutor.java:617)
	at java.lang.Thread.run(Thread.java:745)


	at __randomizedtesting.SeedInfo.seed([D843CCC45F2584AD]:0)
	at org.junit.Assert.fail(Assert.java:93)
	at org.junit.Assert.assertTrue(Assert.java:43)
	at org.junit.Assert.assertNull(Assert.java:551)
	at org.apache.solr.SolrTestCaseJ4.teardownTestCases(SolrTestCaseJ4.java:261)
	at sun.reflect.GeneratedMethodAccessor23.invoke(Unknown Source)
	at sun.reflect.DelegatingMethodAccessorImpl.invoke(DelegatingMethodAccessorImpl.java:43)
	at java.lang.reflect.Method.invoke(Method.java:498)
	at com.carrotsearch.randomizedtesting.RandomizedRunner.invoke(RandomizedRunner.java:1713)
	at com.carrotsearch.randomizedtesting.RandomizedRunner$7.evaluate(RandomizedRunner.java:870)
	at com.carrotsearch.randomizedtesting.rules.StatementAdapter.evaluate(StatementAdapter.java:36)
	at com.carrotsearch.randomizedtesting.rules.SystemPropertiesRestoreRule$1.evaluate(SystemPropertiesRestoreRule.java:57)
	at org.apache.lucene.util.AbstractBeforeAfterRule$1.evaluate(AbstractBeforeAfterRule.java:45)
	at com.carrotsearch.randomizedtesting.rules.StatementAdapter.evaluate(StatementAdapter.java:36)
	at org.apache.lucene.util.TestRuleStoreClassName$1.evaluate(TestRuleStoreClassName.java:41)
	at com.carrotsearch.randomizedtesting.rules.NoShadowingOrOverridesOnMethodsRule$1.evaluate(NoShadowingOrOverridesOnMethodsRule.java:40)
	at com.carrotsearch.randomizedtesting.rules.NoShadowingOrOverridesOnMethodsRule$1.evaluate(NoShadowingOrOverridesOnMethodsRule.java:40)
	at com.carrotsearch.randomizedtesting.rules.StatementAdapter.evaluate(StatementAdapter.java:36)
	at com.carrotsearch.randomizedtesting.rules.StatementAdapter.evaluate(StatementAdapter.java:36)
	at com.carrotsearch.randomizedtesting.rules.StatementAdapter.evaluate(StatementAdapter.java:36)
	at org.apache.lucene.util.TestRuleAssertionsRequired$1.evaluate(TestRuleAssertionsRequired.java:53)
	at org.apache.lucene.util.TestRuleMarkFailure$1.evaluate(TestRuleMarkFailure.java:47)
	at org.apache.lucene.util.TestRuleIgnoreAfterMaxFailures$1.evaluate(TestRuleIgnoreAfterMaxFailures.java:64)
	at org.apache.lucene.util.TestRuleIgnoreTestSuites$1.evaluate(TestRuleIgnoreTestSuites.java:54)
	at com.carrotsearch.randomizedtesting.rules.StatementAdapter.evaluate(StatementAdapter.java:36)
	at com.carrotsearch.randomizedtesting.ThreadLeakControl$StatementRunner.run(ThreadLeakControl.java:367)
	at java.lang.Thread.run(Thread.java:745)


FAILED:  junit.framework.TestSuite.org.apache.solr.core.TestLazyCores

Error Message:
1 thread leaked from SUITE scope at org.apache.solr.core.TestLazyCores:     1) Thread[id=7216, name=searcherExecutor-3964-thread-1, state=WAITING, group=TGRP-TestLazyCores]         at sun.misc.Unsafe.park(Native Method)         at java.util.concurrent.locks.LockSupport.park(LockSupport.java:175)         at java.util.concurrent.locks.AbstractQueuedSynchronizer$ConditionObject.await(AbstractQueuedSynchronizer.java:2039)         at java.util.concurrent.LinkedBlockingQueue.take(LinkedBlockingQueue.java:442)         at java.util.concurrent.ThreadPoolExecutor.getTask(ThreadPoolExecutor.java:1067)         at java.util.concurrent.ThreadPoolExecutor.runWorker(ThreadPoolExecutor.java:1127)         at java.util.concurrent.ThreadPoolExecutor$Worker.run(ThreadPoolExecutor.java:617)         at java.lang.Thread.run(Thread.java:745)

Stack Trace:
com.carrotsearch.randomizedtesting.ThreadLeakError: 1 thread leaked from SUITE scope at org.apache.solr.core.TestLazyCores: 
   1) Thread[id=7216, name=searcherExecutor-3964-thread-1, state=WAITING, group=TGRP-TestLazyCores]
        at sun.misc.Unsafe.park(Native Method)
        at java.util.concurrent.locks.LockSupport.park(LockSupport.java:175)
        at java.util.concurrent.locks.AbstractQueuedSynchronizer$ConditionObject.await(AbstractQueuedSynchronizer.java:2039)
        at java.util.concurrent.LinkedBlockingQueue.take(LinkedBlockingQueue.java:442)
        at java.util.concurrent.ThreadPoolExecutor.getTask(ThreadPoolExecutor.java:1067)
        at java.util.concurrent.ThreadPoolExecutor.runWorker(ThreadPoolExecutor.java:1127)
        at java.util.concurrent.ThreadPoolExecutor$Worker.run(ThreadPoolExecutor.java:617)
        at java.lang.Thread.run(Thread.java:745)
	at __randomizedtesting.SeedInfo.seed([D843CCC45F2584AD]:0)


FAILED:  junit.framework.TestSuite.org.apache.solr.core.TestLazyCores

Error Message:
There are still zombie threads that couldn't be terminated:    1) Thread[id=7216, name=searcherExecutor-3964-thread-1, state=WAITING, group=TGRP-TestLazyCores]         at sun.misc.Unsafe.park(Native Method)         at java.util.concurrent.locks.LockSupport.park(LockSupport.java:175)         at java.util.concurrent.locks.AbstractQueuedSynchronizer$ConditionObject.await(AbstractQueuedSynchronizer.java:2039)         at java.util.concurrent.LinkedBlockingQueue.take(LinkedBlockingQueue.java:442)         at java.util.concurrent.ThreadPoolExecutor.getTask(ThreadPoolExecutor.java:1067)         at java.util.concurrent.ThreadPoolExecutor.runWorker(ThreadPoolExecutor.java:1127)         at java.util.concurrent.ThreadPoolExecutor$Worker.run(ThreadPoolExecutor.java:617)         at java.lang.Thread.run(Thread.java:745)

Stack Trace:
com.carrotsearch.randomizedtesting.ThreadLeakError: There are still zombie threads that couldn't be terminated:
   1) Thread[id=7216, name=searcherExecutor-3964-thread-1, state=WAITING, group=TGRP-TestLazyCores]
        at sun.misc.Unsafe.park(Native Method)
        at java.util.concurrent.locks.LockSupport.park(LockSupport.java:175)
        at java.util.concurrent.locks.AbstractQueuedSynchronizer$ConditionObject.await(AbstractQueuedSynchronizer.java:2039)
        at java.util.concurrent.LinkedBlockingQueue.take(LinkedBlockingQueue.java:442)
        at java.util.concurrent.ThreadPoolExecutor.getTask(ThreadPoolExecutor.java:1067)
        at java.util.concurrent.ThreadPoolExecutor.runWorker(ThreadPoolExecutor.java:1127)
        at java.util.concurrent.ThreadPoolExecutor$Worker.run(ThreadPoolExecutor.java:617)
        at java.lang.Thread.run(Thread.java:745)
	at __randomizedtesting.SeedInfo.seed([D843CCC45F2584AD]:0)




Build Log:
[...truncated 11323 lines...]
   [junit4] Suite: org.apache.solr.core.TestLazyCores
   [junit4]   2> Creating dataDir: /Users/jenkins/workspace/Lucene-Solr-6.x-MacOSX/solr/build/solr-core/test/J0/temp/solr.core.TestLazyCores_D843CCC45F2584AD-001/init-core-data-001
   [junit4]   2> 1114196 INFO  (SUITE-TestLazyCores-seed#[D843CCC45F2584AD]-worker) [    ] o.a.s.SolrTestCaseJ4 Randomized ssl (false) and clientAuth (false) via: @org.apache.solr.util.RandomizeSSL(reason=, value=NaN, ssl=NaN, clientAuth=NaN) w/ MAC_OS_X supressed clientAuth
   [junit4]   2> 1114198 INFO  (TEST-TestLazyCores.testRace-seed#[D843CCC45F2584AD]) [    ] o.a.s.SolrTestCaseJ4 ###Starting testRace
   [junit4]   2> 1114249 INFO  (TEST-TestLazyCores.testRace-seed#[D843CCC45F2584AD]) [    ] o.a.s.u.UpdateShardHandler Creating UpdateShardHandler HTTP client with params: socketTimeout=600000&connTimeout=60000&retry=true
   [junit4]   2> 1114250 INFO  (TEST-TestLazyCores.testRace-seed#[D843CCC45F2584AD]) [    ] o.a.s.c.SolrCores Allocating transient cache for 4 transient cores
   [junit4]   2> 1114301 WARN  (coreLoadExecutor-3823-thread-3) [    ] o.a.s.c.Config Beginning with Solr 5.5, <mergePolicy> is deprecated, use <mergePolicyFactory> instead.
   [junit4]   2> 1114302 INFO  (coreLoadExecutor-3823-thread-3) [    ] o.a.s.c.SolrConfig Using Lucene MatchVersion: 6.3.0
   [junit4]   2> 1114307 WARN  (coreLoadExecutor-3823-thread-1) [    ] o.a.s.c.Config Beginning with Solr 5.5, <mergePolicy> is deprecated, use <mergePolicyFactory> instead.
   [junit4]   2> 1114320 INFO  (coreLoadExecutor-3823-thread-1) [    ] o.a.s.c.SolrConfig Using Lucene MatchVersion: 6.3.0
   [junit4]   2> 1114326 INFO  (coreLoadExecutor-3823-thread-3) [    ] o.a.s.s.IndexSchema [collection5] Schema name=tiny
   [junit4]   2> 1114327 WARN  (coreLoadExecutor-3823-thread-2) [    ] o.a.s.c.Config Beginning with Solr 5.5, <mergePolicy> is deprecated, use <mergePolicyFactory> instead.
   [junit4]   2> 1114328 INFO  (coreLoadExecutor-3823-thread-2) [    ] o.a.s.c.SolrConfig Using Lucene MatchVersion: 6.3.0
   [junit4]   2> 1114330 INFO  (coreLoadExecutor-3823-thread-1) [    ] o.a.s.s.IndexSchema [collection1] Schema name=tiny
   [junit4]   2> 1114333 INFO  (coreLoadExecutor-3823-thread-1) [    ] o.a.s.s.IndexSchema Loaded schema tiny/1.1 with uniqueid field id
   [junit4]   2> 1114333 INFO  (coreLoadExecutor-3823-thread-3) [    ] o.a.s.s.IndexSchema Loaded schema tiny/1.1 with uniqueid field id
   [junit4]   2> 1114337 INFO  (coreLoadExecutor-3823-thread-2) [    ] o.a.s.s.IndexSchema [collection2] Schema name=tiny
   [junit4]   2> 1114339 INFO  (coreLoadExecutor-3823-thread-1) [    ] o.a.s.c.CoreContainer Creating SolrCore 'collection1' using configuration from instancedir /Users/jenkins/workspace/Lucene-Solr-6.x-MacOSX/solr/build/solr-core/test/J0/temp/solr.core.TestLazyCores_D843CCC45F2584AD-001/tempDir-001/collection1
   [junit4]   2> 1114339 INFO  (coreLoadExecutor-3823-thread-3) [    ] o.a.s.c.CoreContainer Creating SolrCore 'collection5' using configuration from instancedir /Users/jenkins/workspace/Lucene-Solr-6.x-MacOSX/solr/build/solr-core/test/J0/temp/solr.core.TestLazyCores_D843CCC45F2584AD-001/tempDir-001/collection5
   [junit4]   2> 1114339 INFO  (coreLoadExecutor-3823-thread-1) [    x:collection1] o.a.s.c.SolrCore [[collection1] ] Opening new SolrCore at [/Users/jenkins/workspace/Lucene-Solr-6.x-MacOSX/solr/build/solr-core/test/J0/temp/solr.core.TestLazyCores_D843CCC45F2584AD-001/tempDir-001/collection1], dataDir=[/Users/jenkins/workspace/Lucene-Solr-6.x-MacOSX/solr/build/solr-core/test/J0/temp/solr.core.TestLazyCores_D843CCC45F2584AD-001/tempDir-001/collection1/data/]
   [junit4]   2> 1114340 INFO  (coreLoadExecutor-3823-thread-3) [    x:collection5] o.a.s.c.SolrCore [[collection5] ] Opening new SolrCore at [/Users/jenkins/workspace/Lucene-Solr-6.x-MacOSX/solr/build/solr-core/test/J0/temp/solr.core.TestLazyCores_D843CCC45F2584AD-001/tempDir-001/collection5], dataDir=[/Users/jenkins/workspace/Lucene-Solr-6.x-MacOSX/solr/build/solr-core/test/J0/temp/solr.core.TestLazyCores_D843CCC45F2584AD-001/tempDir-001/collection5/data/]
   [junit4]   2> 1114340 INFO  (coreLoadExecutor-3823-thread-2) [    ] o.a.s.s.IndexSchema Loaded schema tiny/1.1 with uniqueid field id
   [junit4]   2> 1114343 INFO  (coreLoadExecutor-3823-thread-2) [    ] o.a.s.c.CoreContainer Creating SolrCore 'collection2' using configuration from instancedir /Users/jenkins/workspace/Lucene-Solr-6.x-MacOSX/solr/build/solr-core/test/J0/temp/solr.core.TestLazyCores_D843CCC45F2584AD-001/tempDir-001/collection2
   [junit4]   2> 1114343 INFO  (coreLoadExecutor-3823-thread-2) [    x:collection2] o.a.s.c.SolrCore [[collection2] ] Opening new SolrCore at [/Users/jenkins/workspace/Lucene-Solr-6.x-MacOSX/solr/build/solr-core/test/J0/temp/solr.core.TestLazyCores_D843CCC45F2584AD-001/tempDir-001/collection2], dataDir=[/Users/jenkins/workspace/Lucene-Solr-6.x-MacOSX/solr/build/solr-core/test/J0/temp/solr.core.TestLazyCores_D843CCC45F2584AD-001/tempDir-001/collection2/data/]
   [junit4]   2> 1114344 INFO  (coreLoadExecutor-3823-thread-1) [    x:collection1] o.a.s.u.RandomMergePolicy RandomMergePolicy wrapping class org.apache.lucene.index.LogDocMergePolicy: [LogDocMergePolicy: minMergeSize=1000, mergeFactor=17, maxMergeSize=9223372036854775807, maxMergeSizeForForcedMerge=9223372036854775807, calibrateSizeByDeletes=false, maxMergeDocs=2147483647, maxCFSSegmentSizeMB=8.796093022207999E12, noCFSRatio=0.5187594859640996]
   [junit4]   2> 1114344 INFO  (coreLoadExecutor-3823-thread-3) [    x:collection5] o.a.s.u.RandomMergePolicy RandomMergePolicy wrapping class org.apache.lucene.index.LogDocMergePolicy: [LogDocMergePolicy: minMergeSize=1000, mergeFactor=17, maxMergeSize=9223372036854775807, maxMergeSizeForForcedMerge=9223372036854775807, calibrateSizeByDeletes=false, maxMergeDocs=2147483647, maxCFSSegmentSizeMB=8.796093022207999E12, noCFSRatio=0.5187594859640996]
   [junit4]   2> 1114345 INFO  (coreLoadExecutor-3823-thread-2) [    x:collection2] o.a.s.u.RandomMergePolicy RandomMergePolicy wrapping class org.apache.lucene.index.LogDocMergePolicy: [LogDocMergePolicy: minMergeSize=1000, mergeFactor=17, maxMergeSize=9223372036854775807, maxMergeSizeForForcedMerge=9223372036854775807, calibrateSizeByDeletes=false, maxMergeDocs=2147483647, maxCFSSegmentSizeMB=8.796093022207999E12, noCFSRatio=0.5187594859640996]
   [junit4]   2> 1114372 INFO  (coreLoadExecutor-3823-thread-3) [    x:collection5] o.a.s.u.CommitTracker Hard AutoCommit: disabled
   [junit4]   2> 1114372 INFO  (coreLoadExecutor-3823-thread-3) [    x:collection5] o.a.s.u.CommitTracker Soft AutoCommit: disabled
   [junit4]   2> 1114372 INFO  (coreLoadExecutor-3823-thread-1) [    x:collection1] o.a.s.u.CommitTracker Hard AutoCommit: disabled
   [junit4]   2> 1114372 INFO  (coreLoadExecutor-3823-thread-1) [    x:collection1] o.a.s.u.CommitTracker Soft AutoCommit: disabled
   [junit4]   2> 1114372 INFO  (coreLoadExecutor-3823-thread-2) [    x:collection2] o.a.s.u.CommitTracker Hard AutoCommit: disabled
   [junit4]   2> 1114372 INFO  (coreLoadExecutor-3823-thread-2) [    x:collection2] o.a.s.u.CommitTracker Soft AutoCommit: disabled
   [junit4]   2> 1114376 INFO  (coreLoadExecutor-3823-thread-3) [    x:collection5] o.a.s.u.RandomMergePolicy RandomMergePolicy wrapping class org.apache.lucene.index.LogDocMergePolicy: [LogDocMergePolicy: minMergeSize=1000, mergeFactor=13, maxMergeSize=9223372036854775807, maxMergeSizeForForcedMerge=9223372036854775807, calibrateSizeByDeletes=true, maxMergeDocs=2147483647, maxCFSSegmentSizeMB=8.796093022207999E12, noCFSRatio=1.0]
   [junit4]   2> 1114376 INFO  (coreLoadExecutor-3823-thread-1) [    x:collection1] o.a.s.u.RandomMergePolicy RandomMergePolicy wrapping class org.apache.lucene.index.LogDocMergePolicy: [LogDocMergePolicy: minMergeSize=1000, mergeFactor=13, maxMergeSize=9223372036854775807, maxMergeSizeForForcedMerge=9223372036854775807, calibrateSizeByDeletes=true, maxMergeDocs=2147483647, maxCFSSegmentSizeMB=8.796093022207999E12, noCFSRatio=1.0]
   [junit4]   2> 1114376 INFO  (coreLoadExecutor-3823-thread-2) [    x:collection2] o.a.s.u.RandomMergePolicy RandomMergePolicy wrapping class org.apache.lucene.index.LogDocMergePolicy: [LogDocMergePolicy: minMergeSize=1000, mergeFactor=13, maxMergeSize=9223372036854775807, maxMergeSizeForForcedMerge=9223372036854775807, calibrateSizeByDeletes=true, maxMergeDocs=2147483647, maxCFSSegmentSizeMB=8.796093022207999E12, noCFSRatio=1.0]
   [junit4]   2> 1114377 INFO  (coreLoadExecutor-3823-thread-3) [    x:collection5] o.a.s.s.SolrIndexSearcher Opening [Searcher@611e85a9[collection5] main]
   [junit4]   2> 1114377 INFO  (coreLoadExecutor-3823-thread-3) [    x:collection5] o.a.s.r.ManagedResourceStorage File-based storage initialized to use dir: /Users/jenkins/workspace/Lucene-Solr-6.x-MacOSX/solr/build/solr-core/test/J0/temp/solr.core.TestLazyCores_D843CCC45F2584AD-001/tempDir-001/collection5/conf
   [junit4]   2> 1114378 INFO  (coreLoadExecutor-3823-thread-3) [    x:collection5] o.a.s.h.ReplicationHandler Commits will be reserved for  10000
   [junit4]   2> 1114378 INFO  (searcherExecutor-3825-thread-1-processing-x:collection5) [    x:collection5] o.a.s.c.SolrCore [collection5] Registered new searcher Searcher@611e85a9[collection5] main{ExitableDirectoryReader(UninvertingDirectoryReader())}
   [junit4]   2> 1114378 INFO  (coreLoadExecutor-3823-thread-1) [    x:collection1] o.a.s.s.SolrIndexSearcher Opening [Searcher@32594a8c[collection1] main]
   [junit4]   2> 1114379 INFO  (coreLoadExecutor-3823-thread-1) [    x:collection1] o.a.s.r.ManagedResourceStorage File-based storage initialized to use dir: /Users/jenkins/workspace/Lucene-Solr-6.x-MacOSX/solr/build/solr-core/test/J0/temp/solr.core.TestLazyCores_D843CCC45F2584AD-001/tempDir-001/collection1/conf
   [junit4]   2> 1114379 INFO  (coreLoadExecutor-3823-thread-1) [    x:collection1] o.a.s.h.ReplicationHandler Commits will be reserved for  10000
   [junit4]   2> 1114379 INFO  (searcherExecutor-3824-thread-1-processing-x:collection1) [    x:collection1] o.a.s.c.SolrCore [collection1] Registered new searcher Searcher@32594a8c[collection1] main{ExitableDirectoryReader(UninvertingDirectoryReader())}
   [junit4]   2> 1114380 INFO  (coreLoadExecutor-3823-thread-2) [    x:collection2] o.a.s.s.SolrIndexSearcher Opening [Searcher@5baf8fd[collection2] main]
   [junit4]   2> 1114380 INFO  (coreLoadExecutor-3823-thread-2) [    x:collection2] o.a.s.r.ManagedResourceStorage File-based storage initialized to use dir: /Users/jenkins/workspace/Lucene-Solr-6.x-MacOSX/solr/build/solr-core/test/J0/temp/solr.core.TestLazyCores_D843CCC45F2584AD-001/tempDir-001/collection2/conf
   [junit4]   2> 1114380 INFO  (coreLoadExecutor-3823-thread-2) [    x:collection2] o.a.s.h.ReplicationHandler Commits will be reserved for  10000
   [junit4]   2> 1114381 INFO  (searcherExecutor-3826-thread-1-processing-x:collection2) [    x:collection2] o.a.s.c.SolrCore [collection2] Registered new searcher Searcher@5baf8fd[collection2] main{ExitableDirectoryReader(UninvertingDirectoryReader())}
   [junit4]   2> 1114381 INFO  (coreLoadExecutor-3823-thread-2) [    x:collection2] o.a.s.c.SolrCores Opening transient core collection2
   [junit4]   2> 1114403 WARN  (Thread-1643) [    ] o.a.s.c.Config Beginning with Solr 5.5, <mergePolicy> is deprecated, use <mergePolicyFactory> instead.
   [junit4]   2> 1114404 INFO  (Thread-1643) [    ] o.a.s.c.SolrConfig Using Lucene MatchVersion: 6.3.0
   [junit4]   2> 1114418 INFO  (Thread-1643) [    ] o.a.s.s.IndexSchema [collection3] Schema name=tiny
   [junit4]   2> 1114430 INFO  (Thread-1643) [    ] o.a.s.s.IndexSchema Loaded schema tiny/1.1 with uniqueid field id
   [junit4]   2> 1114434 INFO  (Thread-1643) [    ] o.a.s.c.CoreContainer Creating SolrCore 'collection3' using configuration from instancedir /Users/jenkins/workspace/Lucene-Solr-6.x-MacOSX/solr/build/solr-core/test/J0/temp/solr.core.TestLazyCores_D843CCC45F2584AD-001/tempDir-001/collection3
   [junit4]   2> 1114435 INFO  (Thread-1643) [    x:collection3] o.a.s.c.SolrCore [[collection3] ] Opening new SolrCore at [/Users/jenkins/workspace/Lucene-Solr-6.x-MacOSX/solr/build/solr-core/test/J0/temp/solr.core.TestLazyCores_D843CCC45F2584AD-001/tempDir-001/collection3], dataDir=[/Users/jenkins/workspace/Lucene-Solr-6.x-MacOSX/solr/build/solr-core/test/J0/temp/solr.core.TestLazyCores_D843CCC45F2584AD-001/tempDir-001/collection3/data/]
   [junit4]   2> 1114440 INFO  (Thread-1643) [    x:collection3] o.a.s.u.RandomMergePolicy RandomMergePolicy wrapping class org.apache.lucene.index.LogDocMergePolicy: [LogDocMergePolicy: minMergeSize=1000, mergeFactor=17, maxMergeSize=9223372036854775807, maxMergeSizeForForcedMerge=9223372036854775807, calibrateSizeByDeletes=false, maxMergeDocs=2147483647, maxCFSSegmentSizeMB=8.796093022207999E12, noCFSRatio=0.5187594859640996]
   [junit4]   2> 1114459 INFO  (Thread-1643) [    x:collection3] o.a.s.u.CommitTracker Hard AutoCommit: disabled
   [junit4]   2> 1114459 INFO  (Thread-1643) [    x:collection3] o.a.s.u.CommitTracker Soft AutoCommit: disabled
   [junit4]   2> 1114460 INFO  (Thread-1643) [    x:collection3] o.a.s.u.RandomMergePolicy RandomMergePolicy wrapping class org.apache.lucene.index.LogDocMergePolicy: [LogDocMergePolicy: minMergeSize=1000, mergeFactor=13, maxMergeSize=9223372036854775807, maxMergeSizeForForcedMerge=9223372036854775807, calibrateSizeByDeletes=true, maxMergeDocs=2147483647, maxCFSSegmentSizeMB=8.796093022207999E12, noCFSRatio=1.0]
   [junit4]   2> 1114460 INFO  (Thread-1643) [    x:collection3] o.a.s.s.SolrIndexSearcher Opening [Searcher@79bf9d01[collection3] main]
   [junit4]   2> 1114460 INFO  (Thread-1643) [    x:collection3] o.a.s.r.ManagedResourceStorage File-based storage initialized to use dir: /Users/jenkins/workspace/Lucene-Solr-6.x-MacOSX/solr/build/solr-core/test/J0/temp/solr.core.TestLazyCores_D843CCC45F2584AD-001/tempDir-001/collection3/conf
   [junit4]   2> 1114461 INFO  (Thread-1643) [    x:collection3] o.a.s.h.ReplicationHandler Commits will be reserved for  10000
   [junit4]   2> 1114461 INFO  (searcherExecutor-3836-thread-1-processing-x:collection3) [    x:collection3] o.a.s.c.SolrCore [collection3] Registered new searcher Searcher@79bf9d01[collection3] main{ExitableDirectoryReader(UninvertingDirectoryReader())}
   [junit4]   2> 1114461 INFO  (Thread-1643) [    x:collection3] o.a.s.c.SolrCores Opening transient core collection3
   [junit4]   2> 1114470 INFO  (TEST-TestLazyCores.testRace-seed#[D843CCC45F2584AD]) [    ] o.a.s.c.CoreContainer Shutting down CoreContainer instance=1716356830
   [junit4]   2> 1114471 INFO  (coreCloseExecutor-3840-thread-1) [    x:collection5] o.a.s.c.SolrCore [collection5]  CLOSING SolrCore org.apache.solr.core.SolrCore@27d25d26
   [junit4]   2> 1114472 INFO  (coreCloseExecutor-3840-thread-2) [    x:collection1] o.a.s.c.SolrCore [collection1]  CLOSING SolrCore org.apache.solr.core.SolrCore@39796eb2
   [junit4]   2> 1114473 INFO  (coreCloseExecutor-3840-thread-3) [    x:collection2] o.a.s.c.SolrCore [collection2]  CLOSING SolrCore org.apache.solr.core.SolrCore@31d2decc
   [junit4]   2> 1114482 INFO  (coreCloseExecutor-3840-thread-4) [    x:collection3] o.a.s.c.SolrCore [collection3]  CLOSING SolrCore org.apache.solr.core.SolrCore@55874a93
   [junit4]   2> 1114494 INFO  (TEST-TestLazyCores.testRace-seed#[D843CCC45F2584AD]) [    ] o.a.s.SolrTestCaseJ4 ###Ending testRace
   [junit4]   2> 1114497 INFO  (TEST-TestLazyCores.testBadConfigsGenerateErrors-seed#[D843CCC45F2584AD]) [    ] o.a.s.SolrTestCaseJ4 ###Starting testBadConfigsGenerateErrors
   [junit4]   2> 1114536 INFO  (TEST-TestLazyCores.testBadConfigsGenerateErrors-seed#[D843CCC45F2584AD]) [    ] o.a.s.u.UpdateShardHandler Creating UpdateShardHandler HTTP client with params: socketTimeout=600000&connTimeout=60000&retry=true
   [junit4]   2> 1114545 INFO  (TEST-TestLazyCores.testBadConfigsGenerateErrors-seed#[D843CCC45F2584AD]) [    ] o.a.s.c.CorePropertiesLocator Found 6 core definitions underneath /Users/jenkins/workspace/Lucene-Solr-6.x-MacOSX/solr/build/solr-core/test/J0/temp/solr.core.TestLazyCores_D843CCC45F2584AD-001/tempDir-002
   [junit4]   2> 1114545 INFO  (TEST-TestLazyCores.testBadConfigsGenerateErrors-seed#[D843CCC45F2584AD]) [    ] o.a.s.c.CorePropertiesLocator Cores are: [badConfig1, badConfig2, badSchema1, badSchema2, core1, core2]
   [junit4]   2> 1114569 INFO  (coreLoadExecutor-3847-thread-2) [    ] o.a.s.c.Config Ignoring exception matching \QSAXParseException\E
   [junit4]   2> 1114570 INFO  (coreLoadExecutor-3847-thread-1) [    ] o.a.s.c.Config Ignoring exception matching \QSAXParseException\E
   [junit4]   2> 1114570 ERROR (coreLoadExecutor-3847-thread-1) [    ] o.a.s.c.CoreContainer Error creating core [badConfig1]: Could not load conf for core badConfig1: Error loading solr config from /Users/jenkins/workspace/Lucene-Solr-6.x-MacOSX/solr/build/solr-core/test/J0/temp/solr.core.TestLazyCores_D843CCC45F2584AD-001/tempDir-002/badConfig1/conf/solrconfig.xml
   [junit4]   2> org.apache.solr.common.SolrException: Could not load conf for core badConfig1: Error loading solr config from /Users/jenkins/workspace/Lucene-Solr-6.x-MacOSX/solr/build/solr-core/test/J0/temp/solr.core.TestLazyCores_D843CCC45F2584AD-001/tempDir-002/badConfig1/conf/solrconfig.xml
   [junit4]   2> 	at org.apache.solr.core.ConfigSetService.getConfig(ConfigSetService.java:85)
   [junit4]   2> 	at org.apache.solr.core.CoreContainer.create(CoreContainer.java:840)
   [junit4]   2> 	at org.apache.solr.core.CoreContainer.lambda$load$0(CoreContainer.java:498)
   [junit4]   2> 	at java.util.concurrent.FutureTask.run(FutureTask.java:266)
   [junit4]   2> 	at org.apache.solr.common.util.ExecutorUtil$MDCAwareThreadPoolExecutor.lambda$execute$0(ExecutorUtil.java:229)
   [junit4]   2> 	at java.util.concurrent.ThreadPoolExecutor.runWorker(ThreadPoolExecutor.java:1142)
   [junit4]   2> 	at java.util.concurrent.ThreadPoolExecutor$Worker.run(ThreadPoolExecutor.java:617)
   [junit4]   2> 	at java.lang.Thread.run(Thread.java:745)
   [junit4]   2> Caused by: org.apache.solr.common.SolrException: Error loading solr config from /Users/jenkins/workspace/Lucene-Solr-6.x-MacOSX/solr/build/solr-core/test/J0/temp/solr.core.TestLazyCores_D843CCC45F2584AD-001/tempDir-002/badConfig1/conf/solrconfig.xml
   [junit4]   2> 	at org.apache.solr.core.SolrConfig.readFromResourceLoader(SolrConfig.java:187)
   [junit4]   2> 	at org.apache.solr.core.ConfigSetService.createSolrConfig(ConfigSetService.java:97)
   [junit4]   2> 	at org.apache.solr.core.ConfigSetService.getConfig(ConfigSetService.java:77)
   [junit4]   2> 	... 7 more
   [junit4]   2> Caused by: org.apache.solr.common.SolrException: org.xml.sax.SAXParseException; systemId: solrres:/solrconfig.xml; lineNumber: 56; columnNumber: 5; Il tipo di elemento "reqsthalr" deve terminare con la corrispondente tag finale "</reqsthalr>".
   [junit4]   2> 	at org.apache.solr.core.Config.<init>(Config.java:154)
   [junit4]   2> 	at org.apache.solr.core.Config.<init>(Config.java:90)
   [junit4]   2> 	at org.apache.solr.core.SolrConfig.<init>(SolrConfig.java:202)
   [junit4]   2> 	at org.apache.solr.core.SolrConfig.readFromResourceLoader(SolrConfig.java:179)
   [junit4]   2> 	... 9 more
   [junit4]   2> Caused by: org.xml.sax.SAXParseException; systemId: solrres:/solrconfig.xml; lineNumber: 56; columnNumber: 5; Il tipo di elemento "reqsthalr" deve terminare con la corrispondente tag finale "</reqsthalr>".
   [junit4]   2> 	at com.sun.org.apache.xerces.internal.util.ErrorHandlerWrapper.createSAXParseException(ErrorHandlerWrapper.java:203)
   [junit4]   2> 	at com.sun.org.apache.xerces.internal.util.ErrorHandlerWrapper.fatalError(ErrorHandlerWrapper.java:177)
   [junit4]   2> 	at com.sun.org.apache.xerces.internal.impl.XMLErrorReporter.reportError(XMLErrorReporter.java:400)
   [junit4]   2> 	at com.sun.org.apache.xerces.internal.impl.XMLErrorReporter.reportError(XMLErrorReporter.java:327)
   [junit4]   2> 	at com.sun.org.apache.xerces.internal.impl.XMLScanner.reportFatalError(XMLScanner.java:1472)
   [junit4]   2> 	at com.sun.org.apache.xerces.internal.impl.XMLDocumentFragmentScannerImpl.scanEndElement(XMLDocumentFragmentScannerImpl.java:1749)
   [junit4]   2> 	at com.sun.org.apache.xerces.internal.impl.XMLDocumentFragmentScannerImpl$FragmentContentDriver.next(XMLDocumentFragmentScannerImpl.java:2967)
   [junit4]   2> 	at com.sun.org.apache.xerces.internal.impl.XMLDocumentScannerImpl.next(XMLDocumentScannerImpl.java:602)
   [junit4]   2> 	at com.sun.org.apache.xerces.internal.impl.XMLNSDocumentScannerImpl.next(XMLNSDocumentScannerImpl.java:112)
   [junit4]   2> 	at com.sun.org.apache.xerces.internal.impl.XMLDocumentFragmentScannerImpl.scanDocument(XMLDocumentFragmentScannerImpl.java:505)
   [junit4]   2> 	at com.sun.org.apache.xerces.internal.parsers.XML11Configuration.parse(XML11Configuration.java:841)
   [junit4]   2> 	at com.sun.org.apache.xerces.internal.parsers.XML11Configuration.parse(XML11Configuration.java:770)
   [junit4]   2> 	at com.sun.org.apache.xerces.internal.parsers.XMLParser.parse(XMLParser.java:141)
   [junit4]   2> 	at com.sun.org.apache.xerces.internal.parsers.DOMParser.parse(DOMParser.java:243)
   [junit4]   2> 	at com.sun.org.apache.xerces.internal.jaxp.DocumentBuilderImpl.parse(DocumentBuilderImpl.java:339)
   [junit4]   2> 	at org.apache.solr.core.Config.<init>(Config.java:143)
   [junit4]   2> 	... 12 more
   [junit4]   2> 1114574 WARN  (coreLoadExecutor-3847-thread-3) [    ] o.a.s.c.Config Beginning with Solr 5.5, <mergePolicy> is deprecated, use <mergePolicyFactory> instead.
   [junit4]   2> 1114575 INFO  (coreLoadExecutor-3847-thread-3) [    ] o.a.s.c.SolrConfig Using Lucene MatchVersion: 6.3.0
   [junit4]   2> 1114578 ERROR (coreLoadExecutor-3847-thread-2) [    ] o.a.s.c.CoreContainer Error creating core [badConfig2]: Could not load conf for core badConfig2: Error loading solr config from /Users/jenkins/workspace/Lucene-Solr-6.x-MacOSX/solr/build/solr-core/test/J0/temp/solr.core.TestLazyCores_D843CCC45F2584AD-001/tempDir-002/badConfig2/conf/solrconfig.xml
   [junit4]   2> org.apache.solr.common.SolrException: Could not load conf for core badConfig2: Error loading solr config from /Users/jenkins/workspace/Lucene-Solr-6.x-MacOSX/solr/build/solr-core/test/J0/temp/solr.core.TestLazyCores_D843CCC45F2584AD-001/tempDir-002/badConfig2/conf/solrconfig.xml
   [junit4]   2> 	at org.apache.solr.core.ConfigSetService.getConfig(ConfigSetService.java:85)
   [junit4]   2> 	at org.apache.solr.core.CoreContainer.create(CoreContainer.java:840)
   [junit4]   2> 	at org.apache.solr.core.CoreContainer.lambda$load$0(CoreContainer.java:498)
   [junit4]   2> 	at java.util.concurrent.FutureTask.run(FutureTask.java:266)
   [junit4]   2> 	at org.apache.solr.common.util.ExecutorUtil$MDCAwareThreadPoolExecutor.lambda$execute$0(ExecutorUtil.java:229)
   [junit4]   2> 	at java.util.concurrent.ThreadPoolExecutor.runWorker(ThreadPoolExecutor.java:1142)
   [junit4]   2> 	at java.util.concurrent.ThreadPoolExecutor$Worker.run(ThreadPoolExecutor.java:617)
   [junit4]   2> 	at java.lang.Thread.run(Thread.java:745)
   [junit4]   2> Caused by: org.apache.solr.common.SolrException: Error loading solr config from /Users/jenkins/workspace/Lucene-Solr-6.x-MacOSX/solr/build/solr-core/test/J0/temp/solr.core.TestLazyCores_D843CCC45F2584AD-001/tempDir-002/badConfig2/conf/solrconfig.xml
   [junit4]   2> 	at org.apache.solr.core.SolrConfig.readFromResourceLoader(SolrConfig.java:187)
   [junit4]   2> 	at org.apache.solr.core.ConfigSetService.createSolrConfig(ConfigSetService.java:97)
   [junit4]   2> 	at org.apache.solr.core.ConfigSetService.getConfig(ConfigSetService.java:77)
   [junit4]   2> 	... 7 more
   [junit4]   2> Caused by: org.apache.solr.common.SolrException: org.xml.sax.SAXParseException; systemId: solrres:/solrconfig.xml; lineNumber: 56; columnNumber: 5; Il tipo di elemento "reqsthalr" deve terminare con la corrispondente tag finale "</reqsthalr>".
   [junit4]   2> 	at org.apache.solr.core.Config.<init>(Config.java:154)
   [junit4]   2> 	at org.apache.solr.core.Config.<init>(Config.java:90)
   [junit4]   2> 	at org.apache.solr.core.SolrConfig.<init>(SolrConfig.java:202)
   [junit4]   2> 	at org.apache.solr.core.SolrConfig.readFromResourceLoader(SolrConfig.java:179)
   [junit4]   2> 	... 9 more
   [junit4]   2> Caused by: org.xml.sax.SAXParseException; systemId: solrres:/solrconfig.xml; lineNumber: 56; columnNumber: 5; Il tipo di elemento "reqsthalr" deve terminare con la corrispondente tag finale "</reqsthalr>".
   [junit4]   2> 	at com.sun.org.apache.xerces.internal.util.ErrorHandlerWrapper.createSAXParseException(ErrorHandlerWrapper.java:203)
   [junit4]   2> 	at com.sun.org.apache.xerces.internal.util.ErrorHandlerWrapper.fatalError(ErrorHandlerWrapper.java:177)
   [junit4]   2> 	at com.sun.org.apache.xerces.internal.impl.XMLErrorReporter.reportError(XMLErrorReporter.java:400)
   [junit4]   2> 	at com.sun.org.apache.xerces.internal.impl.XMLErrorReporter.reportError(XMLErrorReporter.java:327)
   [junit4]   2> 	at com.sun.org.apache.xerces.internal.impl.XMLScanner.reportFatalError(XMLScanner.java:1472)
   [junit4]   2> 	at com.sun.org.apache.xerces.internal.impl.XMLDocumentFragmentScannerImpl.scanEndElement(XMLDocumentFragmentScannerImpl.java:1749)
   [junit4]   2> 	at com.sun.org.apache.xerces.internal.impl.XMLDocumentFragmentScannerImpl$FragmentContentDriver.next(XMLDocumentFragmentScannerImpl.java:2967)
   [junit4]   2> 	at com.sun.org.apache.xerces.internal.impl.XMLDocumentScannerImpl.next(XMLDocumentScannerImpl.java:602)
   [junit4]   2> 	at com.sun.org.apache.xerces.internal.impl.XMLNSDocumentScannerImpl.next(XMLNSDocumentScannerImpl.java:112)
   [junit4]   2> 	at com.sun.org.apache.xerces.internal.impl.XMLDocumentFragmentScannerImpl.scanDocument(XMLDocumentFragmentScannerImpl.java:505)
   [junit4]   2> 	at com.sun.org.apache.xerces.internal.parsers.XML11Configuration.parse(XML11Configuration.java:841)
   [junit4]   2> 	at com.sun.org.apache.xerces.internal.parsers.XML11Configuration.parse(XML11Configuration.java:770)
   [junit4]   2> 	at com.sun.org.apache.xerces.internal.parsers.XMLParser.parse(XMLParser.java:141)
   [junit4]   2> 	at com.sun.org.apache.xerces.internal.parsers.DOMParser.parse(DOMParser.java:243)
   [junit4]   2> 	at com.sun.org.apache.xerces.internal.jaxp.DocumentBuilderImpl.parse(DocumentBuilderImpl.java:339)
   [junit4]   2> 	at org.apache.solr.core.Config.<init>(Config.java:143)
   [junit4]   2> 	... 12 more
   [junit4]   2> 1114585 INFO  (coreLoadExecutor-3847-thread-3) [    ] o.a.s.c.Config Ignoring exception matching \QSAXParseException\E
   [junit4]   2> 1114586 ERROR (coreLoadExecutor-3847-thread-3) [    ] o.a.s.c.CoreContainer Error creating core [badSchema1]: Could not load conf for core badSchema1: Can't load schema /Users/jenkins/workspace/Lucene-Solr-6.x-MacOSX/solr/build/solr-core/test/J0/temp/solr.core.TestLazyCores_D843CCC45F2584AD-001/tempDir-002/badSchema1/conf/schema.xml: org.xml.sax.SAXParseException; systemId: solrres:/schema.xml; lineNumber: 34; columnNumber: 5; Il tipo di elemento "filedType" deve terminare con la corrispondente tag finale "</filedType>".
   [junit4]   2> org.apache.solr.common.SolrException: Could not load conf for core badSchema1: Can't load schema /Users/jenkins/workspace/Lucene-Solr-6.x-MacOSX/solr/build/solr-core/test/J0/temp/solr.core.TestLazyCores_D843CCC45F2584AD-001/tempDir-002/badSchema1/conf/schema.xml: org.xml.sax.SAXParseException; systemId: solrres:/schema.xml; lineNumber: 34; columnNumber: 5; Il tipo di elemento "filedType" deve terminare con la corrispondente tag finale "</filedType>".
   [junit4]   2> 	at org.apache.solr.core.ConfigSetService.getConfig(ConfigSetService.java:85)
   [junit4]   2> 	at org.apache.solr.core.CoreContainer.create(CoreContainer.java:840)
   [junit4]   2> 	at org.apache.solr.core.CoreContainer.lambda$load$0(CoreContainer.java:498)
   [junit4]   2> 	at java.util.concurrent.FutureTask.run(FutureTask.java:266)
   [junit4]   2> 	at org.apache.solr.common.util.ExecutorUtil$MDCAwareThreadPoolExecutor.lambda$execute$0(ExecutorUtil.java:229)
   [junit4]   2> 	at java.util.concurrent.ThreadPoolExecutor.runWorker(ThreadPoolExecutor.java:1142)
   [junit4]   2> 	at java.util.concurrent.ThreadPoolExecutor$Worker.run(ThreadPoolExecutor.java:617)
   [junit4]   2> 	at java.lang.Thread.run(Thread.java:745)
   [junit4]   2> Caused by: org.apache.solr.common.SolrException: Can't load schema /Users/jenkins/workspace/Lucene-Solr-6.x-MacOSX/solr/build/solr-core/test/J0/temp/solr.core.TestLazyCores_D843CCC45F2584AD-001/tempDir-002/badSchema1/conf/schema.xml: org.xml.sax.SAXParseException; systemId: solrres:/schema.xml; lineNumber: 34; columnNumber: 5; Il tipo di elemento "filedType" deve terminare con la corrispondente tag finale "</filedType>".
   [junit4]   2> 	at org.apache.solr.schema.IndexSchema.readSchema(IndexSchema.java:598)
   [junit4]   2> 	at org.apache.solr.schema.IndexSchema.<init>(IndexSchema.java:183)
   [junit4]   2> 	at org.apache.solr.schema.IndexSchemaFactory.create(IndexSchemaFactory.java:56)
   [junit4]   2> 	at org.apache.solr.schema.IndexSchemaFactory.buildIndexSchema(IndexSchemaFactory.java:75)
   [junit4]   2> 	at org.apache.solr.core.ConfigSetService.createIndexSchema(ConfigSetService.java:107)
   [junit4]   2> 	at org.apache.solr.core.ConfigSetService.getConfig(ConfigSetService.java:78)
   [junit4]   2> 	... 7 more
   [junit4]   2> Caused by: org.apache.solr.common.SolrException: org.xml.sax.SAXParseException; systemId: solrres:/schema.xml; lineNumber: 34; columnNumber: 5; Il tipo di elemento "filedType" deve terminare con la corrispondente tag finale "</filedType>".
   [junit4]   2> 	at org.apache.solr.core.Config.<init>(Config.java:154)
   [junit4]   2> 	at org.apache.solr.core.Config.<init>(Config.java:90)
   [junit4]   2> 	at org.apache.solr.schema.IndexSchema.readSchema(IndexSchema.java:460)
   [junit4]   2> 	... 12 more
   [junit4]   2> Caused by: org.xml.sax.SAXParseException; systemId: solrres:/schema.xml; lineNumber: 34; columnNumber: 5; Il tipo di elemento "filedType" deve terminare con la corrispondente tag finale "</filedType>".
   [junit4]   2> 	at com.sun.org.apache.xerces.internal.util.ErrorHandlerWrapper.createSAXParseException(ErrorHandlerWrapper.java:203)
   [junit4]   2> 	at com.sun.org.apache.xerces.internal.util.ErrorHandlerWrapper.fatalError(ErrorHandlerWrapper.java:177)
   [junit4]   2> 	at com.sun.org.apache.xerces.internal.impl.XMLErrorReporter.reportError(XMLErrorReporter.java:400)
   [junit4]   2> 	at com.sun.org.apache.xerces.internal.impl.XMLErrorReporter.reportError(XMLErrorReporter.java:327)
   [junit4]   2> 	at com.sun.org.apache.xerces.internal.impl.XMLScanner.reportFatalError(XMLScanner.java:1472)
   [junit4]   2> 	at com.sun.org.apache.xerces.internal.impl.XMLDocumentFragmentScannerImpl.scanEndElement(XMLDocumentFragmentScannerImpl.java:1749)
   [junit4]   2> 	at com.sun.org.apache.xerces.internal.impl.XMLDocumentFragmentScannerImpl$FragmentContentDriver.next(XMLDocumentFragmentScannerImpl.java:2967)
   [junit4]   2> 	at com.sun.org.apache.xerces.internal.impl.XMLDocumentScannerImpl.next(XMLDocumentScannerImpl.java:602)
   [junit4]   2> 	at com.sun.org.apache.xerces.internal.impl.XMLNSDocumentScannerImpl.next(XMLNSDocumentScannerImpl.java:112)
   [junit4]   2> 	at com.sun.org.apache.xerces.internal.impl.XMLDocumentFragmentScannerImpl.scanDocument(XMLDocumentFragmentScannerImpl.java:505)
   [junit4]   2> 	at com.sun.org.apache.xerces.internal.parsers.XML11Configuration.parse(XML11Configuration.java:841)
   [junit4]   2> 	at com.sun.org.apache.xerces.internal.parsers.XML11Configuration.parse(XML11Configuration.java:770)
   [junit4]   2> 	at com.sun.org.apache.xerces.internal.parsers.XMLParser.parse(XMLParser.java:141)
   [junit4]   2> 	at com.sun.org.apache.xerces.internal.parsers.DOMParser.parse(DOMParser.java:243)
   [junit4]   2> 	at com.sun.org.apache.xerces.internal.jaxp.DocumentBuilderImpl.parse(DocumentBuilderImpl.java:339)
   [junit4]   2> 	at org.apache.solr.core.Config.<init>(Config.java:143)
   [junit4]   2> 	... 14 more
   [junit4]   2> 1114598 WARN  (coreLoadExecutor-3847-thread-3) [    ] o.a.s.c.Config Beginning with Solr 5.5, <mergePolicy> is deprecated, use <mergePolicyFactory> instead.
   [junit4]   2> 1114599 INFO  (coreLoadExecutor-3847-thread-3) [    ] o.a.s.c.SolrConfig Using Lucene MatchVersion: 6.3.0
   [junit4]   2> 1114603 WARN  (coreLoadExecutor-3847-thread-2) [    ] o.a.s.c.Config Beginning with Solr 5.5, <mergePolicy> is deprecated, use <mergePolicyFactory> instead.
   [junit4]   2> 1114604 INFO  (coreLoadExecutor-3847-thread-2) [    ] o.a.s.c.SolrConfig Using Lucene MatchVersion: 6.3.0
   [junit4]   2> 1114605 WARN  (coreLoadExecutor-3847-thread-1) [    ] o.a.s.c.Config Beginning with Solr 5.5, <mergePolicy> is deprecated, use <mergePolicyFactory> instead.
   [junit4]   2> 1114605 INFO  (coreLoadExecutor-3847-thread-1) [    ] o.a.s.c.SolrConfig Using Lucene MatchVersion: 6.3.0
   [junit4]   2> 1114613 INFO  (coreLoadExecutor-3847-thread-1) [    ] o.a.s.c.Config Ignoring exception matching \QSAXParseException\E
   [junit4]   2> 1114614 ERROR (coreLoadExecutor-3847-thread-1) [    ] o.a.s.c.CoreContainer Error creating core [badSchema2]: Could not load conf for core badSchema2: Can't load schema /Users/jenkins/workspace/Lucene-Solr-6.x-MacOSX/solr/build/solr-core/test/J0/temp/solr.core.TestLazyCores_D843CCC45F2584AD-001/tempDir-002/badSchema2/conf/schema.xml: org.xml.sax.SAXParseException; systemId: solrres:/schema.xml; lineNumber: 34; columnNumber: 5; Il tipo di elemento "filedType" deve terminare con la corrispondente tag finale "</filedType>".
   [junit4]   2> org.apache.solr.common.SolrException: Could not load conf for core badSchema2: Can't load schema /Users/jenkins/workspace/Lucene-Solr-6.x-MacOSX/solr/build/solr-core/test/J0/temp/solr.core.TestLazyCores_D843CCC45F2584AD-001/tempDir-002/badSchema2/conf/schema.xml: org.xml.sax.SAXParseException; systemId: solrres:/schema.xml; lineNumber: 34; columnNumber: 5; Il tipo di elemento "filedType" deve terminare con la corrispondente tag finale "</filedType>".
   [junit4]   2> 	at org.apache.solr.core.ConfigSetService.getConfig(ConfigSetService.java:85)
   [junit4]   2> 	at org.apache.solr.core.CoreContainer.create(CoreContainer.java:840)
   [junit4]   2> 	at org.apache.solr.core.CoreContainer.lambda$load$0(CoreContainer.java:498)
   [junit4]   2> 	at java.util.concurrent.FutureTask.run(FutureTask.java:266)
   [junit4]   2> 	at org.apache.solr.common.util.ExecutorUtil$MDCAwareThreadPoolExecutor.lambda$execute$0(ExecutorUtil.java:229)
   [junit4]   2> 	at java.util.concurrent.ThreadPoolExecutor.runWorker(ThreadPoolExecutor.java:1142)
   [junit4]   2> 	at java.util.concurrent.ThreadPoolExecutor$Worker.run(ThreadPoolExecutor.java:617)
   [junit4]   2> 	at java.lang.Thread.run(Thread.java:745)
   [junit4]   2> Caused by: org.apache.solr.common.SolrException: Can't load schema /Users/jenkins/workspace/Lucene-Solr-6.x-MacOSX/solr/build/solr-core/test/J0/temp/solr.core.TestLazyCores_D843CCC45F2584AD-001/tempDir-002/badSchema2/conf/schema.xml: org.xml.sax.SAXParseException; systemId: solrres:/schema.xml; lineNumber: 34; columnNumber: 5; Il tipo di elemento "filedType" deve terminare con la corrispondente tag finale "</filedType>".
   [junit4]   2> 	at org.apache.solr.schema.IndexSchema.readSchema(IndexSchema.java:598)
   [junit4]   2> 	at org.apache.solr.schema.IndexSchema.<init>(IndexSchema.java:183)
   [junit4]   2> 	at org.apache.solr.schema.IndexSchemaFactory.create(IndexSchemaFactory.java:56)
   [junit4]   2> 	at org.apache.solr.schema.IndexSchemaFactory.buildIndexSchema(IndexSchemaFactory.java:75)
   [junit4]   2> 	at org.apache.solr.core.ConfigSetService.createIndexSchema(ConfigSetService.java:107)
   [junit4]   2> 	at org.apache.solr.core.ConfigSetService.getConfig(ConfigSetService.java:78)
   [junit4]   2> 	... 7 more
   [junit4]   2> Caused by: org.apache.solr.common.SolrException: org.xml.sax.SAXParseException; systemId: solrres:/schema.xml; lineNumber: 34; columnNumber: 5; Il tipo di elemento "filedType" deve terminare con la corrispondente tag finale "</filedType>".
   [junit4]   2> 	at org.apache.solr.core.Config.<init>(Config.java:154)
   [junit4]   2> 	at org.apache.solr.core.Config.<init>(Config.java:90)
   [junit4]   2> 	at org.apache.solr.schema.IndexSchema.readSchema(IndexSchema.java:460)
   [junit4]   2> 	... 12 more
   [junit4]   2> Caused by: org.xml.sax.SAXParseException; systemId: solrres:/schema.xml; lineNumber: 34; columnNumber: 5; Il tipo di elemento "filedType" deve terminare con la corrispondente tag finale "</filedType>".
   [junit4]   2> 	at com.sun.org.apache.xerces.internal.util.ErrorHandlerWrapper.createSAXParseException(ErrorHandlerWrapper.java:203)
   [junit4]   2> 	at com.sun.org.apache.xerces.internal.util.ErrorHandlerWrapper.fatalError(ErrorHandlerWrapper.java:177)
   [junit4]   2> 	at com.sun.org.apache.xerces.internal.impl.XMLErrorReporter.reportError(XMLErrorReporter.java:400)
   [junit4]   2> 	at com.sun.org.apache.xerces.internal.impl.XMLErrorReporter.reportError(XMLErrorReporter.java:327)
   [junit4]   2> 	at com.sun.org.apache.xerces.internal.impl.XMLScanner.reportFatalError(XMLScanner.java:1472)
   [junit4]   2> 	at com.sun.org.apache.xerces.internal.impl.XMLDocumentFragmentScannerImpl.scanEndElement(XMLDocumentFragmentScannerImpl.java:1749)
   [junit4]   2> 	at com.sun.org.apache.xerces.internal.impl.XMLDocumentFragmentScannerImpl$FragmentContentDriver.next(XMLDocumentFragmentScannerImpl.java:2967)
   [junit4]   2> 	at com.sun.org.apache.xerces.internal.impl.XMLDocumentScannerImpl.next(XMLDocumentScannerImpl.java:602)
   [junit4]   2> 	at com.sun.org.apache.xerces.internal.impl.XMLNSDocumentScannerImpl.next(XMLNSDocumentScannerImpl.java:112)
   [junit4]   2> 	at com.sun.org.apache.xerces.internal.impl.XMLDocumentFragmentScannerImpl.scanDocument(XMLDocumentFragmentScannerImpl.java:505)
   [junit4]   2> 	at com.sun.org.apache.xerces.internal.parsers.XML11Configuration.parse(XML11Configuration.java:841)
   [junit4]   2> 	at com.sun.org.apache.xerces.internal.parsers.XML11Configuration.parse(XML11Configuration.java:770)
   [junit4]   2> 	at com.sun.org.apache.xerces.internal.parsers.XMLParser.parse(XMLParser.java:141)
   [junit4]   2> 	at com.sun.org.apache.xerces.internal.parsers.DOMParser.parse(DOMParser.java:243)
   [junit4]   2> 	at com.sun.org.apache.xerces.internal.jaxp.DocumentBuilderImpl.parse(DocumentBuilderImpl.java:339)
   [junit4]   2> 	at org.apache.solr.core.Config.<init>(Config.java:143)
   [junit4]   2> 	... 14 more
   [junit4]   2> 1114615 INFO  (coreLoadExecutor-3847-thread-2) [    ] o.a.s.s.IndexSchema [core1] Schema name=tiny
   [junit4]   2> 1114618 INFO  (coreLoadExecutor-3847-thread-3) [    ] o.a.s.s.IndexSchema [core2] Schema name=tiny
   [junit4]   2> 1114634 INFO  (coreLoadExecutor-3847-thread-3) [    ] o.a.s.s.IndexSchema Loaded schema tiny/1.1 with uniqueid field id
   [junit4]   2> 1114635 INFO  (coreLoadExecutor-3847-thread-2) [    ] o.a.s.s.IndexSchema Loaded schema tiny/1.1 with uniqueid field id
   [junit4]   2> 1114640 INFO  (coreLoadExecutor-3847-thread-2) [    ] o.a.s.c.CoreContainer Creating SolrCore 'core1' using configuration from instancedir /Users/jenkins/workspace/Lucene-Solr-6.x-MacOSX/solr/build/solr-core/test/J0/temp/solr.core.TestLazyCores_D843CCC45F2584AD-001/tempDir-002/core1
   [junit4]   2> 1114641 INFO  (coreLoadExecutor-3847-thread-2) [    x:core1] o.a.s.c.SolrCore [[core1] ] Opening new SolrCore at [/Users/jenkins/workspace/Lucene-Solr-6.x-MacOSX/solr/build/solr-core/test/J0/temp/solr.core.TestLazyCores_D843CCC45F2584AD-001/tempDir-002/core1], dataDir=[/Users/jenkins/workspace/Lucene-Solr-6.x-MacOSX/solr/build/solr-core/test/J0/temp/solr.core.TestLazyCores_D843CCC45F2584AD-001/tempDir-002/core1/data/]
   [junit4]   2> 1114642 INFO  (coreLoadExecutor-3847-thread-3) [    ] o.a.s.c.CoreContainer Creating SolrCore 'core2' using configuration from instancedir /Users/jenkins/workspace/Lucene-Solr-6.x-MacOSX/solr/build/solr-core/test/J0/temp/solr.core.TestLazyCores_D843CCC45F2584AD-001/tempDir-002/core2
   [junit4]   2> 1114642 INFO  (coreLoadExecutor-3847-thread-3) [    x:core2] o.a.s.c.SolrCore [[core2] ] Opening new SolrCore at [/Users/jenkins/workspace/Lucene-Solr-6.x-MacOSX/solr/build/solr-core/test/J0/temp/solr.core.TestLazyCores_D843CCC45F2584AD-001/tempDir-002/core2], dataDir=[/Users/jenkins/workspace/Lucene-Solr-6.x-MacOSX/solr/build/solr-core/test/J0/temp/solr.core.TestLazyCores_D843CCC45F2584AD-001/tempDir-002/core2/data/]
   [junit4]   2> 1114652 INFO  (coreLoadExecutor-3847-thread-2) [    x:core1] o.a.s.u.RandomMergePolicy RandomMergePolicy wrapping class org.apache.lucene.index.LogDocMergePolicy: [LogDocMergePolicy: minMergeSize=1000, mergeFactor=17, maxMergeSize=9223372036854775807, maxMergeSizeForForcedMerge=9223372036854775807, calibrateSizeByDeletes=false, maxMergeDocs=2147483647, maxCFSSegmentSizeMB=8.796093022207999E12, noCFSRatio=0.5187594859640996]
   [junit4]   2> 1114653 INFO  (coreLoadExecutor-3847-thread-3) [    x:core2] o.a.s.u.RandomMergePolicy RandomMergePolicy wrapping class org.apache.lucene.index.LogDocMergePolicy: [LogDocMergePolicy: minMergeSize=1000, mergeFactor=17, maxMergeSize=9223372036854775807, maxMergeSizeForForcedMerge=9223372036854775807, calibrateSizeByDeletes=false, maxMergeDocs=2147483647, maxCFSSegmentSizeMB=8.796093022207999E12, noCFSRatio=0.5187594859640996]
   [junit4]   2> 1114673 INFO  (coreLoadExecutor-3847-thread-2) [    x:core1] o.a.s.u.CommitTracker Hard AutoCommit: disabled
   [junit4]   2> 1114674 INFO  (coreLoadExecutor-3847-thread-2) [    x:core1] o.a.s.u.CommitTracker Soft AutoCommit: disabled
   [junit4]   2> 1114687 INFO  (coreLoadExecutor-3847-thread-3) [    x:core2] o.a.s.u.CommitTracker Hard AutoCommit: disabled
   [junit4]   2> 1114687 INFO  (coreLoadExecutor-3847-thread-3) [    x:core2] o.a.s.u.CommitTracker Soft AutoCommit: disabled
   [junit4]   2> 1114696 INFO  (coreLoadExecutor-3847-thread-2) [    x:core1] o.a.s.u.RandomMergePolicy RandomMergePolicy wrapping class org.apache.lucene.index.LogDocMergePolicy: [LogDocMergePolicy: minMergeSize=1000, mergeFactor=13, maxMergeSize=9223372036854775807, maxMergeSizeForForcedMerge=9223372036854775807, calibrateSizeByDeletes=true, maxMergeDocs=2147483647, maxCFSSegmentSizeMB=8.796093022207999E12, noCFSRatio=1.0]
   [junit4]   2> 1114708 INFO  (coreLoadExecutor-3847-thread-3) [    x:core2] o.a.s.u.RandomMergePolicy RandomMergePolicy wrapping class org.apache.lucene.index.LogDocMergePolicy: [LogDocMergePolicy: minMergeSize=1000, mergeFactor=13, maxMergeSize=9223372036854775807, maxMergeSizeForForcedMerge=9223372036854775807, calibrateSizeByDeletes=true, maxMergeDocs=2147483647, maxCFSSegmentSizeMB=8.796093022207999E12, noCFSRatio=1.0]
   [junit4]   2> 1114720 INFO  (coreLoadExecutor-3847-thread-2) [    x:core1] o.a.s.s.SolrIndexSearcher Opening [Searcher@59f02b80[core1] main]
   [junit4]   2> 1114721 INFO  (coreLoadExecutor-3847-thread-2) [    x:core1] o.a.s.r.ManagedResourceStorage File-based storage initialized to use dir: /Users/jenkins/workspace/Lucene-Solr-6.x-MacOSX/solr/build/solr-core/test/J0/temp/solr.core.TestLazyCores_D843CCC45F2584AD-001/tempDir-002/core1/conf
   [junit4]   2> 1114722 INFO  (coreLoadExecutor-3847-thread-2) [    x:core1] o.a.s.h.ReplicationHandler Commits will be reserved for  10000
   [junit4]   2> 1114722 INFO  (searcherExecutor-3848-thread-1-processing-x:core1) [    x:core1] o.a.s.c.SolrCore [core1] Registered new searcher Searcher@59f02b80[core1] main{ExitableDirectoryReader(UninvertingDirectoryReader())}
   [junit4]   2> 1114725 INFO  (coreLoadExecutor-3847-thread-3) [    x:core2] o.a.s.s.SolrIndexSearcher Opening [Searcher@7f900905[core2] main]
   [junit4]   2> 1114725 INFO  (coreLoadExecutor-3847-thread-3) [    x:core2] o.a.s.r.ManagedResourceStorage File-based storage initialized to use dir: /Users/jenkins/workspace/Lucene-Solr-6.x-MacOSX/solr/build/solr-core/test/J0/temp/solr.core.TestLazyCores_D843CCC45F2584AD-001/tempDir-002/core2/conf
   [junit4]   2> 1114726 INFO  (coreLoadExecutor-3847-thread-3) [    x:core2] o.a.s.h.ReplicationHandler Commits will be reserved for  10000
   [junit4]   2> 1114726 INFO  (searcherExecutor-3849-thread-1-processing-x:core2) [    x:core2] o.a.s.c.SolrCore [core2] Registered new searcher Searcher@7f900905[core2] main{ExitableDirectoryReader(UninvertingDirectoryReader())}
   [junit4]   2> 1114740 INFO  (TEST-TestLazyCores.testBadConfigsGenerateErrors-seed#[D843CCC45F2584AD]) [    ] o.a.s.u.DirectUpdateHandler2 start commit{,optimize=false,openSearcher=true,waitSearcher=true,expungeDeletes=false,softCommit=false,prepareCommit=false}
   [junit4]   2> 1114741 INFO  (TEST-TestLazyCores.testBadConfigsGenerateErrors-seed#[D843CCC45F2584AD]) [    ] o.a.s.u.SolrIndexWriter Calling setCommitData with IW:org.apache.solr.update.SolrIndexWriter@6d00dde0
   [junit4]   2> 1114817 INFO  (TEST-TestLazyCores.testBadConfigsGenerateErrors-seed#[D843CCC45F2584AD]) [    ] o.a.s.s.SolrIndexSearcher Opening [Searcher@5569d89d[core1] main]
   [junit4]   2> 1114817 INFO  (searcherExecutor-3848-thread-1) [    ] o.a.s.c.SolrCore [core1] Registered new searcher Searcher@5569d89d[core1] main{ExitableDirectoryReader(UninvertingDirectoryReader(Uninverting(_0(6.3.0):c7)))}
   [junit4]   2> 1114817 INFO  (TEST-TestLazyCores.testBadConfigsGenerateErrors-seed#[D843CCC45F2584AD]) [    ] o.a.s.u.DirectUpdateHandler2 end_commit_flush
   [junit4]   2> 1114819 INFO  (TEST-TestLazyCores.testBadConfigsGenerateErrors-seed#[D843CCC45F2584AD]) [    ] o.a.s.c.S.Request [core1]  webapp=null path=null params={q={!prefix+f%3Dv_t}hel&wt=xml} hits=2 status=0 QTime=0
   [junit4]   2> 1114821 INFO  (TEST-TestLazyCores.testBadConfigsGenerateErrors-seed#[D843CCC45F2584AD]) [    ] o.a.s.c.S.Request [core1]  webapp=null path=null params={q={!raw+f%3Dv_t}hello&wt=xml} hits=2 status=0 QTime=0
   [junit4]   2> 1114822 INFO  (TEST-TestLazyCores.testBadConfigsGenerateErrors-seed#[D843CCC45F2584AD]) [    ] o.a.s.c.S.Request [core1]  webapp=null path=null params={q={!raw+f%3Dv_t}Hello&wt=xml} hits=0 status=0 QTime=0
   [junit4]   2> 1114823 INFO  (TEST-TestLazyCores.testBadConfigsGenerateErrors-seed#[D843CCC45F2584AD]) [    ] o.a.s.c.S.Request [core1]  webapp=null path=null params={q={!raw+f%3Dv_f}1.5&wt=xml} hits=0 status=0 QTime=0
   [junit4]   2> 1114876 WARN  (TEST-TestLazyCores.testBadConfigsGenerateErrors-seed#[D843CCC45F2584AD]) [    ] o.a.s.c.Config Beginning with Solr 5.5, <mergePolicy> is deprecated, use <mergePolicyFactory> instead.
   [junit4]   2> 1114876 INFO  (TEST-TestLazyCores.testBadConfigsGenerateErrors-seed#[D843CCC45F2584AD]) [    ] o.a.s.c.SolrConfig Using Lucene MatchVersion: 6.3.0
   [junit4]   2> 1114888 INFO  (TEST-TestLazyCores.testBadConfigsGenerateErrors-seed#[D843CCC45F2584AD]) [    ] o.a.s.s.IndexSchema [badConfig1] Schema name=tiny
   [junit4]   2> 1114898 INFO  (TEST-TestLazyCores.testBadConfigsGenerateErrors-seed#[D843CCC45F2584AD]) [    ] o.a.s.s.IndexSchema Loaded schema tiny/1.1 with uniqueid field id
   [junit4]   2> 1114902 INFO  (TEST-TestLazyCores.testBadConfigsGenerateErrors-seed#[D843CCC45F2584AD]) [    ] o.a.s.c.CoreContainer Creating SolrCore 'badConfig1' using configuration from instancedir /Users/jenkins/workspace/Lucene-Solr-6.x-MacOSX/solr/build/solr-core/test/J0/temp/solr.core.TestLazyCores_D843CCC45F2584AD-001/tempDir-002/badConfig1
   [junit4]   2> 1114902 INFO  (TEST-TestLazyCores.testBadConfigsGenerateErrors-seed#[D843CCC45F2584AD]) [    x:badConfig1] o.a.s.c.SolrCore [[badConfig1] ] Opening new SolrCore at [/Users/jenkins/workspace/Lucene-Solr-6.x-MacOSX/solr/build/solr-core/test/J0/temp/solr.core.TestLazyCores_D843CCC45F2584AD-001/tempDir-002/badConfig1], dataDir=[/Users/jenkins/workspace/Lucene-Solr-6.x-MacOSX/solr/build/solr-core/test/J0/temp/solr.core.TestLazyCores_D843CCC45F2584AD-001/tempDir-002/badConfig1/data/]
   [junit4]   2> 1114907 INFO  (TEST-TestLazyCores.testBadConfigsGenerateErrors-seed#[D843CCC45F2584AD]) [    x:badConfig1] o.a.s.u.RandomMergePolicy RandomMergePolicy wrapping class org.apache.lucene.index.LogByteSizeMergePolicy: [LogByteSizeMergePolicy: minMergeSize=1677721, mergeFactor=42, maxMergeSize=2147483648, maxMergeSizeForForcedMerge=9223372036854775807, calibrateSizeByDeletes=true, maxMergeDocs=2147483647, maxCFSSegmentSizeMB=8.796093022207999E12, noCFSRatio=0.0]
   [junit4]   2> 1114921 INFO  (TEST-TestLazyCores.testBadConfigsGenerateErrors-seed#[D843CCC45F2584AD]) [    x:badConfig1] o.a.s.u.CommitTracker Hard AutoCommit: disabled
   [junit4]   2> 1114921 INFO  (TEST-TestLazyCores.testBadConfigsGenerateErrors-seed#[D843CCC45F2584AD]) [    x:badConfig1] o.a.s.u.CommitTracker Soft AutoCommit: disabled
   [junit4]   2> 1114921 INFO  (TEST-TestLazyCores.testBadConfigsGenerateErrors-seed#[D843CCC45F2584AD]) [    x:badConfig1] o.a.s.u.RandomMergePolicy RandomMergePolicy wrapping class org.apache.lucene.index.AlcoholicMergePolicy: [AlcoholicMergePolicy: minMergeSize=0, mergeFactor=10, maxMergeSize=701966985, maxMergeSizeForForcedMerge=9223372036854775807, calibrateSizeByDeletes=true, maxMergeDocs=2147483647, maxCFSSegmentSizeMB=8.796093022207999E12, noCFSRatio=0.1]
   [junit4]   2> 1114925 INFO  (TEST-TestLazyCores.testBadConfigsGenerateErrors-seed#[D843CCC45F2584AD]) [    x:badConfig1] o.a.s.s.SolrIndexSearcher Opening [Searcher@3cb50eb0[badConfig1] main]
   [junit4]   2> 1114927 INFO  (TEST-TestLazyCores.testBadConfigsGenerateErrors-seed#[D843CCC45F2584AD]) [    x:badConfig1] o.a.s.r.ManagedResourceStorage File-based storage initialized to use dir: /Users/jenkins/workspace/Lucene-Solr-6.x-MacOSX/solr/build/solr-core/test/J0/temp/solr.core.TestLazyCores_D843CCC45F2584AD-001/tempDir-002/badConfig1/conf
   [junit4]   2> 1114929 INFO  (TEST-TestLazyCores.testBadConfigsGenerateErrors-seed#[D843CCC45F2584AD]) [    x:badConfig1] o.a.s.h.ReplicationHandler Commits will be reserved for  10000
   [junit4]   2> 1114929 INFO  (searcherExecutor-3862-thread-1-processing-x:badConfig1) [    x:badConfig1] o.a.s.c.SolrCore [badConfig1] Registered new searcher Searcher@3cb50eb0[badConfig1] main{ExitableDirectoryReader(UninvertingDirectoryReader())}
   [junit4]   2> 1114931 INFO  (TEST-TestLazyCores.testBadConfigsGenerateErrors-seed#[D843CCC45F2584AD]) [    x:badConfig1] o.a.s.c.SolrCores Opening transient core badConfig1
   [junit4]   2> 1114943 WARN  (TEST-TestLazyCores.testBadConfigsGenerateErrors-seed#[D843CCC45F2584AD]) [    x:badConfig1] o.a.s.c.Config Beginning with Solr 5.5, <mergePolicy> is deprecated, use <mergePolicyFactory> instead.
   [junit4]   2> 1114944 INFO  (TEST-TestLazyCores.testBadConfigsGenerateErrors-seed#[D843CCC45F2584AD]) [    x:badConfig1] o.a.s.c.SolrConfig Using Lucene MatchVersion: 6.3.0
   [junit4]   2> 1114954 INFO  (TEST-TestLazyCores.testBadConfigsGenerateErrors-seed#[D843CCC45F2584AD]) [    x:badConfig1] o.a.s.s.IndexSchema [badConfig2] Schema name=tiny
   [junit4]   2> 1114959 INFO  (TEST-TestLazyCores.testBadConfigsGenerateErrors-seed#[D843CCC45F2584AD]) [    x:badConfig1] o.a.s.s.IndexSchema Loaded schema tiny/1.1 with uniqueid field id
   [junit4]   2> 1114966 INFO  (TEST-TestLazyCores.testBadConfigsGenerateErrors-seed#[D843CCC45F2584AD]) [    x:badConfig1] o.a.s.c.CoreContainer Creating SolrCore 'badConfig2' using configuration from instancedir /Users/jenkins/workspace/Lucene-Solr-6.x-MacOSX/solr/build/solr-core/test/J0/temp/solr.core.TestLazyCores_D843CCC45F2584AD-001/tempDir-002/badConfig2
   [junit4]   2> 1114966 INFO  (TEST-TestLazyCores.testBadConfigsGenerateErrors-seed#[D843CCC45F2584AD]) [    x:badConfig2] o.a.s.c.SolrCore [[badConfig2] ] Opening new SolrCore at [/Users/jenkins/workspace/Lucene-Solr-6.x-MacOSX/solr/build/solr-core/test/J0/temp/solr.core.TestLazyCores_D843CCC45F2584AD-001/tempDir-002/badConfig2], dataDir=[/Users/jenkins/workspace/Lucene-Solr-6.x-MacOSX/solr/build/solr-core/test/J0/temp/solr.core.TestLazyCores_D843CCC45F2584AD-001/tempDir-002/badConfig2/data/]
   [junit4]   2> 1114968 INFO  (TEST-TestLazyCores.testBadConfigsGenerateErrors-seed#[D843CCC45F2584AD]) [    x:badConfig2] o.a.s.u.RandomMergePolicy RandomMergePolicy wrapping class org.apache.lucene.index.LogDocMergePolicy: [LogDocMergePolicy: minMergeSize=1000, mergeFactor=25, maxMergeSize=9223372036854775807, maxMergeSizeForForcedMerge=9223372036854775807, calibrateSizeByDeletes=false, maxMergeDocs=2147483647, maxCFSSegmentSizeMB=8.796093022207999E12, noCFSRatio=1.0]
   [junit4]   2> 1114992 INFO  (TEST-TestLazyCores.testBadConfigsGenerateErrors-seed#[D843CCC45F2584AD]) [    x:badConfig2] o.a.s.u.CommitTracker Hard AutoCommit: disabled
   [junit4]   2> 1114992 INFO  (TEST-TestLazyCores.testBadConfigsGenerateErrors-seed#[D843CCC45F2584AD]) [    x:badConfig2] o.a.s.u.CommitTracker Soft AutoCommit: disabled
   [junit4]   2> 1114997 INFO  (TEST-TestLazyCores.testBadConfigsGenerateErrors-seed#[D843CCC45F2584AD]) [    x:badConfig2] o.a.s.u.RandomMergePolicy RandomMergePolicy wrapping class org.apache.lucene.index.TieredMergePolicy: [TieredMergePolicy: maxMergeAtOnce=45, maxMergeAtOnceExplicit=25, maxMergedSegmentMB=27.99609375, floorSegmentMB=0.765625, forceMergeDeletesPctAllowed=14.2024879323649, segmentsPerTier=33.0, maxCFSSegmentSizeMB=8.796093022207999E12, noCFSRatio=0.38135309849921706
   [junit4]   2> 1114997 INFO  (TEST-TestLazyCores.testBadConfigsGenerateErrors-seed#[D843CCC45F2584AD]) [    x:badConfig2] o.a.s.s.SolrIndexSearcher Opening [Searcher@1dcf609a[badConfig2] main]
   [junit4]   2> 1114999 INFO  (TEST-TestLazyCores.testBadConfigsGenerateErrors-seed#[D843CCC45F2584AD]) [    x:badConfig2] o.a.s.r.ManagedResourceStorage File-based storage initialized to use dir: /Users/jenkins/workspace/Lucene-Solr-6.x-MacOSX/solr/build/solr-core/test/J0/temp/solr.core.TestLazyCores_D843CCC45F2584AD-001/tempDir-002/badConfig2/conf
   [junit4]   2> 1115003 INFO  (TEST-TestLazyCores.testBadConfigsGenerateErrors-seed#[D843CCC45F2584AD]) [    x:badConfig2] o.a.s.h.ReplicationHandler Commits will be reserved for  10000
   [junit4]   2> 1115003 INFO  (searcherExecutor-3866-thread-1-processing-x:badConfig2) [    x:badConfig2] o.a.s.c.SolrCore [badConfig2] Registered new searcher Searcher@1dcf609a[badConfig2] main{ExitableDirectoryReader(UninvertingDirectoryReader())}
   [junit4]   2> 1115003 INFO  (TEST-TestLazyCores.testBadConfigsGenerateErrors-seed#[D843CCC45F2584AD]) [    x:badConfig2] o.a.s.c.SolrCores Opening transient core badConfig2
   [junit4]   2> 1115015 WARN  (TEST-TestLazyCores.testBadConfigsGenerateErrors-seed#[D843CCC45F2584AD]) [    x:badConfig2] o.a.s.c.Config Beginning with Solr 5.5, <mergePolicy> is deprecated, use <mergePolicyFactory> instead.
   [junit4]   2> 1115016 INFO  (TEST-TestLazyCores.testBadConfigsGenerateErrors-seed#[D843CCC45F2584AD]) [    x:badConfig2] o.a.s.c.SolrConfig Using Lucene MatchVersion: 6.3.0
   [junit4]   2> 1115026 INFO  (TEST-TestLazyCores.testBadConfigsGenerateErrors-seed#[D843CCC45F2584AD]) [    x:badConfig2] o.a.s.s.IndexSchema [badSchema1] Schema name=tiny
   [junit4]   2> 1115029 INFO  (TEST-TestLazyCores.testBadConfigsGenerateErrors-seed#[D843CCC45F2584AD]) [    x:badConfig2] o.a.s.s.IndexSchema Loaded schema tiny/1.1 with uniqueid field id
   [junit4]   2> 1115032 INFO  (TEST-TestLazyCores.testBadConfigsGenerateErrors-seed#[D843CCC45F2584AD]) [    x:badConfig2] o.a.s.c.CoreContainer Creating SolrCore 'badSchema1' using configuration from instancedir /Users/jenkins/workspace/Lucene-Solr-6.x-MacOSX/solr/build/solr-core/test/J0/temp/solr.core.TestLazyCores_D843CCC45F2584AD-001/tempDir-002/badSchema1
   [junit4]   2> 1115033 INFO  (TEST-TestLazyCores.testBadConfigsGenerateErrors-seed#[D843CCC45F2584AD]) [    x:badSchema1] o.a.s.c.SolrCore [[badSchema1] ] Opening new SolrCore at [/Users/jenkins/workspace/Lucene-Solr-6.x-MacOSX/solr/build/solr-core/test/J0/temp/solr.core.TestLazyCores_D843CCC45F2584AD-001/tempDir-002/badSchema1], dataDir=[/Users/jenkins/workspace/Lucene-Solr-6.x-MacOSX/solr/build/solr-core/test/J0/temp/solr.core.TestLazyCores_D843CCC45F2584AD-001/tempDir-002/badSchema1/data/]
   [junit4]   2> 1115038 INFO  (TEST-TestLazyCores.testBadConfigsGenerateErrors-seed#[D843CCC45F2584AD]) [    x:badSchema1] o.a.s.u.RandomMergePolicy RandomMergePolicy wrapping class org.apache.lucene.index.AlcoholicMergePolicy: [AlcoholicMergePolicy: minMergeSize=0, mergeFactor=10, maxMergeSize=1554530831, maxMergeSizeForForcedMerge=9223372036854775807, calibrateSizeByDeletes=true, maxMergeDocs=2147483647, maxCFSSegmentSizeMB=8.796093022207999E12, noCFSRatio=0.1]
   [junit4]   2> 1115059 INFO  (TEST-TestLazyCores.testBadConfigsGenerateErrors-seed#[D843CCC45F2584AD]) [    x:badSchema1] o.a.s.u.CommitTracker Hard AutoCommit: disabled
   [junit4]   2> 1115059 INFO  (TEST-TestLazyCores.testBadConfigsGenerateErrors-seed#[D843CCC45F2584AD]) [    x:badSchema1] o.a.s.u.CommitTracker Soft AutoCommit: disabled
   [junit4]   2> 1115060 INFO  (TEST-TestLazyCores.testBadConfigsGenerateErrors-seed#[D843CCC45F2584AD]) [    x:badSchema1] o.a.s.u.RandomMergePolicy RandomMergePolicy wrapping class org.apache.lucene.index.LogByteSizeMergePolicy: [LogByteSizeMergePolicy: minMergeSize=1677721, mergeFactor=24, maxMergeSize=2147483648, maxMergeSizeForForcedMerge=9223372036854775807, calibrateSizeByDeletes=false, maxMergeDocs=2147483647, maxCFSSegmentSizeMB=8.796093022207999E12, noCFSRatio=0.0]
   [junit4]   2> 1115060 INFO  (TEST-TestLazyCores.testBadConfigsGenerateErrors-seed#[D843CCC45F2584AD]) [    x:badSchema1] o.a.s.s.SolrIndexSearcher Opening [Searcher@5fada1dd[badSchema1] main]
   [junit4]   2> 1115061 INFO  (TEST-TestLazyCores.testBadConfigsGenerateErrors-seed#[D843CCC45F2584AD]) [    x:badSchema1] o.a.s.r.ManagedResourceStorage File-based storage initialized to use dir: /Users/jenkins/workspace/Lucene-Solr-6.x-MacOSX/solr/build/solr-core/test/J0/temp/solr.core.TestLazyCores_D843CCC45F2584AD-001/tempDir-002/badSchema1/conf
   [junit4]   2> 1115061 INFO  (TEST-TestLazyCores.testBadConfigsGenerateErrors-seed#[D843CCC45F2584AD]) [    x:badSchema1] o.a.s.h.ReplicationHandler Commits will be reserved for  10000
   [junit4]   2> 1115062 INFO  (searcherExecutor-3870-thread-1-processing-x:badSchema1) [    x:badSchema1] o.a.s.c.SolrCore [badSchema1] Registered new searcher Searcher@5fada1dd[badSchema1] main{ExitableDirectoryReader(UninvertingDirectoryReader())}
   [junit4]   2> 1115062 INFO  (TEST-TestLazyCores.testBadConfigsGenerateErrors-seed#[D843CCC45F2584AD]) [    x:badSchema1] o.a.s.c.SolrCores Opening transient core badSchema1
   [junit4]   2> 1115086 WARN  (TEST-TestLazyCores.testBadConfigsGenerateErrors-seed#[D843CCC45F2584AD]) [    x:badSchema1] o.a.s.c.Config Beginning with Solr 5.5, <mergePolicy> is deprecated, use <mergePolicyFactory> instead.
   [junit4]   2> 1115087 INFO  (TEST-TestLazyCores.testBadConfigsGenerateErrors-seed#[D843CCC45F2584AD]) [    x:badSchema1] o.a.s.c.SolrConfig Using Lucene MatchVersion: 6.3.0
   [junit4]   2> 1115098 INFO  (TEST-TestLazyCores.testBadConfigsGenerateErrors-seed#[D843CCC45F2584AD]) [    x:badSchema1] o.a.s.s.IndexSchema [badSchema2] Schema name=tiny
   [junit4]   2> 1115102 INFO  (TEST-TestLazyCores.testBadConfigsGenerateErrors-seed#[D843CCC45F2584AD]) [    x:badSchema1] o.a.s.s.IndexSchema Loaded schema tiny/1.1 with uniqueid field id
   [junit4]   2> 1115105 INFO  (TEST-TestLazyCores.testBadConfigsGenerateErrors-seed#[D843CCC45F2584AD]) [    x:badSchema1] o.a.s.c.CoreContainer Creating SolrCore 'badSchema2' using configuration from instancedir /Users/jenkins/workspace/Lucene-Solr-6.x-MacOSX/solr/build/solr-core/test/J0/temp/solr.core.TestLazyCores_D843CCC45F2584AD-001/tempDir-002/badSchema2
   [junit4]   2> 1115106 INFO  (TEST-TestLazyCores.testBadConfigsGenerateErrors-seed#[D843CCC45F2584AD]) [    x:badSchema2] o.a.s.c.SolrCore [[badSchema2] ] Opening new SolrCore at [/Users/jenkins/workspace/Lucene-Solr-6.x-MacOSX/solr/build/solr-core/test/J0/temp/solr.core.TestLazyCores_D843CCC45F2584AD-001/tempDir-002/badSchema2], dataDir=[/Users/jenkins/workspace/Lucene-Solr-6.x-MacOSX/solr/build/solr-core/test/J0/temp/solr.core.TestLazyCores_D843CCC45F2584AD-001/tempDir-002/badSchema2/data/]
   [junit4]   2> 1115109 INFO  (TEST-TestLazyCores.testBadConfigsGenerateErrors-seed#[D843CCC45F2584AD]) [    x:badSchema2] o.a.s.u.RandomMergePolicy RandomMergePolicy wrapping class org.apache.lucene.index.LogDocMergePolicy: [LogDocMergePolicy: minMergeSize=1000, mergeFactor=14, maxMergeSize=9223372036854775807, maxMergeSizeForForcedMerge=9223372036854775807, calibrateSizeByDeletes=true, maxMergeDocs=2147483647, maxCFSSegmentSizeMB=8.796093022207999E12, noCFSRatio=0.4104901121477432]
   [junit4]   2> 1115125 INFO  (TEST-TestLazyCores.testBadConfigsGenerateErrors-seed#[D843CCC45F2584AD]) [    x:badSchema2] o.a.s.u.CommitTracker Hard AutoCommit: disabled
   [junit4]   2> 1115125 INFO  (TEST-TestLazyCores.testBadConfigsGenerateErrors-seed#[D843CCC45F2584AD]) [    x:badSchema2] o.a.s.u.CommitTracker Soft AutoCommit: disabled
   [junit4]   2> 1115126 INFO  (TEST-TestLazyCores.testBadConfigsGenerateErrors-seed#[D843CCC45F2584AD]) [    x:badSchema2] o.a.s.u.RandomMergePolicy RandomMergePolicy wrapping class org.apache.lucene.index.TieredMergePolicy: [TieredMergePolicy: maxMergeAtOnce=43, maxMergeAtOnceExplicit=32, maxMergedSegmentMB=44.576171875, floorSegmentMB=0.2177734375, forceMergeDeletesPctAllowed=25.987861117365856, segmentsPerTier=48.0, maxCFSSegmentSizeMB=8.796093022207999E12, noCFSRatio=0.0
   [junit4]   2> 1115126 INFO  (TEST-TestLazyCores.testBadConfigsGenerateErrors-seed#[D843CCC45F2584AD]) [    x:badSchema2] o.a.s.s.SolrIndexSearcher Opening [Searcher@25d20bf3[badSchema2] main]
   [junit4]   2> 1115132 INFO  (TEST-TestLazyCores.testBadConfigsGenerateErrors-seed#[D843CCC45F2584AD]) [    x:badSchema2] o.a.s.r.ManagedResourceStorage File-based storage initialized to use dir: /Users/jenkins/workspace/Lucene-Solr-6.x-MacOSX/solr/build/solr-core/test/J0/temp/solr.core.TestLazyCores_D843CCC45F2584AD-001/tempDir-002/badSchema2/conf
   [junit4]   2> 1115133 INFO  (TEST-TestLazyCores.testBadConfigsGenerateErrors-seed#[D843CCC45F2584AD]) [    x:badSchema2] o.a.s.h.ReplicationHandler Commits will be reserved for  10000
   [junit4]   2> 1115137 INFO  (searcherExecutor-3874-thread-1-processing-x:badSchema2) [    x:badSchema2] o.a.s.c.SolrCore [badSchema2] Registered new searcher Searcher@25d20bf3[badSchema2] main{ExitableDirectoryReader(UninvertingDirectoryReader())}
   [junit4]   2> 1115137 INFO  (TEST-TestLazyCores.testBadConfigsGenerateErrors-seed#[D843CCC45F2584AD]) [    x:badSchema2] o.a.s.c.SolrCores Opening transient core badSchema2
   [junit4]   2> 1115142 INFO  (TEST-TestLazyCores.testBadConfigsGenerateErrors-seed#[D843CCC45F2584AD]) [    x:badSchema2] o.a.s.u.DirectUpdateHandler2 start commit{,optimize=false,openSearcher=true,waitSearcher=true,expungeDeletes=false,softCommit=false,prepareCommit=false}
   [junit4]   2> 1115142 INFO  (TEST-TestLazyCores.testBadConfigsGenerateErrors-seed#[D843CCC45F2584AD]) [    x:badSchema2] o.a.s.u.SolrIndexWriter Calling setCommitData with IW:org.apache.solr.update.SolrIndexWriter@6d00dde0
   [junit4]   2> 1115245 INFO  (TEST-TestLazyCores.testBadConfigsGenerateErrors-seed#[D843CCC45F2584AD]) [    x:badSchema2] o.a.s.s.SolrIndexSearcher Opening [Searcher@3191a7d4[core1] main]
   [junit4]   2> 1115245 INFO  (TEST-TestLazyCores.testBadConfigsGenerateErrors-seed#[D843CCC45F2584AD]) [    x:badSchema2] o.a.s.u.DirectUpdateHandler2 end_commit_flush
   [junit4]   2> 1115245 INFO  (searcherExecutor-3848-thread-1-processing-x:badSchema2) [    x:badSchema2] o.a.s.c.SolrCore [core1] Registered new searcher Searcher@3191a7d4[core1] main{ExitableDirectoryReader(UninvertingDirectoryReader(Uninverting(_1(6.3.0):c7)))}
   [junit4]   2> 1115263 INFO  (TEST-TestLazyCores.testBadConfigsGenerateErrors-seed#[D843CCC45F2584AD]) [    x:badSchema2] o.a.s.c.S.Request [core1]  webapp=null path=null params={q={!prefix+f%3Dv_t}hel&wt=xml} hits=2 status=0 QTime=0
   [junit4]   2> 1115264 INFO  (TEST-TestLazyCores.testBadConfigsGenerateErrors-seed#[D843CCC45F2584AD]) [    x:badSchema2] o.a.s.c.S.Request [core1]  webapp=null path=null params={q={!raw+f%3Dv_t}hello&wt=xml} hits=2 status=0 QTime=0
   [junit4]   2> 1115264 INFO  (TEST-TestLazyCores.testBadConfigsGenerateErrors-seed#[D843CCC45F2584AD]) [    x:badSchema2] o.a.s.c.S.Request [core1]  webapp=null path=null params={q={!raw+f%3Dv_t}Hello&wt=xml} hits=0 status=0 QTime=0
   [junit4]   2> 1115264 INFO  (TEST-TestLazyCores.testBadConfigsGenerateErrors-seed#[D843CCC45F2584AD]) [    x:badSchema2] o.a.s.c.S.Request [core1]  webapp=null path=null params={q={!raw+f%3Dv_f}1.5&wt=xml} hits=0 status=0 QTime=0
   [junit4]   2> 1115282 INFO  (TEST-TestLazyCores.testBadConfigsGenerateErrors-seed#[D843CCC45F2584AD]) [    x:badSchema2] o.a.s.u.DirectUpdateHandler2 start commit{,optimize=false,openSearcher=true,waitSearcher=true,expungeDeletes=false,softCommit=false,prepareCommit=false}
   [junit4]   2> 1115283 INFO  (TEST-TestLazyCores.testBadConfigsGenerateErrors-seed#[D843CCC45F2584AD]) [    x:badSchema2] o.a.s.u.SolrIndexWriter Calling setCommitData with IW:org.apache.solr.update.SolrIndexWriter@1e622168
   [junit4]   2> 1115469 INFO  (TEST-TestLazyCores.testBadConfigsGenerateErrors-seed#[D843CCC45F2584AD]) [    x:badSchema2] o.a.s.s.SolrIndexSearcher Opening [Searcher@444a65c0[badConfig1] main]
   [junit4]   2> 1115469 INFO  (TEST-TestLazyCores.testBadConfigsGenerateErrors-seed#[D843CCC45F2584AD]) [    x:badSchema2] o.a.s.u.DirectUpdateHandler2 end_commit_flush
   [junit4]   2> 1115469 INFO  (searcherExecutor-3862-thread-1-processing-x:badSchema2) [    x:badSchema2] o.a.s.c.SolrCore [badConfig1] Registered new searcher Searcher@444a65c0[badConfig1] main{ExitableDirectoryReader(UninvertingDirectoryReader(Uninverting(_0(6.3.0):c7)))}
   [junit4]   2> 1115470 INFO  (TEST-TestLazyCores.testBadConfigsGenerateErrors-seed#[D843CCC45F2584AD]) [    x:badSchema2] o.a.s.c.S.Request [badConfig1]  webapp=null path=null params={q={!prefix+f%3Dv_t}hel&wt=xml} hits=2 status=0 QTime=0
   [junit4]   2> 1115470 INFO  (TEST-TestLazyCores.testBadConfigsGenerateErrors-seed#[D843CCC45F2584AD]) [    x:badSchema2] o.a.s.c.S.Request [badConfig1]  webapp=null path=null params={q={!raw+f%3Dv_t}hello&wt=xml} hits=2 status=0 QTime=0
   [junit4]   2> 1115471 INFO  (TEST-TestLazyCores.testBadConfigsGenerateErrors-seed#[D843CCC45F2584AD]) [    x:badSchema2] o.a.s.c.S.Request [badConfig1]  webapp=null path=null params={q={!raw+f%3Dv_t}Hello&wt=xml} hits=0 status=0 QTime=0
   [junit4]   2> 1115471 INFO  (TEST-TestLazyCores.testBadConfigsGenerateErrors-seed#[D843CCC45F2584AD]) [    x:badSchema2] o.a.s.c.S.Request [badConfig1]  webapp=null path=null params={q={!raw+f%3Dv_f}1.5&wt=xml} hits=0 status=0 QTime=0
   [junit4]   2> 1115472 INFO  (TEST-TestLazyCores.testBadConfigsGenerateErrors-seed#[D843CCC45F2584AD]) [    x:badSchema2] o.a.s.u.DirectUpdateHandler2 start commit{,optimize=false,openSearcher=true,waitSearcher=true,expungeDeletes=false,softCommit=false,prepareCommit=false}
   [junit4]   2> 1115472 INFO  (TEST-TestLazyCores.testBadConfigsGenerateErrors-seed#[D843CCC45F2584AD]) [    x:badSchema2] o.a.s.u.SolrIndexWriter Calling setCommitData with IW:org.apache.solr.update.SolrIndexWriter@c800bef
   [junit4]   2> 1115475 INFO  (TEST-TestLazyCores.testBadConfigsGenerateErrors-seed#[D843CCC45F2584AD]) [    x:badSchema2] o.a.s.s.SolrIndexSearcher Opening [Searcher@6f44568b[badSchema1] main]
   [junit4]   2> 1115476 INFO  (TEST-TestLazyCores.testBadConfigsGenerateErrors-seed#[D843CCC45F2584AD]) [    x:badSchema2] o.a.s.u.DirectUpdateHandler2 end_commit_flush
   [junit4]   2> 1115476 INFO  (searcherExecutor-3870-thread-1-processing-x:badSchema2) [    x:badSchema2] o.a.s.c.SolrCore [badSchema1] Registered new searcher Searcher@6f44568b[badSchema1] main{ExitableDirectoryReader(UninvertingDirectoryReader(Uninverting(_0(6.3.0):c7)))}
   [junit4]   2> 1115476 INFO  (TEST-TestLazyCores.testBadConfigsGenerateErrors-seed#[D843CCC45F2584AD]) [    x:badSchema2] o.a.s.c.S.Request [badSchema1]  webapp=null path=null params={q={!prefix+f%3Dv_t}hel&wt=xml} hits=2 status=0 QTime=0
   [junit4]   2> 1115477 INFO  (TEST-TestLazyCores.testBadConfigsGenerateErrors-seed#[D843CCC45F2584AD]) [    x:badSchema2] o.a.s.c.S.Request [badSchema1]  webapp=null path=null params={q={!raw+f%3Dv_t}hello&wt=xml} hits=2 status=0 QTime=0
   [junit4]   2> 1115477 INFO  (TEST-TestLazyCores.testBadConfigsGenerateErrors-seed#[D843CCC45F2584AD]) [    x:badSchema2] o.a.s.c.S.Request [badSchema1]  webapp=null path=null params={q={!raw+f%3Dv_t}Hello&wt=xml} hits=0 status=0 QTime=0
   [junit4]   2> 1115478 INFO  (TEST-TestLazyCores.testBadConfigsGenerateErrors-seed#[D843CCC45F2584AD]) [    x:badSchema2] o.a.s.c.S.Request [badSchema1]  webapp=null path=null params={q={!raw+f%3Dv_f}1.5&wt=xml} hits=0 status=0 QTime=0
   [junit4]   2> 1115478 INFO  (TEST-TestLazyCores.testBadConfigsGenerateErrors-seed#[D843CCC45F2584AD]) [    x:badSchema2] o.a.s.c.CoreContainer Shutting down CoreContainer instance=1811059557
   [junit4]   2> 1115479 INFO  (coreCloseExecutor-3884-thread-1-processing-x:badSchema2) [    x:core1] o.a.s.c.SolrCore [core1]  CLOSING SolrCore org.apache.solr.core.SolrCore@78efe69d
   [junit4]   2> 1115481 INFO  (coreCloseExecutor-3884-thread-2-processing-x:badSchema2) [    x:core2] o.a.s.c.SolrCore [core2]  CLOSING SolrCore org.apache.solr.core.SolrCore@2f465e01
   [junit4]   2> 1115481 INFO  (coreCloseExecutor-3884-thread-3-processing-x:badSchema2) [    x:badConfig1] o.a.s.c.SolrCore [badConfig1]  CLOSING SolrCore org.apache.solr.core.SolrCore@39ed47ab
   [junit4]   2> 1115483 INFO  (coreCloseExecutor-3884-thread-4-processing-x:badSchema2) [    x:badConfig2] o.a.s.c.SolrCore [badConfig2]  CLOSING SolrCore org.apache.solr.core.SolrCore@298b3dad
   [junit4]   2> 1115483 INFO  (coreCloseExecutor-3884-thread-5-processing-x:badSchema2) [    x:badSchema1] o.a.s.c.SolrCore [badSchema1]  CLOSING SolrCore org.apache.solr.core.SolrCore@76be1b9a
   [junit4]   2> 1115492 INFO  (coreCloseExecutor-3884-thread-6-processing-x:badSchema2) [    x:badSchema2] o.a.s.c.SolrCore [badSchema2]  CLOSING SolrCore org.apache.solr.core.SolrCore@373e18b5
   [junit4]   2> 1115494 INFO  (TEST-TestLazyCores.testBadConfigsGenerateErrors-seed#[D843CCC45F2584AD]) [    x:badSchema2] o.a.s.SolrTestCaseJ4 ###Ending testBadConfigsGenerateErrors
   [junit4]   2> 1115496 INFO  (TEST-TestLazyCores.testCreateTransientFromAdmin-seed#[D843CCC45F2584AD]) [    x:badSchema2] o.a.s.SolrTestCaseJ4 ###Starting testCreateTransientFromAdmin
   [junit4]   2> 1115558 INFO  (TEST-TestLazyCores.testCreateTransientFromAdmin-seed#[D843CCC45F2584AD]) [    x:badSchema2] o.a.s.u.UpdateShardHandler Creating UpdateShardHandler HTTP client with params: socketTimeout=600000&connTimeout=60000&retry=true
   [junit4]   2> 1115561 INFO  (TEST-TestLazyCores.testCreateTransientFromAdmin-seed#[D843CCC45F2584AD]) [    x:badSchema2] o.a.s.c.SolrCores Allocating transient cache for 4 transient cores
   [junit4]   2> 1115593 WARN  (coreLoadExecutor-3891-thread-1-processing-x:badSchema2) [    x:badSchema2] o.a.s.c.Config Beginning with Solr 5.5, <mergePolicy> is deprecated, use <mergePolicyFactory> instead.
   [junit4]   2> 1115594 INFO  (coreLoadExecutor-3891-thread-1-processing-x:badSchema2) [    x:badSchema2] o.a.s.c.SolrConfig Using Lucene MatchVersion: 6.3.0
   [junit4]   2> 1115595 WARN  (coreLoadExecutor-3891-thread-2-processing-x:badSchema2) [    x:badSchema2] o.a.s.c.Config Beginning with Solr 5.5, <mergePolicy> is deprecated, use <mergePolicyFactory> instead.
   [junit4]   2> 1115596 WARN  (coreLoadExecutor-3891-thread-3-processing-x:badSchema2) [    x:badSchema2] o.a.s.c.Config Beginning with Solr 5.5, <mergePolicy> is deprecated, use <mergePolicyFactory> instead.
   [junit4]   2> 1115596 INFO  (coreLoadExecutor-3891-thread-2-processing-x:badSchema2) [    x:badSchema2] o.a.s.c.SolrConfig Using Lucene MatchVersion: 6.3.0
   [junit4]   2> 1115596 INFO  (coreLoadExecutor-3891-thread-3-processing-x:badSchema2) [    x:badSchema2] o.a.s.c.SolrConfig Using Lucene MatchVersion: 6.3.0
   [junit4]   2> 1115605 INFO  (coreLoadExecutor-3891-thread-1-processing-x:badSchema2) [    x:badSchema2] o.a.s.s.IndexSchema [collection1] Schema name=tiny
   [junit4]   2> 1115607 INFO  (coreLoadExecutor-3891-thread-3-processing-x:badSchema2) [    x:badSchema2] o.a.s.s.IndexSchema [collection5] Schema name=tiny
   [junit4]   2> 1115607 INFO  (coreLoadExecutor-3891-thread-2-processing-x:badSchema2) [    x:badSchema2] o.a.s.s.IndexSchema [collection2] Schema name=tiny
   [junit4]   2> 1115628 INFO  (coreLoadExecutor-3891-thread-2-processing-x:badSchema2) [    x:badSchema2] o.a.s.s.IndexSchema Loaded schema tiny/1.1 with uniqueid field id
   [junit4]   2> 1115628 INFO  (coreLoadExecutor-3891-thread-1-processing-x:badSchema2) [    x:badSchema2] o.a.s.s.IndexSchema Loaded schema tiny/1.1 with uniqueid field id
   [junit4]   2> 1115628 INFO  (coreLoadExecutor-3891-thread-3-processing-x:badSchema2) [    x:badSchema2] o.a.s.s.IndexSchema Loaded schema tiny/1.1 with uniqueid field id
   [junit4]   2> 1115644 INFO  (coreLoadExecutor-3891-thread-1-processing-x:badSchema2) [    x:badSchema2] o.a.s.c.CoreContainer Creating SolrCore 'collection1' using configuration from instancedir /Users/jenkins/workspace/Lucene-Solr-6.x-MacOSX/solr/build/solr-core/test/J0/temp/solr.core.TestLazyCores_D843CCC45F2584AD-001/tempDir-003/collection1
   [junit4]   2> 1115644 INFO  (coreLoadExecutor-3891-thread-2-processing-x:badSchema2) [    x:badSchema2] o.a.s.c.CoreContainer Creating SolrCore 'collection2' usin

[...truncated too long message...]

eting, DocValuesTest, StatelessScriptUpdateProcessorFactoryTest, TestGeoJSONResponseWriter, TestReplicationHandlerBackup, RulesTest, TestBM25SimilarityFactory, PingRequestHandlerTest, TestRawResponseWriter, TestConfigSetsAPIExclusivity, TestCorePropertiesReload, DistributedSuggestComponentTest, TestFieldResource, SimpleCollectionCreateDeleteTest, HighlighterMaxOffsetTest, BasicDistributedZkTest, NumericFieldsTest, TestScoreJoinQPScore, TestFastOutputStream, ParsingFieldUpdateProcessorsTest, TestCollectionAPI, CdcrReplicationDistributedZkTest, HdfsUnloadDistributedZkTest, DistributedSpellCheckComponentTest, TestBinaryResponseWriter, TestDefaultSearchFieldResource, TestBinaryField, SyncSliceTest, OverriddenZkACLAndCredentialsProvidersTest, TolerantUpdateProcessorTest, SortSpecParsingTest, HdfsThreadLeakTest, TestManagedSynonymFilterFactory, TestLocalFSCloudBackupRestore, TestJsonFacets, TestSolrCloudWithKerberosAlt, TestUpdate, TestNumericTerms32, TriLevelCompositeIdRoutingTest, TestStressReorder, RemoteQueryErrorTest, TestDefaultStatsCache, TestSubQueryTransformerCrossCore, StandardRequestHandlerTest, BJQParserTest, SynonymTokenizerTest, TestLazyCores]
   [junit4]   2> NOTE: reproduce with: ant test  -Dtestcase=TestLazyCores -Dtests.seed=D843CCC45F2584AD -Dtests.slow=true -Dtests.locale=it -Dtests.timezone=Europe/Nicosia -Dtests.asserts=true -Dtests.file.encoding=UTF-8
   [junit4] ERROR   0.00s J0 | TestLazyCores (suite) <<<
   [junit4]    > Throwable #1: java.lang.AssertionError: ObjectTracker found 5 object(s) that were not released!!! [SolrCore, MDCAwareThreadPoolExecutor, MockDirectoryWrapper, MockDirectoryWrapper, MockDirectoryWrapper]
   [junit4]    > org.apache.solr.common.util.ObjectReleaseTracker$ObjectTrackerException
   [junit4]    > 	at org.apache.solr.common.util.ObjectReleaseTracker.track(ObjectReleaseTracker.java:43)
   [junit4]    > 	at org.apache.solr.core.SolrCore.<init>(SolrCore.java:940)
   [junit4]    > 	at org.apache.solr.core.SolrCore.<init>(SolrCore.java:776)
   [junit4]    > 	at org.apache.solr.core.CoreContainer.create(CoreContainer.java:842)
   [junit4]    > 	at org.apache.solr.core.CoreContainer.lambda$load$0(CoreContainer.java:498)
   [junit4]    > 	at java.util.concurrent.FutureTask.run(FutureTask.java:266)
   [junit4]    > 	at org.apache.solr.common.util.ExecutorUtil$MDCAwareThreadPoolExecutor.lambda$execute$0(ExecutorUtil.java:229)
   [junit4]    > 	at java.util.concurrent.ThreadPoolExecutor.runWorker(ThreadPoolExecutor.java:1142)
   [junit4]    > 	at java.util.concurrent.ThreadPoolExecutor$Worker.run(ThreadPoolExecutor.java:617)
   [junit4]    > 	at java.lang.Thread.run(Thread.java:745)
   [junit4]    > org.apache.solr.common.util.ObjectReleaseTracker$ObjectTrackerException
   [junit4]    > 	at org.apache.solr.common.util.ObjectReleaseTracker.track(ObjectReleaseTracker.java:43)
   [junit4]    > 	at org.apache.solr.core.SolrCore.<init>(SolrCore.java:799)
   [junit4]    > 	at org.apache.solr.core.SolrCore.<init>(SolrCore.java:776)
   [junit4]    > 	at org.apache.solr.core.CoreContainer.create(CoreContainer.java:842)
   [junit4]    > 	at org.apache.solr.core.CoreContainer.lambda$load$0(CoreContainer.java:498)
   [junit4]    > 	at java.util.concurrent.FutureTask.run(FutureTask.java:266)
   [junit4]    > 	at org.apache.solr.common.util.ExecutorUtil$MDCAwareThreadPoolExecutor.lambda$execute$0(ExecutorUtil.java:229)
   [junit4]    > 	at java.util.concurrent.ThreadPoolExecutor.runWorker(ThreadPoolExecutor.java:1142)
   [junit4]    > 	at java.util.concurrent.ThreadPoolExecutor$Worker.run(ThreadPoolExecutor.java:617)
   [junit4]    > 	at java.lang.Thread.run(Thread.java:745)
   [junit4]    > org.apache.solr.common.util.ObjectReleaseTracker$ObjectTrackerException
   [junit4]    > 	at org.apache.solr.common.util.ObjectReleaseTracker.track(ObjectReleaseTracker.java:43)
   [junit4]    > 	at org.apache.solr.core.CachingDirectoryFactory.get(CachingDirectoryFactory.java:347)
   [junit4]    > 	at org.apache.solr.core.SolrCore.getNewIndexDir(SolrCore.java:333)
   [junit4]    > 	at org.apache.solr.core.SolrCore.initIndex(SolrCore.java:642)
   [junit4]    > 	at org.apache.solr.core.SolrCore.<init>(SolrCore.java:850)
   [junit4]    > 	at org.apache.solr.core.SolrCore.<init>(SolrCore.java:776)
   [junit4]    > 	at org.apache.solr.core.CoreContainer.create(CoreContainer.java:842)
   [junit4]    > 	at org.apache.solr.core.CoreContainer.lambda$load$0(CoreContainer.java:498)
   [junit4]    > 	at java.util.concurrent.FutureTask.run(FutureTask.java:266)
   [junit4]    > 	at org.apache.solr.common.util.ExecutorUtil$MDCAwareThreadPoolExecutor.lambda$execute$0(ExecutorUtil.java:229)
   [junit4]    > 	at java.util.concurrent.ThreadPoolExecutor.runWorker(ThreadPoolExecutor.java:1142)
   [junit4]    > 	at java.util.concurrent.ThreadPoolExecutor$Worker.run(ThreadPoolExecutor.java:617)
   [junit4]    > 	at java.lang.Thread.run(Thread.java:745)
   [junit4]    > org.apache.solr.common.util.ObjectReleaseTracker$ObjectTrackerException
   [junit4]    > 	at org.apache.solr.common.util.ObjectReleaseTracker.track(ObjectReleaseTracker.java:43)
   [junit4]    > 	at org.apache.solr.core.CachingDirectoryFactory.get(CachingDirectoryFactory.java:347)
   [junit4]    > 	at org.apache.solr.core.SolrCore.initSnapshotMetaDataManager(SolrCore.java:435)
   [junit4]    > 	at org.apache.solr.core.SolrCore.<init>(SolrCore.java:844)
   [junit4]    > 	at org.apache.solr.core.SolrCore.<init>(SolrCore.java:776)
   [junit4]    > 	at org.apache.solr.core.CoreContainer.create(CoreContainer.java:842)
   [junit4]    > 	at org.apache.solr.core.CoreContainer.lambda$load$0(CoreContainer.java:498)
   [junit4]    > 	at java.util.concurrent.FutureTask.run(FutureTask.java:266)
   [junit4]    > 	at org.apache.solr.common.util.ExecutorUtil$MDCAwareThreadPoolExecutor.lambda$execute$0(ExecutorUtil.java:229)
   [junit4]    > 	at java.util.concurrent.ThreadPoolExecutor.runWorker(ThreadPoolExecutor.java:1142)
   [junit4]    > 	at java.util.concurrent.ThreadPoolExecutor$Worker.run(ThreadPoolExecutor.java:617)
   [junit4]    > 	at java.lang.Thread.run(Thread.java:745)
   [junit4]    > org.apache.solr.common.util.ObjectReleaseTracker$ObjectTrackerException
   [junit4]    > 	at org.apache.solr.common.util.ObjectReleaseTracker.track(ObjectReleaseTracker.java:43)
   [junit4]    > 	at org.apache.solr.core.CachingDirectoryFactory.get(CachingDirectoryFactory.java:347)
   [junit4]    > 	at org.apache.solr.update.SolrIndexWriter.create(SolrIndexWriter.java:66)
   [junit4]    > 	at org.apache.solr.core.SolrCore.initIndex(SolrCore.java:674)
   [junit4]    > 	at org.apache.solr.core.SolrCore.<init>(SolrCore.java:850)
   [junit4]    > 	at org.apache.solr.core.SolrCore.<init>(SolrCore.java:776)
   [junit4]    > 	at org.apache.solr.core.CoreContainer.create(CoreContainer.java:842)
   [junit4]    > 	at org.apache.solr.core.CoreContainer.lambda$load$0(CoreContainer.java:498)
   [junit4]    > 	at java.util.concurrent.FutureTask.run(FutureTask.java:266)
   [junit4]    > 	at org.apache.solr.common.util.ExecutorUtil$MDCAwareThreadPoolExecutor.lambda$execute$0(ExecutorUtil.java:229)
   [junit4]    > 	at java.util.concurrent.ThreadPoolExecutor.runWorker(ThreadPoolExecutor.java:1142)
   [junit4]    > 	at java.util.concurrent.ThreadPoolExecutor$Worker.run(ThreadPoolExecutor.java:617)
   [junit4]    > 	at java.lang.Thread.run(Thread.java:745)
   [junit4]    > 	at __randomizedtesting.SeedInfo.seed([D843CCC45F2584AD]:0)
   [junit4]    > 	at org.apache.solr.SolrTestCaseJ4.teardownTestCases(SolrTestCaseJ4.java:261)
   [junit4]    > 	at java.lang.Thread.run(Thread.java:745)Throwable #2: com.carrotsearch.randomizedtesting.ThreadLeakError: 1 thread leaked from SUITE scope at org.apache.solr.core.TestLazyCores: 
   [junit4]    >    1) Thread[id=7216, name=searcherExecutor-3964-thread-1, state=WAITING, group=TGRP-TestLazyCores]
   [junit4]    >         at sun.misc.Unsafe.park(Native Method)
   [junit4]    >         at java.util.concurrent.locks.LockSupport.park(LockSupport.java:175)
   [junit4]    >         at java.util.concurrent.locks.AbstractQueuedSynchronizer$ConditionObject.await(AbstractQueuedSynchronizer.java:2039)
   [junit4]    >         at java.util.concurrent.LinkedBlockingQueue.take(LinkedBlockingQueue.java:442)
   [junit4]    >         at java.util.concurrent.ThreadPoolExecutor.getTask(ThreadPoolExecutor.java:1067)
   [junit4]    >         at java.util.concurrent.ThreadPoolExecutor.runWorker(ThreadPoolExecutor.java:1127)
   [junit4]    >         at java.util.concurrent.ThreadPoolExecutor$Worker.run(ThreadPoolExecutor.java:617)
   [junit4]    >         at java.lang.Thread.run(Thread.java:745)
   [junit4]    > 	at __randomizedtesting.SeedInfo.seed([D843CCC45F2584AD]:0)Throwable #3: com.carrotsearch.randomizedtesting.ThreadLeakError: There are still zombie threads that couldn't be terminated:
   [junit4]    >    1) Thread[id=7216, name=searcherExecutor-3964-thread-1, state=WAITING, group=TGRP-TestLazyCores]
   [junit4]    >         at sun.misc.Unsafe.park(Native Method)
   [junit4]    >         at java.util.concurrent.locks.LockSupport.park(LockSupport.java:175)
   [junit4]    >         at java.util.concurrent.locks.AbstractQueuedSynchronizer$ConditionObject.await(AbstractQueuedSynchronizer.java:2039)
   [junit4]    >         at java.util.concurrent.LinkedBlockingQueue.take(LinkedBlockingQueue.java:442)
   [junit4]    >         at java.util.concurrent.ThreadPoolExecutor.getTask(ThreadPoolExecutor.java:1067)
   [junit4]    >         at java.util.concurrent.ThreadPoolExecutor.runWorker(ThreadPoolExecutor.java:1127)
   [junit4]    >         at java.util.concurrent.ThreadPoolExecutor$Worker.run(ThreadPoolExecutor.java:617)
   [junit4]    >         at java.lang.Thread.run(Thread.java:745)
   [junit4]    > 	at __randomizedtesting.SeedInfo.seed([D843CCC45F2584AD]:0)
   [junit4] Completed [225/646 (1!)] on J0 in 184.47s, 8 tests, 1 failure, 2 errors <<< FAILURES!

[...truncated 61731 lines...]


Mime
View raw message