lucene-dev mailing list archives

Site index · List index
Message view « Date » · « Thread »
Top « Date » · « Thread »
From Policeman Jenkins Server <jenk...@thetaphi.de>
Subject [JENKINS] Lucene-Solr-6.x-Windows (64bit/jdk1.8.0_102) - Build # 533 - Unstable!
Date Sun, 23 Oct 2016 15:17:42 GMT
Build: https://jenkins.thetaphi.de/job/Lucene-Solr-6.x-Windows/533/
Java: 64bit/jdk1.8.0_102 -XX:-UseCompressedOops -XX:+UseG1GC

1 tests failed.
FAILED:  org.apache.lucene.replicator.IndexAndTaxonomyReplicationClientTest.testRecreateTaxonomy

Error Message:
Could not remove the following files (in the order of attempts):    C:\Users\jenkins\workspace\Lucene-Solr-6.x-Windows\lucene\build\replicator\test\J0\temp\lucene.replicator.IndexAndTaxonomyReplicationClientTest_6AECAFF1AC2DCF0A-001\replicationClientTest-002\2:
java.nio.file.DirectoryNotEmptyException: C:\Users\jenkins\workspace\Lucene-Solr-6.x-Windows\lucene\build\replicator\test\J0\temp\lucene.replicator.IndexAndTaxonomyReplicationClientTest_6AECAFF1AC2DCF0A-001\replicationClientTest-002\2


Stack Trace:
java.io.IOException: Could not remove the following files (in the order of attempts):
   C:\Users\jenkins\workspace\Lucene-Solr-6.x-Windows\lucene\build\replicator\test\J0\temp\lucene.replicator.IndexAndTaxonomyReplicationClientTest_6AECAFF1AC2DCF0A-001\replicationClientTest-002\2:
java.nio.file.DirectoryNotEmptyException: C:\Users\jenkins\workspace\Lucene-Solr-6.x-Windows\lucene\build\replicator\test\J0\temp\lucene.replicator.IndexAndTaxonomyReplicationClientTest_6AECAFF1AC2DCF0A-001\replicationClientTest-002\2

	at __randomizedtesting.SeedInfo.seed([6AECAFF1AC2DCF0A:561F4790C7EC190B]:0)
	at org.apache.lucene.util.IOUtils.rm(IOUtils.java:323)
	at org.apache.lucene.replicator.PerSessionDirectoryFactory.cleanupSession(PerSessionDirectoryFactory.java:58)
	at org.apache.lucene.replicator.ReplicationClient.doUpdate(ReplicationClient.java:259)
	at org.apache.lucene.replicator.ReplicationClient.updateNow(ReplicationClient.java:401)
	at org.apache.lucene.replicator.IndexAndTaxonomyReplicationClientTest.testRecreateTaxonomy(IndexAndTaxonomyReplicationClientTest.java:287)
	at sun.reflect.NativeMethodAccessorImpl.invoke0(Native Method)
	at sun.reflect.NativeMethodAccessorImpl.invoke(NativeMethodAccessorImpl.java:62)
	at sun.reflect.DelegatingMethodAccessorImpl.invoke(DelegatingMethodAccessorImpl.java:43)
	at java.lang.reflect.Method.invoke(Method.java:498)
	at com.carrotsearch.randomizedtesting.RandomizedRunner.invoke(RandomizedRunner.java:1713)
	at com.carrotsearch.randomizedtesting.RandomizedRunner$8.evaluate(RandomizedRunner.java:907)
	at com.carrotsearch.randomizedtesting.RandomizedRunner$9.evaluate(RandomizedRunner.java:943)
	at com.carrotsearch.randomizedtesting.RandomizedRunner$10.evaluate(RandomizedRunner.java:957)
	at org.apache.lucene.util.TestRuleSetupTeardownChained$1.evaluate(TestRuleSetupTeardownChained.java:49)
	at org.apache.lucene.util.AbstractBeforeAfterRule$1.evaluate(AbstractBeforeAfterRule.java:45)
	at org.apache.lucene.util.TestRuleThreadAndTestName$1.evaluate(TestRuleThreadAndTestName.java:48)
	at org.apache.lucene.util.TestRuleIgnoreAfterMaxFailures$1.evaluate(TestRuleIgnoreAfterMaxFailures.java:64)
	at org.apache.lucene.util.TestRuleMarkFailure$1.evaluate(TestRuleMarkFailure.java:47)
	at com.carrotsearch.randomizedtesting.rules.StatementAdapter.evaluate(StatementAdapter.java:36)
	at com.carrotsearch.randomizedtesting.ThreadLeakControl$StatementRunner.run(ThreadLeakControl.java:367)
	at com.carrotsearch.randomizedtesting.ThreadLeakControl.forkTimeoutingTask(ThreadLeakControl.java:811)
	at com.carrotsearch.randomizedtesting.ThreadLeakControl$3.evaluate(ThreadLeakControl.java:462)
	at com.carrotsearch.randomizedtesting.RandomizedRunner.runSingleTest(RandomizedRunner.java:916)
	at com.carrotsearch.randomizedtesting.RandomizedRunner$5.evaluate(RandomizedRunner.java:802)
	at com.carrotsearch.randomizedtesting.RandomizedRunner$6.evaluate(RandomizedRunner.java:852)
	at com.carrotsearch.randomizedtesting.RandomizedRunner$7.evaluate(RandomizedRunner.java:863)
	at org.apache.lucene.util.AbstractBeforeAfterRule$1.evaluate(AbstractBeforeAfterRule.java:45)
	at com.carrotsearch.randomizedtesting.rules.StatementAdapter.evaluate(StatementAdapter.java:36)
	at org.apache.lucene.util.TestRuleStoreClassName$1.evaluate(TestRuleStoreClassName.java:41)
	at com.carrotsearch.randomizedtesting.rules.NoShadowingOrOverridesOnMethodsRule$1.evaluate(NoShadowingOrOverridesOnMethodsRule.java:40)
	at com.carrotsearch.randomizedtesting.rules.NoShadowingOrOverridesOnMethodsRule$1.evaluate(NoShadowingOrOverridesOnMethodsRule.java:40)
	at com.carrotsearch.randomizedtesting.rules.StatementAdapter.evaluate(StatementAdapter.java:36)
	at com.carrotsearch.randomizedtesting.rules.StatementAdapter.evaluate(StatementAdapter.java:36)
	at com.carrotsearch.randomizedtesting.rules.StatementAdapter.evaluate(StatementAdapter.java:36)
	at org.apache.lucene.util.TestRuleAssertionsRequired$1.evaluate(TestRuleAssertionsRequired.java:53)
	at org.apache.lucene.util.TestRuleMarkFailure$1.evaluate(TestRuleMarkFailure.java:47)
	at org.apache.lucene.util.TestRuleIgnoreAfterMaxFailures$1.evaluate(TestRuleIgnoreAfterMaxFailures.java:64)
	at org.apache.lucene.util.TestRuleIgnoreTestSuites$1.evaluate(TestRuleIgnoreTestSuites.java:54)
	at com.carrotsearch.randomizedtesting.rules.StatementAdapter.evaluate(StatementAdapter.java:36)
	at com.carrotsearch.randomizedtesting.ThreadLeakControl$StatementRunner.run(ThreadLeakControl.java:367)
	at java.lang.Thread.run(Thread.java:745)




Build Log:
[...truncated 8275 lines...]
   [junit4] Suite: org.apache.lucene.replicator.IndexAndTaxonomyReplicationClientTest
   [junit4]   2> NOTE: reproduce with: ant test  -Dtestcase=IndexAndTaxonomyReplicationClientTest
-Dtests.method=testRecreateTaxonomy -Dtests.seed=6AECAFF1AC2DCF0A -Dtests.slow=true -Dtests.locale=bg
-Dtests.timezone=America/Maceio -Dtests.asserts=true -Dtests.file.encoding=US-ASCII
   [junit4] ERROR   0.27s J0 | IndexAndTaxonomyReplicationClientTest.testRecreateTaxonomy
<<<
   [junit4]    > Throwable #1: java.io.IOException: Could not remove the following files
(in the order of attempts):
   [junit4]    >    C:\Users\jenkins\workspace\Lucene-Solr-6.x-Windows\lucene\build\replicator\test\J0\temp\lucene.replicator.IndexAndTaxonomyReplicationClientTest_6AECAFF1AC2DCF0A-001\replicationClientTest-002\2:
java.nio.file.DirectoryNotEmptyException: C:\Users\jenkins\workspace\Lucene-Solr-6.x-Windows\lucene\build\replicator\test\J0\temp\lucene.replicator.IndexAndTaxonomyReplicationClientTest_6AECAFF1AC2DCF0A-001\replicationClientTest-002\2
   [junit4]    > 	at __randomizedtesting.SeedInfo.seed([6AECAFF1AC2DCF0A:561F4790C7EC190B]:0)
   [junit4]    > 	at org.apache.lucene.util.IOUtils.rm(IOUtils.java:323)
   [junit4]    > 	at org.apache.lucene.replicator.PerSessionDirectoryFactory.cleanupSession(PerSessionDirectoryFactory.java:58)
   [junit4]    > 	at org.apache.lucene.replicator.ReplicationClient.doUpdate(ReplicationClient.java:259)
   [junit4]    > 	at org.apache.lucene.replicator.ReplicationClient.updateNow(ReplicationClient.java:401)
   [junit4]    > 	at org.apache.lucene.replicator.IndexAndTaxonomyReplicationClientTest.testRecreateTaxonomy(IndexAndTaxonomyReplicationClientTest.java:287)
   [junit4]    > 	at java.lang.Thread.run(Thread.java:745)
   [junit4]   2> NOTE: leaving temporary files on disk at: C:\Users\jenkins\workspace\Lucene-Solr-6.x-Windows\lucene\build\replicator\test\J0\temp\lucene.replicator.IndexAndTaxonomyReplicationClientTest_6AECAFF1AC2DCF0A-001
   [junit4]   2> NOTE: test params are: codec=Asserting(Lucene62): {$full_path$=PostingsFormat(name=LuceneVarGapFixedInterval),
$facets=PostingsFormat(name=Asserting), $payloads$=PostingsFormat(name=LuceneVarGapFixedInterval)},
docValues:{$facets=DocValuesFormat(name=Direct)}, maxPointsInLeafNode=1727, maxMBSortInHeap=7.956370764464507,
sim=RandomSimilarity(queryNorm=true,coord=no): {}, locale=bg, timezone=America/Maceio
   [junit4]   2> NOTE: Windows 10 10.0 amd64/Oracle Corporation 1.8.0_102 (64-bit)/cpus=3,threads=1,free=27059064,total=67108864
   [junit4]   2> NOTE: All tests run in this JVM: [IndexReplicationClientTest, LocalReplicatorTest,
TestStressNRTReplication, IndexAndTaxonomyReplicationClientTest]
   [junit4] Completed [9/9 (1!)] on J0 in 5.66s, 5 tests, 1 error <<< FAILURES!

[...truncated 64831 lines...]


Mime
View raw message