lucene-dev mailing list archives

Site index · List index
Message view « Date » · « Thread »
Top « Date » · « Thread »
From Policeman Jenkins Server <jenk...@thetaphi.de>
Subject [JENKINS-EA] Lucene-Solr-6.x-Linux (32bit/jdk-9-ea+140) - Build # 2049 - Unstable!
Date Thu, 27 Oct 2016 10:12:39 GMT
Build: https://jenkins.thetaphi.de/job/Lucene-Solr-6.x-Linux/2049/
Java: 32bit/jdk-9-ea+140 -server -XX:+UseParallelGC

1 tests failed.
FAILED:  org.apache.solr.cloud.OverseerTaskQueueTest.testPeekElements

Error Message:


Stack Trace:
java.lang.AssertionError
	at __randomizedtesting.SeedInfo.seed([4D72AB8692558674:B05C11A7426CD269]:0)
	at org.junit.Assert.fail(Assert.java:92)
	at org.junit.Assert.assertTrue(Assert.java:43)
	at org.junit.Assert.assertTrue(Assert.java:54)
	at org.apache.solr.cloud.DistributedQueueTest.testPeekElements(DistributedQueueTest.java:181)
	at jdk.internal.reflect.NativeMethodAccessorImpl.invoke0(java.base@9-ea/Native Method)
	at jdk.internal.reflect.NativeMethodAccessorImpl.invoke(java.base@9-ea/NativeMethodAccessorImpl.java:62)
	at jdk.internal.reflect.DelegatingMethodAccessorImpl.invoke(java.base@9-ea/DelegatingMethodAccessorImpl.java:43)
	at java.lang.reflect.Method.invoke(java.base@9-ea/Method.java:535)
	at com.carrotsearch.randomizedtesting.RandomizedRunner.invoke(RandomizedRunner.java:1713)
	at com.carrotsearch.randomizedtesting.RandomizedRunner$8.evaluate(RandomizedRunner.java:907)
	at com.carrotsearch.randomizedtesting.RandomizedRunner$9.evaluate(RandomizedRunner.java:943)
	at com.carrotsearch.randomizedtesting.RandomizedRunner$10.evaluate(RandomizedRunner.java:957)
	at com.carrotsearch.randomizedtesting.rules.SystemPropertiesRestoreRule$1.evaluate(SystemPropertiesRestoreRule.java:57)
	at org.apache.lucene.util.TestRuleSetupTeardownChained$1.evaluate(TestRuleSetupTeardownChained.java:49)
	at org.apache.lucene.util.AbstractBeforeAfterRule$1.evaluate(AbstractBeforeAfterRule.java:45)
	at org.apache.lucene.util.TestRuleThreadAndTestName$1.evaluate(TestRuleThreadAndTestName.java:48)
	at org.apache.lucene.util.TestRuleIgnoreAfterMaxFailures$1.evaluate(TestRuleIgnoreAfterMaxFailures.java:64)
	at org.apache.lucene.util.TestRuleMarkFailure$1.evaluate(TestRuleMarkFailure.java:47)
	at com.carrotsearch.randomizedtesting.rules.StatementAdapter.evaluate(StatementAdapter.java:36)
	at com.carrotsearch.randomizedtesting.ThreadLeakControl$StatementRunner.run(ThreadLeakControl.java:367)
	at com.carrotsearch.randomizedtesting.ThreadLeakControl.forkTimeoutingTask(ThreadLeakControl.java:811)
	at com.carrotsearch.randomizedtesting.ThreadLeakControl$3.evaluate(ThreadLeakControl.java:462)
	at com.carrotsearch.randomizedtesting.RandomizedRunner.runSingleTest(RandomizedRunner.java:916)
	at com.carrotsearch.randomizedtesting.RandomizedRunner$5.evaluate(RandomizedRunner.java:802)
	at com.carrotsearch.randomizedtesting.RandomizedRunner$6.evaluate(RandomizedRunner.java:852)
	at com.carrotsearch.randomizedtesting.RandomizedRunner$7.evaluate(RandomizedRunner.java:863)
	at com.carrotsearch.randomizedtesting.rules.StatementAdapter.evaluate(StatementAdapter.java:36)
	at com.carrotsearch.randomizedtesting.rules.SystemPropertiesRestoreRule$1.evaluate(SystemPropertiesRestoreRule.java:57)
	at org.apache.lucene.util.AbstractBeforeAfterRule$1.evaluate(AbstractBeforeAfterRule.java:45)
	at com.carrotsearch.randomizedtesting.rules.StatementAdapter.evaluate(StatementAdapter.java:36)
	at org.apache.lucene.util.TestRuleStoreClassName$1.evaluate(TestRuleStoreClassName.java:41)
	at com.carrotsearch.randomizedtesting.rules.NoShadowingOrOverridesOnMethodsRule$1.evaluate(NoShadowingOrOverridesOnMethodsRule.java:40)
	at com.carrotsearch.randomizedtesting.rules.NoShadowingOrOverridesOnMethodsRule$1.evaluate(NoShadowingOrOverridesOnMethodsRule.java:40)
	at com.carrotsearch.randomizedtesting.rules.StatementAdapter.evaluate(StatementAdapter.java:36)
	at com.carrotsearch.randomizedtesting.rules.StatementAdapter.evaluate(StatementAdapter.java:36)
	at com.carrotsearch.randomizedtesting.rules.StatementAdapter.evaluate(StatementAdapter.java:36)
	at org.apache.lucene.util.TestRuleAssertionsRequired$1.evaluate(TestRuleAssertionsRequired.java:53)
	at org.apache.lucene.util.TestRuleMarkFailure$1.evaluate(TestRuleMarkFailure.java:47)
	at org.apache.lucene.util.TestRuleIgnoreAfterMaxFailures$1.evaluate(TestRuleIgnoreAfterMaxFailures.java:64)
	at org.apache.lucene.util.TestRuleIgnoreTestSuites$1.evaluate(TestRuleIgnoreTestSuites.java:54)
	at com.carrotsearch.randomizedtesting.rules.StatementAdapter.evaluate(StatementAdapter.java:36)
	at com.carrotsearch.randomizedtesting.ThreadLeakControl$StatementRunner.run(ThreadLeakControl.java:367)
	at java.lang.Thread.run(java.base@9-ea/Thread.java:843)




Build Log:
[...truncated 12192 lines...]
   [junit4] Suite: org.apache.solr.cloud.OverseerTaskQueueTest
   [junit4]   2> Creating dataDir: /home/jenkins/workspace/Lucene-Solr-6.x-Linux/solr/build/solr-core/test/J1/temp/solr.cloud.OverseerTaskQueueTest_4D72AB8692558674-001/init-core-data-001
   [junit4]   2> 1469294 INFO  (SUITE-OverseerTaskQueueTest-seed#[4D72AB8692558674]-worker)
[    ] o.a.s.SolrTestCaseJ4 Randomized ssl (true) and clientAuth (true) via: @org.apache.solr.util.RandomizeSSL(reason="",
ssl=0.0/0.0, value=0.0/0.0, clientAuth=0.0/0.0)
   [junit4]   2> 1469296 INFO  (TEST-OverseerTaskQueueTest.testPeekElements-seed#[4D72AB8692558674])
[    ] o.a.s.SolrTestCaseJ4 ###Starting testPeekElements
   [junit4]   2> 1469296 INFO  (TEST-OverseerTaskQueueTest.testPeekElements-seed#[4D72AB8692558674])
[    ] o.a.s.c.ZkTestServer STARTING ZK TEST SERVER
   [junit4]   2> 1469296 INFO  (Thread-2324) [    ] o.a.s.c.ZkTestServer client port:0.0.0.0/0.0.0.0:0
   [junit4]   2> 1469296 INFO  (Thread-2324) [    ] o.a.s.c.ZkTestServer Starting server
   [junit4]   2> 1469396 INFO  (TEST-OverseerTaskQueueTest.testPeekElements-seed#[4D72AB8692558674])
[    ] o.a.s.c.ZkTestServer start zk server on port:35940
   [junit4]   2> 1472185 INFO  (TEST-OverseerTaskQueueTest.testPeekElements-seed#[4D72AB8692558674])
[    ] o.a.s.SolrTestCaseJ4 ###Ending testPeekElements
   [junit4]   2> 1472185 INFO  (TEST-OverseerTaskQueueTest.testPeekElements-seed#[4D72AB8692558674])
[    ] o.a.s.c.ZkTestServer connecting to 127.0.0.1:35940 35940
   [junit4]   2> 1477201 INFO  (Thread-2324) [    ] o.a.s.c.ZkTestServer connecting to
127.0.0.1:35940 35940
   [junit4]   2> NOTE: reproduce with: ant test  -Dtestcase=OverseerTaskQueueTest -Dtests.method=testPeekElements
-Dtests.seed=4D72AB8692558674 -Dtests.multiplier=3 -Dtests.slow=true -Dtests.locale=en-PN
-Dtests.timezone=Europe/Mariehamn -Dtests.asserts=true -Dtests.file.encoding=UTF-8
   [junit4] FAILURE 7.91s J1 | OverseerTaskQueueTest.testPeekElements <<<
   [junit4]    > Throwable #1: java.lang.AssertionError
   [junit4]    > 	at __randomizedtesting.SeedInfo.seed([4D72AB8692558674:B05C11A7426CD269]:0)
   [junit4]    > 	at org.apache.solr.cloud.DistributedQueueTest.testPeekElements(DistributedQueueTest.java:181)
   [junit4]    > 	at jdk.internal.reflect.NativeMethodAccessorImpl.invoke0(java.base@9-ea/Native
Method)
   [junit4]    > 	at jdk.internal.reflect.NativeMethodAccessorImpl.invoke(java.base@9-ea/NativeMethodAccessorImpl.java:62)
   [junit4]    > 	at jdk.internal.reflect.DelegatingMethodAccessorImpl.invoke(java.base@9-ea/DelegatingMethodAccessorImpl.java:43)
   [junit4]    > 	at java.lang.Thread.run(java.base@9-ea/Thread.java:843)
   [junit4]   2> 1477204 INFO  (TEST-OverseerTaskQueueTest.testDistributedQueue-seed#[4D72AB8692558674])
[    ] o.a.s.SolrTestCaseJ4 ###Starting testDistributedQueue
   [junit4]   2> 1477204 INFO  (TEST-OverseerTaskQueueTest.testDistributedQueue-seed#[4D72AB8692558674])
[    ] o.a.s.c.ZkTestServer STARTING ZK TEST SERVER
   [junit4]   2> 1477205 INFO  (Thread-2325) [    ] o.a.s.c.ZkTestServer client port:0.0.0.0/0.0.0.0:0
   [junit4]   2> 1477205 INFO  (Thread-2325) [    ] o.a.s.c.ZkTestServer Starting server
   [junit4]   2> 1477305 INFO  (TEST-OverseerTaskQueueTest.testDistributedQueue-seed#[4D72AB8692558674])
[    ] o.a.s.c.ZkTestServer start zk server on port:45510
   [junit4]   2> 1479312 INFO  (TEST-OverseerTaskQueueTest.testDistributedQueue-seed#[4D72AB8692558674])
[    ] o.a.s.SolrTestCaseJ4 ###Ending testDistributedQueue
   [junit4]   2> 1479313 INFO  (TEST-OverseerTaskQueueTest.testDistributedQueue-seed#[4D72AB8692558674])
[    ] o.a.s.c.ZkTestServer connecting to 127.0.0.1:45510 45510
   [junit4]   2> 1479368 INFO  (Thread-2325) [    ] o.a.s.c.ZkTestServer connecting to
127.0.0.1:45510 45510
   [junit4]   2> 1479368 WARN  (Thread-2325) [    ] o.a.s.c.ZkTestServer Watch limit violations:

   [junit4]   2> Maximum concurrent children watches above limit:
   [junit4]   2> 
   [junit4]   2> 	4	/solr/distqueue/test
   [junit4]   2> 
   [junit4]   2> 1479370 INFO  (TEST-OverseerTaskQueueTest.testContainsTaskWithRequestId-seed#[4D72AB8692558674])
[    ] o.a.s.SolrTestCaseJ4 ###Starting testContainsTaskWithRequestId
   [junit4]   2> 1479371 INFO  (TEST-OverseerTaskQueueTest.testContainsTaskWithRequestId-seed#[4D72AB8692558674])
[    ] o.a.s.c.ZkTestServer STARTING ZK TEST SERVER
   [junit4]   2> 1479371 INFO  (Thread-2328) [    ] o.a.s.c.ZkTestServer client port:0.0.0.0/0.0.0.0:0
   [junit4]   2> 1479371 INFO  (Thread-2328) [    ] o.a.s.c.ZkTestServer Starting server
   [junit4]   2> 1479471 INFO  (TEST-OverseerTaskQueueTest.testContainsTaskWithRequestId-seed#[4D72AB8692558674])
[    ] o.a.s.c.ZkTestServer start zk server on port:41062
   [junit4]   2> 1479477 INFO  (TEST-OverseerTaskQueueTest.testContainsTaskWithRequestId-seed#[4D72AB8692558674])
[    ] o.a.s.SolrTestCaseJ4 ###Ending testContainsTaskWithRequestId
   [junit4]   2> 1479478 INFO  (TEST-OverseerTaskQueueTest.testContainsTaskWithRequestId-seed#[4D72AB8692558674])
[    ] o.a.s.c.ZkTestServer connecting to 127.0.0.1:41062 41062
   [junit4]   2> 1479555 INFO  (Thread-2328) [    ] o.a.s.c.ZkTestServer connecting to
127.0.0.1:41062 41062
   [junit4]   2> 1479557 INFO  (TEST-OverseerTaskQueueTest.testDistributedQueueBlocking-seed#[4D72AB8692558674])
[    ] o.a.s.SolrTestCaseJ4 ###Starting testDistributedQueueBlocking
   [junit4]   2> 1479558 INFO  (TEST-OverseerTaskQueueTest.testDistributedQueueBlocking-seed#[4D72AB8692558674])
[    ] o.a.s.c.ZkTestServer STARTING ZK TEST SERVER
   [junit4]   2> 1479558 INFO  (Thread-2329) [    ] o.a.s.c.ZkTestServer client port:0.0.0.0/0.0.0.0:0
   [junit4]   2> 1479558 INFO  (Thread-2329) [    ] o.a.s.c.ZkTestServer Starting server
   [junit4]   2> 1479658 INFO  (TEST-OverseerTaskQueueTest.testDistributedQueueBlocking-seed#[4D72AB8692558674])
[    ] o.a.s.c.ZkTestServer start zk server on port:46122
   [junit4]   2> 1480864 WARN  (zkCallback-1721-thread-2) [    ] o.a.s.c.c.ConnectionManager
Watcher org.apache.solr.common.cloud.ConnectionManager@c0e9ac name: ZooKeeperConnection Watcher:127.0.0.1:46122/solr
got event WatchedEvent state:Disconnected type:None path:null path: null type: None
   [junit4]   2> 1480864 WARN  (zkCallback-1721-thread-2) [    ] o.a.s.c.c.ConnectionManager
zkClient has disconnected
   [junit4]   2> 1481883 WARN  (zkCallback-1721-thread-2) [    ] o.a.s.c.c.ConnectionManager
Watcher org.apache.solr.common.cloud.ConnectionManager@c0e9ac name: ZooKeeperConnection Watcher:127.0.0.1:46122/solr
got event WatchedEvent state:Expired type:None path:null path: null type: None
   [junit4]   2> 1481883 WARN  (zkCallback-1721-thread-2) [    ] o.a.s.c.c.ConnectionManager
Our previous ZooKeeper session was expired. Attempting to reconnect to recover relationship
with ZooKeeper...
   [junit4]   2> 1481883 WARN  (zkCallback-1721-thread-2) [    ] o.a.s.c.c.DefaultConnectionStrategy
Connection expired - starting a new one...
   [junit4]   2> 1481884 INFO  (zkCallback-1721-thread-2) [    ] o.a.s.c.c.ConnectionManager
Connection with ZooKeeper reestablished.
   [junit4]   2> 1481884 INFO  (zkCallback-1721-thread-2) [    ] o.a.s.c.c.DefaultConnectionStrategy
Reconnected to ZooKeeper
   [junit4]   2> 1481884 INFO  (zkCallback-1721-thread-2) [    ] o.a.s.c.c.ConnectionManager
Connected:true
   [junit4]   2> 1483035 INFO  (TEST-OverseerTaskQueueTest.testDistributedQueueBlocking-seed#[4D72AB8692558674])
[    ] o.a.s.SolrTestCaseJ4 ###Ending testDistributedQueueBlocking
   [junit4]   2> 1483036 INFO  (TEST-OverseerTaskQueueTest.testDistributedQueueBlocking-seed#[4D72AB8692558674])
[    ] o.a.s.c.ZkTestServer connecting to 127.0.0.1:46122 46122
   [junit4]   2> 1483154 INFO  (Thread-2329) [    ] o.a.s.c.ZkTestServer connecting to
127.0.0.1:46122 46122
   [junit4]   2> 1483155 WARN  (Thread-2329) [    ] o.a.s.c.ZkTestServer Watch limit violations:

   [junit4]   2> Maximum concurrent children watches above limit:
   [junit4]   2> 
   [junit4]   2> 	3	/solr/distqueue/test
   [junit4]   2> 
   [junit4]   2> 1483156 INFO  (SUITE-OverseerTaskQueueTest-seed#[4D72AB8692558674]-worker)
[    ] o.a.s.SolrTestCaseJ4 ###deleteCore
   [junit4]   2> NOTE: leaving temporary files on disk at: /home/jenkins/workspace/Lucene-Solr-6.x-Linux/solr/build/solr-core/test/J1/temp/solr.cloud.OverseerTaskQueueTest_4D72AB8692558674-001
   [junit4]   2> NOTE: test params are: codec=Asserting(Lucene62): {}, docValues:{}, maxPointsInLeafNode=1880,
maxMBSortInHeap=7.3195722090141455, sim=RandomSimilarity(queryNorm=true,coord=yes): {}, locale=en-PN,
timezone=Europe/Mariehamn
   [junit4]   2> NOTE: Linux 4.4.0-42-generic i386/Oracle Corporation 9-ea (32-bit)/cpus=12,threads=1,free=254094880,total=455081984
   [junit4]   2> NOTE: All tests run in this JVM: [SchemaVersionSpecificBehaviorTest, CollectionReloadTest,
AliasIntegrationTest, TestTestInjection, TestSolrCloudWithKerberosAlt, DistributedFacetPivotWhiteBoxTest,
TestSurroundQueryParser, TestSuggestSpellingConverter, EchoParamsTest, TestRuleBasedAuthorizationPlugin,
IndexBasedSpellCheckerTest, TestRestManager, FullHLLTest, TestConfigSetsAPI, DistribJoinFromCollectionTest,
HdfsRecoveryZkTest, TestSimpleQParserPlugin, TestCorePropertiesReload, SpellCheckComponentTest,
ShardRoutingTest, WordBreakSolrSpellCheckerTest, DirectSolrSpellCheckerTest, TestPerFieldSimilarityClassic,
TestSearchPerf, HdfsDirectoryTest, MergeStrategyTest, LoggingHandlerTest, SpatialFilterTest,
TestWordDelimiterFilterFactory, DirectoryFactoryTest, SmileWriterTest, TestMacroExpander,
TestJsonRequest, TestCryptoKeys, DistributedIntervalFacetingTest, TestRTGBase, MoreLikeThisHandlerTest,
TestSubQueryTransformerDistrib, DocValuesTest, SolrInfoMBeanTest, IndexSchemaRuntimeFieldTest,
TestCloudPseudoReturnFields, TestImplicitCoreProperties, HdfsCollectionsAPIDistributedZkTest,
SortByFunctionTest, TestRequestForwarding, TestFieldTypeCollectionResource, TestGeoJSONResponseWriter,
LeaderFailoverAfterPartitionTest, TestSweetSpotSimilarityFactory, TermVectorComponentTest,
DateMathParserTest, TestFiltering, TriLevelCompositeIdRoutingTest, SpellCheckCollatorTest,
TestJsonFacetRefinement, DocumentBuilderTest, TestCopyFieldCollectionResource, TestSQLHandler,
HdfsThreadLeakTest, TestInitQParser, ZkControllerTest, TestHdfsUpdateLog, ConvertedLegacyTest,
SoftAutoCommitTest, TestExclusionRuleCollectionAccess, CSVRequestHandlerTest, SegmentsInfoRequestHandlerTest,
TestDefaultStatsCache, QueryResultKeyTest, CdcrReplicationHandlerTest, JsonLoaderTest, ClusterStateUpdateTest,
TestTrieFacet, TestSimpleTrackingShardHandler, MultiTermTest, AtomicUpdatesTest, TestCloudDeleteByQuery,
CopyFieldTest, BasicFunctionalityTest, TestExactStatsCache, TestRecoveryHdfs, TestChildDocTransformer,
SuggestComponentContextFilterQueryTest, FileUtilsTest, HighlighterTest, JavabinLoaderTest,
TermsComponentTest, BlockJoinFacetDistribTest, CustomCollectionTest, TestSolrIndexConfig,
AnalyticsMergeStrategyTest, TestClassicSimilarityFactory, TestTolerantUpdateProcessorCloud,
TestTrie, TestFuzzyAnalyzedSuggestions, HdfsBasicDistributedZkTest, ZkCLITest, TestNumericTerms64,
SpellingQueryConverterTest, TestLMDirichletSimilarityFactory, UpdateRequestProcessorFactoryTest,
TestSolrCloudSnapshots, TestExpandComponent, BlockCacheTest, TestFieldCache, BasicDistributedZkTest,
CollectionsAPIDistributedZkTest, ZkSolrClientTest, TestDistributedSearch, TestRangeQuery,
StatsComponentTest, QueryElevationComponentTest, BadIndexSchemaTest, TestFunctionQuery, TestLazyCores,
TestIndexSearcher, SolrIndexSplitterTest, SuggesterFSTTest, TestFoldingMultitermQuery, SuggesterTest,
TestPseudoReturnFields, FieldMutatingUpdateProcessorTest, StatelessScriptUpdateProcessorFactoryTest,
DebugComponentTest, DisMaxRequestHandlerTest, TestQueryUtils, TestWriterPerf, PrimitiveFieldTypeTest,
XmlUpdateRequestHandlerTest, RequiredFieldsTest, RegexBoostProcessorTest, TestCollationField,
TestCSVResponseWriter, UniqFieldsUpdateProcessorFactoryTest, TestPHPSerializedResponseWriter,
TestComponentsName, SearchHandlerTest, SampleTest, NumericFieldsTest, TestPostingsSolrHighlighter,
DirectSolrConnectionTest, SpellPossibilityIteratorTest, TestCharFilters, TestLMJelinekMercerSimilarityFactory,
TestFastWriter, TestFastOutputStream, ScriptEngineTest, TestSystemIdResolver, DOMUtilTest,
TestSolrJ, TestLRUCache, CircularListTest, DistributedMLTComponentTest, TestHighlightDedupGrouping,
TestJettySolrRunner, ConnectionReuseTest, CollectionsAPIAsyncDistributedZkTest, ConcurrentDeleteAndCreateCollectionTest,
ConfigSetsAPITest, DeleteInactiveReplicaTest, DeleteStatusTest, DistributedVersionInfoTest,
LeaderElectionContextKeyTest, LeaderInitiatedRecoveryOnShardRestartTest, MultiThreadedOCPTest,
OverseerStatusTest, OverseerTaskQueueTest]
   [junit4] Completed [476/646 (1!)] on J1 in 13.88s, 4 tests, 1 failure <<< FAILURES!

[...truncated 50494 lines...]


Mime
View raw message