lucene-dev mailing list archives

Site index · List index
Message view « Date » · « Thread »
Top « Date » · « Thread »
From Policeman Jenkins Server <jenk...@thetaphi.de>
Subject [JENKINS-EA] Lucene-Solr-6.x-Linux (32bit/jdk-9-ea+140) - Build # 2064 - Unstable!
Date Sat, 29 Oct 2016 06:06:54 GMT
Build: https://jenkins.thetaphi.de/job/Lucene-Solr-6.x-Linux/2064/
Java: 32bit/jdk-9-ea+140 -server -XX:+UseG1GC

1 tests failed.
FAILED:  org.apache.solr.cloud.PeerSyncReplicationTest.test

Error Message:
PeerSync failed. Had to fail back to replication expected:<0> but was:<18>

Stack Trace:
java.lang.AssertionError: PeerSync failed. Had to fail back to replication expected:<0> but was:<18>
	at __randomizedtesting.SeedInfo.seed([E1BCCD231971E84A:69E8F2F9B78D85B2]:0)
	at org.junit.Assert.fail(Assert.java:93)
	at org.junit.Assert.failNotEquals(Assert.java:647)
	at org.junit.Assert.assertEquals(Assert.java:128)
	at org.junit.Assert.assertEquals(Assert.java:472)
	at org.apache.solr.cloud.PeerSyncReplicationTest.bringUpDeadNodeAndEnsureNoReplication(PeerSyncReplicationTest.java:290)
	at org.apache.solr.cloud.PeerSyncReplicationTest.forceNodeFailureAndDoPeerSync(PeerSyncReplicationTest.java:244)
	at org.apache.solr.cloud.PeerSyncReplicationTest.test(PeerSyncReplicationTest.java:130)
	at jdk.internal.reflect.NativeMethodAccessorImpl.invoke0(java.base@9-ea/Native Method)
	at jdk.internal.reflect.NativeMethodAccessorImpl.invoke(java.base@9-ea/NativeMethodAccessorImpl.java:62)
	at jdk.internal.reflect.DelegatingMethodAccessorImpl.invoke(java.base@9-ea/DelegatingMethodAccessorImpl.java:43)
	at java.lang.reflect.Method.invoke(java.base@9-ea/Method.java:535)
	at com.carrotsearch.randomizedtesting.RandomizedRunner.invoke(RandomizedRunner.java:1713)
	at com.carrotsearch.randomizedtesting.RandomizedRunner$8.evaluate(RandomizedRunner.java:907)
	at com.carrotsearch.randomizedtesting.RandomizedRunner$9.evaluate(RandomizedRunner.java:943)
	at com.carrotsearch.randomizedtesting.RandomizedRunner$10.evaluate(RandomizedRunner.java:957)
	at org.apache.solr.BaseDistributedSearchTestCase$ShardsRepeatRule$ShardsFixedStatement.callStatement(BaseDistributedSearchTestCase.java:992)
	at org.apache.solr.BaseDistributedSearchTestCase$ShardsRepeatRule$ShardsStatement.evaluate(BaseDistributedSearchTestCase.java:967)
	at com.carrotsearch.randomizedtesting.rules.SystemPropertiesRestoreRule$1.evaluate(SystemPropertiesRestoreRule.java:57)
	at org.apache.lucene.util.TestRuleSetupTeardownChained$1.evaluate(TestRuleSetupTeardownChained.java:49)
	at org.apache.lucene.util.AbstractBeforeAfterRule$1.evaluate(AbstractBeforeAfterRule.java:45)
	at org.apache.lucene.util.TestRuleThreadAndTestName$1.evaluate(TestRuleThreadAndTestName.java:48)
	at org.apache.lucene.util.TestRuleIgnoreAfterMaxFailures$1.evaluate(TestRuleIgnoreAfterMaxFailures.java:64)
	at org.apache.lucene.util.TestRuleMarkFailure$1.evaluate(TestRuleMarkFailure.java:47)
	at com.carrotsearch.randomizedtesting.rules.StatementAdapter.evaluate(StatementAdapter.java:36)
	at com.carrotsearch.randomizedtesting.ThreadLeakControl$StatementRunner.run(ThreadLeakControl.java:367)
	at com.carrotsearch.randomizedtesting.ThreadLeakControl.forkTimeoutingTask(ThreadLeakControl.java:811)
	at com.carrotsearch.randomizedtesting.ThreadLeakControl$3.evaluate(ThreadLeakControl.java:462)
	at com.carrotsearch.randomizedtesting.RandomizedRunner.runSingleTest(RandomizedRunner.java:916)
	at com.carrotsearch.randomizedtesting.RandomizedRunner$5.evaluate(RandomizedRunner.java:802)
	at com.carrotsearch.randomizedtesting.RandomizedRunner$6.evaluate(RandomizedRunner.java:852)
	at com.carrotsearch.randomizedtesting.RandomizedRunner$7.evaluate(RandomizedRunner.java:863)
	at com.carrotsearch.randomizedtesting.rules.StatementAdapter.evaluate(StatementAdapter.java:36)
	at com.carrotsearch.randomizedtesting.rules.SystemPropertiesRestoreRule$1.evaluate(SystemPropertiesRestoreRule.java:57)
	at org.apache.lucene.util.AbstractBeforeAfterRule$1.evaluate(AbstractBeforeAfterRule.java:45)
	at com.carrotsearch.randomizedtesting.rules.StatementAdapter.evaluate(StatementAdapter.java:36)
	at org.apache.lucene.util.TestRuleStoreClassName$1.evaluate(TestRuleStoreClassName.java:41)
	at com.carrotsearch.randomizedtesting.rules.NoShadowingOrOverridesOnMethodsRule$1.evaluate(NoShadowingOrOverridesOnMethodsRule.java:40)
	at com.carrotsearch.randomizedtesting.rules.NoShadowingOrOverridesOnMethodsRule$1.evaluate(NoShadowingOrOverridesOnMethodsRule.java:40)
	at com.carrotsearch.randomizedtesting.rules.StatementAdapter.evaluate(StatementAdapter.java:36)
	at com.carrotsearch.randomizedtesting.rules.StatementAdapter.evaluate(StatementAdapter.java:36)
	at com.carrotsearch.randomizedtesting.rules.StatementAdapter.evaluate(StatementAdapter.java:36)
	at org.apache.lucene.util.TestRuleAssertionsRequired$1.evaluate(TestRuleAssertionsRequired.java:53)
	at org.apache.lucene.util.TestRuleMarkFailure$1.evaluate(TestRuleMarkFailure.java:47)
	at org.apache.lucene.util.TestRuleIgnoreAfterMaxFailures$1.evaluate(TestRuleIgnoreAfterMaxFailures.java:64)
	at org.apache.lucene.util.TestRuleIgnoreTestSuites$1.evaluate(TestRuleIgnoreTestSuites.java:54)
	at com.carrotsearch.randomizedtesting.rules.StatementAdapter.evaluate(StatementAdapter.java:36)
	at com.carrotsearch.randomizedtesting.ThreadLeakControl$StatementRunner.run(ThreadLeakControl.java:367)
	at java.lang.Thread.run(java.base@9-ea/Thread.java:843)




Build Log:
[...truncated 12110 lines...]
   [junit4] Suite: org.apache.solr.cloud.PeerSyncReplicationTest
   [junit4]   2> Creating dataDir: /home/jenkins/workspace/Lucene-Solr-6.x-Linux/solr/build/solr-core/test/J0/temp/solr.cloud.PeerSyncReplicationTest_E1BCCD231971E84A-001/init-core-data-001
   [junit4]   2> 1633015 INFO  (SUITE-PeerSyncReplicationTest-seed#[E1BCCD231971E84A]-worker) [    ] o.a.s.SolrTestCaseJ4 Randomized ssl (true) and clientAuth (false) via: @org.apache.solr.util.RandomizeSSL(reason="", ssl=0.0/0.0, value=0.0/0.0, clientAuth=0.0/0.0)
   [junit4]   2> 1633016 INFO  (SUITE-PeerSyncReplicationTest-seed#[E1BCCD231971E84A]-worker) [    ] o.a.s.BaseDistributedSearchTestCase Setting hostContext system property: /
   [junit4]   2> 1633018 INFO  (TEST-PeerSyncReplicationTest.test-seed#[E1BCCD231971E84A]) [    ] o.a.s.c.ZkTestServer STARTING ZK TEST SERVER
   [junit4]   2> 1633019 INFO  (Thread-2845) [    ] o.a.s.c.ZkTestServer client port:0.0.0.0/0.0.0.0:0
   [junit4]   2> 1633019 INFO  (Thread-2845) [    ] o.a.s.c.ZkTestServer Starting server
   [junit4]   2> 1633119 INFO  (TEST-PeerSyncReplicationTest.test-seed#[E1BCCD231971E84A]) [    ] o.a.s.c.ZkTestServer start zk server on port:34000
   [junit4]   2> 1633131 INFO  (TEST-PeerSyncReplicationTest.test-seed#[E1BCCD231971E84A]) [    ] o.a.s.c.AbstractZkTestCase put /home/jenkins/workspace/Lucene-Solr-6.x-Linux/solr/core/src/test-files/solr/collection1/conf/solrconfig-tlog.xml to /configs/conf1/solrconfig.xml
   [junit4]   2> 1633136 INFO  (TEST-PeerSyncReplicationTest.test-seed#[E1BCCD231971E84A]) [    ] o.a.s.c.AbstractZkTestCase put /home/jenkins/workspace/Lucene-Solr-6.x-Linux/solr/core/src/test-files/solr/collection1/conf/schema.xml to /configs/conf1/schema.xml
   [junit4]   2> 1633139 INFO  (TEST-PeerSyncReplicationTest.test-seed#[E1BCCD231971E84A]) [    ] o.a.s.c.AbstractZkTestCase put /home/jenkins/workspace/Lucene-Solr-6.x-Linux/solr/core/src/test-files/solr/collection1/conf/solrconfig.snippet.randomindexconfig.xml to /configs/conf1/solrconfig.snippet.randomindexconfig.xml
   [junit4]   2> 1633144 INFO  (TEST-PeerSyncReplicationTest.test-seed#[E1BCCD231971E84A]) [    ] o.a.s.c.AbstractZkTestCase put /home/jenkins/workspace/Lucene-Solr-6.x-Linux/solr/core/src/test-files/solr/collection1/conf/stopwords.txt to /configs/conf1/stopwords.txt
   [junit4]   2> 1633147 INFO  (TEST-PeerSyncReplicationTest.test-seed#[E1BCCD231971E84A]) [    ] o.a.s.c.AbstractZkTestCase put /home/jenkins/workspace/Lucene-Solr-6.x-Linux/solr/core/src/test-files/solr/collection1/conf/protwords.txt to /configs/conf1/protwords.txt
   [junit4]   2> 1633151 INFO  (TEST-PeerSyncReplicationTest.test-seed#[E1BCCD231971E84A]) [    ] o.a.s.c.AbstractZkTestCase put /home/jenkins/workspace/Lucene-Solr-6.x-Linux/solr/core/src/test-files/solr/collection1/conf/currency.xml to /configs/conf1/currency.xml
   [junit4]   2> 1633155 INFO  (TEST-PeerSyncReplicationTest.test-seed#[E1BCCD231971E84A]) [    ] o.a.s.c.AbstractZkTestCase put /home/jenkins/workspace/Lucene-Solr-6.x-Linux/solr/core/src/test-files/solr/collection1/conf/enumsConfig.xml to /configs/conf1/enumsConfig.xml
   [junit4]   2> 1633159 INFO  (TEST-PeerSyncReplicationTest.test-seed#[E1BCCD231971E84A]) [    ] o.a.s.c.AbstractZkTestCase put /home/jenkins/workspace/Lucene-Solr-6.x-Linux/solr/core/src/test-files/solr/collection1/conf/open-exchange-rates.json to /configs/conf1/open-exchange-rates.json
   [junit4]   2> 1633167 INFO  (TEST-PeerSyncReplicationTest.test-seed#[E1BCCD231971E84A]) [    ] o.a.s.c.AbstractZkTestCase put /home/jenkins/workspace/Lucene-Solr-6.x-Linux/solr/core/src/test-files/solr/collection1/conf/mapping-ISOLatin1Accent.txt to /configs/conf1/mapping-ISOLatin1Accent.txt
   [junit4]   2> 1633172 INFO  (TEST-PeerSyncReplicationTest.test-seed#[E1BCCD231971E84A]) [    ] o.a.s.c.AbstractZkTestCase put /home/jenkins/workspace/Lucene-Solr-6.x-Linux/solr/core/src/test-files/solr/collection1/conf/old_synonyms.txt to /configs/conf1/old_synonyms.txt
   [junit4]   2> 1633176 INFO  (TEST-PeerSyncReplicationTest.test-seed#[E1BCCD231971E84A]) [    ] o.a.s.c.AbstractZkTestCase put /home/jenkins/workspace/Lucene-Solr-6.x-Linux/solr/core/src/test-files/solr/collection1/conf/synonyms.txt to /configs/conf1/synonyms.txt
   [junit4]   2> 1634112 INFO  (TEST-PeerSyncReplicationTest.test-seed#[E1BCCD231971E84A]) [    ] o.a.s.SolrTestCaseJ4 Writing core.properties file to /home/jenkins/workspace/Lucene-Solr-6.x-Linux/solr/build/solr-core/test/J0/temp/solr.cloud.PeerSyncReplicationTest_E1BCCD231971E84A-001/control-001/cores/collection1
   [junit4]   2> 1634123 INFO  (TEST-PeerSyncReplicationTest.test-seed#[E1BCCD231971E84A]) [    ] o.e.j.s.Server jetty-9.3.8.v20160314
   [junit4]   2> 1634124 INFO  (TEST-PeerSyncReplicationTest.test-seed#[E1BCCD231971E84A]) [    ] o.e.j.s.h.ContextHandler Started o.e.j.s.ServletContextHandler@881b4e{/,null,AVAILABLE}
   [junit4]   2> 1634125 INFO  (TEST-PeerSyncReplicationTest.test-seed#[E1BCCD231971E84A]) [    ] o.e.j.s.ServerConnector Started ServerConnector@19e292f{SSL,[ssl, http/1.1]}{127.0.0.1:43903}
   [junit4]   2> 1634125 INFO  (TEST-PeerSyncReplicationTest.test-seed#[E1BCCD231971E84A]) [    ] o.e.j.s.Server Started @1636373ms
   [junit4]   2> 1634125 INFO  (TEST-PeerSyncReplicationTest.test-seed#[E1BCCD231971E84A]) [    ] o.a.s.c.s.e.JettySolrRunner Jetty properties: {hostContext=/, solr.data.dir=/home/jenkins/workspace/Lucene-Solr-6.x-Linux/solr/build/solr-core/test/J0/temp/solr.cloud.PeerSyncReplicationTest_E1BCCD231971E84A-001/tempDir-001/control/data, hostPort=43903, coreRootDirectory=/home/jenkins/workspace/Lucene-Solr-6.x-Linux/solr/build/solr-core/test/J0/../../../../../../../../../home/jenkins/workspace/Lucene-Solr-6.x-Linux/solr/build/solr-core/test/J0/temp/solr.cloud.PeerSyncReplicationTest_E1BCCD231971E84A-001/control-001/cores}
   [junit4]   2> 1634125 ERROR (TEST-PeerSyncReplicationTest.test-seed#[E1BCCD231971E84A]) [    ] o.a.s.s.StartupLoggingUtils Missing Java Option solr.log.dir. Logging may be missing or incomplete.
   [junit4]   2> 1634126 INFO  (TEST-PeerSyncReplicationTest.test-seed#[E1BCCD231971E84A]) [    ] o.a.s.s.SolrDispatchFilter  ___      _       Welcome to Apache Solr™ version 6.3.0
   [junit4]   2> 1634126 INFO  (TEST-PeerSyncReplicationTest.test-seed#[E1BCCD231971E84A]) [    ] o.a.s.s.SolrDispatchFilter / __| ___| |_ _   Starting in cloud mode on port null
   [junit4]   2> 1634126 INFO  (TEST-PeerSyncReplicationTest.test-seed#[E1BCCD231971E84A]) [    ] o.a.s.s.SolrDispatchFilter \__ \/ _ \ | '_|  Install dir: null
   [junit4]   2> 1634126 INFO  (TEST-PeerSyncReplicationTest.test-seed#[E1BCCD231971E84A]) [    ] o.a.s.s.SolrDispatchFilter |___/\___/_|_|    Start time: 2016-10-29T05:40:01.425210Z
   [junit4]   2> 1634132 INFO  (TEST-PeerSyncReplicationTest.test-seed#[E1BCCD231971E84A]) [    ] o.a.s.s.SolrDispatchFilter Loading solr.xml from SolrHome (not found in ZooKeeper)
   [junit4]   2> 1634132 INFO  (TEST-PeerSyncReplicationTest.test-seed#[E1BCCD231971E84A]) [    ] o.a.s.c.SolrXmlConfig Loading container configuration from /home/jenkins/workspace/Lucene-Solr-6.x-Linux/solr/build/solr-core/test/J0/temp/solr.cloud.PeerSyncReplicationTest_E1BCCD231971E84A-001/control-001/solr.xml
   [junit4]   2> 1634141 INFO  (TEST-PeerSyncReplicationTest.test-seed#[E1BCCD231971E84A]) [    ] o.a.s.u.UpdateShardHandler Creating UpdateShardHandler HTTP client with params: socketTimeout=340000&connTimeout=45000&retry=true
   [junit4]   2> 1634144 INFO  (TEST-PeerSyncReplicationTest.test-seed#[E1BCCD231971E84A]) [    ] o.a.s.c.ZkContainer Zookeeper client=127.0.0.1:34000/solr
   [junit4]   2> 1634159 INFO  (TEST-PeerSyncReplicationTest.test-seed#[E1BCCD231971E84A]) [    ] o.a.s.c.OverseerElectionContext I am going to be the leader 127.0.0.1:43903_
   [junit4]   2> 1634159 INFO  (TEST-PeerSyncReplicationTest.test-seed#[E1BCCD231971E84A]) [    ] o.a.s.c.Overseer Overseer (id=96843831726637061-127.0.0.1:43903_-n_0000000000) starting
   [junit4]   2> 1634185 INFO  (TEST-PeerSyncReplicationTest.test-seed#[E1BCCD231971E84A]) [    ] o.a.s.c.ZkController Register node as live in ZooKeeper:/live_nodes/127.0.0.1:43903_
   [junit4]   2> 1634188 INFO  (OverseerStateUpdate-96843831726637061-127.0.0.1:43903_-n_0000000000) [    ] o.a.s.c.c.ZkStateReader Updated live nodes from ZooKeeper... (0) -> (1)
   [junit4]   2> 1634207 INFO  (TEST-PeerSyncReplicationTest.test-seed#[E1BCCD231971E84A]) [    ] o.a.s.c.CorePropertiesLocator Found 1 core definitions underneath /home/jenkins/workspace/Lucene-Solr-6.x-Linux/solr/build/solr-core/test/J0/../../../../../../../../../home/jenkins/workspace/Lucene-Solr-6.x-Linux/solr/build/solr-core/test/J0/temp/solr.cloud.PeerSyncReplicationTest_E1BCCD231971E84A-001/control-001/cores
   [junit4]   2> 1634207 INFO  (TEST-PeerSyncReplicationTest.test-seed#[E1BCCD231971E84A]) [    ] o.a.s.c.CorePropertiesLocator Cores are: [collection1]
   [junit4]   2> 1634209 INFO  (OverseerStateUpdate-96843831726637061-127.0.0.1:43903_-n_0000000000) [    ] o.a.s.c.o.ReplicaMutator Assigning new node to shard shard=shard1
   [junit4]   2> 1635217 INFO  (coreLoadExecutor-6077-thread-1) [    ] o.a.s.c.SolrConfig Using Lucene MatchVersion: 6.3.0
   [junit4]   2> 1635227 INFO  (coreLoadExecutor-6077-thread-1) [    ] o.a.s.s.IndexSchema [collection1] Schema name=test
   [junit4]   2> 1635285 WARN  (coreLoadExecutor-6077-thread-1) [    ] o.a.s.s.IndexSchema [collection1] default search field in schema is text. WARNING: Deprecated, please use 'df' on request instead.
   [junit4]   2> 1635287 INFO  (coreLoadExecutor-6077-thread-1) [    ] o.a.s.s.IndexSchema Loaded schema test/1.0 with uniqueid field id
   [junit4]   2> 1635293 INFO  (coreLoadExecutor-6077-thread-1) [    ] o.a.s.c.CoreContainer Creating SolrCore 'collection1' using configuration from collection control_collection
   [junit4]   2> 1635293 INFO  (coreLoadExecutor-6077-thread-1) [    ] o.a.s.c.SolrCore [[collection1] ] Opening new SolrCore at [/home/jenkins/workspace/Lucene-Solr-6.x-Linux/solr/build/solr-core/test/J0/temp/solr.cloud.PeerSyncReplicationTest_E1BCCD231971E84A-001/control-001/cores/collection1], dataDir=[/home/jenkins/workspace/Lucene-Solr-6.x-Linux/solr/build/solr-core/test/J0/../../../../../../../../../home/jenkins/workspace/Lucene-Solr-6.x-Linux/solr/build/solr-core/test/J0/temp/solr.cloud.PeerSyncReplicationTest_E1BCCD231971E84A-001/control-001/cores/collection1/data/]
   [junit4]   2> 1635293 INFO  (coreLoadExecutor-6077-thread-1) [    ] o.a.s.c.JmxMonitoredMap JMX monitoring is enabled. Adding Solr mbeans to JMX Server: com.sun.jmx.mbeanserver.JmxMBeanServer@6e4440
   [junit4]   2> 1635299 INFO  (coreLoadExecutor-6077-thread-1) [    ] o.a.s.u.RandomMergePolicy RandomMergePolicy wrapping class org.apache.lucene.index.TieredMergePolicy: [TieredMergePolicy: maxMergeAtOnce=26, maxMergeAtOnceExplicit=50, maxMergedSegmentMB=36.123046875, floorSegmentMB=1.08203125, forceMergeDeletesPctAllowed=19.161192062240314, segmentsPerTier=36.0, maxCFSSegmentSizeMB=8.796093022207999E12, noCFSRatio=0.8319265994243525
   [junit4]   2> 1635323 WARN  (coreLoadExecutor-6077-thread-1) [    ] o.a.s.c.RequestHandlers INVALID paramSet a in requestHandler {type = requestHandler,name = /dump,class = DumpRequestHandler,args = {defaults={a=A,b=B}}}
   [junit4]   2> 1635328 INFO  (coreLoadExecutor-6077-thread-1) [    ] o.a.s.u.UpdateHandler Using UpdateLog implementation: org.apache.solr.update.UpdateLog
   [junit4]   2> 1635328 INFO  (coreLoadExecutor-6077-thread-1) [    ] o.a.s.u.UpdateLog Initializing UpdateLog: dataDir= defaultSyncLevel=FLUSH numRecordsToKeep=1000 maxNumLogsToKeep=10 numVersionBuckets=65536
   [junit4]   2> 1635329 INFO  (coreLoadExecutor-6077-thread-1) [    ] o.a.s.u.CommitTracker Hard AutoCommit: disabled
   [junit4]   2> 1635329 INFO  (coreLoadExecutor-6077-thread-1) [    ] o.a.s.u.CommitTracker Soft AutoCommit: disabled
   [junit4]   2> 1635331 INFO  (coreLoadExecutor-6077-thread-1) [    ] o.a.s.u.RandomMergePolicy RandomMergePolicy wrapping class org.apache.lucene.index.LogByteSizeMergePolicy: [LogByteSizeMergePolicy: minMergeSize=1677721, mergeFactor=40, maxMergeSize=2147483648, maxMergeSizeForForcedMerge=9223372036854775807, calibrateSizeByDeletes=false, maxMergeDocs=2147483647, maxCFSSegmentSizeMB=8.796093022207999E12, noCFSRatio=0.26313351519593153]
   [junit4]   2> 1635332 INFO  (coreLoadExecutor-6077-thread-1) [    ] o.a.s.s.SolrIndexSearcher Opening [Searcher@5462de[collection1] main]
   [junit4]   2> 1635333 INFO  (coreLoadExecutor-6077-thread-1) [    ] o.a.s.r.ManagedResourceStorage Configured ZooKeeperStorageIO with znodeBase: /configs/conf1
   [junit4]   2> 1635333 INFO  (coreLoadExecutor-6077-thread-1) [    ] o.a.s.r.ManagedResourceStorage Loaded null at path _rest_managed.json using ZooKeeperStorageIO:path=/configs/conf1
   [junit4]   2> 1635333 INFO  (coreLoadExecutor-6077-thread-1) [    ] o.a.s.h.ReplicationHandler Commits will be reserved for  10000
   [junit4]   2> 1635334 INFO  (searcherExecutor-6078-thread-1) [    ] o.a.s.c.SolrCore [collection1] Registered new searcher Searcher@5462de[collection1] main{ExitableDirectoryReader(UninvertingDirectoryReader())}
   [junit4]   2> 1635334 INFO  (coreLoadExecutor-6077-thread-1) [    ] o.a.s.u.UpdateLog Could not find max version in index or recent updates, using new clock 1549501310050500608
   [junit4]   2> 1635338 INFO  (coreZkRegister-6070-thread-1) [    ] o.a.s.c.ShardLeaderElectionContext Enough replicas found to continue.
   [junit4]   2> 1635338 INFO  (coreZkRegister-6070-thread-1) [    ] o.a.s.c.ShardLeaderElectionContext I may be the new leader - try and sync
   [junit4]   2> 1635339 INFO  (coreZkRegister-6070-thread-1) [    ] o.a.s.c.SyncStrategy Sync replicas to https://127.0.0.1:43903/collection1/
   [junit4]   2> 1635339 INFO  (coreZkRegister-6070-thread-1) [    ] o.a.s.c.SyncStrategy Sync Success - now sync replicas to me
   [junit4]   2> 1635339 INFO  (coreZkRegister-6070-thread-1) [    ] o.a.s.c.SyncStrategy https://127.0.0.1:43903/collection1/ has no replicas
   [junit4]   2> 1635340 INFO  (coreZkRegister-6070-thread-1) [    ] o.a.s.c.ShardLeaderElectionContext I am the new leader: https://127.0.0.1:43903/collection1/ shard1
   [junit4]   2> 1635491 INFO  (coreZkRegister-6070-thread-1) [    ] o.a.s.c.ZkController I am the leader, no recovery necessary
   [junit4]   2> 1635716 INFO  (TEST-PeerSyncReplicationTest.test-seed#[E1BCCD231971E84A]) [    ] o.a.s.c.c.ZkStateReader Updated live nodes from ZooKeeper... (0) -> (1)
   [junit4]   2> 1635717 INFO  (TEST-PeerSyncReplicationTest.test-seed#[E1BCCD231971E84A]) [    ] o.a.s.c.ChaosMonkey monkey: init - expire sessions:false cause connection loss:false
   [junit4]   2> 1636739 INFO  (TEST-PeerSyncReplicationTest.test-seed#[E1BCCD231971E84A]) [    ] o.a.s.SolrTestCaseJ4 Writing core.properties file to /home/jenkins/workspace/Lucene-Solr-6.x-Linux/solr/build/solr-core/test/J0/temp/solr.cloud.PeerSyncReplicationTest_E1BCCD231971E84A-001/shard-1-001/cores/collection1
   [junit4]   2> 1636741 INFO  (TEST-PeerSyncReplicationTest.test-seed#[E1BCCD231971E84A]) [    ] o.a.s.c.AbstractFullDistribZkTestBase create jetty 1 in directory /home/jenkins/workspace/Lucene-Solr-6.x-Linux/solr/build/solr-core/test/J0/temp/solr.cloud.PeerSyncReplicationTest_E1BCCD231971E84A-001/shard-1-001
   [junit4]   2> 1636743 INFO  (TEST-PeerSyncReplicationTest.test-seed#[E1BCCD231971E84A]) [    ] o.e.j.s.Server jetty-9.3.8.v20160314
   [junit4]   2> 1636744 INFO  (TEST-PeerSyncReplicationTest.test-seed#[E1BCCD231971E84A]) [    ] o.e.j.s.h.ContextHandler Started o.e.j.s.ServletContextHandler@17fe364{/,null,AVAILABLE}
   [junit4]   2> 1636745 INFO  (TEST-PeerSyncReplicationTest.test-seed#[E1BCCD231971E84A]) [    ] o.e.j.s.ServerConnector Started ServerConnector@193b413{SSL,[ssl, http/1.1]}{127.0.0.1:41563}
   [junit4]   2> 1636745 INFO  (TEST-PeerSyncReplicationTest.test-seed#[E1BCCD231971E84A]) [    ] o.e.j.s.Server Started @1638993ms
   [junit4]   2> 1636745 INFO  (TEST-PeerSyncReplicationTest.test-seed#[E1BCCD231971E84A]) [    ] o.a.s.c.s.e.JettySolrRunner Jetty properties: {hostContext=/, solrconfig=solrconfig.xml, solr.data.dir=/home/jenkins/workspace/Lucene-Solr-6.x-Linux/solr/build/solr-core/test/J0/temp/solr.cloud.PeerSyncReplicationTest_E1BCCD231971E84A-001/tempDir-001/jetty1, hostPort=41563, coreRootDirectory=/home/jenkins/workspace/Lucene-Solr-6.x-Linux/solr/build/solr-core/test/J0/temp/solr.cloud.PeerSyncReplicationTest_E1BCCD231971E84A-001/shard-1-001/cores}
   [junit4]   2> 1636745 ERROR (TEST-PeerSyncReplicationTest.test-seed#[E1BCCD231971E84A]) [    ] o.a.s.s.StartupLoggingUtils Missing Java Option solr.log.dir. Logging may be missing or incomplete.
   [junit4]   2> 1636745 INFO  (TEST-PeerSyncReplicationTest.test-seed#[E1BCCD231971E84A]) [    ] o.a.s.s.SolrDispatchFilter  ___      _       Welcome to Apache Solr™ version 6.3.0
   [junit4]   2> 1636745 INFO  (TEST-PeerSyncReplicationTest.test-seed#[E1BCCD231971E84A]) [    ] o.a.s.s.SolrDispatchFilter / __| ___| |_ _   Starting in cloud mode on port null
   [junit4]   2> 1636745 INFO  (TEST-PeerSyncReplicationTest.test-seed#[E1BCCD231971E84A]) [    ] o.a.s.s.SolrDispatchFilter \__ \/ _ \ | '_|  Install dir: null
   [junit4]   2> 1636746 INFO  (TEST-PeerSyncReplicationTest.test-seed#[E1BCCD231971E84A]) [    ] o.a.s.s.SolrDispatchFilter |___/\___/_|_|    Start time: 2016-10-29T05:40:04.045011Z
   [junit4]   2> 1636748 INFO  (TEST-PeerSyncReplicationTest.test-seed#[E1BCCD231971E84A]) [    ] o.a.s.s.SolrDispatchFilter Loading solr.xml from SolrHome (not found in ZooKeeper)
   [junit4]   2> 1636748 INFO  (TEST-PeerSyncReplicationTest.test-seed#[E1BCCD231971E84A]) [    ] o.a.s.c.SolrXmlConfig Loading container configuration from /home/jenkins/workspace/Lucene-Solr-6.x-Linux/solr/build/solr-core/test/J0/temp/solr.cloud.PeerSyncReplicationTest_E1BCCD231971E84A-001/shard-1-001/solr.xml
   [junit4]   2> 1636754 INFO  (TEST-PeerSyncReplicationTest.test-seed#[E1BCCD231971E84A]) [    ] o.a.s.u.UpdateShardHandler Creating UpdateShardHandler HTTP client with params: socketTimeout=340000&connTimeout=45000&retry=true
   [junit4]   2> 1636756 INFO  (TEST-PeerSyncReplicationTest.test-seed#[E1BCCD231971E84A]) [    ] o.a.s.c.ZkContainer Zookeeper client=127.0.0.1:34000/solr
   [junit4]   2> 1636761 INFO  (TEST-PeerSyncReplicationTest.test-seed#[E1BCCD231971E84A]) [    ] o.a.s.c.c.ZkStateReader Updated live nodes from ZooKeeper... (0) -> (1)
   [junit4]   2> 1636763 INFO  (TEST-PeerSyncReplicationTest.test-seed#[E1BCCD231971E84A]) [    ] o.a.s.c.ZkController Register node as live in ZooKeeper:/live_nodes/127.0.0.1:41563_
   [junit4]   2> 1636763 INFO  (zkCallback-1892-thread-1) [    ] o.a.s.c.c.ZkStateReader Updated live nodes from ZooKeeper... (1) -> (2)
   [junit4]   2> 1636763 INFO  (zkCallback-1901-thread-1) [    ] o.a.s.c.c.ZkStateReader Updated live nodes from ZooKeeper... (1) -> (2)
   [junit4]   2> 1636763 INFO  (zkCallback-1896-thread-1) [    ] o.a.s.c.c.ZkStateReader Updated live nodes from ZooKeeper... (1) -> (2)
   [junit4]   2> 1636782 INFO  (TEST-PeerSyncReplicationTest.test-seed#[E1BCCD231971E84A]) [    ] o.a.s.c.CorePropertiesLocator Found 1 core definitions underneath /home/jenkins/workspace/Lucene-Solr-6.x-Linux/solr/build/solr-core/test/J0/temp/solr.cloud.PeerSyncReplicationTest_E1BCCD231971E84A-001/shard-1-001/cores
   [junit4]   2> 1636782 INFO  (TEST-PeerSyncReplicationTest.test-seed#[E1BCCD231971E84A]) [    ] o.a.s.c.CorePropertiesLocator Cores are: [collection1]
   [junit4]   2> 1636783 INFO  (OverseerStateUpdate-96843831726637061-127.0.0.1:43903_-n_0000000000) [    ] o.a.s.c.o.ReplicaMutator Assigning new node to shard shard=shard1
   [junit4]   2> 1637791 INFO  (coreLoadExecutor-6088-thread-1) [    ] o.a.s.c.SolrConfig Using Lucene MatchVersion: 6.3.0
   [junit4]   2> 1637800 INFO  (coreLoadExecutor-6088-thread-1) [    ] o.a.s.s.IndexSchema [collection1] Schema name=test
   [junit4]   2> 1637867 WARN  (coreLoadExecutor-6088-thread-1) [    ] o.a.s.s.IndexSchema [collection1] default search field in schema is text. WARNING: Deprecated, please use 'df' on request instead.
   [junit4]   2> 1637869 INFO  (coreLoadExecutor-6088-thread-1) [    ] o.a.s.s.IndexSchema Loaded schema test/1.0 with uniqueid field id
   [junit4]   2> 1637876 INFO  (coreLoadExecutor-6088-thread-1) [    ] o.a.s.c.CoreContainer Creating SolrCore 'collection1' using configuration from collection collection1
   [junit4]   2> 1637877 INFO  (coreLoadExecutor-6088-thread-1) [    ] o.a.s.c.SolrCore [[collection1] ] Opening new SolrCore at [/home/jenkins/workspace/Lucene-Solr-6.x-Linux/solr/build/solr-core/test/J0/temp/solr.cloud.PeerSyncReplicationTest_E1BCCD231971E84A-001/shard-1-001/cores/collection1], dataDir=[/home/jenkins/workspace/Lucene-Solr-6.x-Linux/solr/build/solr-core/test/J0/temp/solr.cloud.PeerSyncReplicationTest_E1BCCD231971E84A-001/shard-1-001/cores/collection1/data/]
   [junit4]   2> 1637877 INFO  (coreLoadExecutor-6088-thread-1) [    ] o.a.s.c.JmxMonitoredMap JMX monitoring is enabled. Adding Solr mbeans to JMX Server: com.sun.jmx.mbeanserver.JmxMBeanServer@6e4440
   [junit4]   2> 1637883 INFO  (coreLoadExecutor-6088-thread-1) [    ] o.a.s.u.RandomMergePolicy RandomMergePolicy wrapping class org.apache.lucene.index.TieredMergePolicy: [TieredMergePolicy: maxMergeAtOnce=26, maxMergeAtOnceExplicit=50, maxMergedSegmentMB=36.123046875, floorSegmentMB=1.08203125, forceMergeDeletesPctAllowed=19.161192062240314, segmentsPerTier=36.0, maxCFSSegmentSizeMB=8.796093022207999E12, noCFSRatio=0.8319265994243525
   [junit4]   2> 1637952 WARN  (coreLoadExecutor-6088-thread-1) [    ] o.a.s.c.RequestHandlers INVALID paramSet a in requestHandler {type = requestHandler,name = /dump,class = DumpRequestHandler,args = {defaults={a=A,b=B}}}
   [junit4]   2> 1637960 INFO  (coreLoadExecutor-6088-thread-1) [    ] o.a.s.u.UpdateHandler Using UpdateLog implementation: org.apache.solr.update.UpdateLog
   [junit4]   2> 1637961 INFO  (coreLoadExecutor-6088-thread-1) [    ] o.a.s.u.UpdateLog Initializing UpdateLog: dataDir= defaultSyncLevel=FLUSH numRecordsToKeep=1000 maxNumLogsToKeep=10 numVersionBuckets=65536
   [junit4]   2> 1637962 INFO  (coreLoadExecutor-6088-thread-1) [    ] o.a.s.u.CommitTracker Hard AutoCommit: disabled
   [junit4]   2> 1637962 INFO  (coreLoadExecutor-6088-thread-1) [    ] o.a.s.u.CommitTracker Soft AutoCommit: disabled
   [junit4]   2> 1637963 INFO  (coreLoadExecutor-6088-thread-1) [    ] o.a.s.u.RandomMergePolicy RandomMergePolicy wrapping class org.apache.lucene.index.LogByteSizeMergePolicy: [LogByteSizeMergePolicy: minMergeSize=1677721, mergeFactor=40, maxMergeSize=2147483648, maxMergeSizeForForcedMerge=9223372036854775807, calibrateSizeByDeletes=false, maxMergeDocs=2147483647, maxCFSSegmentSizeMB=8.796093022207999E12, noCFSRatio=0.26313351519593153]
   [junit4]   2> 1637966 INFO  (coreLoadExecutor-6088-thread-1) [    ] o.a.s.s.SolrIndexSearcher Opening [Searcher@17a2aef[collection1] main]
   [junit4]   2> 1637966 INFO  (coreLoadExecutor-6088-thread-1) [    ] o.a.s.r.ManagedResourceStorage Configured ZooKeeperStorageIO with znodeBase: /configs/conf1
   [junit4]   2> 1637966 INFO  (coreLoadExecutor-6088-thread-1) [    ] o.a.s.r.ManagedResourceStorage Loaded null at path _rest_managed.json using ZooKeeperStorageIO:path=/configs/conf1
   [junit4]   2> 1637967 INFO  (coreLoadExecutor-6088-thread-1) [    ] o.a.s.h.ReplicationHandler Commits will be reserved for  10000
   [junit4]   2> 1637967 INFO  (searcherExecutor-6089-thread-1) [    ] o.a.s.c.SolrCore [collection1] Registered new searcher Searcher@17a2aef[collection1] main{ExitableDirectoryReader(UninvertingDirectoryReader())}
   [junit4]   2> 1637967 INFO  (coreLoadExecutor-6088-thread-1) [    ] o.a.s.u.UpdateLog Could not find max version in index or recent updates, using new clock 1549501312811401216
   [junit4]   2> 1637972 INFO  (coreZkRegister-6083-thread-1) [    ] o.a.s.c.ShardLeaderElectionContext Enough replicas found to continue.
   [junit4]   2> 1637972 INFO  (coreZkRegister-6083-thread-1) [    ] o.a.s.c.ShardLeaderElectionContext I may be the new leader - try and sync
   [junit4]   2> 1637972 INFO  (coreZkRegister-6083-thread-1) [    ] o.a.s.c.SyncStrategy Sync replicas to https://127.0.0.1:41563/collection1/
   [junit4]   2> 1637972 INFO  (coreZkRegister-6083-thread-1) [    ] o.a.s.c.SyncStrategy Sync Success - now sync replicas to me
   [junit4]   2> 1637972 INFO  (coreZkRegister-6083-thread-1) [    ] o.a.s.c.SyncStrategy https://127.0.0.1:41563/collection1/ has no replicas
   [junit4]   2> 1637974 INFO  (coreZkRegister-6083-thread-1) [    ] o.a.s.c.ShardLeaderElectionContext I am the new leader: https://127.0.0.1:41563/collection1/ shard1
   [junit4]   2> 1638124 INFO  (coreZkRegister-6083-thread-1) [    ] o.a.s.c.ZkController I am the leader, no recovery necessary
   [junit4]   2> 1639092 INFO  (TEST-PeerSyncReplicationTest.test-seed#[E1BCCD231971E84A]) [    ] o.a.s.SolrTestCaseJ4 Writing core.properties file to /home/jenkins/workspace/Lucene-Solr-6.x-Linux/solr/build/solr-core/test/J0/temp/solr.cloud.PeerSyncReplicationTest_E1BCCD231971E84A-001/shard-2-001/cores/collection1
   [junit4]   2> 1639093 INFO  (TEST-PeerSyncReplicationTest.test-seed#[E1BCCD231971E84A]) [    ] o.a.s.c.AbstractFullDistribZkTestBase create jetty 2 in directory /home/jenkins/workspace/Lucene-Solr-6.x-Linux/solr/build/solr-core/test/J0/temp/solr.cloud.PeerSyncReplicationTest_E1BCCD231971E84A-001/shard-2-001
   [junit4]   2> 1639095 INFO  (TEST-PeerSyncReplicationTest.test-seed#[E1BCCD231971E84A]) [    ] o.e.j.s.Server jetty-9.3.8.v20160314
   [junit4]   2> 1639096 INFO  (TEST-PeerSyncReplicationTest.test-seed#[E1BCCD231971E84A]) [    ] o.e.j.s.h.ContextHandler Started o.e.j.s.ServletContextHandler@3fd74e{/,null,AVAILABLE}
   [junit4]   2> 1639096 INFO  (TEST-PeerSyncReplicationTest.test-seed#[E1BCCD231971E84A]) [    ] o.e.j.s.ServerConnector Started ServerConnector@d84e2c{SSL,[ssl, http/1.1]}{127.0.0.1:43753}
   [junit4]   2> 1639096 INFO  (TEST-PeerSyncReplicationTest.test-seed#[E1BCCD231971E84A]) [    ] o.e.j.s.Server Started @1641344ms
   [junit4]   2> 1639097 INFO  (TEST-PeerSyncReplicationTest.test-seed#[E1BCCD231971E84A]) [    ] o.a.s.c.s.e.JettySolrRunner Jetty properties: {hostContext=/, solrconfig=solrconfig.xml, solr.data.dir=/home/jenkins/workspace/Lucene-Solr-6.x-Linux/solr/build/solr-core/test/J0/temp/solr.cloud.PeerSyncReplicationTest_E1BCCD231971E84A-001/tempDir-001/jetty2, hostPort=43753, coreRootDirectory=/home/jenkins/workspace/Lucene-Solr-6.x-Linux/solr/build/solr-core/test/J0/temp/solr.cloud.PeerSyncReplicationTest_E1BCCD231971E84A-001/shard-2-001/cores}
   [junit4]   2> 1639097 ERROR (TEST-PeerSyncReplicationTest.test-seed#[E1BCCD231971E84A]) [    ] o.a.s.s.StartupLoggingUtils Missing Java Option solr.log.dir. Logging may be missing or incomplete.
   [junit4]   2> 1639097 INFO  (TEST-PeerSyncReplicationTest.test-seed#[E1BCCD231971E84A]) [    ] o.a.s.s.SolrDispatchFilter  ___      _       Welcome to Apache Solr™ version 6.3.0
   [junit4]   2> 1639097 INFO  (TEST-PeerSyncReplicationTest.test-seed#[E1BCCD231971E84A]) [    ] o.a.s.s.SolrDispatchFilter / __| ___| |_ _   Starting in cloud mode on port null
   [junit4]   2> 1639097 INFO  (TEST-PeerSyncReplicationTest.test-seed#[E1BCCD231971E84A]) [    ] o.a.s.s.SolrDispatchFilter \__ \/ _ \ | '_|  Install dir: null
   [junit4]   2> 1639097 INFO  (TEST-PeerSyncReplicationTest.test-seed#[E1BCCD231971E84A]) [    ] o.a.s.s.SolrDispatchFilter |___/\___/_|_|    Start time: 2016-10-29T05:40:06.396491Z
   [junit4]   2> 1639100 INFO  (TEST-PeerSyncReplicationTest.test-seed#[E1BCCD231971E84A]) [    ] o.a.s.s.SolrDispatchFilter Loading solr.xml from SolrHome (not found in ZooKeeper)
   [junit4]   2> 1639100 INFO  (TEST-PeerSyncReplicationTest.test-seed#[E1BCCD231971E84A]) [    ] o.a.s.c.SolrXmlConfig Loading container configuration from /home/jenkins/workspace/Lucene-Solr-6.x-Linux/solr/build/solr-core/test/J0/temp/solr.cloud.PeerSyncReplicationTest_E1BCCD231971E84A-001/shard-2-001/solr.xml
   [junit4]   2> 1639106 INFO  (TEST-PeerSyncReplicationTest.test-seed#[E1BCCD231971E84A]) [    ] o.a.s.u.UpdateShardHandler Creating UpdateShardHandler HTTP client with params: socketTimeout=340000&connTimeout=45000&retry=true
   [junit4]   2> 1639108 INFO  (TEST-PeerSyncReplicationTest.test-seed#[E1BCCD231971E84A]) [    ] o.a.s.c.ZkContainer Zookeeper client=127.0.0.1:34000/solr
   [junit4]   2> 1639113 INFO  (TEST-PeerSyncReplicationTest.test-seed#[E1BCCD231971E84A]) [    ] o.a.s.c.c.ZkStateReader Updated live nodes from ZooKeeper... (0) -> (2)
   [junit4]   2> 1639115 INFO  (TEST-PeerSyncReplicationTest.test-seed#[E1BCCD231971E84A]) [    ] o.a.s.c.ZkController Register node as live in ZooKeeper:/live_nodes/127.0.0.1:43753_
   [junit4]   2> 1639115 INFO  (zkCallback-1892-thread-2) [    ] o.a.s.c.c.ZkStateReader Updated live nodes from ZooKeeper... (2) -> (3)
   [junit4]   2> 1639115 INFO  (zkCallback-1896-thread-1) [    ] o.a.s.c.c.ZkStateReader Updated live nodes from ZooKeeper... (2) -> (3)
   [junit4]   2> 1639116 INFO  (zkCallback-1907-thread-1) [    ] o.a.s.c.c.ZkStateReader Updated live nodes from ZooKeeper... (2) -> (3)
   [junit4]   2> 1639116 INFO  (zkCallback-1901-thread-1) [    ] o.a.s.c.c.ZkStateReader Updated live nodes from ZooKeeper... (2) -> (3)
   [junit4]   2> 1639137 INFO  (TEST-PeerSyncReplicationTest.test-seed#[E1BCCD231971E84A]) [    ] o.a.s.c.CorePropertiesLocator Found 1 core definitions underneath /home/jenkins/workspace/Lucene-Solr-6.x-Linux/solr/build/solr-core/test/J0/temp/solr.cloud.PeerSyncReplicationTest_E1BCCD231971E84A-001/shard-2-001/cores
   [junit4]   2> 1639137 INFO  (TEST-PeerSyncReplicationTest.test-seed#[E1BCCD231971E84A]) [    ] o.a.s.c.CorePropertiesLocator Cores are: [collection1]
   [junit4]   2> 1639138 INFO  (OverseerStateUpdate-96843831726637061-127.0.0.1:43903_-n_0000000000) [    ] o.a.s.c.o.ReplicaMutator Assigning new node to shard shard=shard1
   [junit4]   2> 1640145 INFO  (coreLoadExecutor-6099-thread-1) [    ] o.a.s.c.SolrConfig Using Lucene MatchVersion: 6.3.0
   [junit4]   2> 1640154 INFO  (coreLoadExecutor-6099-thread-1) [    ] o.a.s.s.IndexSchema [collection1] Schema name=test
   [junit4]   2> 1640211 WARN  (coreLoadExecutor-6099-thread-1) [    ] o.a.s.s.IndexSchema [collection1] default search field in schema is text. WARNING: Deprecated, please use 'df' on request instead.
   [junit4]   2> 1640213 INFO  (coreLoadExecutor-6099-thread-1) [    ] o.a.s.s.IndexSchema Loaded schema test/1.0 with uniqueid field id
   [junit4]   2> 1640218 INFO  (coreLoadExecutor-6099-thread-1) [    ] o.a.s.c.CoreContainer Creating SolrCore 'collection1' using configuration from collection collection1
   [junit4]   2> 1640218 INFO  (coreLoadExecutor-6099-thread-1) [    ] o.a.s.c.SolrCore [[collection1] ] Opening new SolrCore at [/home/jenkins/workspace/Lucene-Solr-6.x-Linux/solr/build/solr-core/test/J0/temp/solr.cloud.PeerSyncReplicationTest_E1BCCD231971E84A-001/shard-2-001/cores/collection1], dataDir=[/home/jenkins/workspace/Lucene-Solr-6.x-Linux/solr/build/solr-core/test/J0/temp/solr.cloud.PeerSyncReplicationTest_E1BCCD231971E84A-001/shard-2-001/cores/collection1/data/]
   [junit4]   2> 1640218 INFO  (coreLoadExecutor-6099-thread-1) [    ] o.a.s.c.JmxMonitoredMap JMX monitoring is enabled. Adding Solr mbeans to JMX Server: com.sun.jmx.mbeanserver.JmxMBeanServer@6e4440
   [junit4]   2> 1640224 INFO  (coreLoadExecutor-6099-thread-1) [    ] o.a.s.u.RandomMergePolicy RandomMergePolicy wrapping class org.apache.lucene.index.TieredMergePolicy: [TieredMergePolicy: maxMergeAtOnce=26, maxMergeAtOnceExplicit=50, maxMergedSegmentMB=36.123046875, floorSegmentMB=1.08203125, forceMergeDeletesPctAllowed=19.161192062240314, segmentsPerTier=36.0, maxCFSSegmentSizeMB=8.796093022207999E12, noCFSRatio=0.8319265994243525
   [junit4]   2> 1640281 WARN  (coreLoadExecutor-6099-thread-1) [    ] o.a.s.c.RequestHandlers INVALID paramSet a in requestHandler {type = requestHandler,name = /dump,class = DumpRequestHandler,args = {defaults={a=A,b=B}}}
   [junit4]   2> 1640289 INFO  (coreLoadExecutor-6099-thread-1) [    ] o.a.s.u.UpdateHandler Using UpdateLog implementation: org.apache.solr.update.UpdateLog
   [junit4]   2> 1640289 INFO  (coreLoadExecutor-6099-thread-1) [    ] o.a.s.u.UpdateLog Initializing UpdateLog: dataDir= defaultSyncLevel=FLUSH numRecordsToKeep=1000 maxNumLogsToKeep=10 numVersionBuckets=65536
   [junit4]   2> 1640290 INFO  (coreLoadExecutor-6099-thread-1) [    ] o.a.s.u.CommitTracker Hard AutoCommit: disabled
   [junit4]   2> 1640290 INFO  (coreLoadExecutor-6099-thread-1) [    ] o.a.s.u.CommitTracker Soft AutoCommit: disabled
   [junit4]   2> 1640291 INFO  (coreLoadExecutor-6099-thread-1) [    ] o.a.s.u.RandomMergePolicy RandomMergePolicy wrapping class org.apache.lucene.index.LogByteSizeMergePolicy: [LogByteSizeMergePolicy: minMergeSize=1677721, mergeFactor=40, maxMergeSize=2147483648, maxMergeSizeForForcedMerge=9223372036854775807, calibrateSizeByDeletes=false, maxMergeDocs=2147483647, maxCFSSegmentSizeMB=8.796093022207999E12, noCFSRatio=0.26313351519593153]
   [junit4]   2> 1640293 INFO  (coreLoadExecutor-6099-thread-1) [    ] o.a.s.s.SolrIndexSearcher Opening [Searcher@16c9530[collection1] main]
   [junit4]   2> 1640293 INFO  (coreLoadExecutor-6099-thread-1) [    ] o.a.s.r.ManagedResourceStorage Configured ZooKeeperStorageIO with znodeBase: /configs/conf1
   [junit4]   2> 1640294 INFO  (coreLoadExecutor-6099-thread-1) [    ] o.a.s.r.ManagedResourceStorage Loaded null at path _rest_managed.json using ZooKeeperStorageIO:path=/configs/conf1
   [junit4]   2> 1640294 INFO  (coreLoadExecutor-6099-thread-1) [    ] o.a.s.h.ReplicationHandler Commits will be reserved for  10000
   [junit4]   2> 1640295 INFO  (searcherExecutor-6100-thread-1) [    ] o.a.s.c.SolrCore [collection1] Registered new searcher Searcher@16c9530[collection1] main{ExitableDirectoryReader(UninvertingDirectoryReader())}
   [junit4]   2> 1640295 INFO  (coreLoadExecutor-6099-thread-1) [    ] o.a.s.u.UpdateLog Could not find max version in index or recent updates, using new clock 1549501315252486144
   [junit4]   2> 1640298 INFO  (coreZkRegister-6094-thread-1) [    ] o.a.s.c.ZkController Core needs to recover:collection1
   [junit4]   2> 1640298 INFO  (updateExecutor-1904-thread-1) [    ] o.a.s.u.DefaultSolrCoreState Running recovery
   [junit4]   2> 1640298 INFO  (recoveryExecutor-1905-thread-1) [    ] o.a.s.c.RecoveryStrategy Starting recovery process. recoveringAfterStartup=true
   [junit4]   2> 1640299 INFO  (recoveryExecutor-1905-thread-1) [    ] o.a.s.c.RecoveryStrategy ###### startupVersions=[[]]
   [junit4]   2> 1640299 INFO  (recoveryExecutor-1905-thread-1) [    ] o.a.s.c.RecoveryStrategy Begin buffering updates. core=[collection1]
   [junit4]   2> 1640299 INFO  (recoveryExecutor-1905-thread-1) [    ] o.a.s.u.UpdateLog Starting to buffer updates. FSUpdateLog{state=ACTIVE, tlog=null}
   [junit4]   2> 1640299 INFO  (recoveryExecutor-1905-thread-1) [    ] o.a.s.c.RecoveryStrategy Publishing state of core [collection1] as recovering, leader is [https://127.0.0.1:41563/collection1/] and I am [https://127.0.0.1:43753/collection1/]
   [junit4]   2> 1640301 INFO  (recoveryExecutor-1905-thread-1) [    ] o.a.s.c.RecoveryStrategy Sending prep recovery command to [https://127.0.0.1:41563]; [WaitForState: action=PREPRECOVERY&core=collection1&nodeName=127.0.0.1:43753_&coreNodeName=core_node2&state=recovering&checkLive=true&onlyIfLeader=true&onlyIfLeaderActive=true]
   [junit4]   2> 1640365 INFO  (qtp9812864-11519) [    ] o.a.s.h.a.PrepRecoveryOp Going to wait for coreNodeName: core_node2, state: recovering, checkLive: true, onlyIfLeader: true, onlyIfLeaderActive: true
   [junit4]   2> 1640365 INFO  (qtp9812864-11519) [    ] o.a.s.h.a.PrepRecoveryOp Will wait a max of 183 seconds to see collection1 (shard1 of collection1) have state: recovering
   [junit4]   2> 1640365 INFO  (qtp9812864-11519) [    ] o.a.s.h.a.PrepRecoveryOp In WaitForState(recovering): collection=collection1, shard=shard1, thisCore=collection1, leaderDoesNotNeedRecovery=false, isLeader? true, live=true, checkLive=true, currentState=down, localState=active, nodeName=127.0.0.1:43753_, coreNodeName=core_node2, onlyIfActiveCheckResult=false, nodeProps: core_node2:{"core":"collection1","base_url":"https://127.0.0.1:43753","node_name":"127.0.0.1:43753_","state":"down"}
   [junit4]   2> 1641365 INFO  (qtp9812864-11519) [    ] o.a.s.h.a.PrepRecoveryOp In WaitForState(recovering): collection=collection1, shard=shard1, thisCore=collection1, leaderDoesNotNeedRecovery=false, isLeader? true, live=true, checkLive=true, currentState=recovering, localState=active, nodeName=127.0.0.1:43753_, coreNodeName=core_node2, onlyIfActiveCheckResult=false, nodeProps: core_node2:{"core":"collection1","base_url":"https://127.0.0.1:43753","node_name":"127.0.0.1:43753_","state":"recovering"}
   [junit4]   2> 1641365 INFO  (qtp9812864-11519) [    ] o.a.s.h.a.PrepRecoveryOp Waited coreNodeName: core_node2, state: recovering, checkLive: true, onlyIfLeader: true for: 1 seconds.
   [junit4]   2> 1641366 INFO  (qtp9812864-11519) [    ] o.a.s.s.HttpSolrCall [admin] webapp=null path=/admin/cores params={nodeName=127.0.0.1:43753_&onlyIfLeaderActive=true&core=collection1&coreNodeName=core_node2&action=PREPRECOVERY&checkLive=true&state=recovering&onlyIfLeader=true&wt=javabin&version=2} status=0 QTime=1000
   [junit4]   2> 1641583 INFO  (TEST-PeerSyncReplicationTest.test-seed#[E1BCCD231971E84A]) [    ] o.a.s.SolrTestCaseJ4 Writing core.properties file to /home/jenkins/workspace/Lucene-Solr-6.x-Linux/solr/build/solr-core/test/J0/temp/solr.cloud.PeerSyncReplicationTest_E1BCCD231971E84A-001/shard-3-001/cores/collection1
   [junit4]   2> 1641585 INFO  (TEST-PeerSyncReplicationTest.test-seed#[E1BCCD231971E84A]) [    ] o.a.s.c.AbstractFullDistribZkTestBase create jetty 3 in directory /home/jenkins/workspace/Lucene-Solr-6.x-Linux/solr/build/solr-core/test/J0/temp/solr.cloud.PeerSyncReplicationTest_E1BCCD231971E84A-001/shard-3-001
   [junit4]   2> 1641586 INFO  (TEST-PeerSyncReplicationTest.test-seed#[E1BCCD231971E84A]) [    ] o.e.j.s.Server jetty-9.3.8.v20160314
   [junit4]   2> 1641587 INFO  (TEST-PeerSyncReplicationTest.test-seed#[E1BCCD231971E84A]) [    ] o.e.j.s.h.ContextHandler Started o.e.j.s.ServletContextHandler@984fb{/,null,AVAILABLE}
   [junit4]   2> 1641588 INFO  (TEST-PeerSyncReplicationTest.test-seed#[E1BCCD231971E84A]) [    ] o.e.j.s.ServerConnector Started ServerConnector@17fe48a{SSL,[ssl, http/1.1]}{127.0.0.1:37613}
   [junit4]   2> 1641588 INFO  (TEST-PeerSyncReplicationTest.test-seed#[E1BCCD231971E84A]) [    ] o.e.j.s.Server Started @1643835ms
   [junit4]   2> 1641588 INFO  (TEST-PeerSyncReplicationTest.test-seed#[E1BCCD231971E84A]) [    ] o.a.s.c.s.e.JettySolrRunner Jetty properties: {hostContext=/, solrconfig=solrconfig.xml, solr.data.dir=/home/jenkins/workspace/Lucene-Solr-6.x-Linux/solr/build/solr-core/test/J0/temp/solr.cloud.PeerSyncReplicationTest_E1BCCD231971E84A-001/tempDir-001/jetty3, hostPort=37613, coreRootDirectory=/home/jenkins/workspace/Lucene-Solr-6.x-Linux/solr/build/solr-core/test/J0/temp/solr.cloud.PeerSyncReplicationTest_E1BCCD231971E84A-001/shard-3-001/cores}
   [junit4]   2> 1641588 ERROR (TEST-PeerSyncReplicationTest.test-seed#[E1BCCD231971E84A]) [    ] o.a.s.s.StartupLoggingUtils Missing Java Option solr.log.dir. Logging may be missing or incomplete.
   [junit4]   2> 1641588 INFO  (TEST-PeerSyncReplicationTest.test-seed#[E1BCCD231971E84A]) [    ] o.a.s.s.SolrDispatchFilter  ___      _       Welcome to Apache Solr™ version 6.3.0
   [junit4]   2> 1641588 INFO  (TEST-PeerSyncReplicationTest.test-seed#[E1BCCD231971E84A]) [    ] o.a.s.s.SolrDispatchFilter / __| ___| |_ _   Starting in cloud mode on port null
   [junit4]   2> 1641588 INFO  (TEST-PeerSyncReplicationTest.test-seed#[E1BCCD231971E84A]) [    ] o.a.s.s.SolrDispatchFilter \__ \/ _ \ | '_|  Install dir: null
   [junit4]   2> 1641588 INFO  (TEST-PeerSyncReplicationTest.test-seed#[E1BCCD231971E84A]) [    ] o.a.s.s.SolrDispatchFilter |___/\___/_|_|    Start time: 2016-10-29T05:40:08.887728Z
   [junit4]   2> 1641591 INFO  (TEST-PeerSyncReplicationTest.test-seed#[E1BCCD231971E84A]) [    ] o.a.s.s.SolrDispatchFilter Loading solr.xml from SolrHome (not found in ZooKeeper)
   [junit4]   2> 1641591 INFO  (TEST-PeerSyncReplicationTest.test-seed#[E1BCCD231971E84A]) [    ] o.a.s.c.SolrXmlConfig Loading container configuration from /home/jenkins/workspace/Lucene-Solr-6.x-Linux/solr/build/solr-core/test/J0/temp/solr.cloud.PeerSyncReplicationTest_E1BCCD231971E84A-001/shard-3-001/solr.xml
   [junit4]   2> 1641596 INFO  (TEST-PeerSyncReplicationTest.test-seed#[E1BCCD231971E84A]) [    ] o.a.s.u.UpdateShardHandler Creating UpdateShardHandler HTTP client with params: socketTimeout=340000&connTimeout=45000&retry=true
   [junit4]   2> 1641598 INFO  (TEST-PeerSyncReplicationTest.test-seed#[E1BCCD231971E84A]) [    ] o.a.s.c.ZkContainer Zookeeper client=127.0.0.1:34000/solr
   [junit4]   2> 1641603 INFO  (TEST-PeerSyncReplicationTest.test-seed#[E1BCCD231971E84A]) [    ] o.a.s.c.c.ZkStateReader Updated live nodes from ZooKeeper... (0) -> (3)
   [junit4]   2> 1641605 INFO  (TEST-PeerSyncReplicationTest.test-seed#[E1BCCD231971E84A]) [    ] o.a.s.c.ZkController Register node as live in ZooKeeper:/live_nodes/127.0.0.1:37613_
   [junit4]   2> 1641606 INFO  (zkCallback-1892-thread-2) [    ] o.a.s.c.c.ZkStateReader Updated live nodes from ZooKeeper... (3) -> (4)
   [junit4]   2> 1641606 INFO  (zkCallback-1901-thread-1) [    ] o.a.s.c.c.ZkStateReader Updated live nodes from ZooKeeper... (3) -> (4)
   [junit4]   2> 1641606 INFO  (zkCallback-1914-thread-1) [    ] o.a.s.c.c.ZkStateReader Updated live nodes from ZooKeeper... (3) -> (4)
   [junit4]   2> 1641606 INFO  (zkCallback-1907-thread-1) [    ] o.a.s.c.c.ZkStateReader Updated live nodes from ZooKeeper... (3) -> (4)
   [junit4]   2> 1641606 INFO  (zkCallback-1896-thread-1) [    ] o.a.s.c.c.ZkStateReader Updated live nodes from ZooKeeper... (3) -> (4)
   [junit4]   2> 1641622 INFO  (TEST-PeerSyncReplicationTest.test-seed#[E1BCCD231971E84A]) [    ] o.a.s.c.CorePropertiesLocator Found 1 core definitions underneath /home/jenkins/workspace/Lucene-Solr-6.x-Linux/solr/build/solr-core/test/J0/temp/solr.cloud.PeerSyncReplicationTest_E1BCCD231971E84A-001/shard-3-001/cores
   [junit4]   2> 1641622 INFO  (TEST-PeerSyncReplicationTest.test-seed#[E1BCCD231971E84A]) [    ] o.a.s.c.CorePropertiesLocator Cores are: [collection1]
   [junit4]   2> 1641624 INFO  (OverseerStateUpdate-96843831726637061-127.0.0.1:43903_-n_0000000000) [    ] o.a.s.c.o.ReplicaMutator Assigning new node to shard shard=shard1
   [junit4]   2> 1641866 INFO  (recoveryExecutor-1905-thread-1) [    ] o.a.s.c.RecoveryStrategy Attempting to PeerSync from [https://127.0.0.1:41563/collection1/] - recoveringAfterStartup=[true]
   [junit4]   2> 1641867 INFO  (recoveryExecutor-1905-thread-1) [    ] o.a.s.u.PeerSync PeerSync: core=collection1 url=https://127.0.0.1:43753 START replicas=[https://127.0.0.1:41563/collection1/] nUpdates=1000
   [junit4]   2> 1641871 INFO  (qtp9812864-11525) [    ] o.a.s.u.IndexFingerprint IndexFingerprint millis:1.0 result:{maxVersionSpecified=9223372036854775807, maxVersionEncountered=0, maxInHash=0, versionsHash=0, numVersions=0, numDocs=0, maxDoc=0}
   [junit4]   2> 1641871 INFO  (qtp9812864-11525) [    ] o.a.s.c.S.Request [collection1]  webapp= path=/get params={distrib=false&qt=/get&getFingerprint=9223372036854775807&wt=javabin&version=2} status=0 QTime=1
   [junit4]   2> 1641872 INFO  (recoveryExecutor-1905-thread-1) [    ] o.a.s.u.IndexFingerprint IndexFingerprint millis:0.0 result:{maxVersionSpecified=9223372036854775807, maxVersionEncountered=0, maxInHash=0, versionsHash=0, numVersions=0, numDocs=0, maxDoc=0}
   [junit4]   2> 1641872 INFO  (recoveryExecutor-1905-thread-1) [    ] o.a.s.u.PeerSync We are already in sync. No need to do a PeerSync 
   [junit4]   2> 1641872 INFO  (recoveryExecutor-1905-thread-1) [    ] o.a.s.u.DirectUpdateHandler2 start commit{,optimize=false,openSearcher=true,waitSearcher=true,expungeDeletes=false,softCommit=false,prepareCommit=false}
   [junit4]   2> 1641872 INFO  (recoveryExecutor-1905-thread-1) [    ] o.a.s.u.DirectUpdateHandler2 No uncommitted changes. Skipping IW.commit.
   [junit4]   2> 1641873 INFO  (recoveryExecutor-1905-thread-1) [    ] o.a.s.u.DirectUpdateHandler2 end_commit_flush
   [junit4]   2> 1641873 INFO  (recoveryExecutor-1905-thread-1) [    ] o.a.s.c.RecoveryStrategy PeerSync stage of recovery was successful.
   [junit4]   2> 1641873 INFO  (recoveryExecutor-1905-thread-1) [    ] o.a.s.c.RecoveryStrategy Replaying updates buffered during PeerSync.
   [junit4]   2> 1641873 INFO  (recoveryExecutor-1905-thread-1) [    ] o.a.s.c.RecoveryStrategy No replay needed.
   [junit4]   2> 1641873 INFO  (recoveryExecutor-1905-thread-1) [    ] o.a.s.c.RecoveryStrategy Registering as Active after recovery.
   [junit4]   2> 1642633 INFO  (coreLoadExecutor-6110-thread-1) [    ] o.a.s.c.SolrConfig Using Lucene MatchVersion: 6.3.0
   [junit4]   2> 1642646 INFO  (coreLoadExecutor-6110-thread-1) [    ] o.a.s.s.IndexSchema [collection1] Schema name=test
   [junit4]   2> 1642799 WARN  (coreLoadExecutor-6110-thread-1) [    ] o.a.s.s.IndexSchema [collection1] default search field in schema is text. WARNING: Deprecated, please use 'df' on request instead.
   [junit4]   2> 1642800 INFO  (coreLoadExecutor-6110-thread-1) [    ] o.a.s.s.IndexSchema Loaded schema test/1.0 with uniqueid field id
   [junit4]   2> 1642807 INFO  (coreLoadExecutor-6110-thread-1) [    ] o.a.s.c.CoreContainer Creating SolrCore 'collection1' using configuration from collection collection1
   [junit4]   2> 1642808 INFO  (coreLoadExecutor-6110-thread-1) [    ] o.a.s.c.SolrCore [[collection1] ] Opening new SolrCore at [/home/jenkins/workspace/Lucene-Solr-6.x-Linux/solr/build/solr-core/test/J0/temp/solr.cloud.PeerSyncReplicationTest_E1BCCD231971E84A-001/shard-3-001/cores/collection1], dataDir=[/home/jenkins/workspace/Lucene-Solr-6.x-Linux/solr/build/solr-core/test/J0/temp/solr.cloud.PeerSyncReplicationTest_E1BCCD231971E84A-001/shard-3-001/cores/collection1/data/]
   [junit4]   2> 1642808 INFO  (coreLoadExecutor-6110-thread-1) [    ] o.a.s.c.JmxMonitoredMap JMX monitoring is enabled. Adding Solr mbeans to JMX Server: com.sun.jmx.mbeanserver.JmxMBeanServer@6e4440
   [junit4]   2> 1642814 INFO  (coreLoadExecutor-6110-thread-1) [    ] o.a.s.u.RandomMergePolicy RandomMergePolicy wrapping class org.apache.lucene.index.TieredMergePolicy: [TieredMergePolicy: maxMergeAtOnce=26, maxMergeAtOnceExplicit=50, maxMergedSegmentMB=36.123046875, floorSegmentMB=1.08203125, forceMergeDeletesPctAllowed=19.161192062240314, segmentsPerTier=36.0, maxCFSSegmentSizeMB=8.796093022207999E12, noCFSRatio=0.8319265994243525
   [junit4]   2> 1642851 WARN  (coreLoadExecutor-6110-thread-1) [    ] o.a.s.c.RequestHandlers INVALID paramSet a in requestHandler {type = requestHandler,name = /dump,class = DumpRequestHandler,args = {defaults={a=A,b=B}}}
   [junit4]   2> 1642858 INFO  (coreLoadExecutor-6110-thread-1) [    ] o.a.s.u.UpdateHandler Using UpdateLog implementation: org.apache.solr.update.UpdateLog
   [junit4]   2> 1642858 INFO  (coreLoadExecutor-6110-thread-1) [    ] o.a.s.u.UpdateLog Initializing UpdateLog: dataDir= defaultSyncLevel=FLUSH numRecordsToKeep=1000 maxNumLogsToKeep=10 numVersionBuckets=65536
   [junit4]   2> 1642859 INFO  (coreLoadExecutor-6110-thread-1) [    ] o.a.s.u.CommitTracker Hard AutoCommit: disabled
   [junit4]   2> 1642859 INFO  (coreLoadExecutor-6110-thread-1) [    ] o.a.s.u.CommitTracker Soft AutoCommit: disabled
   [junit4]   2> 1642860 INFO  (coreLoadExecutor-6110-thread-1) [    ] o.a.s.u.RandomMergePolicy RandomMergePolicy wrapping class org.apache.lucene.index.LogByteSizeMergePolicy: [LogByteSizeMergePolicy: minMergeSize=1677721, mergeFactor=40, maxMergeSize=2147483648, maxMergeSizeForForcedMerge=9223372036854775807, calibrateSizeByDeletes=false, maxMergeDocs=2147483647, maxCFSSegmentSizeMB=8.796093022207999E12, noCFSRatio=0.26313351519593153]
   [junit4]   2> 1642862 INFO  (coreLoadExecutor-6110-thread-1) [    ] o.a.s.s.SolrIndexSearcher Opening [Searcher@1eea370[collection1] main]
   [junit4]   2> 1642863 INFO  (coreLoadExecutor-6110-thread-1) [    ] o.a.s.r.ManagedResourceStorage Configured ZooKeeperStorageIO with znodeBase: /configs/conf1
   [junit4]   2> 1642863 INFO  (coreLoadExecutor-6110-thread-1) [    ] o.a.s.r.ManagedResourceStorage Loaded null at path _rest_managed.json using ZooKeeperStorageIO:path=/configs/conf1
   [junit4]   2> 1642863 INFO  (coreLoadExecutor-6110-thread-1) [    ] o.a.s.h.ReplicationHandler Commits will be reserved for  10000
   [junit4]   2> 1642864 INFO  (searcherExecutor-6111-thread-1) [    ] o.a.s.c.SolrCore [collection1] Registered new searcher Searcher@1eea370[collection1] main{ExitableDirectoryReader(UninvertingDirectoryReader())}
   [junit4]   2> 1642864 INFO  (coreLoadExecutor-6110-thread-1) [    ] o.a.s.u.UpdateLog Could not find max version in index or recent updates, using new clock 1549501317946277888
   [junit4]   2> 1642867 INFO  (coreZkRegister-6105-thread-1) [    ] o.a.s.c.ZkController Core needs to recover:collection1
   [junit4]   2> 1642867 INFO  (updateExecutor-1911-thread-1) [    ] o.a.s.u.DefaultSolrCoreState Running recovery
   [junit4]   2> 1642867 INFO  (recoveryExecutor-1912-thread-1) [    ] o.a.s.c.RecoveryStrategy Starting recovery process. recoveringAfterStartup=true
   [junit4]   2> 1642868 INFO  (recoveryExecutor-1912-thread-1) [    ] o.a.s.c.RecoveryStrategy ###### startupVersions=[[]]
   [junit4]   2> 1642868 INFO  (recoveryExecutor-1912-thread-1) [    ] o.a.s.c.RecoveryStrategy Begin buffering updates. core=[collection1]
   [junit4]   2> 1642868 INFO  (recoveryExecutor-1912-thread-1) [    ] o.a.s.u.UpdateLog Starting to buffer updates. FSUpdateLog{state=ACTIVE, tlog=null}
   [junit4]   2> 1642868 INFO  (recoveryExecutor-1912-thread-1) [    ] o.a.s.c.RecoveryStrategy Publishing state of core [collection1] as recovering, leader is [https://127.0.0.1:41563/collection1/] and I am [https://127.0.0.1:37613/collection1/]
   [junit4]   2> 1642870 INFO  (recoveryExecutor-1912-thread-1) [    ] o.a.s.c.RecoveryStrategy Sending prep recovery command to [https://127.0.0.1:41563]; [WaitForState: action=PREPRECOVERY&core=collection1&nodeName=127.0.0.1:37613_&coreNodeName=core_node3&state=recovering&checkLive=true&onlyIfLeader=true&onlyIfLeaderActive=true]
   [junit4]   2> 1642872 INFO  (qtp9812864-11525) [    ] o.a.s.h.a.PrepRecoveryOp Going to wait for coreNodeName: core_node3, state: recovering, checkLive: true, onlyIfLeader: true, onlyIfLeaderActive: true
   [junit4]   2> 1642872 INFO  (qtp9812864-11525) [    ] o.a.s.h.a.PrepRecoveryOp Will wait a max of 183 seconds to see collection1 (shard1 of collection1) have state: recovering
   [junit4]   2> 1642872 INFO  (qtp9812864-11525) [    ] o.a.s.h.a.PrepRecoveryOp In WaitForState(recovering): collection=collection1, shard=shard1, thisCore=collection1, leaderDoesNotNeedRecovery=false, isLeader? true, live=true, checkLive=true, currentState=down, localState=active, nodeName=127.0.0.1:37613_, coreNodeName=core_node3, onlyIfActiveCheckResult=false, nodeProps: core_node3:{"core":"collection1","base_url":"https://127.0.0.1:37613","node_name":"127.0.0.1:37613_","state":"down"}
   [junit4]   2> 1643125 INFO  (TEST-PeerSyncReplicationTest.test-seed#[E1BCCD231971E84A]) [    ] o.a.s.SolrTestCaseJ4 ###Starting test
   [junit4]   2> 1643125 INFO  (TEST-PeerSyncReplicationTest.test-seed#[E1BCCD231971E84A]) [    ] o.a.s.c.AbstractFullDistribZkTestBase Wait for recoveries to finish - wait 30 for each attempt
   [junit4]   2> 1643125 INFO  (TEST-PeerSyncReplicationTest.test-seed#[E1BCCD231971E84A]) [    ] o.a.s.c.AbstractDistribZkTestBase Wait for recoveries to finish - collection: collection1 failOnTimeout:true timeout (sec):30
   [junit4]   2> 1643873 INFO  (qtp9812864-11525) [    ] o.a.s.h.a.PrepRecoveryOp In WaitForState(recovering): collection=collection1, shard=shard1, thisCore=collection1, leaderDoesNotNeedRecovery=false, isLeader? true, live=true, checkLive=true, currentState=recovering, localState=active, nodeName=127.0.0.1:37613_, coreNodeName=core_node3, onlyIfActiveCheckResult=false, nodeProps: core_node3:{"core":"collection1","base_url":"https://127.0.0.1:37613","node_name":"127.0.0.1:37613_","state":"recovering"}
   [junit4]   2> 1643873 INFO  (qtp9812864-11525) [    ] o.a.s.h.a.PrepRecoveryOp Waited coreNodeName: core_node3, state: recovering, checkLive: true, onlyIfLeader: true for: 1 seconds.
   [junit4]   2> 1643873 INFO  (qtp9812864-11525) [    ] o.a.s.s.HttpSolrCall [admin] webapp=null path=/admin/cores params={nodeName=127.0.0.1:37613_&onlyIfLeaderActive=true&core=collection1&coreNodeName=core_node3&action=PREPRECOVERY&checkLive=true&state=recovering&onlyIfLeader=true&wt=javabin&version=2} status=0 QTime=1000
   [junit4]   2> 1644373 INFO  (recoveryExecutor-1912-thread-1) [    ] o.a.s.c.RecoveryStrategy Attempting to PeerSync from [https://127.0.0.1:41563/collection1/] - recoveringAfterStartup=[true]
   [junit4]   2> 1644373 INFO  (recoveryExecutor-1912-thread-1) [    ] o.a.s.u.PeerSync PeerSync: core=collection1 url=https://127.0.0.1:37613 START replicas=[https://127.0.0.1:41563/collection1/] nUpdates=1000
   [junit4]   2> 1644377 INFO  (qtp9812864-11526) [    ] o.a.s.u.IndexFingerprint IndexFingerprint millis:0.0 result:{maxVersionSpecified=9223372036854775807, maxVersionEncountered=0, maxInHash=0, versionsHash=0, numVersions=0, numDocs=0, maxDoc=0}
   [junit4]   2> 1644377 INFO  (qtp9812864-11526) [    ] o.a.s.c.S.Request [collection1]  webapp= path=/get params={distrib=false&qt=/get&getFingerprint=9223372036854775807&wt=javabin&version=2} status=0 QTime=0
   [junit4]   2> 1644378 INFO  (recoveryExecutor-1912-thread-1) [    ] o.a.s.u.IndexFingerprint IndexFingerprint millis:0.0 result:{maxVersionSpecified=9223372036854775807, maxVersionEncountered=0, maxInHash=0, versionsHash=0, numVersions=0, numDocs=0, maxDoc=0}
   [junit4]   2> 1644378 INFO  (recoveryExecutor-1912-thread-1) [    ] o.a.s.u.PeerSync We are already in sync. No need to do a PeerSync 
   [junit4]   2> 1644378 INFO  (recoveryExecutor-1912-thread-1) [    ] o.a.s.u.DirectUpdateHandler2 start commit{,optimize=false,openSearcher=true,waitSearcher=true,expungeDeletes=false,softCommit=false,prepareCommit=false}
   [junit4]   2> 1644378 INFO  (recoveryExecutor-1912-thread-1) [    ] o.a.s.u.DirectUpdateHandler2 No uncommitted changes. Skipping IW.commit.
   [junit4]   2> 1644379 INFO  (recoveryExecutor-1912-thread-1) [    ] o.a.s.u.DirectUpdateHandler2 end_commit_flush
   [junit4]   2> 1644379 INFO  (recoveryExecutor-1912-thread-1) [    ] o.a.s.c.RecoveryStrategy PeerSync stage of recovery was successful.
   [junit4]   2> 1644379 INFO  (recoveryExecutor-1912-thread-1) [    ] o.a.s.c.RecoveryStrategy Replaying updates buffered during PeerSync.
   [junit4]   2> 1644379 INFO  (recoveryExecutor-1912-thread-1) [    ] o.a.s.c.RecoveryStrategy No replay needed.
   [junit4]   2> 1644379 INFO  (recoveryExecutor-1912-thread-1) [    ] o.a.s.c.RecoveryStrategy Registering as Active after recovery.
   [junit4]   2> 1645125 INFO  (TEST-PeerSyncReplicationTest.test-seed#[E1BCCD231971E84A]) [    ] o.a.s.c.AbstractDistribZkTestBase Recoveries finished - collection: collection1
   [junit4]   2> 1645192 INFO  (qtp20860177-11484) [    ] o.a.s.u.DirectUpdateHandler2 start commit{,optimize=false,openSearcher=true,waitSearcher=true,expungeDeletes=false,softCommit=false,prepareCommit=false}
   [junit4]   2> 1645192 INFO  (qtp20860177-11484) [    ] o.a.s.u.DirectUpdateHandler2 No uncommitted changes. Skipping IW.commit.
   [junit4]   2> 1645193 INFO  (qtp20860177-11484) [    ] o.a.s.u.DirectUpdateHandler2 end_commit_flush
   [junit4]   2> 1645193 INFO  (qtp20860177-11484) [    ] o.a.s.u.p.LogUpdateProcessorFactory [collection1]  webapp= path=/update params={waitSearcher=true&commit=true&softCommit=false&wt=javabin&version=2}{commit=} 0 1
   [junit4]   2> 1645198 INFO  (qtp9812864-11520) [    ] o.a.s.u.DirectUpdateHandler2 start commit{,optimize=false,openSearcher=true,waitSearcher=true,expungeDeletes=false,softCommit=false,prepareCommit=false}
   [junit4]   2> 1645198 INFO  (qtp9812864-11520) [    ] o.a.s.u.DirectUpdateHandler2 No uncommitted changes. Skipping IW.commit.
   [junit4]   2> 1645199 INFO  (qtp9812864-11520) [    ] o.a.s.u.DirectUpdateHandler2 end_commit_flush
   [junit4]   2> 1645199 INFO  (qtp9812864-11520) [    ] o.a.s.u.p.LogUpdateProcessorFactory [collection1]  webapp= path=/update params={update.distrib=FROMLEADER&waitSearcher=true&openSearcher=true&commit=true&softCommit=false&distrib.from=https://127.0.0.1:41563/collection1/&commit_end_point=true&wt=javabin&version=2&expungeDeletes=false}{commit=} 0 1
   [junit4]   2> 1645261 INFO  (qtp28895719-11581) [    ] o.a.s.u.DirectUpdateHandler2 start commit{,optimize=false,openSearcher=true,waitSearcher=true,expungeDeletes=false,softCommit=false,prepareCommit=false}
   [junit4]   2> 1645261 INFO  (qtp29861200-11547) [    ] o.a.s.u.DirectUpdateHandler2 start commit{,optimize=false,openSearcher=true,waitSearcher=true,expungeDeletes=false,softCommit=false,prepareCommit=false}
   [junit4]   2> 1645261 INFO  (qtp28895719-11581) [    ] o.a.s.u.DirectUpdateHandler2 No uncommitted changes. Skipping IW.commit.
   [junit4]   2> 1645261 INFO  (qtp29861200-11547) [    ] o.a.s.u.DirectUpdateHandler2 No uncommitted changes. Skipping IW.commit.
   [junit4]   2> 1645262 INFO  (qtp28895719-11581) [    ] o.a.s.u.DirectUpdateHandler2 end_commit_flush
   [junit4]   2> 1645262 INFO  (qtp29861200-11547) [    ] o.a.s.u.DirectUpdateHandler2 end_commit_flush
   [junit4]   2> 1645262 INFO  (qtp28895719-11581) [    ] o.a.s.u.p.LogUpdateProcessorFactory [collection1]  webapp= path=/update params={update.distrib=FROMLEADER&waitSearcher=true&openSearcher=true&commit=true&softCommit=false&distrib.from=https://127.0.0.1:41563/collection1/&commit_end_point=true&wt=javabin&version=2&expungeDeletes=false}{commit=} 0 1
   [junit4]   2> 1645262 INFO  (qtp29861200-11547) [    ] o.a.s.u.p.LogUpdateProcessorFactory [collection1]  webapp= path=/update params={update.distrib=FROMLEADER&waitSearcher=true&openSearcher=true&commit=true&softCommit=false&distrib.from=https://127.0.0.1:41563/collection1/&commit_end_point=true&wt=javabin&version=2&expungeDeletes=false}{commit=} 0 1
   [junit4]   2> 1645263 INFO  (qtp9812864-11526) [    ] o.a.s.u.p.LogUpdateProcessorFactory [collection1]  webapp= path=/update params={waitSearcher=true&commit=true&softCommit=false&wt=javabin&version=2}{commit=} 0 67
   [junit4]   2> 1645265 INFO  (qtp9812864-11526) [    ] o.a.s.c.S.Request [collection1]  webapp= path=/select params={q=*:*&distrib=false&tests=checkShardConsistency&rows=0&wt=javabin&version=2} hits=0 status=0 QTime=0
   [junit4]   2> 1645268 INFO  (qtp29861200-11547) [    ] o.a.s.c.S.Request [collection1]  webapp= path=/select params={q=*:*&distrib=false&tests=checkShardConsistency&rows=0&wt=javabin&version=2} hits=0 status=0 QTime=0
   [junit4]   2> 1645271 INFO  (qtp28895719-11581) [    ] o.a.s.c.S.Request [collection1]  webapp= path=/select params={q=*:*&distrib=false&tests=checkShardConsistency&rows=0&wt=javabin&version=2} hits=0 status=0 QTime=0
   [junit4]   2> 1647276 INFO  (qtp20860177-11489) [    ] o.a.s.u.p.LogUpdateProcessorFactory [collection1]  webapp= path=/update params={wt=javabin&version=2}{deleteByQuery=*:* (-1549501322569449472)} 0 2
   [junit4]   2> 1647287 INFO  (qtp29861200-11552) [    ] o.a.s.u.p.LogUpdateProcessorFactory [collection1]  webapp= path=/update params={update.distrib=FROMLEADER&_version_=-1549501322575740928&distrib.from=https://127.0.0.1:41563/collection1/&wt=javabin&version=2}{deleteByQuery=*:* (-1549501322575740928)} 0 2
   [junit4]   2> 1647287 INFO  (qtp28895719-11586) [    ] o.a.s.u.p.LogUpdateProcessorFactory [collection1]  webapp= path=/update params={update.distrib=FROMLEADER&_version_=-1549501322575740928&distrib.from=https://127.0.0.1:41563/collection1/&wt=javabin&version=2}{deleteByQuery=*:* (-1549501322575740928)} 0 2
   [junit4]   2> 1647287 INFO  (qtp9812864-11524) [    ] o.a.s.u.p.LogUpdateProcessorFactory [collection1]  webapp= path=/update params={wt=javabin&version=2}{deleteByQuery=*:* (-1549501322575740928)} 0 9
   [junit4]   2> 1647297 INFO  (qtp28895719-11582) [    ] o.a.s.u.p.LogUpdateProcessorFactory [collection1]  webapp= path=/update params={update.distrib=FROMLEADER&distrib.from=https://127.0.0.1:41563/collection1/&wt=javabin&version=2}{add=[0 (1549501322588323840)]} 0 1
   [junit4]   2> 1647298 INFO  (qtp29861200-11553) [    ] o.a.s.u.p.LogUpdateProcessorFactory [collection1]  webapp= path=/update params={update.distrib=FROMLEADER&distrib.from=https://127.0.0.1:41563/collection1/&wt=javabin&version=2}{add=[0 (1549501322588323840)]} 0 2
   [junit4]   2> 1647298 INFO  (qtp9812864-11521) [    ] o.a.s.u.p.LogUpdateProcessorFactory [collection1]  webapp= path=/update params={wt=javabin&version=2}{add=[0 (1549501322588323840)]} 0 6
   [junit4]   2> 1647302 INFO  (qtp28895719-11581) [    ] o.a.s.u.p.LogUpdateProcessorFactory [collection1]  webapp= path=/update params={update.distrib=FROMLEADER&distrib.from=https://127.0.0.1:41563/collection1/&wt=javabin&version=2}{add=[1 (1549501322597761024)]} 0 0
   [junit4]   2> 1647302 INFO  (qtp29861200-11554) [    ] o.a.s.u.p.LogUpdateProcessorFactory [collection1]  webapp= path=/update params={update.distrib=FROMLEADER&distrib.from=https://127.0.0.1:41563/collection1/&wt=javabin&version=2}{add=[1 (1549501322597761024)]} 0 0
   [junit4]   2> 1647303 INFO  (qtp9812864-11520) [    ] o.a.s.u.p.LogUpdateProcessorFactory [collection1]  webapp= path=/update params={wt=javabin&version=2}{add=[1 (1549501322597761024)]} 0 3
   [junit4]   2> 1647307 INFO  (qtp29861200-11552) [    ] o.a.s.u.p.LogUpdateProcessorFactory [collection1]  webapp= path=/update params={update.distrib=FROMLEADER&distrib.from=https://127.0.0.1:41563/collection1/&wt=javabin&version=2}{add=[2 (1549501322603003904)]} 0 0
   [junit4]   2> 1647307 INFO  (qtp28895719-11586) [    ] o.a.s.u.p.LogUpdateProcessorFactory [collection1]  webapp= path=/update params={update.distrib=FROMLEADER&distrib.from=https://127.0.0.1:41563/collection1/&wt=javabin&version=2}{add=[2 (1549501322603003904)]} 0 0
   [junit4]   2> 1647308 INFO  (qtp9812864-11526) [    ] o.a.s.u.p.LogUpdateProcessorFactory [collection1]  webapp= path=/update params={wt=javabin&version=2}{add=[2 (1549501322603003904)]} 0 2
   [junit4]   2> 1647316 INFO  (qtp28895719-11582) [    ] o.a.s.u.p.LogUpdateProcessorFactory [collection1]  webapp= path=/update params={update.distrib=FROMLEADER&distrib.from=https://127.0.0.1:41563/collection1/&wt=javabin&version=2}{add=[3 (1549501322607198208)]} 0 0
   [junit4]   2> 1647316 INFO  (qtp29861200-11553) [    ] o.a.s.u.p.LogUpdateProcessorFactory [collection1]  webapp= path=/update params={update.distrib=FROMLEADER&distrib.from=https://127.0.0.1:41563/collection1/&wt=javabin&version=2}{add=[3 (1549501322607198208)]} 0 0
   [junit4]   2> 1647316 INFO  (qtp9812864-11524) [    ] o.a.s.u.p.LogUpdateProcessorFactory [collection1]  webapp= path=/update params={wt=javabin&version=2}{add=[3 (1549501322607198208)]} 0 6
   [junit4]   2> 1647320 INFO  (qtp29861200-11554) [    ] o.a.s.u.p.LogUpdateProcessorFactory [collection1]  webapp= path=/update params={update.distrib=FROMLEADER&distrib.from=https://127.0.0.1:41563/collection1/&wt=javabin&version=2}{add=[4 (1549501322616635392)]} 0 0
   [junit4]   2> 1647320 INFO  (qtp28895719-11581) [    ] o.a.s.u.p.LogUpdateProcessorFactory [collection1]  webapp= path=/update params={update.distrib=FROMLEADER&distrib.from=https://127.0.0.1:41563/collection1/&wt=javabin&version=2}{add=[4 (1549501322616635392)]} 0 0
   [junit4]   2> 1647320 INFO  (qtp9812864-11521) [    ] o.a.s.u.p.LogUpdateProcessorFactory [collection1]  webapp= path=/update params={wt=javabin&version=2}{add=[4 (1549501322616635392)]} 0 2
   [junit4]   2> 1647324 INFO  (qtp28895719-11586) [    ] o.a.s.u.p.LogUpdateProcessorFactory [collection1]  webapp= path=/update params={update.distrib=FROMLEADER&distrib.from=https://127.0.0.1:41563/collection1/&wt=javabin&version=2}{add=[5 (1549501322620829696)]} 0 0
   [junit4]   2> 1647324 INFO  (qtp29861200-11552) [    ] o.a.s.u.p.LogUpdateProcessorFactory [collection1]  webapp= path=/update params={update.distrib=FROMLEADER&distrib.from=https://127.0.0.1:41563/collection1/&wt=javabin&version=2}{add=[5 (1549501322620829696)]} 0 0
   [junit4]   2> 1647324 INFO  (qtp9812864-11520) [    ] o.a.s.u.p.LogUpdateProcessorFactory [collection1]  webapp= path=/update params={wt=javabin&version=2}{add=[5 (1549501322620829696)]} 0 2
   [junit4]   2> 1647329 INFO  (qtp28895719-11582) [    ] o.a.s.u.p.LogUpdateProcessorFactory [collection1]  webapp= path=/update params={update.distrib=FROMLEADER&distrib.from=https://127.0.0.1:41563/collection1/&wt=javabin&version=2}{add=[6 (1549501322626072576)]} 0 0
   [junit4]   2> 1647329 INFO  (qtp29861200-11553) [    ] o.a.s.u.p.LogUpdateProcessorFactory [collection1]  webapp= path=/update params={update.distrib=FROMLEADER&distrib.from=https://127.0.0.1:41563/collection1/&wt=javabin&version=2}{add=[6 (1549501322626072576)]} 0 0
   [junit4]   2> 1647330 INFO  (qtp9812864-11526) [    ] o.a.s.u.p.LogUpdateProcessorFactory [collection1]  webapp= path=/update params={wt=javabin&version=2}{add=[6 (1549501322626072576)]} 0 2
   [junit4]   2> 1647333 INFO  (qtp28895719-11581) [    ] o.a.s.u.p.LogUpdateProcessorFactory [collection1]  webapp= path=/update params={update.distrib=FROMLEADER&distrib.from=https://127.0.0.1:41563/collection1/&wt=javabin&version=2}{add=[7 (1549501322630266880)]} 0 0
   [junit4]   2> 1647333 INFO  (qtp29861200-11554) [    ] o.a.s.u.p.LogUpdateProcessorFactory [collection1]  webapp= path=/update params={update.distrib=FROMLEADER&distrib.from=https://127.0.0.1:41563/collection1/&wt=javabin&version=2}{add=[7 (1549501322630266880)]} 0 0
   [junit4]   2> 1647333 INFO  (qtp9812864-11524) [    ] o.a.s.u.p.LogUpdateProcessorFactory [collection1]  webapp= path=/update params={wt=javabin&version=2}{add=[7 (1549501322630266880)]} 0 2
   [junit4]   2> 1647337 INFO  (qtp28895719-11586) [    ] o.a.s.u.p.LogUpdateProcessorFactory [collection1]  webapp= path=/update params={update.distrib=FROMLEADER&distrib.from=https://127.0.0.1:41563/collection1/&wt=javabin&version=2}{add=[8 (1549501322634461184)]} 0 0
   [junit4]   2> 1647337 INFO  (qtp29861200-11552) [    ] o.a.s.u.p.LogUpdateProcessorFactory [collection1]  webapp= path=/update params={update.distrib=FROMLEADER&distrib.from=https://127.0.0.1:41563/collection1/&wt=javabin&version=2}{add=[8 (1549501322634461184)]} 0 0
   [junit4]   2> 1647337 INFO  (qtp9812864-11521) [    ] o.a.s.u.p.LogUpdateProcessorFactory [collection1]  webapp= path=/update params={wt=javabin&version=2}{add=[8 (1549501322634461184)]} 0 2
   [junit4]   2> 1647341 INFO  (qtp29861200-11553) [    ] o.a.s.u.p.LogUpdateProcessorFactory [collection1]  webapp= path=/update params={update.distrib=FROMLEADER&distrib.from=https://127.0.0.1:41563/collection1/&wt=javabin&version=2}{add=[9 (1549501322639704064)]} 0 0
   [junit4]   2> 1647342 INFO  (qtp28895719-11582) [    ] o.a.s.u.p.LogUpdateProcessorFactory [collection1]  webapp= path=/update params={update.distrib=FROMLEADER&distrib.from=https://127.0.0.1:41563/collection1/&wt=javabin&version=2}{add=[9 (1549501322639704064)]} 0 0
   [junit4]   2> 1647342 INFO  (qtp9812864-11520) [    ] o.a.s.u.p.LogUpdateProcessorFactory [collection1]  webapp= path=/update params={wt=javabin&version=2}{add=[9 (1549501322639704064)]} 0 2
   [junit4]   2> 1647345 INFO  (qtp29861200-11554) [    ] o.a.s.u.p.LogUpdateProcessorFactory [collection1]  webapp= path=/update params={update.distrib=FROMLEADER&distrib.from=https://127.0.0.1:41563/collection1/&wt=javabin&version=2}{add=[10 (1549501322642849792)]} 0 0
   [junit4]   2> 1647345 INFO  (qtp28895719-11581) [    ] o.a.s.u.p.LogUpdateProcessorFactory [collection1]  webapp= path=/update params={update.distrib=FROMLEADER&distrib.from=https://127.0.0.1:41563/collection1/&wt=javabin&version=2}{add=[10 (1549501322642849792)]} 0 0
   [junit4]   2> 1647345 INFO  (qtp9812864-11526) [    ] o.a.s.u.p.LogUpdateProcessorFactory [collection1]  webapp= path=/update params={wt=javabin&version=2}{add=[10 (1549501322642849792)]} 0 2
   [junit4]   2> 1647349 INFO  (qtp29861200-11552) [    ] o.a.s.u.p.LogUpdateProcessorFactory [collection1]  webapp= path=/update params={update.distrib=FROMLEADER&distrib.from=https://127.0.0.1:41563/collection1/&wt=javabin&version=2}{add=[11 (1549501322647044096)]} 0 0
   [junit4]   2> 1647349 INFO  (qtp28895719-11586) [    ] o.a.s.u.p.LogUpdateProcessorFactory [collection1]  webapp= path=/update params={update.distrib=FROMLEADER&distrib.from=https://127.0.0.1:41563/collection1/&wt=javabin&version=2}{add=[11 (1549501322647044096)]} 0 0
   [junit4]   2> 1647349 INFO  (qtp9812864-11524) [    ] o.a.s.u.p.LogUpdateProcessorFactory [collection1]  webapp= path=/update params={wt=javabin&version=2}{add=[11 (1549501322647044096)]} 0 2
   [junit4]   2> 1647353 INFO  (qtp28895719-11582) [    ] o.a.s.u.p.LogUpdateProcessorFactory [collection1]  webapp= path=/update params={update.distrib=FROMLEADER&distrib.from=https://127.0.0.1:41563/collection1/&wt=javabin&version=2}{add=[12 (1549501322651238400)]} 0 0
   [junit4]   2> 1647353 INFO  (qtp29861200-11553) [    ] o.a.s.u.p.LogUpdateProcessorFactory [collection1]  webapp= path=/update params={update.distrib=FROMLEADER&distrib.from=https://127.0.0.1:41563/collection1/&wt=javabin&version=2}{add=[12 (1549501322651238400)]} 0 0
   [junit4]   2> 1647354 INFO  (qtp9812864-11521) [    ] o.a.s.u.p.LogUpdateProcessorFactory [collection1]  webapp= path=/update params={wt=javabin&version=2}{add=[12 (1549501322651238400)]} 0 2
   [junit4]   2> 1647357 INFO  (qtp28895719-11581) [    ] o.a.s.u.p.LogUpdateProcessorFactory [collection1]  webapp= path=/update params={update.distrib=FROMLEADER&distrib.from=https://127.0.0.1:41563/collection1/&wt=javabin&version=2}{add=[13 (1549501322655432704)]} 0 0
   [junit4]   2> 1647357 INFO  (qtp29861200-11554) [    ] o.a.s.u.p.LogUpdateProcessorFactory [collection1]  webapp= path=/update params={update.distrib=FROMLEADER&distrib.from=https://127.0.0.1:41563/collection1/&wt=javabin&version=2}{add=[13 (1549501322655432704)]} 0 0
   [junit4]   2> 1647357 INFO  (qtp9812864-11520) [    ] o.a.s.u.p.LogUpdateProcessorFactory [collection1]  webapp= path=/update params={wt=javabin&version=2}{add=[13 (1549501322655432704)]} 0 2
   [junit4]   2> 1647361 INFO  (qtp28895719-11586) [    ] o.a.s.u.p.LogUpdateProcessorFactory [collection1]  webapp= path=/update params={update.distrib=FROMLEADER&distrib.from=https://127.0.0.1:41563/collection1/&wt=javabin&version=2}{add=[14 (1549501322659627008)]} 0 0
   [junit4]   2> 1647361 INFO  (qtp29861200-11552) [    ] o.a.s.u.p.LogUpdateProcessorFactory [collection1]  webapp= path=/update params={update.distrib=FROMLEADER&distrib.from=https://127.0.0.1:41563/collection1/&wt=javabin&version=2}{add=[14 (1549501322659627008)]} 0 0
   [junit4]   2> 1647362 INFO  (qtp9812864-11526) [    ] o.a.s.u.p.LogUpdateProcessorFactory [collection1]  webapp= path=/update params={wt=javabin&version=2}{add=[14 (1549501322659627008)]} 0 2
   [junit4]   2> 1647365 INFO  (qtp28895719-11582) [    ] o.a.s.u.p.LogUpdateProcessorFactory [collection1]  webapp= path=/update params={update.distrib=FROMLEADER&distrib.from=https://127.0.0.1:41563/collection1/&wt=javabin&version=2}{add=[15 (1549501322663821312)]} 0 0
   [junit4]   2> 1647365 INFO  (qtp29861200-11553) [    ] o.a.s.u.p.LogUpdateProcessorFactory [collection1]  webapp= path=/update params={update.distrib=FROMLEADER&distrib.from=https://127.0.0.1:41563/collection1/&wt=javabin&version=2}{add=[15 (1549501322663821312)]} 0 0
   [junit4]   2> 1647365 INFO  (qtp9812864-11524) [    ] o.a.s.u.p.LogUpdateProcessorFactory [collection1]  webapp= path=/update params={wt=javabin&version=2}{add=[15 (1549501322663821312)]} 0 2
   [junit4]   2> 1647369 INFO  (qtp28895719-11581) [    ] o.a.s.u.p.LogUpdateProcessorFactory [collection1]  webapp= path=/update params={update.distrib=FROMLEADER&distrib.from=https://127.0.0.1:41563/collection1/&wt=javabin&version=2}{add=[16 (1549501322668015616)]} 0 0
   [junit4]   2> 1647369 INFO  (qtp29861200-11554) [    ] o.a.s.u.p.LogUpdateProcessorFactory [collection1]  webapp= path=/update params={update.distrib=FROMLEADER&distrib.from=https://127.0.0.1:41563/collection1/&wt=javabin&version=2}{add=[16 (1549501322668015616)]} 0 0
   [junit4]   2> 1647369 INFO  (qtp9812864-11521) [    ] o.a.s.u.p.LogUpdateProcessorFactory [collection1]  webapp= path=/update params={wt=javabin&version=2}{add=[16 (1549501322668015616)]} 0 2
   [junit4]   2> 1647373 INFO  (qtp29861200-11552) [    ] o.a.s.u.p.LogUpdateProcessorFactory [collection1]  webapp= path=/update params={update.distrib=FROMLEADER&distrib.from=https://127.0.0.1:41563/collection1/&wt=javabin&version=2}{add=[17 (1549501322672209920)]} 0 0
   [junit4]   2> 1647376 INFO  (qtp28895719-11586) [    ] o.a.s.u.p.LogUpdateProcessorFactory [collection1]  webapp= path=/update params={update.distrib=FROMLEADER&distrib.from=https://127.0.0.1:41563/collection1/&wt=javabin&version=2}{add=[17 (1549501322672209920)]} 0 2
   [junit4]   2> 1647376 INFO  (qtp9812864-11520) [    ] o.a.s.u.p.LogUpdateProcessorFactory [collection1]  webapp= path=/update params={wt=javabin&version=2}{add=[17 (1549501322672209920)]} 0 5
   [junit4]   2> 1647380 INFO  (qtp29861200-11553) [    ] o.a.s.u.p.LogUpdateProcessorFactory [collection1]  webapp= path=/update params={update.distrib=FROMLEADER&distrib.from=https://127.0.0.1:41563/collection1/&wt=javabin&version=2}{add=[18 (1549501322679549952)]} 0 0
   [junit4]   2> 1647380 INFO  (qtp28895719-11588) [    ] o.a.s.u.p.LogUpdateProcessorFactory [collection1]  webapp= path=/update params={update.distrib=FROMLEADER&distrib.from=https://127.0.0.1:41563/collection1/&wt=javabin&version=2}{add=[18 (1549501322679549952)]} 0 0
   [junit4]   2> 1647380 INFO  (qtp9812864-11526) [    ] o.a.s.u.p.LogUpdateProcessorFactory [collection1]  webapp= path=/update params={wt=javabin&version=2}{add=[18 (1549501322679549952)]} 0 2
   [junit4]   2> 1647383 INFO  (qtp29861200-11554) [    ] o.a.s.u.p.LogUpdateProcessorFactory [collection1]  webapp= path=/update params={update.distrib=FROMLEADER&distrib.from=https://127.0.0.1:41563/collection1/&wt=javabin&version=2}{add=[19 (1549501322683744256)]} 0 0
   [junit4]   2> 1647384 INFO  (qtp28895719-11581) [    ] o.a.s.u.p.LogUpdateProcessorFactory [collection1]  webapp= path=/update params={update.distrib=FROMLEADER&distrib.from=https://127.0.0.1:41563/collection1/&wt=javabin&version=2}{add=[19 (1549501322683744256)]} 0 0
   [junit4]   2> 1647384 INFO  (qtp9812864-11524) [    ] o.a.s.u.p.LogUpdateProcessorFactory [collection1]  webapp= path=/update params={wt=javabin&version=2}{add=[19 (1549501322683744256)]} 0 2
   [junit4]   2> 1647388 INFO  (qtp28895719-11586) [    ] o.a.s.u.p.LogUpdateProcessorFactory [collection1]  webapp= path=/update params={update.distrib=FROMLEADER&distrib.from=https://127.0.0.1:41563/collection1/&wt=javabin&version=2}{add=[20 (1549501322686889984)]} 0 0
   [junit4]   2> 1647388 INFO  (qtp29861200-11552) [    ] o.a.s.u.p.LogUpdateProcessorFactory [collection1]  webapp= path=/update params={update.distrib=FROMLEADER&distrib.from=https://127.0.0.1:41563/collection1/&wt=javabin&version=2}{add=[20 (1549501322686889984)]} 0 0
   [junit4]   2> 1647388 INFO  (qtp9812864-11521) [    ] o.a.s.u.p.LogUpdateProcessorFactory [collection1]  webapp= path=/update params={wt=javabin&version=2}{add=[20 (1549501322686889984)]} 0 2
   [junit4]   2> 1647392 INFO  (qtp28895719-11588) [    ] o.a.s.u.p.LogUpdateProcessorFactory [collection1]  webapp= path=/update params={update.distrib=FROMLEADER&distrib.from=https://127.0.0.1:41563/collection1/&wt=javabin&version=2}{add=[21 (1549501322692132864)]} 0 0
   [junit4]   2> 1647392 INFO  (qtp29861200-11553) [    ] o.a.s.u.p.LogUpdateProcessorFactory [collection1]  webapp= path=/update params={update.distrib=FROMLEADER&distrib.from=https://127.0.0.1:41563/collection1/&wt=javabin&version=2}{add=[21 (1549501322692132864)]} 0 0
   [junit4]   2> 1647392 INFO  (qtp9812864-11520) [    ] o.a.s.u.p.LogUpdateProcessorFactory [collection1]  webapp= path=/update params={wt=javabin&version=2}{add=[21 (1549501322692132864)]} 0 2
   [junit4]   2> 1647396 INFO  (qtp29861200-11547) [    ] o.a.s.u.p.LogUpdateProcessorFactory [collection1]  webapp= path=/update params={update.distrib=FROMLEADER&distrib.from=https://127.0.0.1:41563/collection1/&wt=javabin&version=2}{add=[22 (1549501322696327168)]} 0 0
   [junit4]   2> 1647396 INFO  (qtp28895719-11581) [    ] o.a.s.u.p.LogUpdateProcessorFactory [collection1]  webapp= path=/update params={update.distrib=FROMLEADER&distrib.from=https://127.0.0.1:41563/collection1/&wt=javabin&version=2}{add=[22 (1549501322696327168)]} 0 0
   [junit4]   2> 1647396 INFO  (qtp9812864-11526) [    ] o.a.s.u.p.LogUpdateProcessorFactory [collection1]  webapp= path=/update params={wt=javabin&version=2}{add=[22 (1549501322696327168)]} 0 2
   [junit4]   2> 1647400 INFO  (qtp28895719-11586) [    ] o.a.s.u.p.LogUpdateProcessorFactory [collection1]  webapp= path=/update params={update.distrib=FROMLEADER&distrib.from=https://127.0.0.1:41563/collection1/&wt=javabin&version=2}{add=[23 (1549501322700521472)]} 0 0
   [junit4]   2> 1647400 INFO  (qtp29861200-11552) [    ] o.a.s.u.p.LogUpdateProcessorFactory [collection1]  webapp= path=/update params={update.distrib=FROMLEADER&distrib.from=https://127.0.0.1:41563/collection1/&wt=javabin&version=2}{add=[23 (1549501322700521472)]} 0 0
   [junit4]   2> 1647400 INFO  (qtp9812864-11524) [    ] o.a.s.u.p.LogUpdateProcessorFactory [collection1]  webapp= path=/update params={wt=javabin&version=2}{add=[23 (1549501322700521472)]} 0 2
   [junit4]   2> 1647403 INFO  (qtp29861200-11553) [    ] o.a.s.u.p.LogUpdateProcessorFactory [collection1]  webapp= path=/update params={update.distrib=FROMLEADER&distrib.from=https://127.0.0.1:41563/collection1/&wt=javabin&version=2}{add=[24 (1549501322703667200)]} 0 0
   [junit4]   2> 1647403 INFO  (qtp28895719-11588) [    ] o.a.s.u.p.LogUpdateProcessorFactory [collection1]  webapp= path=/update params={update.distrib=FROMLEADER&distrib.from=https://127.0.0.1:41563/collection1/&wt=javabin&version=2}{add=[24 (1549501322703667200)]} 0 0
   [junit4]   2> 1647404 INFO  (qtp9812864-11521) [    ] o.a.s.u.p.LogUpdateProcessorFactory [collection1]  webapp= path=/update params={wt=javabin&version=2}{add=[24 (1549501322703667200)]} 0 2
   [junit4]   2> 1647407 INFO  (qtp29861200-11547) [    ] o.a.s.u.p.LogUpdateProcessorFactory [collection1]  webapp= path=/update params={update.distrib=FROMLEADER&distrib.from=https://127.0.0.1:41563/collection1/&wt=javabin&version=2}{add=[25 (1549501322707861504)]} 0 0
   [junit4]   2> 1647407 INFO  (qtp28895719-11581) [    ] o.a.s.u.p.LogUpdateProcessorFactory [collection1]  webapp= path=/update params={update.distrib=FROMLEADER&distrib.from=https://127.0.0.1:41563/collection1/&wt=javabin&version=2}{add=[25 (1549501322707861504)]} 0 0
   [junit4]   2> 1647407 INFO  (qtp9812864-11520) [    ] o.a.s.u.p.LogUpdateProcessorFactory [collection1]  webapp= path=/update params={wt=javabin&version=2}{add=[25 (1549501322707861504)]} 0 2
   [junit4]   2> 1647412 INFO  (qtp29861200-11552) [    ] o.a.s.u.p.LogUpdateProcessorFactory [collection1]  webapp= path=/update params={update.distrib=FROMLEADER&distrib.from=https://127.0.0.1:41563/collection1/&wt=javabin&version=2}{add=[26 (1549501322712055808)]} 0 0
   [junit4]   2> 1647412 INFO  (qtp28895719-11586) [    ] o.a.s.u.p.LogUpdateProcessorFactory [collection1]  webapp= path=/update params={update.distrib=FROMLEADER&distrib.from=https://127.0.0.1:41563/collection1/&wt=javabin&version=2}{add=[26 (1549501322712055808)]} 0 0
   [junit4]   2> 1647412 INFO  (qtp9812864-11526) [    ] o.a.s.u.p.LogUpdateProcessorFactory [collection1]  webapp= path=/update params={wt=javabin&version=2}{add=[26 (1549501322712055808)]} 0 3
   [junit4]   2> 1647415 INFO  (qtp28895719-11582) [    ] o.a.s.u.p.LogUpdateProcessorFactory [collection1]  webapp= path=/update params={update.distrib=FROMLEADER&distrib.from=https://127.0.0.1:41563/collection1/&wt=javabin&version=2}{add=[27 (1549501322717298688)]} 0 0
   [junit4]   2> 1647415 INFO  (qtp29861200-11553) [    ] o.a.s.u.p.LogUpdateProcessorFactory [collection1]  webapp= path=/update params={update.distrib=FROMLEADER&distrib.from=https://127.0.0.1:41563/collection1/&wt=javabin&version=2}{add=[27 (1549501322717298688)]} 0 0
   [junit4]   2> 1647416 INFO  (qtp9812864-11524) [    ] o.a.s.u.p.LogUpdateProcessorFactory [collection1]  webapp= path=/update params={wt=javabin&version=2}{add=[27 (1549501322717298688)]} 0 2
   [junit4]   2> 1647419 INFO  (qtp28895719-11581) [    ] o.a.s.u.p.LogUpdateProcessorFactory [collection1]  webapp= path=/update params={update.distrib=FROMLEADER&distrib.from=https://127.0.0.1:41563/collection1/&wt=javabin&version=2}{add=[28 (1549501322720444416)]} 0 0
   [junit4]   2> 1647419 INFO  (qtp29861200-11547) [    ] o.a.s.u.p.LogUpdateProcessorFactory [collection1]  webapp= path=/update params={update.distrib=FROMLEADER&distrib.from=https://127.0.0.1:41563/collection1/&wt=javabin&version=2}{add=[28 (1549501322720444416)]} 0 0
   [junit4]   2> 1647419 INFO  (qtp9812864-11521) [    ] o.a.s.u.p.LogUpdateProcessorFactory [collection1]  webapp= path=/update params={wt=javabin&version=2}{add=[28 (1549501322720444416)]} 0 2
   [junit4]   2> 1647424 INFO  (qtp28895719-11586) [    ] o.a.s.u.p.LogUpdateProcessorFactory [collection1]  webapp= path=/update params={update.distrib=FROMLEADER&distrib.from=https://127.0.0.1:41563/collection1/&wt=javabin&version=2}{add=[29 (1549501322724638720)]} 0 0
   [junit4]   2> 1647424 INFO  (qtp29861200-11552) [    ] o.a.s.u.p.LogUpdateProcessorFactory [collection1]  webapp= path=/update params={update.distrib=FROMLEADER&distrib.from=https://127.0.0.1:41563/collection1/&wt=javabin&version=2}{add=[29 (1549501322724638720)]} 0 0
   [junit4]   2> 1647424 INFO  (qtp9812864-11520) [    ] o.a.s.u.p.LogUpdateProcessorFactory [collection1]  webapp= path=/update params={wt=javabin&version=2}{add=[29 (1549501322724638720)]} 0 3
   [junit4]   2> 1647429 INFO  (qtp28895719-11582) [    ] o.a.s.u.p.LogUpdateProcessorFactory [collection1]  webapp= path=/update params={update.distrib=FROMLEADER&distrib.from=https://127.0.0.1:41563/collection1/&wt=javabin&version=2}{add=[30 (1549501322729881600)]} 0 0
   [junit4]   2> 1647429 INFO  (qtp29861200-11553) [    ] o.a.s.u.p.LogUpdateProcessorFactory [collection1]  webapp= path=/update params={update.distrib=FROMLEADER&distrib.from=https://127.0.0.1:41563/collection1/&wt=javabin&version=2}{add=[30 (1549501322729881600)]} 0 0
   [junit4]   2> 1647429 INFO  (qtp9812864-11526) [    ] o.a.s.u.p.LogUpdateProcessorFactory [collection1]  webapp= path=/update params={wt=javabin&version=2}{add=[30 (1549501322729881600)]} 0 3
   [junit4]   2> 1647432 INFO  (qtp29861200-11547) [    ] o.a.s.u.p.LogUpdateProcessorFactory [collection1]  webapp= path=/update params={update.distrib=FROMLEADER&distrib.from=https://127.0.0.1:41563/collection1/&wt=javabin&version=2}{add=[31 (1549501322735124480)]} 0 0
   [junit4]   2> 1647432 INFO  (qtp28895719-11581) [    ] o.a.s.u.p.LogUpdateProcessorFactory [collection1]  webapp= path=/update params={update.distrib=FROMLEADER&distrib.from=https://127.0.0.1:41563/collection1/&wt=javabin&version=2}{add=[31 (1549501322735124480)]} 0 0
   [junit4]   2> 1647433 INFO  (qtp9812864-11524) [    ] o.a.s.u.p.LogUpdateProcessorFactory [collection1]  webapp= path=/update params={wt=javabin&version=2}{add=[31 (1549501322735124480)]} 0 2
   [junit4]   2> 1647437 INFO  (qtp28895719-11586) [    ] o.a.s.u.p.LogUpdateProcessorFactory [collection1]  webapp= path=/update params={update.distrib=FROMLEADER&distrib.from=https://127.0.0.1:41563/collection1/&wt=javabin&version=2}{add=[32 (1549501322740367360)]} 0 0
   [junit4]   2> 1647437 INFO  (qtp29861200-11552) [    ] o.a.s.u.p.LogUpdateProcessorFactory [collection1]  webapp= path=/update params={update.distrib=FROMLEADER&distrib.from=https://127.0.0.1:41563/collection1/&wt=javabin&version=2}{add=[32 (1549501322740367360)]} 0 0
   [junit4]   2> 1647438 INFO  (qtp9812864-11521) [    ] o.a.s.u.p.LogUpdateProcessorFactory [collection1]  webapp= pa

[...truncated too long message...]

per.server.NIOServerCnxn.doIO(NIOServerCnxn.java:228)
   [junit4]   2> 	at org.apache.zookeeper.server.NIOServerCnxnFactory.run(NIOServerCnxnFactory.java:208)
   [junit4]   2> 	at java.lang.Thread.run(java.base@9-ea/Thread.java:843)
   [junit4]   2> 1673267 WARN  (zkCallback-1921-thread-2) [    ] o.a.s.c.c.ZkStateReader ZooKeeper watch triggered, but Solr cannot talk to ZK: [KeeperErrorCode = Session expired for /live_nodes]
   [junit4]   2> 1674263 WARN  (zkCallback-1921-thread-3) [    ] o.a.s.c.SyncStrategy Closed, skipping sync up.
   [junit4]   2> 1674264 INFO  (zkCallback-1921-thread-3) [    ] o.a.s.c.SolrCore [collection1]  CLOSING SolrCore org.apache.solr.core.SolrCore@6a4bd8
   [junit4]   2> 1674335 INFO  (TEST-PeerSyncReplicationTest.test-seed#[E1BCCD231971E84A]) [    ] o.e.j.s.ServerConnector Stopped ServerConnector@d2fdee{SSL,[ssl, http/1.1]}{127.0.0.1:43753}
   [junit4]   2> 1674335 INFO  (TEST-PeerSyncReplicationTest.test-seed#[E1BCCD231971E84A]) [    ] o.e.j.s.h.ContextHandler Stopped o.e.j.s.ServletContextHandler@443d06{/,null,UNAVAILABLE}
   [junit4]   2> 1674335 INFO  (TEST-PeerSyncReplicationTest.test-seed#[E1BCCD231971E84A]) [    ] o.a.s.c.ChaosMonkey monkey: stop shard! 37613
   [junit4]   2> 1674339 INFO  (TEST-PeerSyncReplicationTest.test-seed#[E1BCCD231971E84A]) [    ] o.a.s.c.ZkTestServer connecting to 127.0.0.1:34000 34000
   [junit4]   2> 1674356 INFO  (Thread-2845) [    ] o.a.s.c.ZkTestServer connecting to 127.0.0.1:34000 34000
   [junit4]   2> 1674356 WARN  (Thread-2845) [    ] o.a.s.c.ZkTestServer Watch limit violations: 
   [junit4]   2> Maximum concurrent create/delete watches above limit:
   [junit4]   2> 
   [junit4]   2> 	6	/solr/aliases.json
   [junit4]   2> 	5	/solr/security.json
   [junit4]   2> 	5	/solr/configs/conf1
   [junit4]   2> 	4	/solr/collections/collection1/state.json
   [junit4]   2> 
   [junit4]   2> Maximum concurrent data watches above limit:
   [junit4]   2> 
   [junit4]   2> 	6	/solr/clusterstate.json
   [junit4]   2> 	6	/solr/clusterprops.json
   [junit4]   2> 	2	/solr/overseer_elect/election/96843831726637065-127.0.0.1:41563_-n_0000000001
   [junit4]   2> 	2	/solr/collections/collection1/leader_elect/shard1/election/96843831726637065-core_node1-n_0000000000
   [junit4]   2> 
   [junit4]   2> Maximum concurrent children watches above limit:
   [junit4]   2> 
   [junit4]   2> 	38	/solr/overseer/collection-queue-work
   [junit4]   2> 	19	/solr/overseer/queue
   [junit4]   2> 	6	/solr/collections
   [junit4]   2> 	5	/solr/live_nodes
   [junit4]   2> 	3	/solr/overseer/queue-work
   [junit4]   2> 
   [junit4]   2> NOTE: reproduce with: ant test  -Dtestcase=PeerSyncReplicationTest -Dtests.method=test -Dtests.seed=E1BCCD231971E84A -Dtests.multiplier=3 -Dtests.slow=true -Dtests.locale=fr-CG -Dtests.timezone=Europe/Monaco -Dtests.asserts=true -Dtests.file.encoding=UTF-8
   [junit4] FAILURE 41.3s J0 | PeerSyncReplicationTest.test <<<
   [junit4]    > Throwable #1: java.lang.AssertionError: PeerSync failed. Had to fail back to replication expected:<0> but was:<18>
   [junit4]    > 	at __randomizedtesting.SeedInfo.seed([E1BCCD231971E84A:69E8F2F9B78D85B2]:0)
   [junit4]    > 	at org.apache.solr.cloud.PeerSyncReplicationTest.bringUpDeadNodeAndEnsureNoReplication(PeerSyncReplicationTest.java:290)
   [junit4]    > 	at org.apache.solr.cloud.PeerSyncReplicationTest.forceNodeFailureAndDoPeerSync(PeerSyncReplicationTest.java:244)
   [junit4]    > 	at org.apache.solr.cloud.PeerSyncReplicationTest.test(PeerSyncReplicationTest.java:130)
   [junit4]    > 	at jdk.internal.reflect.NativeMethodAccessorImpl.invoke0(java.base@9-ea/Native Method)
   [junit4]    > 	at jdk.internal.reflect.NativeMethodAccessorImpl.invoke(java.base@9-ea/NativeMethodAccessorImpl.java:62)
   [junit4]    > 	at jdk.internal.reflect.DelegatingMethodAccessorImpl.invoke(java.base@9-ea/DelegatingMethodAccessorImpl.java:43)
   [junit4]    > 	at org.apache.solr.BaseDistributedSearchTestCase$ShardsRepeatRule$ShardsFixedStatement.callStatement(BaseDistributedSearchTestCase.java:992)
   [junit4]    > 	at org.apache.solr.BaseDistributedSearchTestCase$ShardsRepeatRule$ShardsStatement.evaluate(BaseDistributedSearchTestCase.java:967)
   [junit4]    > 	at java.lang.Thread.run(java.base@9-ea/Thread.java:843)
   [junit4]   2> 1674359 INFO  (SUITE-PeerSyncReplicationTest-seed#[E1BCCD231971E84A]-worker) [    ] o.a.s.SolrTestCaseJ4 ###deleteCore
   [junit4]   2> NOTE: leaving temporary files on disk at: /home/jenkins/workspace/Lucene-Solr-6.x-Linux/solr/build/solr-core/test/J0/temp/solr.cloud.PeerSyncReplicationTest_E1BCCD231971E84A-001
   [junit4]   2> Oct 29, 2016 5:40:41 AM com.carrotsearch.randomizedtesting.ThreadLeakControl checkThreadLeaks
   [junit4]   2> WARNING: Will linger awaiting termination of 1 leaked thread(s).
   [junit4]   2> NOTE: test params are: codec=Asserting(Lucene62): {other_tl1=PostingsFormat(name=LuceneVarGapFixedInterval), range_facet_l_dv=PostingsFormat(name=Memory doPackFST= false), rnd_s=PostingsFormat(name=LuceneVarGapFixedInterval), multiDefault=PostingsFormat(name=MockRandom), intDefault=PostingsFormat(name=LuceneVarGapFixedInterval), a_i1=PostingsFormat(name=MockRandom), range_facet_l=PostingsFormat(name=MockRandom), _version_=PostingsFormat(name=LuceneVarGapFixedInterval), a_t=PostingsFormat(name=MockRandom), id=PostingsFormat(name=Memory doPackFST= false), range_facet_i_dv=PostingsFormat(name=MockRandom), text=FSTOrd50, timestamp=PostingsFormat(name=MockRandom)}, docValues:{range_facet_l_dv=DocValuesFormat(name=Asserting), range_facet_i_dv=DocValuesFormat(name=Lucene54), timestamp=DocValuesFormat(name=Lucene54)}, maxPointsInLeafNode=1549, maxMBSortInHeap=7.853889738368505, sim=RandomSimilarity(queryNorm=false,coord=crazy): {}, locale=fr-CG, timezone=Europe/Monaco
   [junit4]   2> NOTE: Linux 4.4.0-42-generic i386/Oracle Corporation 9-ea (32-bit)/cpus=12,threads=1,free=75310864,total=310378496
   [junit4]   2> NOTE: All tests run in this JVM: [ConjunctionSolrSpellCheckerTest, DistributedFacetPivotLongTailTest, TestDynamicFieldResource, PolyFieldTest, DocumentAnalysisRequestHandlerTest, TestPerFieldSimilarity, TestExpandComponent, CloudExitableDirectoryReaderTest, DirectoryFactoryTest, TestSolr4Spatial, HdfsBasicDistributedZkTest, MBeansHandlerTest, TestValueSourceCache, TestRestManager, TestLockTree, TestLazyCores, StandardRequestHandlerTest, ReturnFieldsTest, LeaderElectionContextKeyTest, TestDistributedSearch, TestJsonFacetRefinement, SpatialRPTFieldTypeTest, TestCorePropertiesReload, TestCSVLoader, BlockJoinFacetDistribTest, TestFunctionQuery, RecoveryAfterSoftCommitTest, TestPerFieldSimilarityClassic, TestRemoteStreaming, TestCloudPivotFacet, PreAnalyzedUpdateProcessorTest, TestConfigSetImmutable, CoreMergeIndexesAdminHandlerTest, TestIBSimilarityFactory, TestCodecSupport, BadCopyFieldTest, ChaosMonkeyNothingIsSafeTest, TestFaceting, TestNoOpRegenerator, HdfsWriteToMultipleCollectionsTest, DeleteShardTest, DateFieldTest, CacheHeaderTest, OverseerCollectionConfigSetProcessorTest, CdcrVersionReplicationTest, AsyncCallRequestStatusResponseTest, TestJmxIntegration, TestAuthenticationFramework, TestComponentsName, DistributedFacetPivotWhiteBoxTest, PKIAuthenticationIntegrationTest, SegmentsInfoRequestHandlerTest, DisMaxRequestHandlerTest, TestHdfsUpdateLog, TestSolrFieldCacheMBean, TestRandomCollapseQParserPlugin, TestSolrConfigHandler, TriLevelCompositeIdRoutingTest, TestSolrCoreProperties, FileBasedSpellCheckerTest, LeaderInitiatedRecoveryOnCommitTest, TestInitQParser, TestMacroExpander, AlternateDirectoryTest, TestTolerantUpdateProcessorCloud, TestRequestForwarding, SolrCoreTest, TestFastWriter, SynonymTokenizerTest, TestCrossCoreJoin, TestSchemaManager, DefaultValueUpdateProcessorTest, NumericFieldsTest, TestUniqueKeyFieldResource, TestTrieFacet, TestBinaryResponseWriter, CreateCollectionCleanupTest, RuleEngineTest, TestExclusionRuleCollectionAccess, TestJoin, DistributedSuggestComponentTest, TestFieldTypeCollectionResource, TestFilteredDocIdSet, ActionThrottleTest, PathHierarchyTokenizerFactoryTest, ConcurrentDeleteAndCreateCollectionTest, OutputWriterTest, AnalysisAfterCoreReloadTest, XsltUpdateRequestHandlerTest, OverseerStatusTest, AtomicUpdatesTest, CdcrReplicationDistributedZkTest, TestRandomRequestDistribution, TestSolrConfigHandlerConcurrent, SmileWriterTest, TestLeaderElectionZkExpiry, PeerSyncTest, TestEmbeddedSolrServerConstructors, TestObjectReleaseTracker, TestAddFieldRealTimeGet, TestSerializedLuceneMatchVersion, AnalyticsMergeStrategyTest, TestSchemaResource, BasicDistributedZkTest, ChaosMonkeySafeLeaderTest, SyncSliceTest, OpenCloseCoreStressTest, LeaderElectionIntegrationTest, ShardRoutingTest, TestReplicationHandler, LeaderElectionTest, AutoCommitTest, TestDistributedGrouping, TermVectorComponentDistributedTest, TestStressReorder, TestRangeQuery, TestGroupingSearch, SolrCmdDistributorTest, QueryElevationComponentTest, TestBadConfig, TestIndexSearcher, ShowFileRequestHandlerTest, DistributedQueryElevationComponentTest, TestFoldingMultitermQuery, DocValuesTest, QueryEqualityTest, DistanceFunctionTest, IndexBasedSpellCheckerTest, TestWriterPerf, DirectSolrSpellCheckerTest, PrimitiveFieldTypeTest, TermsComponentTest, DocumentBuilderTest, RequiredFieldsTest, TestSolrQueryParser, RegexBoostProcessorTest, TestCSVResponseWriter, UniqFieldsUpdateProcessorFactoryTest, JsonLoaderTest, TestPHPSerializedResponseWriter, CSVRequestHandlerTest, TestLFUCache, SolrTestCaseJ4Test, TestCursorMarkWithoutUniqueKey, TestHighlightDedupGrouping, TestJettySolrRunner, ConnectionReuseTest, AssignTest, CdcrReplicationHandlerTest, CleanupOldIndexTest, CollectionReloadTest, CollectionsAPIAsyncDistributedZkTest, DeleteLastCustomShardedReplicaTest, DistribDocExpirationUpdateProcessorTest, LeaderFailoverAfterPartitionTest, OverriddenZkACLAndCredentialsProvidersTest, PeerSyncReplicationTest]
   [junit4] Completed [459/648 (1!)] on J0 in 41.87s, 1 test, 1 failure <<< FAILURES!

[...truncated 50613 lines...]


Mime
View raw message