lucene-dev mailing list archives

Site index · List index
Message view « Date » · « Thread »
Top « Date » · « Thread »
From Policeman Jenkins Server <jenk...@thetaphi.de>
Subject [JENKINS] Lucene-Solr-master-Linux (32bit/jdk1.8.0_102) - Build # 18168 - Unstable!
Date Sat, 29 Oct 2016 10:51:15 GMT
Build: https://jenkins.thetaphi.de/job/Lucene-Solr-master-Linux/18168/
Java: 32bit/jdk1.8.0_102 -client -XX:+UseConcMarkSweepGC

3 tests failed.
FAILED:  org.apache.solr.core.TestDynamicLoading.testDynamicLoading

Error Message:
Could not get expected value  'X val changed' for path 'x' full output: {   "responseHeader":{     "status":0,     "QTime":0},   "params":{"wt":"json"},   "context":{     "webapp":"",     "path":"/test1",     "httpMethod":"GET"},   "class":"org.apache.solr.core.BlobStoreTestRequestHandler",   "x":null},  from server:  null

Stack Trace:
java.lang.AssertionError: Could not get expected value  'X val changed' for path 'x' full output: {
  "responseHeader":{
    "status":0,
    "QTime":0},
  "params":{"wt":"json"},
  "context":{
    "webapp":"",
    "path":"/test1",
    "httpMethod":"GET"},
  "class":"org.apache.solr.core.BlobStoreTestRequestHandler",
  "x":null},  from server:  null
	at __randomizedtesting.SeedInfo.seed([927D77D5D86553ED:4A305A822FB8F64D]:0)
	at org.junit.Assert.fail(Assert.java:93)
	at org.junit.Assert.assertTrue(Assert.java:43)
	at org.apache.solr.core.TestSolrConfigHandler.testForResponseElement(TestSolrConfigHandler.java:535)
	at org.apache.solr.core.TestDynamicLoading.testDynamicLoading(TestDynamicLoading.java:249)
	at sun.reflect.NativeMethodAccessorImpl.invoke0(Native Method)
	at sun.reflect.NativeMethodAccessorImpl.invoke(NativeMethodAccessorImpl.java:62)
	at sun.reflect.DelegatingMethodAccessorImpl.invoke(DelegatingMethodAccessorImpl.java:43)
	at java.lang.reflect.Method.invoke(Method.java:498)
	at com.carrotsearch.randomizedtesting.RandomizedRunner.invoke(RandomizedRunner.java:1713)
	at com.carrotsearch.randomizedtesting.RandomizedRunner$8.evaluate(RandomizedRunner.java:907)
	at com.carrotsearch.randomizedtesting.RandomizedRunner$9.evaluate(RandomizedRunner.java:943)
	at com.carrotsearch.randomizedtesting.RandomizedRunner$10.evaluate(RandomizedRunner.java:957)
	at org.apache.solr.BaseDistributedSearchTestCase$ShardsRepeatRule$ShardsFixedStatement.callStatement(BaseDistributedSearchTestCase.java:985)
	at org.apache.solr.BaseDistributedSearchTestCase$ShardsRepeatRule$ShardsStatement.evaluate(BaseDistributedSearchTestCase.java:960)
	at com.carrotsearch.randomizedtesting.rules.SystemPropertiesRestoreRule$1.evaluate(SystemPropertiesRestoreRule.java:57)
	at org.apache.lucene.util.TestRuleSetupTeardownChained$1.evaluate(TestRuleSetupTeardownChained.java:49)
	at org.apache.lucene.util.AbstractBeforeAfterRule$1.evaluate(AbstractBeforeAfterRule.java:45)
	at org.apache.lucene.util.TestRuleThreadAndTestName$1.evaluate(TestRuleThreadAndTestName.java:48)
	at org.apache.lucene.util.TestRuleIgnoreAfterMaxFailures$1.evaluate(TestRuleIgnoreAfterMaxFailures.java:64)
	at org.apache.lucene.util.TestRuleMarkFailure$1.evaluate(TestRuleMarkFailure.java:47)
	at com.carrotsearch.randomizedtesting.rules.StatementAdapter.evaluate(StatementAdapter.java:36)
	at com.carrotsearch.randomizedtesting.ThreadLeakControl$StatementRunner.run(ThreadLeakControl.java:367)
	at com.carrotsearch.randomizedtesting.ThreadLeakControl.forkTimeoutingTask(ThreadLeakControl.java:811)
	at com.carrotsearch.randomizedtesting.ThreadLeakControl$3.evaluate(ThreadLeakControl.java:462)
	at com.carrotsearch.randomizedtesting.RandomizedRunner.runSingleTest(RandomizedRunner.java:916)
	at com.carrotsearch.randomizedtesting.RandomizedRunner$5.evaluate(RandomizedRunner.java:802)
	at com.carrotsearch.randomizedtesting.RandomizedRunner$6.evaluate(RandomizedRunner.java:852)
	at com.carrotsearch.randomizedtesting.RandomizedRunner$7.evaluate(RandomizedRunner.java:863)
	at com.carrotsearch.randomizedtesting.rules.StatementAdapter.evaluate(StatementAdapter.java:36)
	at com.carrotsearch.randomizedtesting.rules.SystemPropertiesRestoreRule$1.evaluate(SystemPropertiesRestoreRule.java:57)
	at org.apache.lucene.util.AbstractBeforeAfterRule$1.evaluate(AbstractBeforeAfterRule.java:45)
	at com.carrotsearch.randomizedtesting.rules.StatementAdapter.evaluate(StatementAdapter.java:36)
	at org.apache.lucene.util.TestRuleStoreClassName$1.evaluate(TestRuleStoreClassName.java:41)
	at com.carrotsearch.randomizedtesting.rules.NoShadowingOrOverridesOnMethodsRule$1.evaluate(NoShadowingOrOverridesOnMethodsRule.java:40)
	at com.carrotsearch.randomizedtesting.rules.NoShadowingOrOverridesOnMethodsRule$1.evaluate(NoShadowingOrOverridesOnMethodsRule.java:40)
	at com.carrotsearch.randomizedtesting.rules.StatementAdapter.evaluate(StatementAdapter.java:36)
	at com.carrotsearch.randomizedtesting.rules.StatementAdapter.evaluate(StatementAdapter.java:36)
	at com.carrotsearch.randomizedtesting.rules.StatementAdapter.evaluate(StatementAdapter.java:36)
	at org.apache.lucene.util.TestRuleAssertionsRequired$1.evaluate(TestRuleAssertionsRequired.java:53)
	at org.apache.lucene.util.TestRuleMarkFailure$1.evaluate(TestRuleMarkFailure.java:47)
	at org.apache.lucene.util.TestRuleIgnoreAfterMaxFailures$1.evaluate(TestRuleIgnoreAfterMaxFailures.java:64)
	at org.apache.lucene.util.TestRuleIgnoreTestSuites$1.evaluate(TestRuleIgnoreTestSuites.java:54)
	at com.carrotsearch.randomizedtesting.rules.StatementAdapter.evaluate(StatementAdapter.java:36)
	at com.carrotsearch.randomizedtesting.ThreadLeakControl$StatementRunner.run(ThreadLeakControl.java:367)
	at java.lang.Thread.run(Thread.java:745)


FAILED:  org.apache.solr.security.BasicAuthStandaloneTest.testBasicAuth

Error Message:
Invalid json <html> <head> <meta http-equiv="Content-Type" content="text/html;charset=ISO-8859-1"/> <title>Error 401 </title> </head> <body> <h2>HTTP ERROR: 401</h2> <p>Problem accessing /solr/admin/authentication. Reason: <pre>    Bad credentials</pre></p> <hr /><a href="http://eclipse.org/jetty">Powered by Jetty:// 9.3.8.v20160314</a><hr/> </body> </html> 

Stack Trace:
java.lang.AssertionError: Invalid json <html>
<head>
<meta http-equiv="Content-Type" content="text/html;charset=ISO-8859-1"/>
<title>Error 401 </title>
</head>
<body>
<h2>HTTP ERROR: 401</h2>
<p>Problem accessing /solr/admin/authentication. Reason:
<pre>    Bad credentials</pre></p>
<hr /><a href="http://eclipse.org/jetty">Powered by Jetty:// 9.3.8.v20160314</a><hr/>
</body>
</html>

	at __randomizedtesting.SeedInfo.seed([927D77D5D86553ED:2E1301C77C36D097]:0)
	at org.junit.Assert.fail(Assert.java:93)
	at org.apache.solr.security.BasicAuthIntegrationTest.verifySecurityStatus(BasicAuthIntegrationTest.java:256)
	at org.apache.solr.security.BasicAuthIntegrationTest.verifySecurityStatus(BasicAuthIntegrationTest.java:237)
	at org.apache.solr.security.BasicAuthStandaloneTest.testBasicAuth(BasicAuthStandaloneTest.java:102)
	at sun.reflect.NativeMethodAccessorImpl.invoke0(Native Method)
	at sun.reflect.NativeMethodAccessorImpl.invoke(NativeMethodAccessorImpl.java:62)
	at sun.reflect.DelegatingMethodAccessorImpl.invoke(DelegatingMethodAccessorImpl.java:43)
	at java.lang.reflect.Method.invoke(Method.java:498)
	at com.carrotsearch.randomizedtesting.RandomizedRunner.invoke(RandomizedRunner.java:1713)
	at com.carrotsearch.randomizedtesting.RandomizedRunner$8.evaluate(RandomizedRunner.java:907)
	at com.carrotsearch.randomizedtesting.RandomizedRunner$9.evaluate(RandomizedRunner.java:943)
	at com.carrotsearch.randomizedtesting.RandomizedRunner$10.evaluate(RandomizedRunner.java:957)
	at com.carrotsearch.randomizedtesting.rules.SystemPropertiesRestoreRule$1.evaluate(SystemPropertiesRestoreRule.java:57)
	at org.apache.lucene.util.TestRuleSetupTeardownChained$1.evaluate(TestRuleSetupTeardownChained.java:49)
	at org.apache.lucene.util.AbstractBeforeAfterRule$1.evaluate(AbstractBeforeAfterRule.java:45)
	at org.apache.lucene.util.TestRuleThreadAndTestName$1.evaluate(TestRuleThreadAndTestName.java:48)
	at org.apache.lucene.util.TestRuleIgnoreAfterMaxFailures$1.evaluate(TestRuleIgnoreAfterMaxFailures.java:64)
	at org.apache.lucene.util.TestRuleMarkFailure$1.evaluate(TestRuleMarkFailure.java:47)
	at com.carrotsearch.randomizedtesting.rules.StatementAdapter.evaluate(StatementAdapter.java:36)
	at com.carrotsearch.randomizedtesting.ThreadLeakControl$StatementRunner.run(ThreadLeakControl.java:367)
	at com.carrotsearch.randomizedtesting.ThreadLeakControl.forkTimeoutingTask(ThreadLeakControl.java:811)
	at com.carrotsearch.randomizedtesting.ThreadLeakControl$3.evaluate(ThreadLeakControl.java:462)
	at com.carrotsearch.randomizedtesting.RandomizedRunner.runSingleTest(RandomizedRunner.java:916)
	at com.carrotsearch.randomizedtesting.RandomizedRunner$5.evaluate(RandomizedRunner.java:802)
	at com.carrotsearch.randomizedtesting.RandomizedRunner$6.evaluate(RandomizedRunner.java:852)
	at com.carrotsearch.randomizedtesting.RandomizedRunner$7.evaluate(RandomizedRunner.java:863)
	at com.carrotsearch.randomizedtesting.rules.StatementAdapter.evaluate(StatementAdapter.java:36)
	at com.carrotsearch.randomizedtesting.rules.SystemPropertiesRestoreRule$1.evaluate(SystemPropertiesRestoreRule.java:57)
	at org.apache.lucene.util.AbstractBeforeAfterRule$1.evaluate(AbstractBeforeAfterRule.java:45)
	at com.carrotsearch.randomizedtesting.rules.StatementAdapter.evaluate(StatementAdapter.java:36)
	at org.apache.lucene.util.TestRuleStoreClassName$1.evaluate(TestRuleStoreClassName.java:41)
	at com.carrotsearch.randomizedtesting.rules.NoShadowingOrOverridesOnMethodsRule$1.evaluate(NoShadowingOrOverridesOnMethodsRule.java:40)
	at com.carrotsearch.randomizedtesting.rules.NoShadowingOrOverridesOnMethodsRule$1.evaluate(NoShadowingOrOverridesOnMethodsRule.java:40)
	at com.carrotsearch.randomizedtesting.rules.StatementAdapter.evaluate(StatementAdapter.java:36)
	at com.carrotsearch.randomizedtesting.rules.StatementAdapter.evaluate(StatementAdapter.java:36)
	at com.carrotsearch.randomizedtesting.rules.StatementAdapter.evaluate(StatementAdapter.java:36)
	at org.apache.lucene.util.TestRuleAssertionsRequired$1.evaluate(TestRuleAssertionsRequired.java:53)
	at org.apache.lucene.util.TestRuleMarkFailure$1.evaluate(TestRuleMarkFailure.java:47)
	at org.apache.lucene.util.TestRuleIgnoreAfterMaxFailures$1.evaluate(TestRuleIgnoreAfterMaxFailures.java:64)
	at org.apache.lucene.util.TestRuleIgnoreTestSuites$1.evaluate(TestRuleIgnoreTestSuites.java:54)
	at com.carrotsearch.randomizedtesting.rules.StatementAdapter.evaluate(StatementAdapter.java:36)
	at com.carrotsearch.randomizedtesting.ThreadLeakControl$StatementRunner.run(ThreadLeakControl.java:367)
	at java.lang.Thread.run(Thread.java:745)


FAILED:  org.apache.solr.handler.TestReplicationHandler.doTestIndexAndConfigAliasReplication

Error Message:
expected:<1> but was:<0>

Stack Trace:
java.lang.AssertionError: expected:<1> but was:<0>
	at __randomizedtesting.SeedInfo.seed([927D77D5D86553ED:650E998D1E8DFC0B]:0)
	at org.junit.Assert.fail(Assert.java:93)
	at org.junit.Assert.failNotEquals(Assert.java:647)
	at org.junit.Assert.assertEquals(Assert.java:128)
	at org.junit.Assert.assertEquals(Assert.java:472)
	at org.junit.Assert.assertEquals(Assert.java:456)
	at org.apache.solr.handler.TestReplicationHandler.doTestIndexAndConfigAliasReplication(TestReplicationHandler.java:1329)
	at sun.reflect.NativeMethodAccessorImpl.invoke0(Native Method)
	at sun.reflect.NativeMethodAccessorImpl.invoke(NativeMethodAccessorImpl.java:62)
	at sun.reflect.DelegatingMethodAccessorImpl.invoke(DelegatingMethodAccessorImpl.java:43)
	at java.lang.reflect.Method.invoke(Method.java:498)
	at com.carrotsearch.randomizedtesting.RandomizedRunner.invoke(RandomizedRunner.java:1713)
	at com.carrotsearch.randomizedtesting.RandomizedRunner$8.evaluate(RandomizedRunner.java:907)
	at com.carrotsearch.randomizedtesting.RandomizedRunner$9.evaluate(RandomizedRunner.java:943)
	at com.carrotsearch.randomizedtesting.RandomizedRunner$10.evaluate(RandomizedRunner.java:957)
	at com.carrotsearch.randomizedtesting.rules.SystemPropertiesRestoreRule$1.evaluate(SystemPropertiesRestoreRule.java:57)
	at org.apache.lucene.util.TestRuleSetupTeardownChained$1.evaluate(TestRuleSetupTeardownChained.java:49)
	at org.apache.lucene.util.AbstractBeforeAfterRule$1.evaluate(AbstractBeforeAfterRule.java:45)
	at org.apache.lucene.util.TestRuleThreadAndTestName$1.evaluate(TestRuleThreadAndTestName.java:48)
	at org.apache.lucene.util.TestRuleIgnoreAfterMaxFailures$1.evaluate(TestRuleIgnoreAfterMaxFailures.java:64)
	at org.apache.lucene.util.TestRuleMarkFailure$1.evaluate(TestRuleMarkFailure.java:47)
	at com.carrotsearch.randomizedtesting.rules.StatementAdapter.evaluate(StatementAdapter.java:36)
	at com.carrotsearch.randomizedtesting.ThreadLeakControl$StatementRunner.run(ThreadLeakControl.java:367)
	at com.carrotsearch.randomizedtesting.ThreadLeakControl.forkTimeoutingTask(ThreadLeakControl.java:811)
	at com.carrotsearch.randomizedtesting.ThreadLeakControl$3.evaluate(ThreadLeakControl.java:462)
	at com.carrotsearch.randomizedtesting.RandomizedRunner.runSingleTest(RandomizedRunner.java:916)
	at com.carrotsearch.randomizedtesting.RandomizedRunner$5.evaluate(RandomizedRunner.java:802)
	at com.carrotsearch.randomizedtesting.RandomizedRunner$6.evaluate(RandomizedRunner.java:852)
	at com.carrotsearch.randomizedtesting.RandomizedRunner$7.evaluate(RandomizedRunner.java:863)
	at com.carrotsearch.randomizedtesting.rules.StatementAdapter.evaluate(StatementAdapter.java:36)
	at com.carrotsearch.randomizedtesting.rules.SystemPropertiesRestoreRule$1.evaluate(SystemPropertiesRestoreRule.java:57)
	at org.apache.lucene.util.AbstractBeforeAfterRule$1.evaluate(AbstractBeforeAfterRule.java:45)
	at com.carrotsearch.randomizedtesting.rules.StatementAdapter.evaluate(StatementAdapter.java:36)
	at org.apache.lucene.util.TestRuleStoreClassName$1.evaluate(TestRuleStoreClassName.java:41)
	at com.carrotsearch.randomizedtesting.rules.NoShadowingOrOverridesOnMethodsRule$1.evaluate(NoShadowingOrOverridesOnMethodsRule.java:40)
	at com.carrotsearch.randomizedtesting.rules.NoShadowingOrOverridesOnMethodsRule$1.evaluate(NoShadowingOrOverridesOnMethodsRule.java:40)
	at com.carrotsearch.randomizedtesting.rules.StatementAdapter.evaluate(StatementAdapter.java:36)
	at com.carrotsearch.randomizedtesting.rules.StatementAdapter.evaluate(StatementAdapter.java:36)
	at com.carrotsearch.randomizedtesting.rules.StatementAdapter.evaluate(StatementAdapter.java:36)
	at org.apache.lucene.util.TestRuleAssertionsRequired$1.evaluate(TestRuleAssertionsRequired.java:53)
	at org.apache.lucene.util.TestRuleMarkFailure$1.evaluate(TestRuleMarkFailure.java:47)
	at org.apache.lucene.util.TestRuleIgnoreAfterMaxFailures$1.evaluate(TestRuleIgnoreAfterMaxFailures.java:64)
	at org.apache.lucene.util.TestRuleIgnoreTestSuites$1.evaluate(TestRuleIgnoreTestSuites.java:54)
	at com.carrotsearch.randomizedtesting.rules.StatementAdapter.evaluate(StatementAdapter.java:36)
	at com.carrotsearch.randomizedtesting.ThreadLeakControl$StatementRunner.run(ThreadLeakControl.java:367)
	at java.lang.Thread.run(Thread.java:745)




Build Log:
[...truncated 10966 lines...]
   [junit4] Suite: org.apache.solr.core.TestDynamicLoading
   [junit4]   2> Creating dataDir: /home/jenkins/workspace/Lucene-Solr-master-Linux/solr/build/solr-core/test/J0/temp/solr.core.TestDynamicLoading_927D77D5D86553ED-001/init-core-data-001
   [junit4]   2> 485880 INFO  (SUITE-TestDynamicLoading-seed#[927D77D5D86553ED]-worker) [    ] o.a.s.SolrTestCaseJ4 Randomized ssl (true) and clientAuth (false) via: @org.apache.solr.util.RandomizeSSL(reason=, ssl=NaN, value=NaN, clientAuth=NaN)
   [junit4]   2> 485881 INFO  (SUITE-TestDynamicLoading-seed#[927D77D5D86553ED]-worker) [    ] o.a.s.BaseDistributedSearchTestCase Setting hostContext system property: /
   [junit4]   2> 485884 INFO  (TEST-TestDynamicLoading.testDynamicLoading-seed#[927D77D5D86553ED]) [    ] o.a.s.c.ZkTestServer STARTING ZK TEST SERVER
   [junit4]   2> 485884 INFO  (Thread-537) [    ] o.a.s.c.ZkTestServer client port:0.0.0.0/0.0.0.0:0
   [junit4]   2> 485884 INFO  (Thread-537) [    ] o.a.s.c.ZkTestServer Starting server
   [junit4]   2> 485984 INFO  (TEST-TestDynamicLoading.testDynamicLoading-seed#[927D77D5D86553ED]) [    ] o.a.s.c.ZkTestServer start zk server on port:36406
   [junit4]   2> 486023 INFO  (TEST-TestDynamicLoading.testDynamicLoading-seed#[927D77D5D86553ED]) [    ] o.a.s.c.AbstractZkTestCase put /home/jenkins/workspace/Lucene-Solr-master-Linux/solr/core/src/test-files/solr/collection1/conf/solrconfig-tlog.xml to /configs/conf1/solrconfig.xml
   [junit4]   2> 486026 INFO  (TEST-TestDynamicLoading.testDynamicLoading-seed#[927D77D5D86553ED]) [    ] o.a.s.c.AbstractZkTestCase put /home/jenkins/workspace/Lucene-Solr-master-Linux/solr/core/src/test-files/solr/collection1/conf/schema.xml to /configs/conf1/schema.xml
   [junit4]   2> 486028 INFO  (TEST-TestDynamicLoading.testDynamicLoading-seed#[927D77D5D86553ED]) [    ] o.a.s.c.AbstractZkTestCase put /home/jenkins/workspace/Lucene-Solr-master-Linux/solr/core/src/test-files/solr/collection1/conf/solrconfig.snippet.randomindexconfig.xml to /configs/conf1/solrconfig.snippet.randomindexconfig.xml
   [junit4]   2> 486030 INFO  (TEST-TestDynamicLoading.testDynamicLoading-seed#[927D77D5D86553ED]) [    ] o.a.s.c.AbstractZkTestCase put /home/jenkins/workspace/Lucene-Solr-master-Linux/solr/core/src/test-files/solr/collection1/conf/stopwords.txt to /configs/conf1/stopwords.txt
   [junit4]   2> 486032 INFO  (TEST-TestDynamicLoading.testDynamicLoading-seed#[927D77D5D86553ED]) [    ] o.a.s.c.AbstractZkTestCase put /home/jenkins/workspace/Lucene-Solr-master-Linux/solr/core/src/test-files/solr/collection1/conf/protwords.txt to /configs/conf1/protwords.txt
   [junit4]   2> 486034 INFO  (TEST-TestDynamicLoading.testDynamicLoading-seed#[927D77D5D86553ED]) [    ] o.a.s.c.AbstractZkTestCase put /home/jenkins/workspace/Lucene-Solr-master-Linux/solr/core/src/test-files/solr/collection1/conf/currency.xml to /configs/conf1/currency.xml
   [junit4]   2> 486035 INFO  (TEST-TestDynamicLoading.testDynamicLoading-seed#[927D77D5D86553ED]) [    ] o.a.s.c.AbstractZkTestCase put /home/jenkins/workspace/Lucene-Solr-master-Linux/solr/core/src/test-files/solr/collection1/conf/enumsConfig.xml to /configs/conf1/enumsConfig.xml
   [junit4]   2> 486037 INFO  (TEST-TestDynamicLoading.testDynamicLoading-seed#[927D77D5D86553ED]) [    ] o.a.s.c.AbstractZkTestCase put /home/jenkins/workspace/Lucene-Solr-master-Linux/solr/core/src/test-files/solr/collection1/conf/open-exchange-rates.json to /configs/conf1/open-exchange-rates.json
   [junit4]   2> 486039 INFO  (TEST-TestDynamicLoading.testDynamicLoading-seed#[927D77D5D86553ED]) [    ] o.a.s.c.AbstractZkTestCase put /home/jenkins/workspace/Lucene-Solr-master-Linux/solr/core/src/test-files/solr/collection1/conf/mapping-ISOLatin1Accent.txt to /configs/conf1/mapping-ISOLatin1Accent.txt
   [junit4]   2> 486041 INFO  (TEST-TestDynamicLoading.testDynamicLoading-seed#[927D77D5D86553ED]) [    ] o.a.s.c.AbstractZkTestCase put /home/jenkins/workspace/Lucene-Solr-master-Linux/solr/core/src/test-files/solr/collection1/conf/old_synonyms.txt to /configs/conf1/old_synonyms.txt
   [junit4]   2> 486044 INFO  (TEST-TestDynamicLoading.testDynamicLoading-seed#[927D77D5D86553ED]) [    ] o.a.s.c.AbstractZkTestCase put /home/jenkins/workspace/Lucene-Solr-master-Linux/solr/core/src/test-files/solr/collection1/conf/synonyms.txt to /configs/conf1/synonyms.txt
   [junit4]   2> 486169 INFO  (TEST-TestDynamicLoading.testDynamicLoading-seed#[927D77D5D86553ED]) [    ] o.a.s.SolrTestCaseJ4 Writing core.properties file to /home/jenkins/workspace/Lucene-Solr-master-Linux/solr/build/solr-core/test/J0/temp/solr.core.TestDynamicLoading_927D77D5D86553ED-001/control-001/cores/collection1
   [junit4]   2> 486178 INFO  (TEST-TestDynamicLoading.testDynamicLoading-seed#[927D77D5D86553ED]) [    ] o.e.j.s.Server jetty-9.3.8.v20160314
   [junit4]   2> 486180 INFO  (TEST-TestDynamicLoading.testDynamicLoading-seed#[927D77D5D86553ED]) [    ] o.e.j.s.h.ContextHandler Started o.e.j.s.ServletContextHandler@715d32{/,null,AVAILABLE}
   [junit4]   2> 486196 INFO  (TEST-TestDynamicLoading.testDynamicLoading-seed#[927D77D5D86553ED]) [    ] o.e.j.s.ServerConnector Started ServerConnector@1d4b92{SSL,[ssl, http/1.1]}{127.0.0.1:33701}
   [junit4]   2> 486196 INFO  (TEST-TestDynamicLoading.testDynamicLoading-seed#[927D77D5D86553ED]) [    ] o.e.j.s.Server Started @487788ms
   [junit4]   2> 486196 INFO  (TEST-TestDynamicLoading.testDynamicLoading-seed#[927D77D5D86553ED]) [    ] o.a.s.c.s.e.JettySolrRunner Jetty properties: {solr.data.dir=/home/jenkins/workspace/Lucene-Solr-master-Linux/solr/build/solr-core/test/J0/temp/solr.core.TestDynamicLoading_927D77D5D86553ED-001/tempDir-001/control/data, hostContext=/, hostPort=33701, coreRootDirectory=/home/jenkins/workspace/Lucene-Solr-master-Linux/solr/build/solr-core/test/J0/temp/solr.core.TestDynamicLoading_927D77D5D86553ED-001/control-001/cores}
   [junit4]   2> 486197 ERROR (TEST-TestDynamicLoading.testDynamicLoading-seed#[927D77D5D86553ED]) [    ] o.a.s.s.StartupLoggingUtils Missing Java Option solr.log.dir. Logging may be missing or incomplete.
   [junit4]   2> 486197 INFO  (TEST-TestDynamicLoading.testDynamicLoading-seed#[927D77D5D86553ED]) [    ] o.a.s.s.SolrDispatchFilter  ___      _       Welcome to Apache Solr™ version 7.0.0
   [junit4]   2> 486197 INFO  (TEST-TestDynamicLoading.testDynamicLoading-seed#[927D77D5D86553ED]) [    ] o.a.s.s.SolrDispatchFilter / __| ___| |_ _   Starting in cloud mode on port null
   [junit4]   2> 486197 INFO  (TEST-TestDynamicLoading.testDynamicLoading-seed#[927D77D5D86553ED]) [    ] o.a.s.s.SolrDispatchFilter \__ \/ _ \ | '_|  Install dir: null
   [junit4]   2> 486197 INFO  (TEST-TestDynamicLoading.testDynamicLoading-seed#[927D77D5D86553ED]) [    ] o.a.s.s.SolrDispatchFilter |___/\___/_|_|    Start time: 2016-10-29T10:13:41.925Z
   [junit4]   2> 486204 INFO  (TEST-TestDynamicLoading.testDynamicLoading-seed#[927D77D5D86553ED]) [    ] o.a.s.s.SolrDispatchFilter Loading solr.xml from SolrHome (not found in ZooKeeper)
   [junit4]   2> 486204 INFO  (TEST-TestDynamicLoading.testDynamicLoading-seed#[927D77D5D86553ED]) [    ] o.a.s.c.SolrXmlConfig Loading container configuration from /home/jenkins/workspace/Lucene-Solr-master-Linux/solr/build/solr-core/test/J0/temp/solr.core.TestDynamicLoading_927D77D5D86553ED-001/control-001/solr.xml
   [junit4]   2> 486226 INFO  (TEST-TestDynamicLoading.testDynamicLoading-seed#[927D77D5D86553ED]) [    ] o.a.s.c.ZkContainer Zookeeper client=127.0.0.1:36406/solr
   [junit4]   2> 486264 INFO  (TEST-TestDynamicLoading.testDynamicLoading-seed#[927D77D5D86553ED]) [n:127.0.0.1:33701_    ] o.a.s.c.OverseerElectionContext I am going to be the leader 127.0.0.1:33701_
   [junit4]   2> 486274 INFO  (TEST-TestDynamicLoading.testDynamicLoading-seed#[927D77D5D86553ED]) [n:127.0.0.1:33701_    ] o.a.s.c.Overseer Overseer (id=96844907912429573-127.0.0.1:33701_-n_0000000000) starting
   [junit4]   2> 486288 INFO  (TEST-TestDynamicLoading.testDynamicLoading-seed#[927D77D5D86553ED]) [n:127.0.0.1:33701_    ] o.a.s.c.ZkController Register node as live in ZooKeeper:/live_nodes/127.0.0.1:33701_
   [junit4]   2> 486290 INFO  (zkCallback-564-thread-1-processing-n:127.0.0.1:33701_) [n:127.0.0.1:33701_    ] o.a.s.c.c.ZkStateReader Updated live nodes from ZooKeeper... (0) -> (1)
   [junit4]   2> 486372 INFO  (TEST-TestDynamicLoading.testDynamicLoading-seed#[927D77D5D86553ED]) [n:127.0.0.1:33701_    ] o.a.s.c.CorePropertiesLocator Found 1 core definitions underneath /home/jenkins/workspace/Lucene-Solr-master-Linux/solr/build/solr-core/test/J0/temp/solr.core.TestDynamicLoading_927D77D5D86553ED-001/control-001/cores
   [junit4]   2> 486372 INFO  (TEST-TestDynamicLoading.testDynamicLoading-seed#[927D77D5D86553ED]) [n:127.0.0.1:33701_    ] o.a.s.c.CorePropertiesLocator Cores are: [collection1]
   [junit4]   2> 486375 INFO  (OverseerStateUpdate-96844907912429573-127.0.0.1:33701_-n_0000000000) [n:127.0.0.1:33701_    ] o.a.s.c.o.ReplicaMutator Assigning new node to shard shard=shard1
   [junit4]   2> 486435 INFO  (coreLoadExecutor-1289-thread-1-processing-n:127.0.0.1:33701_) [n:127.0.0.1:33701_ c:control_collection   x:collection1] o.a.s.c.SolrConfig Using Lucene MatchVersion: 7.0.0
   [junit4]   2> 486526 INFO  (coreLoadExecutor-1289-thread-1-processing-n:127.0.0.1:33701_) [n:127.0.0.1:33701_ c:control_collection   x:collection1] o.a.s.s.IndexSchema [collection1] Schema name=test
   [junit4]   2> 487029 WARN  (coreLoadExecutor-1289-thread-1-processing-n:127.0.0.1:33701_) [n:127.0.0.1:33701_ c:control_collection   x:collection1] o.a.s.s.IndexSchema [collection1] default search field in schema is text. WARNING: Deprecated, please use 'df' on request instead.
   [junit4]   2> 487033 INFO  (coreLoadExecutor-1289-thread-1-processing-n:127.0.0.1:33701_) [n:127.0.0.1:33701_ c:control_collection   x:collection1] o.a.s.s.IndexSchema Loaded schema test/1.0 with uniqueid field id
   [junit4]   2> 487059 INFO  (coreLoadExecutor-1289-thread-1-processing-n:127.0.0.1:33701_) [n:127.0.0.1:33701_ c:control_collection   x:collection1] o.a.s.c.CoreContainer Creating SolrCore 'collection1' using configuration from collection control_collection
   [junit4]   2> 487059 INFO  (coreLoadExecutor-1289-thread-1-processing-n:127.0.0.1:33701_) [n:127.0.0.1:33701_ c:control_collection s:shard1 r:core_node1 x:collection1] o.a.s.c.SolrCore [[collection1] ] Opening new SolrCore at [/home/jenkins/workspace/Lucene-Solr-master-Linux/solr/build/solr-core/test/J0/temp/solr.core.TestDynamicLoading_927D77D5D86553ED-001/control-001/cores/collection1], dataDir=[/home/jenkins/workspace/Lucene-Solr-master-Linux/solr/build/solr-core/test/J0/temp/solr.core.TestDynamicLoading_927D77D5D86553ED-001/control-001/cores/collection1/data/]
   [junit4]   2> 487060 INFO  (coreLoadExecutor-1289-thread-1-processing-n:127.0.0.1:33701_) [n:127.0.0.1:33701_ c:control_collection s:shard1 r:core_node1 x:collection1] o.a.s.c.JmxMonitoredMap JMX monitoring is enabled. Adding Solr mbeans to JMX Server: com.sun.jmx.mbeanserver.JmxMBeanServer@1f5ec6e
   [junit4]   2> 487061 INFO  (coreLoadExecutor-1289-thread-1-processing-n:127.0.0.1:33701_) [n:127.0.0.1:33701_ c:control_collection s:shard1 r:core_node1 x:collection1] o.a.s.u.RandomMergePolicy RandomMergePolicy wrapping class org.apache.lucene.index.TieredMergePolicy: [TieredMergePolicy: maxMergeAtOnce=35, maxMergeAtOnceExplicit=49, maxMergedSegmentMB=54.796875, floorSegmentMB=1.27734375, forceMergeDeletesPctAllowed=22.454714915635304, segmentsPerTier=36.0, maxCFSSegmentSizeMB=8.796093022207999E12, noCFSRatio=0.8461503176893176
   [junit4]   2> 487067 WARN  (coreLoadExecutor-1289-thread-1-processing-n:127.0.0.1:33701_) [n:127.0.0.1:33701_ c:control_collection s:shard1 r:core_node1 x:collection1] o.a.s.c.RequestHandlers INVALID paramSet a in requestHandler {type = requestHandler,name = /dump,class = DumpRequestHandler,args = {defaults={a=A,b=B}}}
   [junit4]   2> 487100 INFO  (coreLoadExecutor-1289-thread-1-processing-n:127.0.0.1:33701_) [n:127.0.0.1:33701_ c:control_collection s:shard1 r:core_node1 x:collection1] o.a.s.u.UpdateHandler Using UpdateLog implementation: org.apache.solr.update.UpdateLog
   [junit4]   2> 487100 INFO  (coreLoadExecutor-1289-thread-1-processing-n:127.0.0.1:33701_) [n:127.0.0.1:33701_ c:control_collection s:shard1 r:core_node1 x:collection1] o.a.s.u.UpdateLog Initializing UpdateLog: dataDir= defaultSyncLevel=FLUSH numRecordsToKeep=100 maxNumLogsToKeep=10 numVersionBuckets=65536
   [junit4]   2> 487110 INFO  (coreLoadExecutor-1289-thread-1-processing-n:127.0.0.1:33701_) [n:127.0.0.1:33701_ c:control_collection s:shard1 r:core_node1 x:collection1] o.a.s.u.CommitTracker Hard AutoCommit: disabled
   [junit4]   2> 487110 INFO  (coreLoadExecutor-1289-thread-1-processing-n:127.0.0.1:33701_) [n:127.0.0.1:33701_ c:control_collection s:shard1 r:core_node1 x:collection1] o.a.s.u.CommitTracker Soft AutoCommit: disabled
   [junit4]   2> 487110 INFO  (coreLoadExecutor-1289-thread-1-processing-n:127.0.0.1:33701_) [n:127.0.0.1:33701_ c:control_collection s:shard1 r:core_node1 x:collection1] o.a.s.u.RandomMergePolicy RandomMergePolicy wrapping class org.apache.lucene.index.LogByteSizeMergePolicy: [LogByteSizeMergePolicy: minMergeSize=1677721, mergeFactor=29, maxMergeSize=2147483648, maxMergeSizeForForcedMerge=9223372036854775807, calibrateSizeByDeletes=false, maxMergeDocs=2147483647, maxCFSSegmentSizeMB=8.796093022207999E12, noCFSRatio=0.8389533316934468]
   [junit4]   2> 487111 INFO  (coreLoadExecutor-1289-thread-1-processing-n:127.0.0.1:33701_) [n:127.0.0.1:33701_ c:control_collection s:shard1 r:core_node1 x:collection1] o.a.s.s.SolrIndexSearcher Opening [Searcher@1ec24f4[collection1] main]
   [junit4]   2> 487112 INFO  (coreLoadExecutor-1289-thread-1-processing-n:127.0.0.1:33701_) [n:127.0.0.1:33701_ c:control_collection s:shard1 r:core_node1 x:collection1] o.a.s.r.ManagedResourceStorage Configured ZooKeeperStorageIO with znodeBase: /configs/conf1
   [junit4]   2> 487112 INFO  (coreLoadExecutor-1289-thread-1-processing-n:127.0.0.1:33701_) [n:127.0.0.1:33701_ c:control_collection s:shard1 r:core_node1 x:collection1] o.a.s.r.ManagedResourceStorage Loaded null at path _rest_managed.json using ZooKeeperStorageIO:path=/configs/conf1
   [junit4]   2> 487113 INFO  (coreLoadExecutor-1289-thread-1-processing-n:127.0.0.1:33701_) [n:127.0.0.1:33701_ c:control_collection s:shard1 r:core_node1 x:collection1] o.a.s.h.ReplicationHandler Commits will be reserved for  10000
   [junit4]   2> 487115 INFO  (searcherExecutor-1290-thread-1-processing-n:127.0.0.1:33701_ x:collection1 s:shard1 c:control_collection r:core_node1) [n:127.0.0.1:33701_ c:control_collection s:shard1 r:core_node1 x:collection1] o.a.s.c.SolrCore [collection1] Registered new searcher Searcher@1ec24f4[collection1] main{ExitableDirectoryReader(UninvertingDirectoryReader())}
   [junit4]   2> 487116 INFO  (coreLoadExecutor-1289-thread-1-processing-n:127.0.0.1:33701_) [n:127.0.0.1:33701_ c:control_collection s:shard1 r:core_node1 x:collection1] o.a.s.u.UpdateLog Could not find max version in index or recent updates, using new clock 1549518527889670144
   [junit4]   2> 487126 INFO  (coreZkRegister-1282-thread-1-processing-n:127.0.0.1:33701_ x:collection1 s:shard1 c:control_collection r:core_node1) [n:127.0.0.1:33701_ c:control_collection s:shard1 r:core_node1 x:collection1] o.a.s.c.ShardLeaderElectionContext Enough replicas found to continue.
   [junit4]   2> 487126 INFO  (coreZkRegister-1282-thread-1-processing-n:127.0.0.1:33701_ x:collection1 s:shard1 c:control_collection r:core_node1) [n:127.0.0.1:33701_ c:control_collection s:shard1 r:core_node1 x:collection1] o.a.s.c.ShardLeaderElectionContext I may be the new leader - try and sync
   [junit4]   2> 487126 INFO  (coreZkRegister-1282-thread-1-processing-n:127.0.0.1:33701_ x:collection1 s:shard1 c:control_collection r:core_node1) [n:127.0.0.1:33701_ c:control_collection s:shard1 r:core_node1 x:collection1] o.a.s.c.SyncStrategy Sync replicas to https://127.0.0.1:33701/collection1/
   [junit4]   2> 487127 INFO  (coreZkRegister-1282-thread-1-processing-n:127.0.0.1:33701_ x:collection1 s:shard1 c:control_collection r:core_node1) [n:127.0.0.1:33701_ c:control_collection s:shard1 r:core_node1 x:collection1] o.a.s.c.SyncStrategy Sync Success - now sync replicas to me
   [junit4]   2> 487127 INFO  (coreZkRegister-1282-thread-1-processing-n:127.0.0.1:33701_ x:collection1 s:shard1 c:control_collection r:core_node1) [n:127.0.0.1:33701_ c:control_collection s:shard1 r:core_node1 x:collection1] o.a.s.c.SyncStrategy https://127.0.0.1:33701/collection1/ has no replicas
   [junit4]   2> 487138 INFO  (coreZkRegister-1282-thread-1-processing-n:127.0.0.1:33701_ x:collection1 s:shard1 c:control_collection r:core_node1) [n:127.0.0.1:33701_ c:control_collection s:shard1 r:core_node1 x:collection1] o.a.s.c.ShardLeaderElectionContext I am the new leader: https://127.0.0.1:33701/collection1/ shard1
   [junit4]   2> 487290 INFO  (coreZkRegister-1282-thread-1-processing-n:127.0.0.1:33701_ x:collection1 s:shard1 c:control_collection r:core_node1) [n:127.0.0.1:33701_ c:control_collection s:shard1 r:core_node1 x:collection1] o.a.s.c.ZkController I am the leader, no recovery necessary
   [junit4]   2> 487389 INFO  (TEST-TestDynamicLoading.testDynamicLoading-seed#[927D77D5D86553ED]) [    ] o.a.s.c.c.ZkStateReader Updated live nodes from ZooKeeper... (0) -> (1)
   [junit4]   2> 487390 INFO  (TEST-TestDynamicLoading.testDynamicLoading-seed#[927D77D5D86553ED]) [    ] o.a.s.c.ChaosMonkey monkey: init - expire sessions:false cause connection loss:false
   [junit4]   2> 487390 INFO  (TEST-TestDynamicLoading.testDynamicLoading-seed#[927D77D5D86553ED]) [    ] o.a.s.c.AbstractFullDistribZkTestBase Creating collection1 with stateFormat=2
   [junit4]   2> 487544 INFO  (TEST-TestDynamicLoading.testDynamicLoading-seed#[927D77D5D86553ED]) [    ] o.a.s.SolrTestCaseJ4 Writing core.properties file to /home/jenkins/workspace/Lucene-Solr-master-Linux/solr/build/solr-core/test/J0/temp/solr.core.TestDynamicLoading_927D77D5D86553ED-001/shard-1-001/cores/collection1
   [junit4]   2> 487546 INFO  (TEST-TestDynamicLoading.testDynamicLoading-seed#[927D77D5D86553ED]) [    ] o.a.s.c.AbstractFullDistribZkTestBase create jetty 1 in directory /home/jenkins/workspace/Lucene-Solr-master-Linux/solr/build/solr-core/test/J0/temp/solr.core.TestDynamicLoading_927D77D5D86553ED-001/shard-1-001
   [junit4]   2> 487551 INFO  (TEST-TestDynamicLoading.testDynamicLoading-seed#[927D77D5D86553ED]) [    ] o.e.j.s.Server jetty-9.3.8.v20160314
   [junit4]   2> 487552 INFO  (TEST-TestDynamicLoading.testDynamicLoading-seed#[927D77D5D86553ED]) [    ] o.e.j.s.h.ContextHandler Started o.e.j.s.ServletContextHandler@1b783ec{/,null,AVAILABLE}
   [junit4]   2> 487558 INFO  (TEST-TestDynamicLoading.testDynamicLoading-seed#[927D77D5D86553ED]) [    ] o.e.j.s.ServerConnector Started ServerConnector@734bcd{SSL,[ssl, http/1.1]}{127.0.0.1:33538}
   [junit4]   2> 487558 INFO  (TEST-TestDynamicLoading.testDynamicLoading-seed#[927D77D5D86553ED]) [    ] o.e.j.s.Server Started @489150ms
   [junit4]   2> 487558 INFO  (TEST-TestDynamicLoading.testDynamicLoading-seed#[927D77D5D86553ED]) [    ] o.a.s.c.s.e.JettySolrRunner Jetty properties: {solr.data.dir=/home/jenkins/workspace/Lucene-Solr-master-Linux/solr/build/solr-core/test/J0/temp/solr.core.TestDynamicLoading_927D77D5D86553ED-001/tempDir-001/jetty1, solrconfig=solrconfig.xml, hostContext=/, hostPort=33538, coreRootDirectory=/home/jenkins/workspace/Lucene-Solr-master-Linux/solr/build/solr-core/test/J0/../../../../../../../../../home/jenkins/workspace/Lucene-Solr-master-Linux/solr/build/solr-core/test/J0/temp/solr.core.TestDynamicLoading_927D77D5D86553ED-001/shard-1-001/cores}
   [junit4]   2> 487559 ERROR (TEST-TestDynamicLoading.testDynamicLoading-seed#[927D77D5D86553ED]) [    ] o.a.s.s.StartupLoggingUtils Missing Java Option solr.log.dir. Logging may be missing or incomplete.
   [junit4]   2> 487559 INFO  (TEST-TestDynamicLoading.testDynamicLoading-seed#[927D77D5D86553ED]) [    ] o.a.s.s.SolrDispatchFilter  ___      _       Welcome to Apache Solr™ version 7.0.0
   [junit4]   2> 487559 INFO  (TEST-TestDynamicLoading.testDynamicLoading-seed#[927D77D5D86553ED]) [    ] o.a.s.s.SolrDispatchFilter / __| ___| |_ _   Starting in cloud mode on port null
   [junit4]   2> 487559 INFO  (TEST-TestDynamicLoading.testDynamicLoading-seed#[927D77D5D86553ED]) [    ] o.a.s.s.SolrDispatchFilter \__ \/ _ \ | '_|  Install dir: null
   [junit4]   2> 487559 INFO  (TEST-TestDynamicLoading.testDynamicLoading-seed#[927D77D5D86553ED]) [    ] o.a.s.s.SolrDispatchFilter |___/\___/_|_|    Start time: 2016-10-29T10:13:43.287Z
   [junit4]   2> 487562 INFO  (TEST-TestDynamicLoading.testDynamicLoading-seed#[927D77D5D86553ED]) [    ] o.a.s.s.SolrDispatchFilter Loading solr.xml from SolrHome (not found in ZooKeeper)
   [junit4]   2> 487562 INFO  (TEST-TestDynamicLoading.testDynamicLoading-seed#[927D77D5D86553ED]) [    ] o.a.s.c.SolrXmlConfig Loading container configuration from /home/jenkins/workspace/Lucene-Solr-master-Linux/solr/build/solr-core/test/J0/temp/solr.core.TestDynamicLoading_927D77D5D86553ED-001/shard-1-001/solr.xml
   [junit4]   2> 487589 INFO  (TEST-TestDynamicLoading.testDynamicLoading-seed#[927D77D5D86553ED]) [    ] o.a.s.c.ZkContainer Zookeeper client=127.0.0.1:36406/solr
   [junit4]   2> 487599 INFO  (TEST-TestDynamicLoading.testDynamicLoading-seed#[927D77D5D86553ED]) [n:127.0.0.1:33538_    ] o.a.s.c.c.ZkStateReader Updated live nodes from ZooKeeper... (0) -> (1)
   [junit4]   2> 487608 INFO  (TEST-TestDynamicLoading.testDynamicLoading-seed#[927D77D5D86553ED]) [n:127.0.0.1:33538_    ] o.a.s.c.ZkController Register node as live in ZooKeeper:/live_nodes/127.0.0.1:33538_
   [junit4]   2> 487610 INFO  (zkCallback-568-thread-1) [    ] o.a.s.c.c.ZkStateReader Updated live nodes from ZooKeeper... (1) -> (2)
   [junit4]   2> 487611 INFO  (zkCallback-574-thread-1-processing-n:127.0.0.1:33538_) [n:127.0.0.1:33538_    ] o.a.s.c.c.ZkStateReader Updated live nodes from ZooKeeper... (1) -> (2)
   [junit4]   2> 487611 INFO  (zkCallback-564-thread-4-processing-n:127.0.0.1:33701_) [n:127.0.0.1:33701_    ] o.a.s.c.c.ZkStateReader Updated live nodes from ZooKeeper... (1) -> (2)
   [junit4]   2> 487657 INFO  (TEST-TestDynamicLoading.testDynamicLoading-seed#[927D77D5D86553ED]) [n:127.0.0.1:33538_    ] o.a.s.c.CorePropertiesLocator Found 1 core definitions underneath /home/jenkins/workspace/Lucene-Solr-master-Linux/solr/build/solr-core/test/J0/../../../../../../../../../home/jenkins/workspace/Lucene-Solr-master-Linux/solr/build/solr-core/test/J0/temp/solr.core.TestDynamicLoading_927D77D5D86553ED-001/shard-1-001/cores
   [junit4]   2> 487657 INFO  (TEST-TestDynamicLoading.testDynamicLoading-seed#[927D77D5D86553ED]) [n:127.0.0.1:33538_    ] o.a.s.c.CorePropertiesLocator Cores are: [collection1]
   [junit4]   2> 487665 INFO  (OverseerStateUpdate-96844907912429573-127.0.0.1:33701_-n_0000000000) [n:127.0.0.1:33701_    ] o.a.s.c.o.ReplicaMutator Assigning new node to shard shard=shard2
   [junit4]   2> 487768 INFO  (zkCallback-574-thread-1-processing-n:127.0.0.1:33538_) [n:127.0.0.1:33538_    ] o.a.s.c.c.ZkStateReader A cluster state change: [WatchedEvent state:SyncConnected type:NodeDataChanged path:/collections/collection1/state.json] for collection [collection1] has occurred - updating... (live nodes size: [2])
   [junit4]   2> 488698 INFO  (coreLoadExecutor-1300-thread-1-processing-n:127.0.0.1:33538_) [n:127.0.0.1:33538_ c:collection1   x:collection1] o.a.s.c.SolrConfig Using Lucene MatchVersion: 7.0.0
   [junit4]   2> 488740 INFO  (coreLoadExecutor-1300-thread-1-processing-n:127.0.0.1:33538_) [n:127.0.0.1:33538_ c:collection1   x:collection1] o.a.s.s.IndexSchema [collection1] Schema name=test
   [junit4]   2> 489155 WARN  (coreLoadExecutor-1300-thread-1-processing-n:127.0.0.1:33538_) [n:127.0.0.1:33538_ c:collection1   x:collection1] o.a.s.s.IndexSchema [collection1] default search field in schema is text. WARNING: Deprecated, please use 'df' on request instead.
   [junit4]   2> 489166 INFO  (coreLoadExecutor-1300-thread-1-processing-n:127.0.0.1:33538_) [n:127.0.0.1:33538_ c:collection1   x:collection1] o.a.s.s.IndexSchema Loaded schema test/1.0 with uniqueid field id
   [junit4]   2> 489217 INFO  (coreLoadExecutor-1300-thread-1-processing-n:127.0.0.1:33538_) [n:127.0.0.1:33538_ c:collection1   x:collection1] o.a.s.c.CoreContainer Creating SolrCore 'collection1' using configuration from collection collection1
   [junit4]   2> 489218 INFO  (coreLoadExecutor-1300-thread-1-processing-n:127.0.0.1:33538_) [n:127.0.0.1:33538_ c:collection1 s:shard2 r:core_node1 x:collection1] o.a.s.c.SolrCore [[collection1] ] Opening new SolrCore at [/home/jenkins/workspace/Lucene-Solr-master-Linux/solr/build/solr-core/test/J0/temp/solr.core.TestDynamicLoading_927D77D5D86553ED-001/shard-1-001/cores/collection1], dataDir=[/home/jenkins/workspace/Lucene-Solr-master-Linux/solr/build/solr-core/test/J0/../../../../../../../../../home/jenkins/workspace/Lucene-Solr-master-Linux/solr/build/solr-core/test/J0/temp/solr.core.TestDynamicLoading_927D77D5D86553ED-001/shard-1-001/cores/collection1/data/]
   [junit4]   2> 489218 INFO  (coreLoadExecutor-1300-thread-1-processing-n:127.0.0.1:33538_) [n:127.0.0.1:33538_ c:collection1 s:shard2 r:core_node1 x:collection1] o.a.s.c.JmxMonitoredMap JMX monitoring is enabled. Adding Solr mbeans to JMX Server: com.sun.jmx.mbeanserver.JmxMBeanServer@1f5ec6e
   [junit4]   2> 489219 INFO  (coreLoadExecutor-1300-thread-1-processing-n:127.0.0.1:33538_) [n:127.0.0.1:33538_ c:collection1 s:shard2 r:core_node1 x:collection1] o.a.s.u.RandomMergePolicy RandomMergePolicy wrapping class org.apache.lucene.index.TieredMergePolicy: [TieredMergePolicy: maxMergeAtOnce=35, maxMergeAtOnceExplicit=49, maxMergedSegmentMB=54.796875, floorSegmentMB=1.27734375, forceMergeDeletesPctAllowed=22.454714915635304, segmentsPerTier=36.0, maxCFSSegmentSizeMB=8.796093022207999E12, noCFSRatio=0.8461503176893176
   [junit4]   2> 489236 WARN  (coreLoadExecutor-1300-thread-1-processing-n:127.0.0.1:33538_) [n:127.0.0.1:33538_ c:collection1 s:shard2 r:core_node1 x:collection1] o.a.s.c.RequestHandlers INVALID paramSet a in requestHandler {type = requestHandler,name = /dump,class = DumpRequestHandler,args = {defaults={a=A,b=B}}}
   [junit4]   2> 489292 INFO  (coreLoadExecutor-1300-thread-1-processing-n:127.0.0.1:33538_) [n:127.0.0.1:33538_ c:collection1 s:shard2 r:core_node1 x:collection1] o.a.s.u.UpdateHandler Using UpdateLog implementation: org.apache.solr.update.UpdateLog
   [junit4]   2> 489292 INFO  (coreLoadExecutor-1300-thread-1-processing-n:127.0.0.1:33538_) [n:127.0.0.1:33538_ c:collection1 s:shard2 r:core_node1 x:collection1] o.a.s.u.UpdateLog Initializing UpdateLog: dataDir= defaultSyncLevel=FLUSH numRecordsToKeep=100 maxNumLogsToKeep=10 numVersionBuckets=65536
   [junit4]   2> 489293 INFO  (coreLoadExecutor-1300-thread-1-processing-n:127.0.0.1:33538_) [n:127.0.0.1:33538_ c:collection1 s:shard2 r:core_node1 x:collection1] o.a.s.u.CommitTracker Hard AutoCommit: disabled
   [junit4]   2> 489293 INFO  (coreLoadExecutor-1300-thread-1-processing-n:127.0.0.1:33538_) [n:127.0.0.1:33538_ c:collection1 s:shard2 r:core_node1 x:collection1] o.a.s.u.CommitTracker Soft AutoCommit: disabled
   [junit4]   2> 489294 INFO  (coreLoadExecutor-1300-thread-1-processing-n:127.0.0.1:33538_) [n:127.0.0.1:33538_ c:collection1 s:shard2 r:core_node1 x:collection1] o.a.s.u.RandomMergePolicy RandomMergePolicy wrapping class org.apache.lucene.index.LogByteSizeMergePolicy: [LogByteSizeMergePolicy: minMergeSize=1677721, mergeFactor=29, maxMergeSize=2147483648, maxMergeSizeForForcedMerge=9223372036854775807, calibrateSizeByDeletes=false, maxMergeDocs=2147483647, maxCFSSegmentSizeMB=8.796093022207999E12, noCFSRatio=0.8389533316934468]
   [junit4]   2> 489295 INFO  (coreLoadExecutor-1300-thread-1-processing-n:127.0.0.1:33538_) [n:127.0.0.1:33538_ c:collection1 s:shard2 r:core_node1 x:collection1] o.a.s.s.SolrIndexSearcher Opening [Searcher@12d06b9[collection1] main]
   [junit4]   2> 489298 INFO  (coreLoadExecutor-1300-thread-1-processing-n:127.0.0.1:33538_) [n:127.0.0.1:33538_ c:collection1 s:shard2 r:core_node1 x:collection1] o.a.s.r.ManagedResourceStorage Configured ZooKeeperStorageIO with znodeBase: /configs/conf1
   [junit4]   2> 489299 INFO  (coreLoadExecutor-1300-thread-1-processing-n:127.0.0.1:33538_) [n:127.0.0.1:33538_ c:collection1 s:shard2 r:core_node1 x:collection1] o.a.s.r.ManagedResourceStorage Loaded null at path _rest_managed.json using ZooKeeperStorageIO:path=/configs/conf1
   [junit4]   2> 489300 INFO  (coreLoadExecutor-1300-thread-1-processing-n:127.0.0.1:33538_) [n:127.0.0.1:33538_ c:collection1 s:shard2 r:core_node1 x:collection1] o.a.s.h.ReplicationHandler Commits will be reserved for  10000
   [junit4]   2> 489301 INFO  (coreLoadExecutor-1300-thread-1-processing-n:127.0.0.1:33538_) [n:127.0.0.1:33538_ c:collection1 s:shard2 r:core_node1 x:collection1] o.a.s.u.UpdateLog Could not find max version in index or recent updates, using new clock 1549518530180808704
   [junit4]   2> 489323 INFO  (searcherExecutor-1301-thread-1-processing-n:127.0.0.1:33538_ x:collection1 s:shard2 c:collection1 r:core_node1) [n:127.0.0.1:33538_ c:collection1 s:shard2 r:core_node1 x:collection1] o.a.s.c.SolrCore [collection1] Registered new searcher Searcher@12d06b9[collection1] main{ExitableDirectoryReader(UninvertingDirectoryReader())}
   [junit4]   2> 489326 INFO  (coreZkRegister-1295-thread-1-processing-n:127.0.0.1:33538_ x:collection1 s:shard2 c:collection1 r:core_node1) [n:127.0.0.1:33538_ c:collection1 s:shard2 r:core_node1 x:collection1] o.a.s.c.ShardLeaderElectionContext Enough replicas found to continue.
   [junit4]   2> 489326 INFO  (coreZkRegister-1295-thread-1-processing-n:127.0.0.1:33538_ x:collection1 s:shard2 c:collection1 r:core_node1) [n:127.0.0.1:33538_ c:collection1 s:shard2 r:core_node1 x:collection1] o.a.s.c.ShardLeaderElectionContext I may be the new leader - try and sync
   [junit4]   2> 489326 INFO  (coreZkRegister-1295-thread-1-processing-n:127.0.0.1:33538_ x:collection1 s:shard2 c:collection1 r:core_node1) [n:127.0.0.1:33538_ c:collection1 s:shard2 r:core_node1 x:collection1] o.a.s.c.SyncStrategy Sync replicas to https://127.0.0.1:33538/collection1/
   [junit4]   2> 489327 INFO  (coreZkRegister-1295-thread-1-processing-n:127.0.0.1:33538_ x:collection1 s:shard2 c:collection1 r:core_node1) [n:127.0.0.1:33538_ c:collection1 s:shard2 r:core_node1 x:collection1] o.a.s.c.SyncStrategy Sync Success - now sync replicas to me
   [junit4]   2> 489327 INFO  (coreZkRegister-1295-thread-1-processing-n:127.0.0.1:33538_ x:collection1 s:shard2 c:collection1 r:core_node1) [n:127.0.0.1:33538_ c:collection1 s:shard2 r:core_node1 x:collection1] o.a.s.c.SyncStrategy https://127.0.0.1:33538/collection1/ has no replicas
   [junit4]   2> 489328 INFO  (zkCallback-574-thread-1-processing-n:127.0.0.1:33538_) [n:127.0.0.1:33538_    ] o.a.s.c.c.ZkStateReader A cluster state change: [WatchedEvent state:SyncConnected type:NodeDataChanged path:/collections/collection1/state.json] for collection [collection1] has occurred - updating... (live nodes size: [2])
   [junit4]   2> 489333 INFO  (coreZkRegister-1295-thread-1-processing-n:127.0.0.1:33538_ x:collection1 s:shard2 c:collection1 r:core_node1) [n:127.0.0.1:33538_ c:collection1 s:shard2 r:core_node1 x:collection1] o.a.s.c.ShardLeaderElectionContext I am the new leader: https://127.0.0.1:33538/collection1/ shard2
   [junit4]   2> 489438 INFO  (zkCallback-574-thread-1-processing-n:127.0.0.1:33538_) [n:127.0.0.1:33538_    ] o.a.s.c.c.ZkStateReader A cluster state change: [WatchedEvent state:SyncConnected type:NodeDataChanged path:/collections/collection1/state.json] for collection [collection1] has occurred - updating... (live nodes size: [2])
   [junit4]   2> 489486 INFO  (coreZkRegister-1295-thread-1-processing-n:127.0.0.1:33538_ x:collection1 s:shard2 c:collection1 r:core_node1) [n:127.0.0.1:33538_ c:collection1 s:shard2 r:core_node1 x:collection1] o.a.s.c.ZkController I am the leader, no recovery necessary
   [junit4]   2> 489592 INFO  (zkCallback-574-thread-1-processing-n:127.0.0.1:33538_) [n:127.0.0.1:33538_    ] o.a.s.c.c.ZkStateReader A cluster state change: [WatchedEvent state:SyncConnected type:NodeDataChanged path:/collections/collection1/state.json] for collection [collection1] has occurred - updating... (live nodes size: [2])
   [junit4]   2> 489774 INFO  (TEST-TestDynamicLoading.testDynamicLoading-seed#[927D77D5D86553ED]) [    ] o.a.s.SolrTestCaseJ4 Writing core.properties file to /home/jenkins/workspace/Lucene-Solr-master-Linux/solr/build/solr-core/test/J0/temp/solr.core.TestDynamicLoading_927D77D5D86553ED-001/shard-2-001/cores/collection1
   [junit4]   2> 489775 INFO  (TEST-TestDynamicLoading.testDynamicLoading-seed#[927D77D5D86553ED]) [    ] o.a.s.c.AbstractFullDistribZkTestBase create jetty 2 in directory /home/jenkins/workspace/Lucene-Solr-master-Linux/solr/build/solr-core/test/J0/temp/solr.core.TestDynamicLoading_927D77D5D86553ED-001/shard-2-001
   [junit4]   2> 489793 INFO  (TEST-TestDynamicLoading.testDynamicLoading-seed#[927D77D5D86553ED]) [    ] o.e.j.s.Server jetty-9.3.8.v20160314
   [junit4]   2> 489795 INFO  (TEST-TestDynamicLoading.testDynamicLoading-seed#[927D77D5D86553ED]) [    ] o.e.j.s.h.ContextHandler Started o.e.j.s.ServletContextHandler@17c7aa7{/,null,AVAILABLE}
   [junit4]   2> 489801 INFO  (TEST-TestDynamicLoading.testDynamicLoading-seed#[927D77D5D86553ED]) [    ] o.e.j.s.ServerConnector Started ServerConnector@9ae1{SSL,[ssl, http/1.1]}{127.0.0.1:45512}
   [junit4]   2> 489801 INFO  (TEST-TestDynamicLoading.testDynamicLoading-seed#[927D77D5D86553ED]) [    ] o.e.j.s.Server Started @491393ms
   [junit4]   2> 489801 INFO  (TEST-TestDynamicLoading.testDynamicLoading-seed#[927D77D5D86553ED]) [    ] o.a.s.c.s.e.JettySolrRunner Jetty properties: {solr.data.dir=/home/jenkins/workspace/Lucene-Solr-master-Linux/solr/build/solr-core/test/J0/temp/solr.core.TestDynamicLoading_927D77D5D86553ED-001/tempDir-001/jetty2, solrconfig=solrconfig.xml, hostContext=/, hostPort=45512, coreRootDirectory=/home/jenkins/workspace/Lucene-Solr-master-Linux/solr/build/solr-core/test/J0/temp/solr.core.TestDynamicLoading_927D77D5D86553ED-001/shard-2-001/cores}
   [junit4]   2> 489802 ERROR (TEST-TestDynamicLoading.testDynamicLoading-seed#[927D77D5D86553ED]) [    ] o.a.s.s.StartupLoggingUtils Missing Java Option solr.log.dir. Logging may be missing or incomplete.
   [junit4]   2> 489805 INFO  (TEST-TestDynamicLoading.testDynamicLoading-seed#[927D77D5D86553ED]) [    ] o.a.s.s.SolrDispatchFilter  ___      _       Welcome to Apache Solr™ version 7.0.0
   [junit4]   2> 489805 INFO  (TEST-TestDynamicLoading.testDynamicLoading-seed#[927D77D5D86553ED]) [    ] o.a.s.s.SolrDispatchFilter / __| ___| |_ _   Starting in cloud mode on port null
   [junit4]   2> 489805 INFO  (TEST-TestDynamicLoading.testDynamicLoading-seed#[927D77D5D86553ED]) [    ] o.a.s.s.SolrDispatchFilter \__ \/ _ \ | '_|  Install dir: null
   [junit4]   2> 489806 INFO  (TEST-TestDynamicLoading.testDynamicLoading-seed#[927D77D5D86553ED]) [    ] o.a.s.s.SolrDispatchFilter |___/\___/_|_|    Start time: 2016-10-29T10:13:45.534Z
   [junit4]   2> 489814 INFO  (TEST-TestDynamicLoading.testDynamicLoading-seed#[927D77D5D86553ED]) [    ] o.a.s.s.SolrDispatchFilter Loading solr.xml from SolrHome (not found in ZooKeeper)
   [junit4]   2> 489814 INFO  (TEST-TestDynamicLoading.testDynamicLoading-seed#[927D77D5D86553ED]) [    ] o.a.s.c.SolrXmlConfig Loading container configuration from /home/jenkins/workspace/Lucene-Solr-master-Linux/solr/build/solr-core/test/J0/temp/solr.core.TestDynamicLoading_927D77D5D86553ED-001/shard-2-001/solr.xml
   [junit4]   2> 489831 INFO  (TEST-TestDynamicLoading.testDynamicLoading-seed#[927D77D5D86553ED]) [    ] o.a.s.c.ZkContainer Zookeeper client=127.0.0.1:36406/solr
   [junit4]   2> 489844 INFO  (TEST-TestDynamicLoading.testDynamicLoading-seed#[927D77D5D86553ED]) [n:127.0.0.1:45512_    ] o.a.s.c.c.ZkStateReader Updated live nodes from ZooKeeper... (0) -> (2)
   [junit4]   2> 489860 INFO  (TEST-TestDynamicLoading.testDynamicLoading-seed#[927D77D5D86553ED]) [n:127.0.0.1:45512_    ] o.a.s.c.ZkController Register node as live in ZooKeeper:/live_nodes/127.0.0.1:45512_
   [junit4]   2> 489867 INFO  (zkCallback-568-thread-1) [    ] o.a.s.c.c.ZkStateReader Updated live nodes from ZooKeeper... (2) -> (3)
   [junit4]   2> 489868 INFO  (zkCallback-574-thread-1-processing-n:127.0.0.1:33538_) [n:127.0.0.1:33538_    ] o.a.s.c.c.ZkStateReader Updated live nodes from ZooKeeper... (2) -> (3)
   [junit4]   2> 489868 INFO  (zkCallback-580-thread-1-processing-n:127.0.0.1:45512_) [n:127.0.0.1:45512_    ] o.a.s.c.c.ZkStateReader Updated live nodes from ZooKeeper... (2) -> (3)
   [junit4]   2> 489868 INFO  (zkCallback-564-thread-4-processing-n:127.0.0.1:33701_) [n:127.0.0.1:33701_    ] o.a.s.c.c.ZkStateReader Updated live nodes from ZooKeeper... (2) -> (3)
   [junit4]   2> 489933 INFO  (TEST-TestDynamicLoading.testDynamicLoading-seed#[927D77D5D86553ED]) [n:127.0.0.1:45512_    ] o.a.s.c.CorePropertiesLocator Found 1 core definitions underneath /home/jenkins/workspace/Lucene-Solr-master-Linux/solr/build/solr-core/test/J0/temp/solr.core.TestDynamicLoading_927D77D5D86553ED-001/shard-2-001/cores
   [junit4]   2> 489933 INFO  (TEST-TestDynamicLoading.testDynamicLoading-seed#[927D77D5D86553ED]) [n:127.0.0.1:45512_    ] o.a.s.c.CorePropertiesLocator Cores are: [collection1]
   [junit4]   2> 489940 INFO  (OverseerStateUpdate-96844907912429573-127.0.0.1:33701_-n_0000000000) [n:127.0.0.1:33701_    ] o.a.s.c.o.ReplicaMutator Assigning new node to shard shard=shard1
   [junit4]   2> 490044 INFO  (zkCallback-574-thread-1-processing-n:127.0.0.1:33538_) [n:127.0.0.1:33538_    ] o.a.s.c.c.ZkStateReader A cluster state change: [WatchedEvent state:SyncConnected type:NodeDataChanged path:/collections/collection1/state.json] for collection [collection1] has occurred - updating... (live nodes size: [3])
   [junit4]   2> 490044 INFO  (zkCallback-580-thread-1-processing-n:127.0.0.1:45512_) [n:127.0.0.1:45512_    ] o.a.s.c.c.ZkStateReader A cluster state change: [WatchedEvent state:SyncConnected type:NodeDataChanged path:/collections/collection1/state.json] for collection [collection1] has occurred - updating... (live nodes size: [3])
   [junit4]   2> 490987 INFO  (coreLoadExecutor-1311-thread-1-processing-n:127.0.0.1:45512_) [n:127.0.0.1:45512_ c:collection1   x:collection1] o.a.s.c.SolrConfig Using Lucene MatchVersion: 7.0.0
   [junit4]   2> 491092 INFO  (coreLoadExecutor-1311-thread-1-processing-n:127.0.0.1:45512_) [n:127.0.0.1:45512_ c:collection1   x:collection1] o.a.s.s.IndexSchema [collection1] Schema name=test
   [junit4]   2> 491547 WARN  (coreLoadExecutor-1311-thread-1-processing-n:127.0.0.1:45512_) [n:127.0.0.1:45512_ c:collection1   x:collection1] o.a.s.s.IndexSchema [collection1] default search field in schema is text. WARNING: Deprecated, please use 'df' on request instead.
   [junit4]   2> 491552 INFO  (coreLoadExecutor-1311-thread-1-processing-n:127.0.0.1:45512_) [n:127.0.0.1:45512_ c:collection1   x:collection1] o.a.s.s.IndexSchema Loaded schema test/1.0 with uniqueid field id
   [junit4]   2> 491598 INFO  (coreLoadExecutor-1311-thread-1-processing-n:127.0.0.1:45512_) [n:127.0.0.1:45512_ c:collection1   x:collection1] o.a.s.c.CoreContainer Creating SolrCore 'collection1' using configuration from collection collection1
   [junit4]   2> 491599 INFO  (coreLoadExecutor-1311-thread-1-processing-n:127.0.0.1:45512_) [n:127.0.0.1:45512_ c:collection1 s:shard1 r:core_node2 x:collection1] o.a.s.c.SolrCore [[collection1] ] Opening new SolrCore at [/home/jenkins/workspace/Lucene-Solr-master-Linux/solr/build/solr-core/test/J0/temp/solr.core.TestDynamicLoading_927D77D5D86553ED-001/shard-2-001/cores/collection1], dataDir=[/home/jenkins/workspace/Lucene-Solr-master-Linux/solr/build/solr-core/test/J0/temp/solr.core.TestDynamicLoading_927D77D5D86553ED-001/shard-2-001/cores/collection1/data/]
   [junit4]   2> 491599 INFO  (coreLoadExecutor-1311-thread-1-processing-n:127.0.0.1:45512_) [n:127.0.0.1:45512_ c:collection1 s:shard1 r:core_node2 x:collection1] o.a.s.c.JmxMonitoredMap JMX monitoring is enabled. Adding Solr mbeans to JMX Server: com.sun.jmx.mbeanserver.JmxMBeanServer@1f5ec6e
   [junit4]   2> 491602 INFO  (coreLoadExecutor-1311-thread-1-processing-n:127.0.0.1:45512_) [n:127.0.0.1:45512_ c:collection1 s:shard1 r:core_node2 x:collection1] o.a.s.u.RandomMergePolicy RandomMergePolicy wrapping class org.apache.lucene.index.TieredMergePolicy: [TieredMergePolicy: maxMergeAtOnce=35, maxMergeAtOnceExplicit=49, maxMergedSegmentMB=54.796875, floorSegmentMB=1.27734375, forceMergeDeletesPctAllowed=22.454714915635304, segmentsPerTier=36.0, maxCFSSegmentSizeMB=8.796093022207999E12, noCFSRatio=0.8461503176893176
   [junit4]   2> 491613 WARN  (coreLoadExecutor-1311-thread-1-processing-n:127.0.0.1:45512_) [n:127.0.0.1:45512_ c:collection1 s:shard1 r:core_node2 x:collection1] o.a.s.c.RequestHandlers INVALID paramSet a in requestHandler {type = requestHandler,name = /dump,class = DumpRequestHandler,args = {defaults={a=A,b=B}}}
   [junit4]   2> 491689 INFO  (coreLoadExecutor-1311-thread-1-processing-n:127.0.0.1:45512_) [n:127.0.0.1:45512_ c:collection1 s:shard1 r:core_node2 x:collection1] o.a.s.u.UpdateHandler Using UpdateLog implementation: org.apache.solr.update.UpdateLog
   [junit4]   2> 491689 INFO  (coreLoadExecutor-1311-thread-1-processing-n:127.0.0.1:45512_) [n:127.0.0.1:45512_ c:collection1 s:shard1 r:core_node2 x:collection1] o.a.s.u.UpdateLog Initializing UpdateLog: dataDir= defaultSyncLevel=FLUSH numRecordsToKeep=100 maxNumLogsToKeep=10 numVersionBuckets=65536
   [junit4]   2> 491690 INFO  (coreLoadExecutor-1311-thread-1-processing-n:127.0.0.1:45512_) [n:127.0.0.1:45512_ c:collection1 s:shard1 r:core_node2 x:collection1] o.a.s.u.CommitTracker Hard AutoCommit: disabled
   [junit4]   2> 491691 INFO  (coreLoadExecutor-1311-thread-1-processing-n:127.0.0.1:45512_) [n:127.0.0.1:45512_ c:collection1 s:shard1 r:core_node2 x:collection1] o.a.s.u.CommitTracker Soft AutoCommit: disabled
   [junit4]   2> 491692 INFO  (coreLoadExecutor-1311-thread-1-processing-n:127.0.0.1:45512_) [n:127.0.0.1:45512_ c:collection1 s:shard1 r:core_node2 x:collection1] o.a.s.u.RandomMergePolicy RandomMergePolicy wrapping class org.apache.lucene.index.LogByteSizeMergePolicy: [LogByteSizeMergePolicy: minMergeSize=1677721, mergeFactor=29, maxMergeSize=2147483648, maxMergeSizeForForcedMerge=9223372036854775807, calibrateSizeByDeletes=false, maxMergeDocs=2147483647, maxCFSSegmentSizeMB=8.796093022207999E12, noCFSRatio=0.8389533316934468]
   [junit4]   2> 491693 INFO  (coreLoadExecutor-1311-thread-1-processing-n:127.0.0.1:45512_) [n:127.0.0.1:45512_ c:collection1 s:shard1 r:core_node2 x:collection1] o.a.s.s.SolrIndexSearcher Opening [Searcher@1d6677b[collection1] main]
   [junit4]   2> 491695 INFO  (coreLoadExecutor-1311-thread-1-processing-n:127.0.0.1:45512_) [n:127.0.0.1:45512_ c:collection1 s:shard1 r:core_node2 x:collection1] o.a.s.r.ManagedResourceStorage Configured ZooKeeperStorageIO with znodeBase: /configs/conf1
   [junit4]   2> 491696 INFO  (coreLoadExecutor-1311-thread-1-processing-n:127.0.0.1:45512_) [n:127.0.0.1:45512_ c:collection1 s:shard1 r:core_node2 x:collection1] o.a.s.r.ManagedResourceStorage Loaded null at path _rest_managed.json using ZooKeeperStorageIO:path=/configs/conf1
   [junit4]   2> 491696 INFO  (coreLoadExecutor-1311-thread-1-processing-n:127.0.0.1:45512_) [n:127.0.0.1:45512_ c:collection1 s:shard1 r:core_node2 x:collection1] o.a.s.h.ReplicationHandler Commits will be reserved for  10000
   [junit4]   2> 491698 INFO  (coreLoadExecutor-1311-thread-1-processing-n:127.0.0.1:45512_) [n:127.0.0.1:45512_ c:collection1 s:shard1 r:core_node2 x:collection1] o.a.s.u.UpdateLog Could not find max version in index or recent updates, using new clock 1549518532694245376
   [junit4]   2> 491719 INFO  (searcherExecutor-1312-thread-1-processing-n:127.0.0.1:45512_ x:collection1 s:shard1 c:collection1 r:core_node2) [n:127.0.0.1:45512_ c:collection1 s:shard1 r:core_node2 x:collection1] o.a.s.c.SolrCore [collection1] Registered new searcher Searcher@1d6677b[collection1] main{ExitableDirectoryReader(UninvertingDirectoryReader())}
   [junit4]   2> 491730 INFO  (zkCallback-574-thread-1-processing-n:127.0.0.1:33538_) [n:127.0.0.1:33538_    ] o.a.s.c.c.ZkStateReader A cluster state change: [WatchedEvent state:SyncConnected type:NodeDataChanged path:/collections/collection1/state.json] for collection [collection1] has occurred - updating... (live nodes size: [3])
   [junit4]   2> 491732 INFO  (zkCallback-580-thread-1-processing-n:127.0.0.1:45512_) [n:127.0.0.1:45512_    ] o.a.s.c.c.ZkStateReader A cluster state change: [WatchedEvent state:SyncConnected type:NodeDataChanged path:/collections/collection1/state.json] for collection [collection1] has occurred - updating... (live nodes size: [3])
   [junit4]   2> 491733 INFO  (coreZkRegister-1306-thread-1-processing-n:127.0.0.1:45512_ x:collection1 s:shard1 c:collection1 r:core_node2) [n:127.0.0.1:45512_ c:collection1 s:shard1 r:core_node2 x:collection1] o.a.s.c.ShardLeaderElectionContext Enough replicas found to continue.
   [junit4]   2> 491734 INFO  (coreZkRegister-1306-thread-1-processing-n:127.0.0.1:45512_ x:collection1 s:shard1 c:collection1 r:core_node2) [n:127.0.0.1:45512_ c:collection1 s:shard1 r:core_node2 x:collection1] o.a.s.c.ShardLeaderElectionContext I may be the new leader - try and sync
   [junit4]   2> 491734 INFO  (coreZkRegister-1306-thread-1-processing-n:127.0.0.1:45512_ x:collection1 s:shard1 c:collection1 r:core_node2) [n:127.0.0.1:45512_ c:collection1 s:shard1 r:core_node2 x:collection1] o.a.s.c.SyncStrategy Sync replicas to https://127.0.0.1:45512/collection1/
   [junit4]   2> 491734 INFO  (coreZkRegister-1306-thread-1-processing-n:127.0.0.1:45512_ x:collection1 s:shard1 c:collection1 r:core_node2) [n:127.0.0.1:45512_ c:collection1 s:shard1 r:core_node2 x:collection1] o.a.s.c.SyncStrategy Sync Success - now sync replicas to me
   [junit4]   2> 491734 INFO  (coreZkRegister-1306-thread-1-processing-n:127.0.0.1:45512_ x:collection1 s:shard1 c:collection1 r:core_node2) [n:127.0.0.1:45512_ c:collection1 s:shard1 r:core_node2 x:collection1] o.a.s.c.SyncStrategy https://127.0.0.1:45512/collection1/ has no replicas
   [junit4]   2> 491740 INFO  (coreZkRegister-1306-thread-1-processing-n:127.0.0.1:45512_ x:collection1 s:shard1 c:collection1 r:core_node2) [n:127.0.0.1:45512_ c:collection1 s:shard1 r:core_node2 x:collection1] o.a.s.c.ShardLeaderElectionContext I am the new leader: https://127.0.0.1:45512/collection1/ shard1
   [junit4]   2> 491844 INFO  (zkCallback-574-thread-1-processing-n:127.0.0.1:33538_) [n:127.0.0.1:33538_    ] o.a.s.c.c.ZkStateReader A cluster state change: [WatchedEvent state:SyncConnected type:NodeDataChanged path:/collections/collection1/state.json] for collection [collection1] has occurred - updating... (live nodes size: [3])
   [junit4]   2> 491844 INFO  (zkCallback-580-thread-1-processing-n:127.0.0.1:45512_) [n:127.0.0.1:45512_    ] o.a.s.c.c.ZkStateReader A cluster state change: [WatchedEvent state:SyncConnected type:NodeDataChanged path:/collections/collection1/state.json] for collection [collection1] has occurred - updating... (live nodes size: [3])
   [junit4]   2> 491891 INFO  (coreZkRegister-1306-thread-1-processing-n:127.0.0.1:45512_ x:collection1 s:shard1 c:collection1 r:core_node2) [n:127.0.0.1:45512_ c:collection1 s:shard1 r:core_node2 x:collection1] o.a.s.c.ZkController I am the leader, no recovery necessary
   [junit4]   2> 492001 INFO  (zkCallback-574-thread-1-processing-n:127.0.0.1:33538_) [n:127.0.0.1:33538_    ] o.a.s.c.c.ZkStateReader A cluster state change: [WatchedEvent state:SyncConnected type:NodeDataChanged path:/collections/collection1/state.json] for collection [collection1] has occurred - updating... (live nodes size: [3])
   [junit4]   2> 492001 INFO  (zkCallback-580-thread-1-processing-n:127.0.0.1:45512_) [n:127.0.0.1:45512_    ] o.a.s.c.c.ZkStateReader A cluster state change: [WatchedEvent state:SyncConnected type:NodeDataChanged path:/collections/collection1/state.json] for collection [collection1] has occurred - updating... (live nodes size: [3])
   [junit4]   2> 492060 INFO  (TEST-TestDynamicLoading.testDynamicLoading-seed#[927D77D5D86553ED]) [    ] o.a.s.SolrTestCaseJ4 Writing core.properties file to /home/jenkins/workspace/Lucene-Solr-master-Linux/solr/build/solr-core/test/J0/temp/solr.core.TestDynamicLoading_927D77D5D86553ED-001/shard-3-001/cores/collection1
   [junit4]   2> 492061 INFO  (TEST-TestDynamicLoading.testDynamicLoading-seed#[927D77D5D86553ED]) [    ] o.a.s.c.AbstractFullDistribZkTestBase create jetty 3 in directory /home/jenkins/workspace/Lucene-Solr-master-Linux/solr/build/solr-core/test/J0/temp/solr.core.TestDynamicLoading_927D77D5D86553ED-001/shard-3-001
   [junit4]   2> 492064 INFO  (TEST-TestDynamicLoading.testDynamicLoading-seed#[927D77D5D86553ED]) [    ] o.e.j.s.Server jetty-9.3.8.v20160314
   [junit4]   2> 492065 INFO  (TEST-TestDynamicLoading.testDynamicLoading-seed#[927D77D5D86553ED]) [    ] o.e.j.s.h.ContextHandler Started o.e.j.s.ServletContextHandler@b1b566{/,null,AVAILABLE}
   [junit4]   2> 492071 INFO  (TEST-TestDynamicLoading.testDynamicLoading-seed#[927D77D5D86553ED]) [    ] o.e.j.s.ServerConnector Started ServerConnector@2b48ae{SSL,[ssl, http/1.1]}{127.0.0.1:41159}
   [junit4]   2> 492071 INFO  (TEST-TestDynamicLoading.testDynamicLoading-seed#[927D77D5D86553ED]) [    ] o.e.j.s.Server Started @493663ms
   [junit4]   2> 492075 INFO  (TEST-TestDynamicLoading.testDynamicLoading-seed#[927D77D5D86553ED]) [    ] o.a.s.c.s.e.JettySolrRunner Jetty properties: {solr.data.dir=/home/jenkins/workspace/Lucene-Solr-master-Linux/solr/build/solr-core/test/J0/temp/solr.core.TestDynamicLoading_927D77D5D86553ED-001/tempDir-001/jetty3, solrconfig=solrconfig.xml, hostContext=/, hostPort=41159, coreRootDirectory=/home/jenkins/workspace/Lucene-Solr-master-Linux/solr/build/solr-core/test/J0/temp/solr.core.TestDynamicLoading_927D77D5D86553ED-001/shard-3-001/cores}
   [junit4]   2> 492075 ERROR (TEST-TestDynamicLoading.testDynamicLoading-seed#[927D77D5D86553ED]) [    ] o.a.s.s.StartupLoggingUtils Missing Java Option solr.log.dir. Logging may be missing or incomplete.
   [junit4]   2> 492076 INFO  (TEST-TestDynamicLoading.testDynamicLoading-seed#[927D77D5D86553ED]) [    ] o.a.s.s.SolrDispatchFilter  ___      _       Welcome to Apache Solr™ version 7.0.0
   [junit4]   2> 492076 INFO  (TEST-TestDynamicLoading.testDynamicLoading-seed#[927D77D5D86553ED]) [    ] o.a.s.s.SolrDispatchFilter / __| ___| |_ _   Starting in cloud mode on port null
   [junit4]   2> 492076 INFO  (TEST-TestDynamicLoading.testDynamicLoading-seed#[927D77D5D86553ED]) [    ] o.a.s.s.SolrDispatchFilter \__ \/ _ \ | '_|  Install dir: null
   [junit4]   2> 492076 INFO  (TEST-TestDynamicLoading.testDynamicLoading-seed#[927D77D5D86553ED]) [    ] o.a.s.s.SolrDispatchFilter |___/\___/_|_|    Start time: 2016-10-29T10:13:47.804Z
   [junit4]   2> 492080 INFO  (TEST-TestDynamicLoading.testDynamicLoading-seed#[927D77D5D86553ED]) [    ] o.a.s.s.SolrDispatchFilter Loading solr.xml from SolrHome (not found in ZooKeeper)
   [junit4]   2> 492080 INFO  (TEST-TestDynamicLoading.testDynamicLoading-seed#[927D77D5D86553ED]) [    ] o.a.s.c.SolrXmlConfig Loading container configuration from /home/jenkins/workspace/Lucene-Solr-master-Linux/solr/build/solr-core/test/J0/temp/solr.core.TestDynamicLoading_927D77D5D86553ED-001/shard-3-001/solr.xml
   [junit4]   2> 492101 INFO  (TEST-TestDynamicLoading.testDynamicLoading-seed#[927D77D5D86553ED]) [    ] o.a.s.c.ZkContainer Zookeeper client=127.0.0.1:36406/solr
   [junit4]   2> 492117 INFO  (TEST-TestDynamicLoading.testDynamicLoading-seed#[927D77D5D86553ED]) [n:127.0.0.1:41159_    ] o.a.s.c.c.ZkStateReader Updated live nodes from ZooKeeper... (0) -> (3)
   [junit4]   2> 492122 INFO  (TEST-TestDynamicLoading.testDynamicLoading-seed#[927D77D5D86553ED]) [n:127.0.0.1:41159_    ] o.a.s.c.ZkController Register node as live in ZooKeeper:/live_nodes/127.0.0.1:41159_
   [junit4]   2> 492123 INFO  (zkCallback-568-thread-1) [    ] o.a.s.c.c.ZkStateReader Updated live nodes from ZooKeeper... (3) -> (4)
   [junit4]   2> 492127 INFO  (zkCallback-580-thread-1-processing-n:127.0.0.1:45512_) [n:127.0.0.1:45512_    ] o.a.s.c.c.ZkStateReader Updated live nodes from ZooKeeper... (3) -> (4)
   [junit4]   2> 492127 INFO  (zkCallback-574-thread-1-processing-n:127.0.0.1:33538_) [n:127.0.0.1:33538_    ] o.a.s.c.c.ZkStateReader Updated live nodes from ZooKeeper... (3) -> (4)
   [junit4]   2> 492127 INFO  (zkCallback-564-thread-2-processing-n:127.0.0.1:33701_) [n:127.0.0.1:33701_    ] o.a.s.c.c.ZkStateReader Updated live nodes from ZooKeeper... (3) -> (4)
   [junit4]   2> 492128 INFO  (zkCallback-586-thread-1-processing-n:127.0.0.1:41159_) [n:127.0.0.1:41159_    ] o.a.s.c.c.ZkStateReader Updated live nodes from ZooKeeper... (3) -> (4)
   [junit4]   2> 492180 INFO  (TEST-TestDynamicLoading.testDynamicLoading-seed#[927D77D5D86553ED]) [n:127.0.0.1:41159_    ] o.a.s.c.CorePropertiesLocator Found 1 core definitions underneath /home/jenkins/workspace/Lucene-Solr-master-Linux/solr/build/solr-core/test/J0/temp/solr.core.TestDynamicLoading_927D77D5D86553ED-001/shard-3-001/cores
   [junit4]   2> 492180 INFO  (TEST-TestDynamicLoading.testDynamicLoading-seed#[927D77D5D86553ED]) [n:127.0.0.1:41159_    ] o.a.s.c.CorePropertiesLocator Cores are: [collection1]
   [junit4]   2> 492185 INFO  (OverseerStateUpdate-96844907912429573-127.0.0.1:33701_-n_0000000000) [n:127.0.0.1:33701_    ] o.a.s.c.o.ReplicaMutator Assigning new node to shard shard=shard2
   [junit4]   2> 492288 INFO  (zkCallback-574-thread-1-processing-n:127.0.0.1:33538_) [n:127.0.0.1:33538_    ] o.a.s.c.c.ZkStateReader A cluster state change: [WatchedEvent state:SyncConnected type:NodeDataChanged path:/collections/collection1/state.json] for collection [collection1] has occurred - updating... (live nodes size: [4])
   [junit4]   2> 492288 INFO  (zkCallback-580-thread-1-processing-n:127.0.0.1:45512_) [n:127.0.0.1:45512_    ] o.a.s.c.c.ZkStateReader A cluster state change: [WatchedEvent state:SyncConnected type:NodeDataChanged path:/collections/collection1/state.json] for collection [collection1] has occurred - updating... (live nodes size: [4])
   [junit4]   2> 492288 INFO  (zkCallback-586-thread-1-processing-n:127.0.0.1:41159_) [n:127.0.0.1:41159_    ] o.a.s.c.c.ZkStateReader A cluster state change: [WatchedEvent state:SyncConnected type:NodeDataChanged path:/collections/collection1/state.json] for collection [collection1] has occurred - updating... (live nodes size: [4])
   [junit4]   2> 493209 INFO  (coreLoadExecutor-1322-thread-1-processing-n:127.0.0.1:41159_) [n:127.0.0.1:41159_ c:collection1   x:collection1] o.a.s.c.SolrConfig Using Lucene MatchVersion: 7.0.0
   [junit4]   2> 493284 INFO  (coreLoadExecutor-1322-thread-1-processing-n:127.0.0.1:41159_) [n:127.0.0.1:41159_ c:collection1   x:collection1] o.a.s.s.IndexSchema [collection1] Schema name=test
   [junit4]   2> 493737 WARN  (coreLoadExecutor-1322-thread-1-processing-n:127.0.0.1:41159_) [n:127.0.0.1:41159_ c:collection1   x:collection1] o.a.s.s.IndexSchema [collection1] default search field in schema is text. WARNING: Deprecated, please use 'df' on request instead.
   [junit4]   2> 493750 INFO  (coreLoadExecutor-1322-thread-1-processing-n:127.0.0.1:41159_) [n:127.0.0.1:41159_ c:collection1   x:collection1] o.a.s.s.IndexSchema Loaded schema test/1.0 with uniqueid field id
   [junit4]   2> 493778 INFO  (coreLoadExecutor-1322-thread-1-processing-n:127.0.0.1:41159_) [n:127.0.0.1:41159_ c:collection1   x:collection1] o.a.s.c.CoreContainer Creating SolrCore 'collection1' using configuration from collection collection1
   [junit4]   2> 493778 INFO  (coreLoadExecutor-1322-thread-1-processing-n:127.0.0.1:41159_) [n:127.0.0.1:41159_ c:collection1 s:shard2 r:core_node3 x:collection1] o.a.s.c.SolrCore [[collection1] ] Opening new SolrCore at [/home/jenkins/workspace/Lucene-Solr-master-Linux/solr/build/solr-core/test/J0/temp/solr.core.TestDynamicLoading_927D77D5D86553ED-001/shard-3-001/cores/collection1], dataDir=[/home/jenkins/workspace/Lucene-Solr-master-Linux/solr/build/solr-core/test/J0/temp/solr.core.TestDynamicLoading_927D77D5D86553ED-001/shard-3-001/cores/collection1/data/]
   [junit4]   2> 493778 INFO  (coreLoadExecutor-1322-thread-1-processing-n:127.0.0.1:41159_) [n:127.0.0.1:41159_ c:collection1 s:shard2 r:core_node3 x:collection1] o.a.s.c.JmxMonitoredMap JMX monitoring is enabled. Adding Solr mbeans to JMX Server: com.sun.jmx.mbeanserver.JmxMBeanServer@1f5ec6e
   [junit4]   2> 493780 INFO  (coreLoadExecutor-1322-thread-1-processing-n:127.0.0.1:41159_) [n:127.0.0.1:41159_ c:collection1 s:shard2 r:core_node3 x:collection1] o.a.s.u.RandomMergePolicy RandomMergePolicy wrapping class org.apache.lucene.index.TieredMergePolicy: [TieredMergePolicy: maxMergeAtOnce=35, maxMergeAtOnceExplicit=49, maxMergedSegmentMB=54.796875, floorSegmentMB=1.27734375, forceMergeDeletesPctAllowed=22.454714915635304, segmentsPerTier=36.0, maxCFSSegmentSizeMB=8.796093022207999E12, noCFSRatio=0.8461503176893176
   [junit4]   2> 493803 WARN  (coreLoadExecutor-1322-thread-1-processing-n:127.0.0.1:41159_) [n:127.0.0.1:41159_ c:collection1 s:shard2 r:core_node3 x:collection1] o.a.s.c.RequestHandlers INVALID paramSet a in requestHandler {type = requestHandler,name = /dump,class = DumpRequestHandler,args = {defaults={a=A,b=B}}}
   [junit4]   2> 493849 INFO  (coreLoadExecutor-1322-thread-1-processing-n:127.0.0.1:41159_) [n:127.0.0.1:41159_ c:collection1 s:shard2 r:core_node3 x:collection1] o.a.s.u.UpdateHandler Using UpdateLog implementation: org.apache.solr.update.UpdateLog
   [junit4]   2> 493849 INFO  (coreLoadExecutor-1322-thread-1-processing-n:127.0.0.1:41159_) [n:127.0.0.1:41159_ c:collection1 s:shard2 r:core_node3 x:collection1] o.a.s.u.UpdateLog Initializing UpdateLog: dataDir= defaultSyncLevel=FLUSH numRecordsToKeep=100 maxNumLogsToKeep=10 numVersionBuckets=65536
   [junit4]   2> 493862 INFO  (coreLoadExecutor-1322-thread-1-processing-n:127.0.0.1:41159_) [n:127.0.0.1:41159_ c:collection1 s:shard2 r:core_node3 x:collection1] o.a.s.u.CommitTracker Hard AutoCommit: disabled
   [junit4]   2> 493862 INFO  (coreLoadExecutor-1322-thread-1-processing-n:127.0.0.1:41159_) [n:127.0.0.1:41159_ c:collection1 s:shard2 r:core_node3 x:collection1] o.a.s.u.CommitTracker Soft AutoCommit: disabled
   [junit4]   2> 493863 INFO  (coreLoadExecutor-1322-thread-1-processing-n:127.0.0.1:41159_) [n:127.0.0.1:41159_ c:collection1 s:shard2 r:core_node3 x:collection1] o.a.s.u.RandomMergePolicy RandomMergePolicy wrapping class org.apache.lucene.index.LogByteSizeMergePolicy: [LogByteSizeMergePolicy: minMergeSize=1677721, mergeFactor=29, maxMergeSize=2147483648, maxMergeSizeForForcedMerge=9223372036854775807, calibrateSizeByDeletes=false, maxMergeDocs=2147483647, maxCFSSegmentSizeMB=8.796093022207999E12, noCFSRatio=0.8389533316934468]
   [junit4]   2> 493864 INFO  (coreLoadExecutor-1322-thread-1-processing-n:127.0.0.1:41159_) [n:127.0.0.1:41159_ c:collection1 s:shard2 r:core_node3 x:collection1] o.a.s.s.SolrIndexSearcher Opening [Searcher@30267a[collection1] main]
   [junit4]   2> 493866 INFO  (coreLoadExecutor-1322-thread-1-processing-n:127.0.0.1:41159_) [n:127.0.0.1:41159_ c:collection1 s:shard2 r:core_node3 x:collection1] o.a.s.r.ManagedResourceStorage Configured ZooKeeperStorageIO with znodeBase: /configs/conf1
   [junit4]   2> 493866 INFO  (coreLoadExecutor-1322-thread-1-processing-n:127.0.0.1:41159_) [n:127.0.0.1:41159_ c:collection1 s:shard2 r:core_node3 x:collection1] o.a.s.r.ManagedResourceStorage Loaded null at path _rest_managed.json using ZooKeeperStorageIO:path=/configs/conf1
   [junit4]   2> 493867 INFO  (coreLoadExecutor-1322-thread-1-processing-n:127.0.0.1:41159_) [n:127.0.0.1:41159_ c:collection1 s:shard2 r:core_node3 x:collection1] o.a.s.h.ReplicationHandler Commits will be reserved for  10000
   [junit4]   2> 493870 INFO  (searcherExecutor-1323-thread-1-processing-n:127.0.0.1:41159_ x:collection1 s:shard2 c:collection1 r:core_node3) [n:127.0.0.1:41159_ c:collection1 s:shard2 r:core_node3 x:collection1] o.a.s.c.SolrCore [collection1] Registered new searcher Searcher@30267a[collection1] main{ExitableDirectoryReader(UninvertingDirectoryReader())}
   [junit4]   2> 493871 INFO  (coreLoadExecutor-1322-thread-1-processing-n:127.0.0.1:41159_) [n:127.0.0.1:41159_ c:collection1 s:shard2 r:core_node3 x:collection1] o.a.s.u.UpdateLog Could not find max version in index or recent updates, using new clock 1549518534972801024
   [junit4]   2> 493876 INFO  (coreZkRegister-1317-thread-1-processing-n:127.0.0.1:41159_ x:collection1 s:shard2 c:collection1 r:core_node3) [n:127.0.0.1:41159_ c:collection1 s:shard2 r:core_node3 x:collection1] o.a.s.c.ZkController Core needs to recover:collection1
   [junit4]   2> 493877 INFO  (updateExecutor-583-thread-1-processing-n:127.0.0.1:41159_ x:collection1 s:shard2 c:collection1 r:core_node3) [n:127.0.0.1:41159_ c:collection1 s:shard2 r:core_node3 x:collection1] o.a.s.u.DefaultSolrCoreState Running recovery
   [junit4]   2> 493877 INFO  (recoveryExecutor-584-thread-1-processing-n:127.0.0.1:41159_ x:collection1 s:shard2 c:collection1 r:core_node3) [n:127.0.0.1:41159_ c:collection1 s:shard2 r:core_node3 x:collection1] o.a.s.c.RecoveryStrategy Starting recovery process. recoveringAfterStartup=true
   [junit4]   2> 493878 INFO  (recoveryExecutor-584-thread-1-processing-n:127.0.0.1:41159_ x:collection1 s:shard2 c:collection1 r:core_node3) [n:127.0.0.1:41159_ c:collection1 s:shard2 r:core_node3 x:collection1] o.a.s.c.RecoveryStrategy ###### startupVersions=[[]]
   [junit4]   2> 493878 INFO  (recoveryExecutor-584-thread-1-processing-n:127.0.0.1:41159_ x:collection1 s:shard2 c:collection1 r:core_node3) [n:127.0.0.1:41159_ c:collection1 s:shard2 r:core_node3 x:collection1] o.a.s.c.RecoveryStrategy Begin buffering updates. core=[collection1]
   [junit4]   2> 493878 INFO  (recoveryExecutor-584-thread-1-processing-n:127.0.0.1:41159_ x:collection1 s:shard2 c:collection1 r:core_node3) [n:127.0.0.1:41159_ c:collection1 s:shard2 r:core_node3 x:collection1] o.a.s.u.UpdateLog Starting to buffer updates. FSUpdateLog{state=ACTIVE, tlog=null}
   [junit4]   2> 493878 INFO  (recoveryExecutor-584-thread-1-processing-n:127.0.0.1:41159_ x:collection1 s:shard2 c:collection1 r:core_node3) [n:127.0.0.1:41159_ c:collection1 s:shard2 r:core_node3 x:collection1] o.a.s.c.RecoveryStrategy Publishing state of core [collection1] as recovering, leader is [https://127.0.0.1:33538/collection1/] and I am [https://127.0.0.1:41159/collection1/]
   [junit4]   2> 493881 INFO  (recoveryExecutor-584-thread-1-processing-n:127.0.0.1:41159_ x:collection1 s:shard2 c:collection1 r:core_node3) [n:127.0.0.1:41159_ c:collection1 s:shard2 r:core_node3 x:collection1] o.a.s.c.RecoveryStrategy Sending prep recovery command to [https://127.0.0.1:33538]; [WaitForState: action=PREPRECOVERY&core=collection1&nodeName=127.0.0.1:41159_&coreNodeName=core_node3&state=recovering&checkLive=true&onlyIfLeader=true&onlyIfLeaderActive=true]
   [junit4]   2> 493885 INFO  (zkCallback-586-thread-1-processing-n:127.0.0.1:41159_) [n:127.0.0.1:41159_    ] o.a.s.c.c.ZkStateReader A cluster state change: [WatchedEvent state:SyncConnected type:NodeDataChanged path:/collections/collection1/state.json] for collection [collection1] has occurred - updating... (live nodes size: [4])
   [junit4]   2> 493888 INFO  (zkCallback-580-thread-1-processing-n:127.0.0.1:45512_) [n:127.0.0.1:45512_    ] o.a.s.c.c.ZkStateReader A cluster state change: [WatchedEvent state:SyncConnected type:NodeDataChanged path:/collections/collection1/state.json] for collection [collection1] has occurred - updating... (live nodes size: [4])
   [junit4]   2> 493889 INFO  (zkCallback-574-thread-1-processing-n:127.0.0.1:33538_) [n:127.0.0.1:33538_    ] o.a.s.c.c.ZkStateReader A cluster state change: [WatchedEvent state:SyncConnected type:NodeDataChanged path:/collections/collection1/state.json] for collection [collection1] has occurred - updating... (live nodes size: [4])
   [junit4]   2> 494014 INFO  (qtp2065984-2716) [n:127.0.0.1:33538_    ] o.a.s.h.a.PrepRecoveryOp Going to wait for coreNodeName: core_node3, state: recovering, checkLive: true, onlyIfLeader: true, onlyIfLeaderActive: true
   [junit4]   2> 494015 INFO  (qtp2065984-2716) [n:127.0.0.1:33538_    ] o.a.s.h.a.PrepRecoveryOp Will wait a max of 183 seconds to see collection1 (shard2 of collection1) have state: recovering
   [junit4]   2> 494015 INFO  (qtp2065984-2716) [n:127.0.0.1:33538_    ] o.a.s.h.a.PrepRecoveryOp In WaitForState(recovering): collection=collection1, shard=shard2, thisCore=collection1, leaderDoesNotNeedRecovery=false, isLeader? true, live=true, checkLive=true, currentState=recovering, localState=active, nodeName=127.0.0.1:41159_, coreNodeName=core_node3, onlyIfActiveCheckResult=false, nodeProps: core_node3:{"core":"collection1","base_url":"https://127.0.0.1:41159","node_name":"127.0.0.1:41159_","state":"recovering"}
   [junit4]   2> 494015 INFO  (qtp2065984-2716) [n:127.0.0.1:33538_    ] o.a.s.h.a.PrepRecoveryOp Waited coreNodeName: core_node3, state: recovering, checkLive: true, onlyIfLeader: true for: 0 seconds.
   [junit4]   2> 494015 INFO  (qtp2065984-2716) [n:127.0.0.1:33538_    ] o.a.s.s.HttpSolrCall [admin] webapp=null path=/admin/cores params={nodeName=127.0.0.1:41159_&onlyIfLeaderActive=true&core=collection1&coreNodeName=core_node3&action=PREPRECOVERY&checkLive=true&state=recovering&onlyIfLeader=true&wt=javabin&version=2} status=0 QTime=0
   [junit4]   2> 494271 INFO  (TEST-TestDynamicLoading.testDynamicLoading-seed#[927D77D5D86553ED]) [    ] o.a.s.SolrTestCaseJ4 Writing core.properties file to /home/jenkins/workspace/Lucene-Solr-master-Linux/solr/build/solr-core/test/J0/temp/solr.core.TestDynamicLoading_927D77D5D86553ED-001/shard-4-001/cores/collection1
   [junit4]   2> 494272 INFO  (TEST-TestDynamicLoading.testDynamicLoading-seed#[927D77D5D86553ED]) [    ] o.a.s.c.AbstractFullDistribZkTestBase create jetty 4 in directory /home/jenkins/workspace/Lucene-Solr-master-Linux/solr/build/solr-core/test/J0/temp/solr.core.TestDynamicLoading_927D77D5D86553ED-001/shard-4-001
   [junit4]   2> 494278 INFO  (TEST-TestDynamicLoading.testDynamicLoading-seed#[927D77D5D86553ED]) [    ] o.e.j.s.Server jetty-9.3.8.v20160314
   [junit4]   2> 494279 INFO  (TEST-TestDynamicLoading.testDynamicLoading-seed#[927D77D5D86553ED]) [    ] o.e.j.s.h.ContextHandler Started o.e.j.s.ServletContextHandler@8e44a1{/,null,AVAILABLE}
   [junit4]   2> 494283 INFO  (TEST-TestDynamicLoading.testDynamicLoading-seed#[927D77D5D86553ED]) [    ] o.e.j.s.ServerConnector Started ServerConnector@1ed01b4{SSL,[ssl, http/1.1]}{127.0.0.1:35052}
   [junit4]   2> 494283 INFO  (TEST-TestDynamicLoading.testDynamicLoading-seed#[927D77D5D86553ED]) [    ] o.e.j.s.Server Started @495875ms
   [junit4]   2> 494283 INFO  (TEST-TestDynamicLoading.testDynamicLoading-seed#[927D77D5D86553ED]) [    ] o.a.s.c.s.e.JettySolrRunner Jetty properties: {solr.data.dir=/home/jenkins/workspace/Lucene-Solr-master-Linux/solr/build/solr-core/test/J0/temp/solr.core.TestDynamicLoading_927D77D5D86553ED-001/tempDir-001/jetty4, solrconfig=solrconfig.xml, hostContext=/, hostPort=35052, coreRootDirectory=/home/jenkins/workspace/Lucene-Solr-master-Linux/solr/build/solr-core/test/J0/../../../../../../../../../home/jenkins/workspace/Lucene-Solr-master-Linux/solr/build/solr-core/test/J0/temp/solr.core.TestDynamicLoading_927D77D5D86553ED-001/shard-4-001/cores}
   [junit4]   2> 494283 ERROR (TEST-TestDynamicLoading.testDynamicLoading-seed#[927D77D5D86553ED]) [    ] o.a.s.s.StartupLoggingUtils Missing Java Option solr.log.dir. Logging may be missing or incomplete.
   [junit4]   2> 494284 INFO  (TEST-TestDynamicLoading.testDynamicLoading-seed#[927D77D5D86553ED]) [    ] o.a.s.s.SolrDispatchFilter  ___      _       Welcome to Apache Solr™ version 7.0.0
   [junit4]   2> 494284 INFO  (TEST-TestDynamicLoading.testDynamicLoading-seed#[927D77D5D86553ED]) [    ] o.a.s.s.SolrDispatchFilter / __| ___| |_ _   Starting in cloud mode on port null
   [junit4]   2> 494284 INFO  (TEST-TestDynamicLoading.testDynamicLoading-seed#[927D77D5D86553ED]) [    ] o.a.s.s.SolrDispatchFilter \__ \/ _ \ | '_|  Install dir: null
   [junit4]   2> 494284 INFO  (TEST-TestDynamicLoading.testDynamicLoading-seed#[927D77D5D86553ED]) [    ] o.a.s.s.SolrDispatchFilter |___/\___/_|_|    Start time: 2016-10-29T10:13:50.012Z
   [junit4]   2> 494288 INFO  (TEST-TestDynamicLoading.testDynamicLoading-seed#[927D77D5D86553ED]) [    ] o.a.s.s.SolrDispatchFilter Loading solr.xml from SolrHome (not found in ZooKeeper)
   [junit4]   2> 494288 INFO  (TEST-TestDynamicLoading.testDynamicLoading-seed#[927D77D5D86553ED]) [    ] o.a.s.c.SolrXmlConfig Loading container configuration from /home/jenkins/workspace/Lucene-Solr-master-Linux/solr/build/solr-core/test/J0/temp/solr.core.TestDynamicLoading_927D77D5D86553ED-001/shard-4-001/solr.xml
   [junit4]   2> 494302 INFO  (TEST-TestDynamicLoading.testDynamicLoading-seed#[927D77D5D86553ED]) [    ] o.a.s.c.ZkContainer Zookeeper client=127.0.0.1:36406/solr
   [junit4]   2> 494313 INFO  (TEST-TestDynamicLoading.testDynamicLoading-seed#[927D77D5D86553ED]) [n:127.0.0.1:35052_    ] o.a.s.c.c.ZkStateReader Updated live nodes from ZooKeeper... (0) -> (4)
   [junit4]   2> 494317 INFO  (TEST-TestDynamicLoading.testDynamicLoading-seed#[927D77D5D86553ED]) [n:127.0.0.1:35052_    ] o.a.s.c.ZkController Register node as live in ZooKeeper:/live_nodes/127.0.0.1:35052_
   [junit4]   2> 494319 INFO  (zkCallback-586-thread-1-processing-n:127.0.0.1:41159_) [n:127.0.0.1:41159_    ] o.a.s.c.c.ZkStateReader Updated live nodes from ZooKeeper... (4) -> (5)
   [junit4]   2> 494319 INFO  (zkCallback-568-thread-1) [    ] o.a.s.c.c.ZkStateReader Updated live nodes from ZooKeeper... (4) -> (5)
   [junit4]   2> 494319 INFO  (zkCallback-564-thread-4-processing-n:127.0.0.1:33701_) [n:127.0.0.1:33701_    ] o.a.s.c.c.ZkStateReader Updated live nodes from ZooKeeper... (4) -> (5)
   [junit4]   2> 494319 INFO  (zkCallback-574-thread-1-processing-n:127.0.0.1:33538_) [n:127.0.0.1:33538_    ] o.a.s.c.c.ZkStateReader Updated live nodes from ZooKeeper... (4) -> (5)
   [junit4]   2> 494319 INFO  (zkCallback-580-thread-1-processing-n:127.0.0.1:45512_) [n:127.0.0.1:45512_    ] o.a.s.c.c.ZkStateReader Updated live nodes from ZooKeeper... (4) -> (5)
   [junit4]   2> 494320 INFO  (zkCallback-593-thread-1-processing-n:127.0.0.1:35052_) [n:127.0.0.1:35052_    ] o.a.s.c.c.ZkStateReader Updated live nodes from ZooKeeper... (4) -> (5)
   [junit4]   2> 494355 INFO  (TEST-TestDynamicLoading.testDynamicLoading-seed#[927D77D5D86553ED]) [n:127.0.0.1:35052_    ] o.a.s.c.CorePropertiesLocator Found 1 core definitions underneath /home/jenkins/workspace/Lucene-Solr-master-Linux/solr/build/solr-core/test/J0/../../../../../../../../../home/jenkins/workspace/Lucene-Solr-master-Linux/solr/build/solr-core/test/J0/temp/solr.core.TestDynamicLoading_927D77D5D86553ED-001/shard-4-001/cores
   [junit4]   2> 494355 INFO  (TEST-TestDynamicLoading.testDynamicLoading-seed#[927D77D5D86553ED]) [n:127.0.0.1:35052_    ] o.a.s.c.CorePropertiesLocator Cores are: [collection1]
   [junit4]   2> 494358 INFO  (OverseerStateUpdate-96844907912429573-127.0.0.1:33701_-n_0000000000) [n:127.0.0.1:33701_    ] o.a.s.c.o.ReplicaMutator Assigning new node to shard shard=shard1
   [junit4]   2> 494461 INFO  (zkCallback-586-thread-1-processing-n:127.0.0.1:41159_) [n:127.0.0.1:41159_    ] o.a.s.c.c.ZkStateReader A cluster state change: [WatchedEvent state:SyncConnected type:NodeDataChanged path:/collections/collection1/state.json] for collection [collection1] has occurred - updating... (live nodes size: [5])
   [junit4]   2> 494461 INFO  (zkCallback-574-thread-1-processing-n:127.0.0.1:33538_) [n:127.0.0.1:33538_    ] o.a.s.c.c.ZkStateReader A cluster state change: [WatchedEvent state:SyncConnected type:NodeDataChanged path:/collections/collection1/state.json] for collection [collection1] has occurred - updating... (live nodes size: [5])
   [junit4]   2> 494461 INFO  (zkCallback-593-thread-1-processing-n:127.0.0.1:35052_) [n:127.0.0.1:35052_    ] o.a.s.c.c.ZkStateReader A cluster state change: [WatchedEvent state:SyncConnected type:NodeDataChanged path:/collections/collection1/state.json] for collection [collection1] has occurred - updating... (live nodes size: [5])
   [junit4]   2> 494461 INFO  (zkCallback-580-thread-1-processing-n:127.0.0.1:45512_) [n:127.0.0.1:45512_    ] o.a.s.c.c.ZkStateReader A cluster state change: [WatchedEvent state:SyncConnected type:NodeDataChanged path:/collections/collection1/state.json] for collection [collection1] has occurred - updating... (live nodes size: [5])
   [junit4]   2> 495383 INFO  (coreLoadExecutor-1333-thread-1-processing-n:127.0.0.1:35052_) [n:127.0.0.1:35052_ c:collection1   x:collection1] o.a.s.c.SolrConfig Using Lucene MatchVersion: 7.0.0
   [junit4]   2> 495412 INFO  (coreLoadExecutor-1333-thread-1-processing-n:127.0.0.1:35052_) [n:127.0.0.1:35052_ c:collection1   x:collection1] o.a.s.s.IndexSchema [collection1] Schema name=test
   [junit4]   2> 495566 WARN  (coreLoadExecutor-1333-thread-1-processing-n:127.0.0.1:35052_) [n:127.0.0.1:35052_ c:collection1   x:collection1] o.a.s.s.IndexSchema [collection1] default search field in schema is text. WARNING: Deprecated, please use 'df' on request instead.
   [junit4]   2> 495572 INFO  (coreLoadExecutor-1333-thread-1-processing-n:127.0.0.1:35052_) [n:127.0.0.1:35052_ c:collection1   x:collection1] o.a.s.s.IndexSchema Loaded schema test/1.0 with uniqueid field id
   [junit4]   2> 495588 INFO  (coreLoadExecutor-1333-thread-1-processing-n:127.0.0.1:35052_) [n:127.0.0.1:35052_ c:collection1   x:collection1] o.a.s.c.CoreContainer Creating SolrCore 'collection1' using configuration from collection collection1
   [junit4]   2> 495588 INFO  (coreLoadExecutor-1333-thread-1-processing-n:127.0.0.1:35052_) [n:127.0.0.1:35052_ c:collection1 s:shard1 r:core_node4 x:collection1] o.a.s.c.SolrCore [[collection1] ] Opening new SolrCore at [/home/jenkins/workspace/Lucene-Solr-master-Linux/solr/build/solr-core/test/J0/temp/solr.core.TestDynamicLoading_927D77D5D86553ED-001/shard-4-001/cores/collection1], dataDir=[/home/jenkins/workspace/Lucene-Solr-master-Linux/solr/build/solr-core/test/J0/../../../../../../../../../home/jenkins/workspace/Lucene-Solr-master-Linux/solr/build/solr-core/test/J0/temp/solr.core.TestDynamicLoading_927D77D5D86553ED-001/shard-4-001/cores/collection1/data/]
   [junit4]   2> 495589 INFO  (coreLoadExecutor-1333-thread-1-processing-n:127.0.0.1:35052_) [n:127.0.0.1:35052_ c:collection1 s:shard1 r:core_node4 x:collection1] o.a.s.c.JmxMonitoredMap JMX monitoring is enabled. Adding Solr mbeans to JMX Server: com.sun.jmx.mbeanserver.JmxMBeanServer@1f5ec6e
   [junit4]   2> 495590 INFO

[...truncated too long message...]

PropertiesLocator Cores are: [collection1]
   [junit4]   2> 2111884 INFO  (coreLoadExecutor-6300-thread-1) [    ] o.a.s.c.SolrConfig Using Lucene MatchVersion: 7.0.0
   [junit4]   2> 2111895 INFO  (coreLoadExecutor-6300-thread-1) [    ] o.a.s.s.IndexSchema [collection1] Schema name=minimal
   [junit4]   2> 2111898 INFO  (coreLoadExecutor-6300-thread-1) [    ] o.a.s.s.IndexSchema Loaded schema minimal/1.1 with uniqueid field id
   [junit4]   2> 2111899 INFO  (coreLoadExecutor-6300-thread-1) [    ] o.a.s.c.CoreContainer Creating SolrCore 'collection1' using configuration from instancedir /home/jenkins/workspace/Lucene-Solr-master-Linux/solr/build/solr-core/test/J2/temp/solr.security.BasicAuthStandaloneTest_927D77D5D86553ED-001/inst-001/./collection1
   [junit4]   2> 2111900 INFO  (coreLoadExecutor-6300-thread-1) [    x:collection1] o.a.s.c.SolrCore [[collection1] ] Opening new SolrCore at [/home/jenkins/workspace/Lucene-Solr-master-Linux/solr/build/solr-core/test/J2/temp/solr.security.BasicAuthStandaloneTest_927D77D5D86553ED-001/inst-001/collection1], dataDir=[/home/jenkins/workspace/Lucene-Solr-master-Linux/solr/build/solr-core/test/J2/temp/solr.security.BasicAuthStandaloneTest_927D77D5D86553ED-001/inst-001/./collection1/data/]
   [junit4]   2> 2111908 INFO  (coreLoadExecutor-6300-thread-1) [    x:collection1] o.a.s.u.CommitTracker Hard AutoCommit: disabled
   [junit4]   2> 2111908 INFO  (coreLoadExecutor-6300-thread-1) [    x:collection1] o.a.s.u.CommitTracker Soft AutoCommit: disabled
   [junit4]   2> 2111909 INFO  (coreLoadExecutor-6300-thread-1) [    x:collection1] o.a.s.s.SolrIndexSearcher Opening [Searcher@1034593[collection1] main]
   [junit4]   2> 2111909 INFO  (coreLoadExecutor-6300-thread-1) [    x:collection1] o.a.s.r.ManagedResourceStorage File-based storage initialized to use dir: /home/jenkins/workspace/Lucene-Solr-master-Linux/solr/build/solr-core/test/J2/temp/solr.security.BasicAuthStandaloneTest_927D77D5D86553ED-001/inst-001/collection1/conf
   [junit4]   2> 2111909 INFO  (coreLoadExecutor-6300-thread-1) [    x:collection1] o.a.s.h.ReplicationHandler Commits will be reserved for  10000
   [junit4]   2> 2111910 INFO  (searcherExecutor-6301-thread-1-processing-x:collection1) [    x:collection1] o.a.s.c.SolrCore [collection1] Registered new searcher Searcher@1034593[collection1] main{ExitableDirectoryReader(UninvertingDirectoryReader())}
   [junit4]   2> 2112377 INFO  (qtp21812365-14309) [    ] o.a.s.s.HttpSolrCall [admin] webapp=null path=/admin/authentication params={} status=0 QTime=0
   [junit4]   2> 2112379 INFO  (TEST-BasicAuthStandaloneTest.testBasicAuth-seed#[927D77D5D86553ED]) [    ] o.a.s.c.CoreContainer Security node changed, reloading security.json
   [junit4]   2> 2112379 INFO  (TEST-BasicAuthStandaloneTest.testBasicAuth-seed#[927D77D5D86553ED]) [    ] o.a.s.c.CoreContainer Initializing authorization plugin: solr.RuleBasedAuthorizationPlugin
   [junit4]   2> 2112379 INFO  (TEST-BasicAuthStandaloneTest.testBasicAuth-seed#[927D77D5D86553ED]) [    ] o.a.s.c.CoreContainer Initializing authentication plugin: solr.BasicAuthPlugin
   [junit4]   2> 2112381 INFO  (TEST-BasicAuthStandaloneTest.testBasicAuth-seed#[927D77D5D86553ED]) [    ] o.e.j.s.ServerConnector Stopped ServerConnector@7a2f6a{HTTP/1.1,[http/1.1]}{127.0.0.1:0}
   [junit4]   2> 2112381 INFO  (TEST-BasicAuthStandaloneTest.testBasicAuth-seed#[927D77D5D86553ED]) [    ] o.a.s.c.CoreContainer Shutting down CoreContainer instance=10425120
   [junit4]   2> 2112381 INFO  (coreCloseExecutor-6305-thread-1) [    x:collection1] o.a.s.c.SolrCore [collection1]  CLOSING SolrCore org.apache.solr.core.SolrCore@99cd27
   [junit4]   2> 2112382 INFO  (TEST-BasicAuthStandaloneTest.testBasicAuth-seed#[927D77D5D86553ED]) [    ] o.e.j.s.h.ContextHandler Stopped o.e.j.s.ServletContextHandler@65b651{/solr,null,UNAVAILABLE}
   [junit4]   2> 2112383 INFO  (TEST-BasicAuthStandaloneTest.testBasicAuth-seed#[927D77D5D86553ED]) [    ] o.a.s.SolrTestCaseJ4 ###Ending testBasicAuth
   [junit4]   2> NOTE: reproduce with: ant test  -Dtestcase=BasicAuthStandaloneTest -Dtests.method=testBasicAuth -Dtests.seed=927D77D5D86553ED -Dtests.multiplier=3 -Dtests.slow=true -Dtests.locale=ga-IE -Dtests.timezone=America/Yellowknife -Dtests.asserts=true -Dtests.file.encoding=UTF-8
   [junit4] FAILURE 0.54s J2 | BasicAuthStandaloneTest.testBasicAuth <<<
   [junit4]    > Throwable #1: java.lang.AssertionError: Invalid json <html>
   [junit4]    > <head>
   [junit4]    > <meta http-equiv="Content-Type" content="text/html;charset=ISO-8859-1"/>
   [junit4]    > <title>Error 401 </title>
   [junit4]    > </head>
   [junit4]    > <body>
   [junit4]    > <h2>HTTP ERROR: 401</h2>
   [junit4]    > <p>Problem accessing /solr/admin/authentication. Reason:
   [junit4]    > <pre>    Bad credentials</pre></p>
   [junit4]    > <hr /><a href="http://eclipse.org/jetty">Powered by Jetty:// 9.3.8.v20160314</a><hr/>
   [junit4]    > </body>
   [junit4]    > </html>
   [junit4]    > 	at __randomizedtesting.SeedInfo.seed([927D77D5D86553ED:2E1301C77C36D097]:0)
   [junit4]    > 	at org.apache.solr.security.BasicAuthIntegrationTest.verifySecurityStatus(BasicAuthIntegrationTest.java:256)
   [junit4]    > 	at org.apache.solr.security.BasicAuthIntegrationTest.verifySecurityStatus(BasicAuthIntegrationTest.java:237)
   [junit4]    > 	at org.apache.solr.security.BasicAuthStandaloneTest.testBasicAuth(BasicAuthStandaloneTest.java:102)
   [junit4]    > 	at java.lang.Thread.run(Thread.java:745)
   [junit4]   2> 2112386 INFO  (SUITE-BasicAuthStandaloneTest-seed#[927D77D5D86553ED]-worker) [    ] o.a.s.SolrTestCaseJ4 ###deleteCore
   [junit4]   2> NOTE: leaving temporary files on disk at: /home/jenkins/workspace/Lucene-Solr-master-Linux/solr/build/solr-core/test/J2/temp/solr.security.BasicAuthStandaloneTest_927D77D5D86553ED-001
   [junit4]   2> NOTE: test params are: codec=Asserting(Lucene70): {}, docValues:{}, maxPointsInLeafNode=1889, maxMBSortInHeap=6.446047768264046, sim=RandomSimilarity(queryNorm=true): {}, locale=ga-IE, timezone=America/Yellowknife
   [junit4]   2> NOTE: Linux 4.4.0-42-generic i386/Oracle Corporation 1.8.0_102 (32-bit)/cpus=12,threads=1,free=164745864,total=518959104
   [junit4]   2> NOTE: All tests run in this JVM: [TestLocalFSCloudBackupRestore, TestFieldCacheReopen, NoCacheHeaderTest, TestIndexSearcher, TestUtils, TermVectorComponentDistributedTest, TestBinaryField, TestJsonFacets, CdcrUpdateLogTest, DistribCursorPagingTest, CircularListTest, SynonymTokenizerTest, TestCustomStream, DeleteReplicaTest, SolrCoreCheckLockOnStartupTest, TestSmileRequest, TestTolerantSearch, HttpPartitionTest, TestRecovery, TestIndexingPerformance, LeaderElectionTest, TestDocSet, TestCollapseQParserPlugin, TestSolrQueryParserResource, TestTolerantUpdateProcessorRandomCloud, StressHdfsTest, TestManagedResourceStorage, FullSolrCloudDistribCmdsTest, JSONWriterTest, OverseerTest, RollingRestartTest, TestIBSimilarityFactory, PrimitiveFieldTypeTest, TestSortByMinMaxFunction, VMParamsZkACLAndCredentialsProvidersTest, ShardSplitTest, VersionInfoTest, TestRTimerTree, OverseerRolesTest, LeaderFailureAfterFreshStartTest, TestUninvertingReader, StatsReloadRaceTest, TestFieldCacheSortRandom, HardAutoCommitTest, RAMDirectoryFactoryTest, TestComponentsName, TestInfoStreamLogging, TestGroupingSearch, TestDynamicFieldCollectionResource, BadIndexSchemaTest, CleanupOldIndexTest, TestQuerySenderNoQuery, TestSSLRandomization, CdcrBootstrapTest, TestHashQParserPlugin, SolrIndexConfigTest, TestMaxScoreQueryParser, TestCoreDiscovery, DistributedFacetPivotSmallAdvancedTest, ChangedSchemaMergeTest, HighlighterConfigTest, PreAnalyzedFieldTest, BasicAuthIntegrationTest, TestCloudInspectUtil, XmlUpdateRequestHandlerTest, ConnectionReuseTest, TestFastOutputStream, HdfsLockFactoryTest, TestDocBasedVersionConstraints, CollectionsAPISolrJTest, TestReloadAndDeleteDocs, TestSolrDeletionPolicy1, TestPHPSerializedResponseWriter, TestSha256AuthenticationProvider, TestMergePolicyConfig, TemplateUpdateProcessorTest, ZkStateWriterTest, DateFieldTest, TestOverriddenPrefixQueryForCustomFieldType, TestRawResponseWriter, EnumFieldTest, TestSchemaVersionResource, ResourceLoaderTest, TestRandomFlRTGCloud, BitVectorTest, SimpleCollectionCreateDeleteTest, CheckHdfsIndexTest, PrimUtilsTest, TestCloudManagedSchema, SolrPluginUtilsTest, TestFieldResource, HdfsTlogReplayBufferedWhileIndexingTest, SuggesterWFSTTest, TestDownShardTolerantSearch, StatsComponentTest, LukeRequestHandlerTest, TestReqParamsAPI, CloudMLTQParserTest, CoreAdminCreateDiscoverTest, OverriddenZkACLAndCredentialsProvidersTest, CursorMarkTest, TestSolrQueryParser, ReplaceNodeTest, ConnectionManagerTest, HdfsNNFailoverTest, BlockDirectoryTest, RemoteQueryErrorTest, TestConfigSetsAPI, TestConfigSetsAPIZkFailure, TestCryptoKeys, TestHdfsCloudBackupRestore, TestLeaderElectionWithEmptyReplica, TestLockTree, TestMiniSolrCloudCluster, HdfsDirectoryFactoryTest, TestBackupRepositoryFactory, TestImplicitCoreProperties, TestShardHandlerFactory, TestSolrConfigHandler, TestBlobHandler, CoreAdminRequestStatusTest, CoreMergeIndexesAdminHandlerTest, InfoHandlerTest, SecurityConfHandlerTest, SegmentsInfoRequestHandlerTest, DistributedExpandComponentTest, DistributedFacetExistsSmallTest, DistributedFacetPivotLargeTest, DistributedFacetPivotWhiteBoxTest, DistributedQueryComponentOptimizationTest, FacetPivotSmallTest, SuggestComponentTest, TestSlowCompositeReaderWrapper, TestIntervalFaceting, TestChildDocTransformer, TestRestManager, TestDynamicFieldResource, TestFieldCollectionResource, TestFieldTypeCollectionResource, TestSchemaNameResource, TestSolrQueryParserDefaultOperatorResource, TestCloudSchemaless, TestOrdValues, BJQParserTest, GraphQueryTest, TestScoreJoinQPScore, SimpleMLTQParserTest, TestDFISimilarityFactory, TestPerFieldSimilarityWithDefaultOverride, TestDistribIDF, BasicAuthStandaloneTest]
   [junit4] Completed [615/647 (3!)] on J2 in 0.57s, 1 test, 1 failure <<< FAILURES!

[...truncated 52821 lines...]


Mime
View raw message