lucene-dev mailing list archives

Site index · List index
Message view « Date » · « Thread »
Top « Date » · « Thread »
From Policeman Jenkins Server <jenk...@thetaphi.de>
Subject [JENKINS] Lucene-Solr-master-MacOSX (64bit/jdk1.8.0) - Build # 3636 - Unstable!
Date Sat, 29 Oct 2016 20:23:37 GMT
Build: https://jenkins.thetaphi.de/job/Lucene-Solr-master-MacOSX/3636/
Java: 64bit/jdk1.8.0 -XX:-UseCompressedOops -XX:+UseSerialGC

1 tests failed.
FAILED:  org.apache.solr.security.BasicAuthStandaloneTest.testBasicAuth

Error Message:
Invalid json <html> <head> <meta http-equiv="Content-Type" content="text/html;charset=ISO-8859-1"/>
<title>Error 401 </title> </head> <body> <h2>HTTP ERROR: 401</h2>
<p>Problem accessing /solr/admin/authentication. Reason: <pre>    Bad credentials</pre></p>
<hr /><a href="http://eclipse.org/jetty">Powered by Jetty:// 9.3.8.v20160314</a><hr/>
</body> </html> 

Stack Trace:
java.lang.AssertionError: Invalid json <html>
<head>
<meta http-equiv="Content-Type" content="text/html;charset=ISO-8859-1"/>
<title>Error 401 </title>
</head>
<body>
<h2>HTTP ERROR: 401</h2>
<p>Problem accessing /solr/admin/authentication. Reason:
<pre>    Bad credentials</pre></p>
<hr /><a href="http://eclipse.org/jetty">Powered by Jetty:// 9.3.8.v20160314</a><hr/>
</body>
</html>

	at __randomizedtesting.SeedInfo.seed([33D21BE7C47A7E4:BF5357ACD814249E]:0)
	at org.junit.Assert.fail(Assert.java:93)
	at org.apache.solr.security.BasicAuthIntegrationTest.verifySecurityStatus(BasicAuthIntegrationTest.java:256)
	at org.apache.solr.security.BasicAuthIntegrationTest.verifySecurityStatus(BasicAuthIntegrationTest.java:237)
	at org.apache.solr.security.BasicAuthStandaloneTest.testBasicAuth(BasicAuthStandaloneTest.java:102)
	at sun.reflect.NativeMethodAccessorImpl.invoke0(Native Method)
	at sun.reflect.NativeMethodAccessorImpl.invoke(NativeMethodAccessorImpl.java:62)
	at sun.reflect.DelegatingMethodAccessorImpl.invoke(DelegatingMethodAccessorImpl.java:43)
	at java.lang.reflect.Method.invoke(Method.java:498)
	at com.carrotsearch.randomizedtesting.RandomizedRunner.invoke(RandomizedRunner.java:1713)
	at com.carrotsearch.randomizedtesting.RandomizedRunner$8.evaluate(RandomizedRunner.java:907)
	at com.carrotsearch.randomizedtesting.RandomizedRunner$9.evaluate(RandomizedRunner.java:943)
	at com.carrotsearch.randomizedtesting.RandomizedRunner$10.evaluate(RandomizedRunner.java:957)
	at com.carrotsearch.randomizedtesting.rules.SystemPropertiesRestoreRule$1.evaluate(SystemPropertiesRestoreRule.java:57)
	at org.apache.lucene.util.TestRuleSetupTeardownChained$1.evaluate(TestRuleSetupTeardownChained.java:49)
	at org.apache.lucene.util.AbstractBeforeAfterRule$1.evaluate(AbstractBeforeAfterRule.java:45)
	at org.apache.lucene.util.TestRuleThreadAndTestName$1.evaluate(TestRuleThreadAndTestName.java:48)
	at org.apache.lucene.util.TestRuleIgnoreAfterMaxFailures$1.evaluate(TestRuleIgnoreAfterMaxFailures.java:64)
	at org.apache.lucene.util.TestRuleMarkFailure$1.evaluate(TestRuleMarkFailure.java:47)
	at com.carrotsearch.randomizedtesting.rules.StatementAdapter.evaluate(StatementAdapter.java:36)
	at com.carrotsearch.randomizedtesting.ThreadLeakControl$StatementRunner.run(ThreadLeakControl.java:367)
	at com.carrotsearch.randomizedtesting.ThreadLeakControl.forkTimeoutingTask(ThreadLeakControl.java:811)
	at com.carrotsearch.randomizedtesting.ThreadLeakControl$3.evaluate(ThreadLeakControl.java:462)
	at com.carrotsearch.randomizedtesting.RandomizedRunner.runSingleTest(RandomizedRunner.java:916)
	at com.carrotsearch.randomizedtesting.RandomizedRunner$5.evaluate(RandomizedRunner.java:802)
	at com.carrotsearch.randomizedtesting.RandomizedRunner$6.evaluate(RandomizedRunner.java:852)
	at com.carrotsearch.randomizedtesting.RandomizedRunner$7.evaluate(RandomizedRunner.java:863)
	at com.carrotsearch.randomizedtesting.rules.StatementAdapter.evaluate(StatementAdapter.java:36)
	at com.carrotsearch.randomizedtesting.rules.SystemPropertiesRestoreRule$1.evaluate(SystemPropertiesRestoreRule.java:57)
	at org.apache.lucene.util.AbstractBeforeAfterRule$1.evaluate(AbstractBeforeAfterRule.java:45)
	at com.carrotsearch.randomizedtesting.rules.StatementAdapter.evaluate(StatementAdapter.java:36)
	at org.apache.lucene.util.TestRuleStoreClassName$1.evaluate(TestRuleStoreClassName.java:41)
	at com.carrotsearch.randomizedtesting.rules.NoShadowingOrOverridesOnMethodsRule$1.evaluate(NoShadowingOrOverridesOnMethodsRule.java:40)
	at com.carrotsearch.randomizedtesting.rules.NoShadowingOrOverridesOnMethodsRule$1.evaluate(NoShadowingOrOverridesOnMethodsRule.java:40)
	at com.carrotsearch.randomizedtesting.rules.StatementAdapter.evaluate(StatementAdapter.java:36)
	at com.carrotsearch.randomizedtesting.rules.StatementAdapter.evaluate(StatementAdapter.java:36)
	at com.carrotsearch.randomizedtesting.rules.StatementAdapter.evaluate(StatementAdapter.java:36)
	at org.apache.lucene.util.TestRuleAssertionsRequired$1.evaluate(TestRuleAssertionsRequired.java:53)
	at org.apache.lucene.util.TestRuleMarkFailure$1.evaluate(TestRuleMarkFailure.java:47)
	at org.apache.lucene.util.TestRuleIgnoreAfterMaxFailures$1.evaluate(TestRuleIgnoreAfterMaxFailures.java:64)
	at org.apache.lucene.util.TestRuleIgnoreTestSuites$1.evaluate(TestRuleIgnoreTestSuites.java:54)
	at com.carrotsearch.randomizedtesting.rules.StatementAdapter.evaluate(StatementAdapter.java:36)
	at com.carrotsearch.randomizedtesting.ThreadLeakControl$StatementRunner.run(ThreadLeakControl.java:367)
	at java.lang.Thread.run(Thread.java:745)




Build Log:
[...truncated 12559 lines...]
   [junit4] Suite: org.apache.solr.security.BasicAuthStandaloneTest
   [junit4]   2> Creating dataDir: /Users/jenkins/workspace/Lucene-Solr-master-MacOSX/solr/build/solr-core/test/J1/temp/solr.security.BasicAuthStandaloneTest_33D21BE7C47A7E4-001/init-core-data-001
   [junit4]   2> 3579790 INFO  (SUITE-BasicAuthStandaloneTest-seed#[33D21BE7C47A7E4]-worker)
[    ] o.a.s.SolrTestCaseJ4 Randomized ssl (false) and clientAuth (false) via: @org.apache.solr.util.RandomizeSSL(reason=,
value=NaN, ssl=NaN, clientAuth=NaN) w/ MAC_OS_X supressed clientAuth
   [junit4]   2> 3579793 INFO  (TEST-BasicAuthStandaloneTest.testBasicAuth-seed#[33D21BE7C47A7E4])
[    ] o.a.s.SolrTestCaseJ4 ###Starting testBasicAuth
   [junit4]   2> 3579800 INFO  (TEST-BasicAuthStandaloneTest.testBasicAuth-seed#[33D21BE7C47A7E4])
[    ] o.e.j.s.Server jetty-9.3.8.v20160314
   [junit4]   2> 3579804 INFO  (TEST-BasicAuthStandaloneTest.testBasicAuth-seed#[33D21BE7C47A7E4])
[    ] o.e.j.s.h.ContextHandler Started o.e.j.s.ServletContextHandler@71179f1a{/solr,null,AVAILABLE}
   [junit4]   2> 3579805 INFO  (TEST-BasicAuthStandaloneTest.testBasicAuth-seed#[33D21BE7C47A7E4])
[    ] o.e.j.s.ServerConnector Started ServerConnector@165a2a7a{HTTP/1.1,[http/1.1]}{127.0.0.1:64928}
   [junit4]   2> 3579805 INFO  (TEST-BasicAuthStandaloneTest.testBasicAuth-seed#[33D21BE7C47A7E4])
[    ] o.e.j.s.Server Started @3584766ms
   [junit4]   2> 3579805 INFO  (TEST-BasicAuthStandaloneTest.testBasicAuth-seed#[33D21BE7C47A7E4])
[    ] o.a.s.c.s.e.JettySolrRunner Jetty properties: {solr.data.dir=/Users/jenkins/workspace/Lucene-Solr-master-MacOSX/solr/build/solr-core/test/J1/temp/solr.security.BasicAuthStandaloneTest_33D21BE7C47A7E4-001/inst-001/collection1/data,
hostContext=/solr, hostPort=64928}
   [junit4]   2> 3579805 ERROR (TEST-BasicAuthStandaloneTest.testBasicAuth-seed#[33D21BE7C47A7E4])
[    ] o.a.s.s.StartupLoggingUtils Missing Java Option solr.log.dir. Logging may be missing
or incomplete.
   [junit4]   2> 3579806 INFO  (TEST-BasicAuthStandaloneTest.testBasicAuth-seed#[33D21BE7C47A7E4])
[    ] o.a.s.s.SolrDispatchFilter  ___      _       Welcome to Apache Solr™ version 7.0.0
   [junit4]   2> 3579806 INFO  (TEST-BasicAuthStandaloneTest.testBasicAuth-seed#[33D21BE7C47A7E4])
[    ] o.a.s.s.SolrDispatchFilter / __| ___| |_ _   Starting in standalone mode on port null
   [junit4]   2> 3579806 INFO  (TEST-BasicAuthStandaloneTest.testBasicAuth-seed#[33D21BE7C47A7E4])
[    ] o.a.s.s.SolrDispatchFilter \__ \/ _ \ | '_|  Install dir: null
   [junit4]   2> 3579806 INFO  (TEST-BasicAuthStandaloneTest.testBasicAuth-seed#[33D21BE7C47A7E4])
[    ] o.a.s.s.SolrDispatchFilter |___/\___/_|_|    Start time: 2016-10-29T19:55:56.677Z
   [junit4]   2> 3579807 INFO  (TEST-BasicAuthStandaloneTest.testBasicAuth-seed#[33D21BE7C47A7E4])
[    ] o.a.s.c.SolrXmlConfig Loading container configuration from /Users/jenkins/workspace/Lucene-Solr-master-MacOSX/solr/build/solr-core/test/J1/temp/solr.security.BasicAuthStandaloneTest_33D21BE7C47A7E4-001/inst-001/solr.xml
   [junit4]   2> 3579832 INFO  (TEST-BasicAuthStandaloneTest.testBasicAuth-seed#[33D21BE7C47A7E4])
[    ] o.a.s.c.CorePropertiesLocator Found 1 core definitions underneath /Users/jenkins/workspace/Lucene-Solr-master-MacOSX/solr/build/solr-core/test/J1/temp/solr.security.BasicAuthStandaloneTest_33D21BE7C47A7E4-001/inst-001/.
   [junit4]   2> 3579833 INFO  (TEST-BasicAuthStandaloneTest.testBasicAuth-seed#[33D21BE7C47A7E4])
[    ] o.a.s.c.CorePropertiesLocator Cores are: [collection1]
   [junit4]   2> 3579849 INFO  (coreLoadExecutor-13273-thread-1) [    ] o.a.s.c.SolrConfig
Using Lucene MatchVersion: 7.0.0
   [junit4]   2> 3579913 INFO  (coreLoadExecutor-13273-thread-1) [    ] o.a.s.s.IndexSchema
[collection1] Schema name=minimal
   [junit4]   2> 3579924 INFO  (coreLoadExecutor-13273-thread-1) [    ] o.a.s.s.IndexSchema
Loaded schema minimal/1.1 with uniqueid field id
   [junit4]   2> 3579937 INFO  (coreLoadExecutor-13273-thread-1) [    ] o.a.s.c.CoreContainer
Creating SolrCore 'collection1' using configuration from instancedir /Users/jenkins/workspace/Lucene-Solr-master-MacOSX/solr/build/solr-core/test/J1/temp/solr.security.BasicAuthStandaloneTest_33D21BE7C47A7E4-001/inst-001/./collection1
   [junit4]   2> 3579938 INFO  (coreLoadExecutor-13273-thread-1) [    x:collection1] o.a.s.c.SolrCore
[[collection1] ] Opening new SolrCore at [/Users/jenkins/workspace/Lucene-Solr-master-MacOSX/solr/build/solr-core/test/J1/temp/solr.security.BasicAuthStandaloneTest_33D21BE7C47A7E4-001/inst-001/collection1],
dataDir=[/Users/jenkins/workspace/Lucene-Solr-master-MacOSX/solr/build/solr-core/test/J1/temp/solr.security.BasicAuthStandaloneTest_33D21BE7C47A7E4-001/inst-001/./collection1/data/]
   [junit4]   2> 3579953 INFO  (coreLoadExecutor-13273-thread-1) [    x:collection1] o.a.s.u.CommitTracker
Hard AutoCommit: disabled
   [junit4]   2> 3579953 INFO  (coreLoadExecutor-13273-thread-1) [    x:collection1] o.a.s.u.CommitTracker
Soft AutoCommit: disabled
   [junit4]   2> 3579953 INFO  (coreLoadExecutor-13273-thread-1) [    x:collection1] o.a.s.s.SolrIndexSearcher
Opening [Searcher@6d187cc0[collection1] main]
   [junit4]   2> 3579954 INFO  (coreLoadExecutor-13273-thread-1) [    x:collection1] o.a.s.r.ManagedResourceStorage
File-based storage initialized to use dir: /Users/jenkins/workspace/Lucene-Solr-master-MacOSX/solr/build/solr-core/test/J1/temp/solr.security.BasicAuthStandaloneTest_33D21BE7C47A7E4-001/inst-001/collection1/conf
   [junit4]   2> 3579955 INFO  (coreLoadExecutor-13273-thread-1) [    x:collection1] o.a.s.h.ReplicationHandler
Commits will be reserved for  10000
   [junit4]   2> 3579955 INFO  (searcherExecutor-13274-thread-1-processing-x:collection1)
[    x:collection1] o.a.s.c.SolrCore [collection1] Registered new searcher Searcher@6d187cc0[collection1]
main{ExitableDirectoryReader(UninvertingDirectoryReader())}
   [junit4]   2> 3580350 INFO  (qtp736790587-50625) [    ] o.a.s.s.HttpSolrCall [admin]
webapp=null path=/admin/authentication params={} status=0 QTime=0
   [junit4]   2> 3580352 INFO  (TEST-BasicAuthStandaloneTest.testBasicAuth-seed#[33D21BE7C47A7E4])
[    ] o.a.s.c.CoreContainer Security node changed, reloading security.json
   [junit4]   2> 3580354 INFO  (TEST-BasicAuthStandaloneTest.testBasicAuth-seed#[33D21BE7C47A7E4])
[    ] o.a.s.c.CoreContainer Initializing authorization plugin: solr.RuleBasedAuthorizationPlugin
   [junit4]   2> 3580355 INFO  (TEST-BasicAuthStandaloneTest.testBasicAuth-seed#[33D21BE7C47A7E4])
[    ] o.a.s.c.CoreContainer Initializing authentication plugin: solr.BasicAuthPlugin
   [junit4]   2> 3580359 INFO  (TEST-BasicAuthStandaloneTest.testBasicAuth-seed#[33D21BE7C47A7E4])
[    ] o.e.j.s.ServerConnector Stopped ServerConnector@165a2a7a{HTTP/1.1,[http/1.1]}{127.0.0.1:0}
   [junit4]   2> 3580359 INFO  (TEST-BasicAuthStandaloneTest.testBasicAuth-seed#[33D21BE7C47A7E4])
[    ] o.a.s.c.CoreContainer Shutting down CoreContainer instance=536707978
   [junit4]   2> 3580360 INFO  (coreCloseExecutor-13278-thread-1) [    x:collection1] o.a.s.c.SolrCore
[collection1]  CLOSING SolrCore org.apache.solr.core.SolrCore@103453db
   [junit4]   2> 3580361 INFO  (TEST-BasicAuthStandaloneTest.testBasicAuth-seed#[33D21BE7C47A7E4])
[    ] o.e.j.s.h.ContextHandler Stopped o.e.j.s.ServletContextHandler@71179f1a{/solr,null,UNAVAILABLE}
   [junit4]   2> 3580363 INFO  (TEST-BasicAuthStandaloneTest.testBasicAuth-seed#[33D21BE7C47A7E4])
[    ] o.a.s.SolrTestCaseJ4 ###Ending testBasicAuth
   [junit4]   2> NOTE: reproduce with: ant test  -Dtestcase=BasicAuthStandaloneTest -Dtests.method=testBasicAuth
-Dtests.seed=33D21BE7C47A7E4 -Dtests.slow=true -Dtests.locale=es-NI -Dtests.timezone=Pacific/Saipan
-Dtests.asserts=true -Dtests.file.encoding=UTF-8
   [junit4] FAILURE 0.58s J1 | BasicAuthStandaloneTest.testBasicAuth <<<
   [junit4]    > Throwable #1: java.lang.AssertionError: Invalid json <html>
   [junit4]    > <head>
   [junit4]    > <meta http-equiv="Content-Type" content="text/html;charset=ISO-8859-1"/>
   [junit4]    > <title>Error 401 </title>
   [junit4]    > </head>
   [junit4]    > <body>
   [junit4]    > <h2>HTTP ERROR: 401</h2>
   [junit4]    > <p>Problem accessing /solr/admin/authentication. Reason:
   [junit4]    > <pre>    Bad credentials</pre></p>
   [junit4]    > <hr /><a href="http://eclipse.org/jetty">Powered by Jetty://
9.3.8.v20160314</a><hr/>
   [junit4]    > </body>
   [junit4]    > </html>
   [junit4]    > 	at __randomizedtesting.SeedInfo.seed([33D21BE7C47A7E4:BF5357ACD814249E]:0)
   [junit4]    > 	at org.apache.solr.security.BasicAuthIntegrationTest.verifySecurityStatus(BasicAuthIntegrationTest.java:256)
   [junit4]    > 	at org.apache.solr.security.BasicAuthIntegrationTest.verifySecurityStatus(BasicAuthIntegrationTest.java:237)
   [junit4]    > 	at org.apache.solr.security.BasicAuthStandaloneTest.testBasicAuth(BasicAuthStandaloneTest.java:102)
   [junit4]    > 	at java.lang.Thread.run(Thread.java:745)
   [junit4]   2> 3580369 INFO  (SUITE-BasicAuthStandaloneTest-seed#[33D21BE7C47A7E4]-worker)
[    ] o.a.s.SolrTestCaseJ4 ###deleteCore
   [junit4]   2> NOTE: leaving temporary files on disk at: /Users/jenkins/workspace/Lucene-Solr-master-MacOSX/solr/build/solr-core/test/J1/temp/solr.security.BasicAuthStandaloneTest_33D21BE7C47A7E4-001
   [junit4]   2> NOTE: test params are: codec=Asserting(Lucene70): {}, docValues:{}, maxPointsInLeafNode=885,
maxMBSortInHeap=7.5373682385976295, sim=RandomSimilarity(queryNorm=true): {}, locale=es-NI,
timezone=Pacific/Saipan
   [junit4]   2> NOTE: Mac OS X 10.11.6 x86_64/Oracle Corporation 1.8.0_102 (64-bit)/cpus=3,threads=1,free=166207192,total=518979584
   [junit4]   2> NOTE: All tests run in this JVM: [CurrencyFieldOpenExchangeTest, QueryResultKeyTest,
TestCollapseQParserPlugin, HdfsChaosMonkeyNothingIsSafeTest, DistanceUnitsTest, TestSolrCloudWithDelegationTokens,
CdcrBootstrapTest, TestSolr4Spatial, TestLockTree, LeaderElectionIntegrationTest, TestReversedWildcardFilterFactory,
TestHashQParserPlugin, TestSolrCloudSnapshots, LoggingHandlerTest, ExternalFileFieldSortTest,
TestShardHandlerFactory, BJQParserTest, RankQueryTest, TestDistributedGrouping, TestCloudSchemaless,
NoCacheHeaderTest, TestCloudPivotFacet, ConfigSetsAPITest, DistribCursorPagingTest, TestConfigReload,
DistributedFacetPivotLongTailTest, ExitableDirectoryReaderTest, MinimalSchemaTest, TestSuggestSpellingConverter,
DebugComponentTest, TestTolerantUpdateProcessorRandomCloud, CollectionsAPISolrJTest, GraphQueryTest,
RAMDirectoryFactoryTest, TestRandomRequestDistribution, DistributedSuggestComponentTest, TestFiltering,
TestExpandComponent, SolrCLIZkUtilsTest, ReplaceNodeTest, FileBasedSpellCheckerTest, StatsComponentTest,
DistributedIntervalFacetingTest, NotRequiredUniqueKeyTest, CdcrReplicationHandlerTest, BasicZkTest,
AddSchemaFieldsUpdateProcessorFactoryTest, DeleteShardTest, TestLMJelinekMercerSimilarityFactory,
TestBulkSchemaAPI, TestOmitPositions, TestDFRSimilarityFactory, TestPHPSerializedResponseWriter,
RegexBoostProcessorTest, TestReloadDeadlock, CdcrVersionReplicationTest, TestTrieFacet, TestConfig,
TestRecovery, TestSortingResponseWriter, OutOfBoxZkACLAndCredentialsProvidersTest, TestEmbeddedSolrServerConstructors,
HdfsRestartWhileUpdatingTest, HLLUtilTest, BlockJoinFacetRandomTest, TestSolrCloudWithSecureImpersonation,
RulesTest, FieldAnalysisRequestHandlerTest, TestNonDefinedSimilarityFactory, TestStressRecovery,
TestTrie, TestCrossCoreJoin, BufferStoreTest, TestBadConfig, TestXmlQParserPlugin, TestSubQueryTransformer,
TestSubQueryTransformerDistrib, TestSha256AuthenticationProvider, BasicDistributedZk2Test,
TestDocBasedVersionConstraints, SignatureUpdateProcessorFactoryTest, DistanceFunctionTest,
BasicAuthIntegrationTest, TestCopyFieldCollectionResource, TestRTimerTree, ParsingFieldUpdateProcessorsTest,
TestNRTOpen, TestUninvertingReader, FullHLLTest, CircularListTest, SharedFSAutoReplicaFailoverUtilsTest,
TestFieldCacheWithThreads, TestValueSourceCache, TestDynamicLoading, EchoParamsTest, AnalyticsMergeStrategyTest,
TestLegacyNumericRangeQueryBuilder, HdfsLockFactoryTest, TestCloudManagedSchema, CollectionReloadTest,
DistributedVersionInfoTest, CoreSorterTest, SmileWriterTest, SolrInfoMBeanTest, TestCloudDeleteByQuery,
TestReplicaProperties, MigrateRouteKeyTest, TestConfigOverlay, HighlighterConfigTest, TestReRankQParserPlugin,
CursorMarkTest, TestStressLiveNodes, TriLevelCompositeIdRoutingTest, TestAtomicUpdateErrorCases,
TestSQLHandlerNonCloud, HdfsBasicDistributedZk2Test, CollectionsAPIDistributedZkTest, HdfsRecoverLeaseTest,
TestOnReconnectListenerSupport, TestFieldCollectionResource, BadIndexSchemaTest, TemplateUpdateProcessorTest,
TestPKIAuthenticationPlugin, WordBreakSolrSpellCheckerTest, ShardSplitTest, TestLuceneMatchVersion,
LeaderFailoverAfterPartitionTest, TestLMDirichletSimilarityFactory, SegmentsInfoRequestHandlerTest,
FieldMutatingUpdateProcessorTest, TestClassicSimilarityFactory, TestFieldCache, ScriptEngineTest,
TestSolrIndexConfig, CSVRequestHandlerTest, ClusterStateTest, UpdateRequestProcessorFactoryTest,
StressHdfsTest, TestDistribIDF, TestManagedResourceStorage, TestNumericTerms32, TestMacros,
HdfsThreadLeakTest, TestReplicationHandlerBackup, SpatialHeatmapFacetsTest, TestQueryTypes,
TestIntervalFaceting, ZkSolrClientTest, DistributedFacetPivotSmallTest, TestRestoreCore, DeleteInactiveReplicaTest,
TestBlendedInfixSuggestions, TestAnalyzedSuggestions, TestExactStatsCache, SuggestComponentTest,
TestFilteredDocIdSet, BasicDistributedZkTest, OpenCloseCoreStressTest, ShardRoutingTest, FullSolrCloudDistribCmdsTest,
ClusterStateUpdateTest, TestRandomFaceting, TestZkChroot, ShardRoutingCustomTest, TestDistributedSearch,
AutoCommitTest, TermVectorComponentDistributedTest, TestReload, DistributedTermsComponentTest,
TestCoreContainer, SolrCoreTest, SolrCmdDistributorTest, SoftAutoCommitTest, TestExtendedDismaxParser,
SuggesterFSTTest, TestFoldingMultitermQuery, SuggesterTSTTest, SuggesterWFSTTest, SolrCoreCheckLockOnStartupTest,
TestUpdate, DirectUpdateHandlerOptimizeTest, StatelessScriptUpdateProcessorFactoryTest, XsltUpdateRequestHandlerTest,
LukeRequestHandlerTest, DocumentAnalysisRequestHandlerTest, PrimitiveFieldTypeTest, XmlUpdateRequestHandlerTest,
PathHierarchyTokenizerFactoryTest, TestIndexingPerformance, RequiredFieldsTest, SolrPluginUtilsTest,
TestCollationField, QueryParsingTest, BinaryUpdateRequestHandlerTest, TestPartialUpdateDeduplication,
SOLR749Test, UpdateParamsTest, ResponseLogComponentTest, BadComponentTest, TestSolrDeletionPolicy2,
SampleTest, TestBinaryField, TestElisionMultitermQuery, TestFuzzyAnalyzedSuggestions, TestSolrCoreProperties,
DirectSolrConnectionTest, TestCodecSupport, TestJmxMonitoredMap, URLClassifyProcessorTest,
DateMathParserTest, PreAnalyzedFieldTest, TestSystemIdResolver, PrimUtilsTest, SpellingQueryConverterTest,
TestUtils, TestDocumentBuilder, SliceStateTest, SystemInfoHandlerTest, UUIDFieldTest, FileUtilsTest,
TestDistributedMissingSort, TestHighlightDedupGrouping, TestSimpleTrackingShardHandler, ConnectionReuseTest,
AliasIntegrationTest, BaseCdcrDistributedZkTest, CdcrReplicationDistributedZkTest, CdcrRequestHandlerTest,
CleanupOldIndexTest, ConnectionManagerTest, CreateCollectionCleanupTest, DistribDocExpirationUpdateProcessorTest,
LeaderElectionContextKeyTest, LeaderFailureAfterFreshStartTest, LeaderInitiatedRecoveryOnCommitTest,
LeaderInitiatedRecoveryOnShardRestartTest, MultiThreadedOCPTest, OverseerRolesTest, OverseerTaskQueueTest,
RecoveryAfterSoftCommitTest, ReplicationFactorTest, RestartWhileUpdatingTest, SSLMigrationTest,
SharedFSAutoReplicaFailoverTest, SimpleCollectionCreateDeleteTest, SolrCloudExampleTest, TestCloudPseudoReturnFields,
TestCloudRecovery, TestConfigSetsAPI, TestDistribDocBasedVersion, TestDownShardTolerantSearch,
TestLeaderElectionWithEmptyReplica, TestMiniSolrCloudCluster, TestRequestStatusCollectionAPI,
TestSizeLimitedDistributedMap, TestStressCloudBlindAtomicUpdates, VMParamsZkACLAndCredentialsProvidersTest,
ZkStateWriterTest, RuleEngineTest, CachingDirectoryFactoryTest, HdfsDirectoryFactoryTest,
TestBackupRepositoryFactory, TestConfigSetProperties, TestConfigSets, TestCorePropertiesReload,
RequestLoggingTest, TestHdfsBackupRestoreCore, TestReqParamsAPI, TestSolrConfigHandlerConcurrent,
CoreAdminRequestStatusTest, CoreMergeIndexesAdminHandlerTest, InfoHandlerTest, SecurityConfHandlerTest,
DistributedDebugComponentTest, DistributedFacetExistsSmallTest, TestPivotHelperCode, TestTrackingShardHandlerFactory,
TestFieldTypeResource, TestSchemaResource, TestSchemaVersionResource, TestSolrQueryParserDefaultOperatorResource,
TestManagedStopFilterFactory, TestManagedSchema, TestSchemaManager, TestUseDocValuesAsStored,
SortSpecParsingTest, TestAddFieldRealTimeGet, TestComplexPhraseQParserPlugin, TestFieldSortValues,
TestInitQParser, TestMissingGroups, TestRandomCollapseQParserPlugin, TestOrdValues, TestScoreJoinQPNoScore,
TestScoreJoinQPScore, TestJsonRequest, CloudMLTQParserTest, TestDFISimilarityFactory, TestPerFieldSimilarityWithDefaultOverride,
TestDefaultStatsCache, TestLRUStatsCache, BasicAuthStandaloneTest]
   [junit4] Completed [618/647 (1!)] on J1 in 0.60s, 1 test, 1 failure <<< FAILURES!

[...truncated 60487 lines...]


Mime
View raw message