lucene-dev mailing list archives

Site index · List index
Message view « Date » · « Thread »
Top « Date » · « Thread »
From Policeman Jenkins Server <jenk...@thetaphi.de>
Subject [JENKINS] Lucene-Solr-6.x-MacOSX (64bit/jdk1.8.0) - Build # 498 - Unstable!
Date Thu, 27 Oct 2016 20:00:17 GMT
Build: https://jenkins.thetaphi.de/job/Lucene-Solr-6.x-MacOSX/498/
Java: 64bit/jdk1.8.0 -XX:+UseCompressedOops -XX:+UseConcMarkSweepGC

1 tests failed.
FAILED:  org.apache.solr.update.SoftAutoCommitTest.testSoftAndHardCommitMaxTimeRapidAdds

Error Message:
1: soft wasn't fast enough

Stack Trace:
java.lang.AssertionError: 1: soft wasn't fast enough
	at __randomizedtesting.SeedInfo.seed([670C956621E1A8C8:3B193B5FCA63E9B0]:0)
	at org.junit.Assert.fail(Assert.java:93)
	at org.junit.Assert.assertTrue(Assert.java:43)
	at org.junit.Assert.assertNotNull(Assert.java:526)
	at org.apache.solr.update.SoftAutoCommitTest.testSoftAndHardCommitMaxTimeRapidAdds(SoftAutoCommitTest.java:322)
	at sun.reflect.NativeMethodAccessorImpl.invoke0(Native Method)
	at sun.reflect.NativeMethodAccessorImpl.invoke(NativeMethodAccessorImpl.java:62)
	at sun.reflect.DelegatingMethodAccessorImpl.invoke(DelegatingMethodAccessorImpl.java:43)
	at java.lang.reflect.Method.invoke(Method.java:498)
	at com.carrotsearch.randomizedtesting.RandomizedRunner.invoke(RandomizedRunner.java:1713)
	at com.carrotsearch.randomizedtesting.RandomizedRunner$8.evaluate(RandomizedRunner.java:907)
	at com.carrotsearch.randomizedtesting.RandomizedRunner$9.evaluate(RandomizedRunner.java:943)
	at com.carrotsearch.randomizedtesting.RandomizedRunner$10.evaluate(RandomizedRunner.java:957)
	at com.carrotsearch.randomizedtesting.rules.SystemPropertiesRestoreRule$1.evaluate(SystemPropertiesRestoreRule.java:57)
	at org.apache.lucene.util.TestRuleSetupTeardownChained$1.evaluate(TestRuleSetupTeardownChained.java:49)
	at org.apache.lucene.util.AbstractBeforeAfterRule$1.evaluate(AbstractBeforeAfterRule.java:45)
	at org.apache.lucene.util.TestRuleThreadAndTestName$1.evaluate(TestRuleThreadAndTestName.java:48)
	at org.apache.lucene.util.TestRuleIgnoreAfterMaxFailures$1.evaluate(TestRuleIgnoreAfterMaxFailures.java:64)
	at org.apache.lucene.util.TestRuleMarkFailure$1.evaluate(TestRuleMarkFailure.java:47)
	at com.carrotsearch.randomizedtesting.rules.StatementAdapter.evaluate(StatementAdapter.java:36)
	at com.carrotsearch.randomizedtesting.ThreadLeakControl$StatementRunner.run(ThreadLeakControl.java:367)
	at com.carrotsearch.randomizedtesting.ThreadLeakControl.forkTimeoutingTask(ThreadLeakControl.java:811)
	at com.carrotsearch.randomizedtesting.ThreadLeakControl$3.evaluate(ThreadLeakControl.java:462)
	at com.carrotsearch.randomizedtesting.RandomizedRunner.runSingleTest(RandomizedRunner.java:916)
	at com.carrotsearch.randomizedtesting.RandomizedRunner$5.evaluate(RandomizedRunner.java:802)
	at com.carrotsearch.randomizedtesting.RandomizedRunner$6.evaluate(RandomizedRunner.java:852)
	at com.carrotsearch.randomizedtesting.RandomizedRunner$7.evaluate(RandomizedRunner.java:863)
	at com.carrotsearch.randomizedtesting.rules.StatementAdapter.evaluate(StatementAdapter.java:36)
	at com.carrotsearch.randomizedtesting.rules.SystemPropertiesRestoreRule$1.evaluate(SystemPropertiesRestoreRule.java:57)
	at org.apache.lucene.util.AbstractBeforeAfterRule$1.evaluate(AbstractBeforeAfterRule.java:45)
	at com.carrotsearch.randomizedtesting.rules.StatementAdapter.evaluate(StatementAdapter.java:36)
	at org.apache.lucene.util.TestRuleStoreClassName$1.evaluate(TestRuleStoreClassName.java:41)
	at com.carrotsearch.randomizedtesting.rules.NoShadowingOrOverridesOnMethodsRule$1.evaluate(NoShadowingOrOverridesOnMethodsRule.java:40)
	at com.carrotsearch.randomizedtesting.rules.NoShadowingOrOverridesOnMethodsRule$1.evaluate(NoShadowingOrOverridesOnMethodsRule.java:40)
	at com.carrotsearch.randomizedtesting.rules.StatementAdapter.evaluate(StatementAdapter.java:36)
	at com.carrotsearch.randomizedtesting.rules.StatementAdapter.evaluate(StatementAdapter.java:36)
	at com.carrotsearch.randomizedtesting.rules.StatementAdapter.evaluate(StatementAdapter.java:36)
	at org.apache.lucene.util.TestRuleAssertionsRequired$1.evaluate(TestRuleAssertionsRequired.java:53)
	at org.apache.lucene.util.TestRuleMarkFailure$1.evaluate(TestRuleMarkFailure.java:47)
	at org.apache.lucene.util.TestRuleIgnoreAfterMaxFailures$1.evaluate(TestRuleIgnoreAfterMaxFailures.java:64)
	at org.apache.lucene.util.TestRuleIgnoreTestSuites$1.evaluate(TestRuleIgnoreTestSuites.java:54)
	at com.carrotsearch.randomizedtesting.rules.StatementAdapter.evaluate(StatementAdapter.java:36)
	at com.carrotsearch.randomizedtesting.ThreadLeakControl$StatementRunner.run(ThreadLeakControl.java:367)
	at java.lang.Thread.run(Thread.java:745)




Build Log:
[...truncated 10596 lines...]
   [junit4] Suite: org.apache.solr.update.SoftAutoCommitTest
   [junit4]   2> Creating dataDir: /Users/jenkins/workspace/Lucene-Solr-6.x-MacOSX/solr/build/solr-core/test/J0/temp/solr.update.SoftAutoCommitTest_670C956621E1A8C8-001/init-core-data-001
   [junit4]   2> 0    INFO  (SUITE-SoftAutoCommitTest-seed#[670C956621E1A8C8]-worker) [
   ] o.e.j.u.log Logging initialized @5900ms
   [junit4]   2> 28   INFO  (SUITE-SoftAutoCommitTest-seed#[670C956621E1A8C8]-worker) [
   ] o.a.s.SolrTestCaseJ4 Randomized ssl (false) and clientAuth (false) via: @org.apache.solr.util.RandomizeSSL(reason=,
value=NaN, ssl=NaN, clientAuth=NaN) w/ MAC_OS_X supressed clientAuth
   [junit4]   2> 76   INFO  (SUITE-SoftAutoCommitTest-seed#[670C956621E1A8C8]-worker) [
   ] o.a.s.SolrTestCaseJ4 ####initCore
   [junit4]   2> 533  INFO  (SUITE-SoftAutoCommitTest-seed#[670C956621E1A8C8]-worker) [
   ] o.a.s.c.SolrResourceLoader Using system property solr.solr.home: /Users/jenkins/workspace/Lucene-Solr-6.x-MacOSX/solr/core/src/test-files/solr
   [junit4]   2> 549  INFO  (SUITE-SoftAutoCommitTest-seed#[670C956621E1A8C8]-worker) [
   ] o.a.s.c.SolrResourceLoader [null] Added 2 libs to classloader, from paths: [/Users/jenkins/workspace/Lucene-Solr-6.x-MacOSX/solr/core/src/test-files/solr/collection1/lib,
/Users/jenkins/workspace/Lucene-Solr-6.x-MacOSX/solr/core/src/test-files/solr/collection1/lib/classes]
   [junit4]   2> 1684 WARN  (SUITE-SoftAutoCommitTest-seed#[670C956621E1A8C8]-worker) [
   ] o.a.s.c.Config Beginning with Solr 5.5, <mergePolicy> is deprecated, use <mergePolicyFactory>
instead.
   [junit4]   2> 1695 INFO  (SUITE-SoftAutoCommitTest-seed#[670C956621E1A8C8]-worker) [
   ] o.a.s.c.SolrConfig Using Lucene MatchVersion: 6.3.0
   [junit4]   2> 2124 INFO  (SUITE-SoftAutoCommitTest-seed#[670C956621E1A8C8]-worker) [
   ] o.a.s.s.IndexSchema [null] Schema name=test
   [junit4]   2> 4734 WARN  (SUITE-SoftAutoCommitTest-seed#[670C956621E1A8C8]-worker) [
   ] o.a.s.s.IndexSchema [null] default search field in schema is text. WARNING: Deprecated,
please use 'df' on request instead.
   [junit4]   2> 4764 INFO  (SUITE-SoftAutoCommitTest-seed#[670C956621E1A8C8]-worker) [
   ] o.a.s.s.IndexSchema Loaded schema test/1.0 with uniqueid field id
   [junit4]   2> 6197 INFO  (SUITE-SoftAutoCommitTest-seed#[670C956621E1A8C8]-worker) [
   ] o.a.s.u.UpdateShardHandler Creating UpdateShardHandler HTTP client with params: socketTimeout=30000&connTimeout=30000&retry=true
   [junit4]   2> 6559 INFO  (coreLoadExecutor-6-thread-1) [    ] o.a.s.c.SolrResourceLoader
[null] Added 2 libs to classloader, from paths: [/Users/jenkins/workspace/Lucene-Solr-6.x-MacOSX/solr/core/src/test-files/solr/collection1/lib,
/Users/jenkins/workspace/Lucene-Solr-6.x-MacOSX/solr/core/src/test-files/solr/collection1/lib/classes]
   [junit4]   2> 6667 WARN  (coreLoadExecutor-6-thread-1) [    ] o.a.s.c.Config Beginning
with Solr 5.5, <mergePolicy> is deprecated, use <mergePolicyFactory> instead.
   [junit4]   2> 6669 INFO  (coreLoadExecutor-6-thread-1) [    ] o.a.s.c.SolrConfig Using
Lucene MatchVersion: 6.3.0
   [junit4]   2> 6718 INFO  (coreLoadExecutor-6-thread-1) [    ] o.a.s.s.IndexSchema [collection1]
Schema name=test
   [junit4]   2> 6979 WARN  (coreLoadExecutor-6-thread-1) [    ] o.a.s.s.IndexSchema [collection1]
default search field in schema is text. WARNING: Deprecated, please use 'df' on request instead.
   [junit4]   2> 6989 INFO  (coreLoadExecutor-6-thread-1) [    ] o.a.s.s.IndexSchema Loaded
schema test/1.0 with uniqueid field id
   [junit4]   2> 7030 INFO  (coreLoadExecutor-6-thread-1) [    ] o.a.s.c.CoreContainer
Creating SolrCore 'collection1' using configuration from instancedir /Users/jenkins/workspace/Lucene-Solr-6.x-MacOSX/solr/core/src/test-files/solr/collection1
   [junit4]   2> 7432 INFO  (coreLoadExecutor-6-thread-1) [    x:collection1] o.a.s.c.SolrCore
[[collection1] ] Opening new SolrCore at [/Users/jenkins/workspace/Lucene-Solr-6.x-MacOSX/solr/core/src/test-files/solr/collection1],
dataDir=[/Users/jenkins/workspace/Lucene-Solr-6.x-MacOSX/solr/build/solr-core/test/J0/temp/solr.update.SoftAutoCommitTest_670C956621E1A8C8-001/init-core-data-001/]
   [junit4]   2> 7595 INFO  (coreLoadExecutor-6-thread-1) [    x:collection1] o.a.s.u.RandomMergePolicy
RandomMergePolicy wrapping class org.apache.lucene.index.LogByteSizeMergePolicy: [LogByteSizeMergePolicy:
minMergeSize=1677721, mergeFactor=33, maxMergeSize=2147483648, maxMergeSizeForForcedMerge=9223372036854775807,
calibrateSizeByDeletes=true, maxMergeDocs=2147483647, maxCFSSegmentSizeMB=8.796093022207999E12,
noCFSRatio=1.0]
   [junit4]   2> 12041 INFO  (coreLoadExecutor-6-thread-1) [    x:collection1] o.a.s.u.UpdateHandler
Using UpdateLog implementation: org.apache.solr.update.UpdateLog
   [junit4]   2> 12041 INFO  (coreLoadExecutor-6-thread-1) [    x:collection1] o.a.s.u.UpdateLog
Initializing UpdateLog: dataDir= defaultSyncLevel=FLUSH numRecordsToKeep=100 maxNumLogsToKeep=10
numVersionBuckets=65536
   [junit4]   2> 12077 INFO  (coreLoadExecutor-6-thread-1) [    x:collection1] o.a.s.u.CommitTracker
Hard AutoCommit: disabled
   [junit4]   2> 12077 INFO  (coreLoadExecutor-6-thread-1) [    x:collection1] o.a.s.u.CommitTracker
Soft AutoCommit: disabled
   [junit4]   2> 12078 INFO  (coreLoadExecutor-6-thread-1) [    x:collection1] o.a.s.u.RandomMergePolicy
RandomMergePolicy wrapping class org.apache.lucene.index.TieredMergePolicy: [TieredMergePolicy:
maxMergeAtOnce=12, maxMergeAtOnceExplicit=16, maxMergedSegmentMB=25.7421875, floorSegmentMB=1.2060546875,
forceMergeDeletesPctAllowed=3.5626389698614522, segmentsPerTier=24.0, maxCFSSegmentSizeMB=8.796093022207999E12,
noCFSRatio=1.0
   [junit4]   2> 12222 INFO  (coreLoadExecutor-6-thread-1) [    x:collection1] o.a.s.s.SolrIndexSearcher
Opening [Searcher@5898b87[collection1] main]
   [junit4]   2> 12485 INFO  (coreLoadExecutor-6-thread-1) [    x:collection1] o.a.s.h.c.SpellCheckComponent
Initializing spell checkers
   [junit4]   2> 12773 INFO  (coreLoadExecutor-6-thread-1) [    x:collection1] o.a.s.s.DirectSolrSpellChecker
init: {name=direct,classname=DirectSolrSpellChecker,field=lowerfilt,minQueryLength=3}
   [junit4]   2> 13108 INFO  (coreLoadExecutor-6-thread-1) [    x:collection1] o.a.s.h.ReplicationHandler
Commits will be reserved for  10000
   [junit4]   2> 13274 INFO  (searcherExecutor-7-thread-1-processing-x:collection1) [ 
  x:collection1] o.a.s.h.c.SpellCheckComponent Loading spell index for spellchecker: default
   [junit4]   2> 13281 INFO  (searcherExecutor-7-thread-1-processing-x:collection1) [ 
  x:collection1] o.a.s.h.c.SpellCheckComponent Loading spell index for spellchecker: direct
   [junit4]   2> 13281 INFO  (searcherExecutor-7-thread-1-processing-x:collection1) [ 
  x:collection1] o.a.s.h.c.SpellCheckComponent Loading spell index for spellchecker: wordbreak
   [junit4]   2> 13281 INFO  (searcherExecutor-7-thread-1-processing-x:collection1) [ 
  x:collection1] o.a.s.h.c.SpellCheckComponent Loading spell index for spellchecker: multipleFields
   [junit4]   2> 13283 INFO  (searcherExecutor-7-thread-1-processing-x:collection1) [ 
  x:collection1] o.a.s.h.c.SpellCheckComponent Loading spell index for spellchecker: jarowinkler
   [junit4]   2> 13289 INFO  (searcherExecutor-7-thread-1-processing-x:collection1) [ 
  x:collection1] o.a.s.h.c.SpellCheckComponent Loading spell index for spellchecker: external
   [junit4]   2> 13291 INFO  (searcherExecutor-7-thread-1-processing-x:collection1) [ 
  x:collection1] o.a.s.h.c.SpellCheckComponent Loading spell index for spellchecker: freq
   [junit4]   2> 13293 INFO  (searcherExecutor-7-thread-1-processing-x:collection1) [ 
  x:collection1] o.a.s.h.c.SpellCheckComponent Loading spell index for spellchecker: fqcn
   [junit4]   2> 13295 INFO  (searcherExecutor-7-thread-1-processing-x:collection1) [ 
  x:collection1] o.a.s.h.c.SpellCheckComponent Loading spell index for spellchecker: perDict
   [junit4]   2> 13296 INFO  (searcherExecutor-7-thread-1-processing-x:collection1) [ 
  x:collection1] o.a.s.c.SolrCore [collection1] Registered new searcher Searcher@5898b87[collection1]
main{ExitableDirectoryReader(UninvertingDirectoryReader())}
   [junit4]   2> 13296 INFO  (coreLoadExecutor-6-thread-1) [    x:collection1] o.a.s.u.UpdateLog
Could not find max version in index or recent updates, using new clock 1549369163681628160
   [junit4]   2> 13317 INFO  (SUITE-SoftAutoCommitTest-seed#[670C956621E1A8C8]-worker)
[    ] o.a.s.SolrTestCaseJ4 ####initCore end
   [junit4]   2> 13355 INFO  (TEST-SoftAutoCommitTest.testSoftAndHardCommitMaxTimeRapidAdds-seed#[670C956621E1A8C8])
[    ] o.a.s.SolrTestCaseJ4 ###Starting testSoftAndHardCommitMaxTimeRapidAdds
   [junit4]   2> 13356 INFO  (TEST-SoftAutoCommitTest.testSoftAndHardCommitMaxTimeRapidAdds-seed#[670C956621E1A8C8])
[    ] o.a.s.c.SolrResourceLoader [null] Added 2 libs to classloader, from paths: [/Users/jenkins/workspace/Lucene-Solr-6.x-MacOSX/solr/core/src/test-files/solr/collection1/lib,
/Users/jenkins/workspace/Lucene-Solr-6.x-MacOSX/solr/core/src/test-files/solr/collection1/lib/classes]
   [junit4]   2> 13467 WARN  (TEST-SoftAutoCommitTest.testSoftAndHardCommitMaxTimeRapidAdds-seed#[670C956621E1A8C8])
[    ] o.a.s.c.Config Beginning with Solr 5.5, <mergePolicy> is deprecated, use <mergePolicyFactory>
instead.
   [junit4]   2> 13469 INFO  (TEST-SoftAutoCommitTest.testSoftAndHardCommitMaxTimeRapidAdds-seed#[670C956621E1A8C8])
[    ] o.a.s.c.SolrConfig Using Lucene MatchVersion: 6.3.0
   [junit4]   2> 13510 INFO  (TEST-SoftAutoCommitTest.testSoftAndHardCommitMaxTimeRapidAdds-seed#[670C956621E1A8C8])
[    ] o.a.s.s.IndexSchema [collection1] Schema name=test
   [junit4]   2> 13709 WARN  (TEST-SoftAutoCommitTest.testSoftAndHardCommitMaxTimeRapidAdds-seed#[670C956621E1A8C8])
[    ] o.a.s.s.IndexSchema [collection1] default search field in schema is text. WARNING:
Deprecated, please use 'df' on request instead.
   [junit4]   2> 13713 INFO  (TEST-SoftAutoCommitTest.testSoftAndHardCommitMaxTimeRapidAdds-seed#[670C956621E1A8C8])
[    ] o.a.s.s.IndexSchema Loaded schema test/1.0 with uniqueid field id
   [junit4]   2> 13750 INFO  (TEST-SoftAutoCommitTest.testSoftAndHardCommitMaxTimeRapidAdds-seed#[670C956621E1A8C8])
[    ] o.a.s.c.CoreContainer Reloading SolrCore 'collection1' using configuration from instancedir
/Users/jenkins/workspace/Lucene-Solr-6.x-MacOSX/solr/core/src/test-files/solr/collection1
   [junit4]   2> 13752 INFO  (TEST-SoftAutoCommitTest.testSoftAndHardCommitMaxTimeRapidAdds-seed#[670C956621E1A8C8])
[    x:collection1] o.a.s.c.SolrCore [[collection1] ] Opening new SolrCore at [/Users/jenkins/workspace/Lucene-Solr-6.x-MacOSX/solr/core/src/test-files/solr/collection1],
dataDir=[/Users/jenkins/workspace/Lucene-Solr-6.x-MacOSX/solr/build/solr-core/test/J0/temp/solr.update.SoftAutoCommitTest_670C956621E1A8C8-001/init-core-data-001/]
   [junit4]   2> 13781 INFO  (TEST-SoftAutoCommitTest.testSoftAndHardCommitMaxTimeRapidAdds-seed#[670C956621E1A8C8])
[    x:collection1] o.a.s.u.CommitTracker Hard AutoCommit: disabled
   [junit4]   2> 13781 INFO  (TEST-SoftAutoCommitTest.testSoftAndHardCommitMaxTimeRapidAdds-seed#[670C956621E1A8C8])
[    x:collection1] o.a.s.u.CommitTracker Soft AutoCommit: disabled
   [junit4]   2> 13783 INFO  (TEST-SoftAutoCommitTest.testSoftAndHardCommitMaxTimeRapidAdds-seed#[670C956621E1A8C8])
[    x:collection1] o.a.s.s.SolrIndexSearcher Opening [Searcher@6b0a3504[collection1] main]
   [junit4]   2> 13784 INFO  (TEST-SoftAutoCommitTest.testSoftAndHardCommitMaxTimeRapidAdds-seed#[670C956621E1A8C8])
[    x:collection1] o.a.s.h.c.SpellCheckComponent Initializing spell checkers
   [junit4]   2> 13786 INFO  (TEST-SoftAutoCommitTest.testSoftAndHardCommitMaxTimeRapidAdds-seed#[670C956621E1A8C8])
[    x:collection1] o.a.s.s.DirectSolrSpellChecker init: {name=direct,classname=DirectSolrSpellChecker,field=lowerfilt,minQueryLength=3}
   [junit4]   2> 13817 INFO  (TEST-SoftAutoCommitTest.testSoftAndHardCommitMaxTimeRapidAdds-seed#[670C956621E1A8C8])
[    x:collection1] o.a.s.h.ReplicationHandler Commits will be reserved for  10000
   [junit4]   2> 13819 INFO  (searcherExecutor-12-thread-1-processing-x:collection1) [
   x:collection1] o.a.s.h.c.SpellCheckComponent Loading spell index for spellchecker: default
   [junit4]   2> 13820 INFO  (searcherExecutor-12-thread-1-processing-x:collection1) [
   x:collection1] o.a.s.h.c.SpellCheckComponent Loading spell index for spellchecker: direct
   [junit4]   2> 13820 INFO  (searcherExecutor-12-thread-1-processing-x:collection1) [
   x:collection1] o.a.s.h.c.SpellCheckComponent Loading spell index for spellchecker: wordbreak
   [junit4]   2> 13820 INFO  (TEST-SoftAutoCommitTest.testSoftAndHardCommitMaxTimeRapidAdds-seed#[670C956621E1A8C8])
[    x:collection1] o.a.s.u.UpdateLog Could not find max version in index or recent updates,
using new clock 1549369164231081984
   [junit4]   2> 13820 INFO  (searcherExecutor-12-thread-1-processing-x:collection1) [
   x:collection1] o.a.s.h.c.SpellCheckComponent Loading spell index for spellchecker: multipleFields
   [junit4]   2> 13822 INFO  (searcherExecutor-12-thread-1-processing-x:collection1) [
   x:collection1] o.a.s.h.c.SpellCheckComponent Loading spell index for spellchecker: jarowinkler
   [junit4]   2> 13823 INFO  (searcherExecutor-12-thread-1-processing-x:collection1) [
   x:collection1] o.a.s.h.c.SpellCheckComponent Loading spell index for spellchecker: external
   [junit4]   2> 13825 INFO  (searcherExecutor-12-thread-1-processing-x:collection1) [
   x:collection1] o.a.s.h.c.SpellCheckComponent Loading spell index for spellchecker: freq
   [junit4]   2> 13827 INFO  (searcherExecutor-12-thread-1-processing-x:collection1) [
   x:collection1] o.a.s.h.c.SpellCheckComponent Loading spell index for spellchecker: fqcn
   [junit4]   2> 13829 INFO  (searcherExecutor-12-thread-1-processing-x:collection1) [
   x:collection1] o.a.s.h.c.SpellCheckComponent Loading spell index for spellchecker: perDict
   [junit4]   2> 13829 INFO  (searcherExecutor-12-thread-1-processing-x:collection1) [
   x:collection1] o.a.s.c.SolrCore [collection1] Registered new searcher Searcher@6b0a3504[collection1]
main{ExitableDirectoryReader(UninvertingDirectoryReader())}
   [junit4]   2> 13834 INFO  (TEST-SoftAutoCommitTest.testSoftAndHardCommitMaxTimeRapidAdds-seed#[670C956621E1A8C8])
[    x:collection1] o.a.s.u.RandomMergePolicy RandomMergePolicy wrapping class org.apache.lucene.index.LogDocMergePolicy:
[LogDocMergePolicy: minMergeSize=1000, mergeFactor=20, maxMergeSize=9223372036854775807, maxMergeSizeForForcedMerge=9223372036854775807,
calibrateSizeByDeletes=false, maxMergeDocs=2147483647, maxCFSSegmentSizeMB=8.796093022207999E12,
noCFSRatio=0.6115630658974729]
   [junit4]   2> 13839 INFO  (TEST-SoftAutoCommitTest.testSoftAndHardCommitMaxTimeRapidAdds-seed#[670C956621E1A8C8])
[    x:collection1] o.a.s.u.DefaultSolrCoreState New IndexWriter is ready to be used.
   [junit4]   2> 13847 INFO  (TEST-SoftAutoCommitTest.testSoftAndHardCommitMaxTimeRapidAdds-seed#[670C956621E1A8C8])
[    x:collection1] o.a.s.s.SolrIndexSearcher Opening [Searcher@3621315a[collection1] main]
   [junit4]   2> 13849 INFO  (TEST-SoftAutoCommitTest.testSoftAndHardCommitMaxTimeRapidAdds-seed#[670C956621E1A8C8])
[    x:collection1] o.a.s.c.SolrCore [collection1]  CLOSING SolrCore org.apache.solr.core.SolrCore@34c93791
   [junit4]   2> 13873 INFO  (searcherExecutor-12-thread-1-processing-x:collection1) [
   x:collection1] o.a.s.c.SolrCore [collection1] Registered new searcher Searcher@3621315a[collection1]
main{ExitableDirectoryReader(UninvertingDirectoryReader())}
   [junit4]   2> 14960 INFO  (TEST-SoftAutoCommitTest.testSoftAndHardCommitMaxTimeRapidAdds-seed#[670C956621E1A8C8])
[    x:collection1] o.a.s.u.p.LogUpdateProcessorFactory [collection1]  webapp=null path=null
params={}{add=[5000 (1549369164928385024)]} 0 1094
   [junit4]   2> 15000 INFO  (TEST-SoftAutoCommitTest.testSoftAndHardCommitMaxTimeRapidAdds-seed#[670C956621E1A8C8])
[    x:collection1] o.a.s.u.p.LogUpdateProcessorFactory [collection1]  webapp=null path=null
params={}{add=[5001 (1549369165467353088)]} 0 1
   [junit4]   2> 15002 INFO  (TEST-SoftAutoCommitTest.testSoftAndHardCommitMaxTimeRapidAdds-seed#[670C956621E1A8C8])
[    x:collection1] o.a.s.u.p.LogUpdateProcessorFactory [collection1]  webapp=null path=null
params={}{add=[5002 (1549369165469450240)]} 0 1
   [junit4]   2> 15004 INFO  (TEST-SoftAutoCommitTest.testSoftAndHardCommitMaxTimeRapidAdds-seed#[670C956621E1A8C8])
[    x:collection1] o.a.s.u.p.LogUpdateProcessorFactory [collection1]  webapp=null path=null
params={}{add=[5003 (1549369165471547392)]} 0 1
   [junit4]   2> 15005 INFO  (TEST-SoftAutoCommitTest.testSoftAndHardCommitMaxTimeRapidAdds-seed#[670C956621E1A8C8])
[    x:collection1] o.a.s.u.p.LogUpdateProcessorFactory [collection1]  webapp=null path=null
params={}{add=[5004 (1549369165473644544)]} 0 0
   [junit4]   2> 15451 INFO  (commitScheduler-15-thread-1) [    x:collection1] o.a.s.u.DirectUpdateHandler2
start commit{,optimize=false,openSearcher=true,waitSearcher=true,expungeDeletes=false,softCommit=true,prepareCommit=false}
   [junit4]   2> 16011 INFO  (TEST-SoftAutoCommitTest.testSoftAndHardCommitMaxTimeRapidAdds-seed#[670C956621E1A8C8])
[    x:collection1] o.a.s.SolrTestCaseJ4 ###Ending testSoftAndHardCommitMaxTimeRapidAdds
   [junit4]   2> NOTE: reproduce with: ant test  -Dtestcase=SoftAutoCommitTest -Dtests.method=testSoftAndHardCommitMaxTimeRapidAdds
-Dtests.seed=670C956621E1A8C8 -Dtests.slow=true -Dtests.locale=vi-VN -Dtests.timezone=Pacific/Honolulu
-Dtests.asserts=true -Dtests.file.encoding=UTF-8
   [junit4] FAILURE 2.70s J0 | SoftAutoCommitTest.testSoftAndHardCommitMaxTimeRapidAdds <<<
   [junit4]    > Throwable #1: java.lang.AssertionError: 1: soft wasn't fast enough
   [junit4]    > 	at __randomizedtesting.SeedInfo.seed([670C956621E1A8C8:3B193B5FCA63E9B0]:0)
   [junit4]    > 	at org.apache.solr.update.SoftAutoCommitTest.testSoftAndHardCommitMaxTimeRapidAdds(SoftAutoCommitTest.java:322)
   [junit4]    > 	at java.lang.Thread.run(Thread.java:745)
   [junit4]   2> 16031 INFO  (TEST-SoftAutoCommitTest.testSoftAndHardCommitMaxTimeMixedAdds-seed#[670C956621E1A8C8])
[    x:collection1] o.a.s.SolrTestCaseJ4 ###Starting testSoftAndHardCommitMaxTimeMixedAdds
   [junit4]   2> 16032 INFO  (TEST-SoftAutoCommitTest.testSoftAndHardCommitMaxTimeMixedAdds-seed#[670C956621E1A8C8])
[    x:collection1] o.a.s.c.SolrResourceLoader [null] Added 2 libs to classloader, from paths:
[/Users/jenkins/workspace/Lucene-Solr-6.x-MacOSX/solr/core/src/test-files/solr/collection1/lib,
/Users/jenkins/workspace/Lucene-Solr-6.x-MacOSX/solr/core/src/test-files/solr/collection1/lib/classes]
   [junit4]   2> 16120 WARN  (TEST-SoftAutoCommitTest.testSoftAndHardCommitMaxTimeMixedAdds-seed#[670C956621E1A8C8])
[    x:collection1] o.a.s.c.Config Beginning with Solr 5.5, <mergePolicy> is deprecated,
use <mergePolicyFactory> instead.
   [junit4]   2> 16121 INFO  (TEST-SoftAutoCommitTest.testSoftAndHardCommitMaxTimeMixedAdds-seed#[670C956621E1A8C8])
[    x:collection1] o.a.s.c.SolrConfig Using Lucene MatchVersion: 6.3.0
   [junit4]   2> 16159 INFO  (commitScheduler-14-thread-1) [    x:collection1] o.a.s.u.DirectUpdateHandler2
start commit{,optimize=false,openSearcher=true,waitSearcher=true,expungeDeletes=false,softCommit=false,prepareCommit=false}
   [junit4]   2> 16169 INFO  (TEST-SoftAutoCommitTest.testSoftAndHardCommitMaxTimeMixedAdds-seed#[670C956621E1A8C8])
[    x:collection1] o.a.s.s.IndexSchema [collection1] Schema name=test
   [junit4]   2> 16307 INFO  (commitScheduler-15-thread-1) [    x:collection1] o.a.s.s.SolrIndexSearcher
Opening [Searcher@4e68d7c9[collection1] main]
   [junit4]   2> 16308 INFO  (commitScheduler-14-thread-1) [    x:collection1] o.a.s.u.SolrIndexWriter
Calling setCommitData with IW:org.apache.solr.update.SolrIndexWriter@2774646c
   [junit4]   2> 16308 INFO  (searcherExecutor-12-thread-1-processing-x:collection1) [
   x:collection1] o.a.s.c.SolrCore [collection1] Registered new searcher Searcher@4e68d7c9[collection1]
main{ExitableDirectoryReader(UninvertingDirectoryReader(Uninverting(_0(6.3.0):c5)))}
   [junit4]   2> 16319 INFO  (commitScheduler-15-thread-1) [    x:collection1] o.a.s.u.DirectUpdateHandler2
end_commit_flush
   [junit4]   2> 16411 INFO  (commitScheduler-14-thread-1) [    x:collection1] o.a.s.s.SolrIndexSearcher
Opening [Searcher@a2b3878[collection1] main]
   [junit4]   2> 16413 INFO  (commitScheduler-14-thread-1) [    x:collection1] o.a.s.u.DirectUpdateHandler2
end_commit_flush
   [junit4]   2> 16413 INFO  (searcherExecutor-12-thread-1-processing-x:collection1) [
   x:collection1] o.a.s.c.SolrCore [collection1] Registered new searcher Searcher@a2b3878[collection1]
main{ExitableDirectoryReader(UninvertingDirectoryReader(Uninverting(_0(6.3.0):c5)))}
   [junit4]   2> 16437 WARN  (TEST-SoftAutoCommitTest.testSoftAndHardCommitMaxTimeMixedAdds-seed#[670C956621E1A8C8])
[    x:collection1] o.a.s.s.IndexSchema [collection1] default search field in schema is text.
WARNING: Deprecated, please use 'df' on request instead.
   [junit4]   2> 16440 INFO  (TEST-SoftAutoCommitTest.testSoftAndHardCommitMaxTimeMixedAdds-seed#[670C956621E1A8C8])
[    x:collection1] o.a.s.s.IndexSchema Loaded schema test/1.0 with uniqueid field id
   [junit4]   2> 16459 INFO  (TEST-SoftAutoCommitTest.testSoftAndHardCommitMaxTimeMixedAdds-seed#[670C956621E1A8C8])
[    x:collection1] o.a.s.c.CoreContainer Reloading SolrCore 'collection1' using configuration
from instancedir /Users/jenkins/workspace/Lucene-Solr-6.x-MacOSX/solr/core/src/test-files/solr/collection1
   [junit4]   2> 16460 INFO  (TEST-SoftAutoCommitTest.testSoftAndHardCommitMaxTimeMixedAdds-seed#[670C956621E1A8C8])
[    x:collection1] o.a.s.c.SolrCore [[collection1] ] Opening new SolrCore at [/Users/jenkins/workspace/Lucene-Solr-6.x-MacOSX/solr/core/src/test-files/solr/collection1],
dataDir=[/Users/jenkins/workspace/Lucene-Solr-6.x-MacOSX/solr/build/solr-core/test/J0/temp/solr.update.SoftAutoCommitTest_670C956621E1A8C8-001/init-core-data-001/]
   [junit4]   2> 16480 INFO  (TEST-SoftAutoCommitTest.testSoftAndHardCommitMaxTimeMixedAdds-seed#[670C956621E1A8C8])
[    x:collection1] o.a.s.u.CommitTracker Hard AutoCommit: disabled
   [junit4]   2> 16480 INFO  (TEST-SoftAutoCommitTest.testSoftAndHardCommitMaxTimeMixedAdds-seed#[670C956621E1A8C8])
[    x:collection1] o.a.s.u.CommitTracker Soft AutoCommit: disabled
   [junit4]   2> 16481 INFO  (TEST-SoftAutoCommitTest.testSoftAndHardCommitMaxTimeMixedAdds-seed#[670C956621E1A8C8])
[    x:collection1] o.a.s.s.SolrIndexSearcher Opening [Searcher@754ba470[collection1] main]
   [junit4]   2> 16482 INFO  (TEST-SoftAutoCommitTest.testSoftAndHardCommitMaxTimeMixedAdds-seed#[670C956621E1A8C8])
[    x:collection1] o.a.s.h.c.SpellCheckComponent Initializing spell checkers
   [junit4]   2> 16483 INFO  (TEST-SoftAutoCommitTest.testSoftAndHardCommitMaxTimeMixedAdds-seed#[670C956621E1A8C8])
[    x:collection1] o.a.s.s.DirectSolrSpellChecker init: {name=direct,classname=DirectSolrSpellChecker,field=lowerfilt,minQueryLength=3}
   [junit4]   2> 16492 INFO  (TEST-SoftAutoCommitTest.testSoftAndHardCommitMaxTimeMixedAdds-seed#[670C956621E1A8C8])
[    x:collection1] o.a.s.h.ReplicationHandler Commits will be reserved for  10000
   [junit4]   2> 16492 INFO  (searcherExecutor-16-thread-1-processing-x:collection1) [
   x:collection1] o.a.s.h.c.SpellCheckComponent Loading spell index for spellchecker: default
   [junit4]   2> 16493 INFO  (searcherExecutor-16-thread-1-processing-x:collection1) [
   x:collection1] o.a.s.h.c.SpellCheckComponent Loading spell index for spellchecker: direct
   [junit4]   2> 16494 INFO  (searcherExecutor-16-thread-1-processing-x:collection1) [
   x:collection1] o.a.s.h.c.SpellCheckComponent Loading spell index for spellchecker: wordbreak
   [junit4]   2> 16494 INFO  (searcherExecutor-16-thread-1-processing-x:collection1) [
   x:collection1] o.a.s.h.c.SpellCheckComponent Loading spell index for spellchecker: multipleFields
   [junit4]   2> 16495 INFO  (searcherExecutor-16-thread-1-processing-x:collection1) [
   x:collection1] o.a.s.h.c.SpellCheckComponent Loading spell index for spellchecker: jarowinkler
   [junit4]   2> 16496 INFO  (searcherExecutor-16-thread-1-processing-x:collection1) [
   x:collection1] o.a.s.h.c.SpellCheckComponent Loading spell index for spellchecker: external
   [junit4]   2> 16497 INFO  (searcherExecutor-16-thread-1-processing-x:collection1) [
   x:collection1] o.a.s.h.c.SpellCheckComponent Loading spell index for spellchecker: freq
   [junit4]   2> 16498 INFO  (searcherExecutor-16-thread-1-processing-x:collection1) [
   x:collection1] o.a.s.h.c.SpellCheckComponent Loading spell index for spellchecker: fqcn
   [junit4]   2> 16499 INFO  (searcherExecutor-16-thread-1-processing-x:collection1) [
   x:collection1] o.a.s.h.c.SpellCheckComponent Loading spell index for spellchecker: perDict
   [junit4]   2> 16499 INFO  (searcherExecutor-16-thread-1-processing-x:collection1) [
   x:collection1] o.a.s.c.SolrCore [collection1] Registered new searcher Searcher@754ba470[collection1]
main{ExitableDirectoryReader(UninvertingDirectoryReader(Uninverting(_0(6.3.0):c5)))}
   [junit4]   2> 16512 INFO  (TEST-SoftAutoCommitTest.testSoftAndHardCommitMaxTimeMixedAdds-seed#[670C956621E1A8C8])
[    x:collection1] o.a.s.u.RandomMergePolicy RandomMergePolicy wrapping class org.apache.lucene.index.TieredMergePolicy:
[TieredMergePolicy: maxMergeAtOnce=18, maxMergeAtOnceExplicit=41, maxMergedSegmentMB=21.107421875,
floorSegmentMB=1.9609375, forceMergeDeletesPctAllowed=16.89736731863041, segmentsPerTier=19.0,
maxCFSSegmentSizeMB=8.796093022207999E12, noCFSRatio=0.0
   [junit4]   2> 16515 INFO  (TEST-SoftAutoCommitTest.testSoftAndHardCommitMaxTimeMixedAdds-seed#[670C956621E1A8C8])
[    x:collection1] o.a.s.u.DefaultSolrCoreState New IndexWriter is ready to be used.
   [junit4]   2> 16517 INFO  (TEST-SoftAutoCommitTest.testSoftAndHardCommitMaxTimeMixedAdds-seed#[670C956621E1A8C8])
[    x:collection1] o.a.s.s.SolrIndexSearcher Opening [Searcher@60361af8[collection1] main]
   [junit4]   2> 16518 INFO  (TEST-SoftAutoCommitTest.testSoftAndHardCommitMaxTimeMixedAdds-seed#[670C956621E1A8C8])
[    x:collection1] o.a.s.c.SolrCore [collection1]  CLOSING SolrCore org.apache.solr.core.SolrCore@59c0bd41
   [junit4]   2> 16518 INFO  (searcherExecutor-16-thread-1-processing-x:collection1) [
   x:collection1] o.a.s.c.SolrCore [collection1] Registered new searcher Searcher@60361af8[collection1]
main{ExitableDirectoryReader(UninvertingDirectoryReader(Uninverting(_0(6.3.0):c5)))}
   [junit4]   2> 16525 INFO  (TEST-SoftAutoCommitTest.testSoftAndHardCommitMaxTimeMixedAdds-seed#[670C956621E1A8C8])
[    x:collection1] o.a.s.u.p.LogUpdateProcessorFactory [collection1]  webapp=null path=null
params={}{add=[529 (1549369167063285760)]} 0 4
   [junit4]   2> 17035 INFO  (commitScheduler-19-thread-1) [    x:collection1] o.a.s.u.DirectUpdateHandler2
start commit{,optimize=false,openSearcher=true,waitSearcher=true,expungeDeletes=false,softCommit=true,prepareCommit=false}
   [junit4]   2> 17081 INFO  (commitScheduler-19-thread-1) [    x:collection1] o.a.s.s.SolrIndexSearcher
Opening [Searcher@1a24ba1b[collection1] main]
   [junit4]   2> 17083 INFO  (commitScheduler-19-thread-1) [    x:collection1] o.a.s.u.DirectUpdateHandler2
end_commit_flush
   [junit4]   2> 17084 INFO  (searcherExecutor-16-thread-1-processing-x:collection1) [
   x:collection1] o.a.s.c.SolrCore [collection1] Registered new searcher Searcher@1a24ba1b[collection1]
main{ExitableDirectoryReader(UninvertingDirectoryReader(Uninverting(_0(6.3.0):c5) Uninverting(_1(6.3.0):c1)))}
   [junit4]   2> 17086 INFO  (TEST-SoftAutoCommitTest.testSoftAndHardCommitMaxTimeMixedAdds-seed#[670C956621E1A8C8])
[    x:collection1] o.a.s.u.p.LogUpdateProcessorFactory [collection1]  webapp=null path=null
params={}{add=[530 (1549369167653634048)]} 0 2
   [junit4]   2> 17596 INFO  (commitScheduler-19-thread-1) [    x:collection1] o.a.s.u.DirectUpdateHandler2
start commit{,optimize=false,openSearcher=true,waitSearcher=true,expungeDeletes=false,softCommit=true,prepareCommit=false}
   [junit4]   2> 17604 INFO  (commitScheduler-19-thread-1) [    x:collection1] o.a.s.s.SolrIndexSearcher
Opening [Searcher@8bd0aae[collection1] main]
   [junit4]   2> 17604 INFO  (commitScheduler-19-thread-1) [    x:collection1] o.a.s.u.DirectUpdateHandler2
end_commit_flush
   [junit4]   2> 17605 INFO  (searcherExecutor-16-thread-1-processing-x:collection1) [
   x:collection1] o.a.s.c.SolrCore [collection1] Registered new searcher Searcher@8bd0aae[collection1]
main{ExitableDirectoryReader(UninvertingDirectoryReader(Uninverting(_0(6.3.0):c5) Uninverting(_1(6.3.0):c1)
Uninverting(_2(6.3.0):c1)))}
   [junit4]   2> 17735 INFO  (commitScheduler-18-thread-1) [    x:collection1] o.a.s.u.DirectUpdateHandler2
start commit{,optimize=false,openSearcher=true,waitSearcher=true,expungeDeletes=false,softCommit=false,prepareCommit=false}
   [junit4]   2> 17735 INFO  (commitScheduler-18-thread-1) [    x:collection1] o.a.s.u.SolrIndexWriter
Calling setCommitData with IW:org.apache.solr.update.SolrIndexWriter@3dd51259
   [junit4]   2> 17739 INFO  (commitScheduler-18-thread-1) [    x:collection1] o.a.s.s.SolrIndexSearcher
Opening [Searcher@1fa32e7c[collection1] main]
   [junit4]   2> 17740 INFO  (searcherExecutor-16-thread-1-processing-x:collection1) [
   x:collection1] o.a.s.c.SolrCore [collection1] Registered new searcher Searcher@1fa32e7c[collection1]
main{ExitableDirectoryReader(UninvertingDirectoryReader(Uninverting(_0(6.3.0):c5) Uninverting(_1(6.3.0):c1)
Uninverting(_2(6.3.0):c1)))}
   [junit4]   2> 17741 INFO  (commitScheduler-18-thread-1) [    x:collection1] o.a.s.u.DirectUpdateHandler2
end_commit_flush
   [junit4]   2> 20945 INFO  (TEST-SoftAutoCommitTest.testSoftAndHardCommitMaxTimeMixedAdds-seed#[670C956621E1A8C8])
[    x:collection1] o.a.s.SolrTestCaseJ4 ###Ending testSoftAndHardCommitMaxTimeMixedAdds
   [junit4]   2> 20955 INFO  (TEST-SoftAutoCommitTest.testSoftAndHardCommitMaxTimeDelete-seed#[670C956621E1A8C8])
[    x:collection1] o.a.s.SolrTestCaseJ4 ###Starting testSoftAndHardCommitMaxTimeDelete
   [junit4]   2> 20957 INFO  (TEST-SoftAutoCommitTest.testSoftAndHardCommitMaxTimeDelete-seed#[670C956621E1A8C8])
[    x:collection1] o.a.s.c.SolrResourceLoader [null] Added 2 libs to classloader, from paths:
[/Users/jenkins/workspace/Lucene-Solr-6.x-MacOSX/solr/core/src/test-files/solr/collection1/lib,
/Users/jenkins/workspace/Lucene-Solr-6.x-MacOSX/solr/core/src/test-files/solr/collection1/lib/classes]
   [junit4]   2> 21033 WARN  (TEST-SoftAutoCommitTest.testSoftAndHardCommitMaxTimeDelete-seed#[670C956621E1A8C8])
[    x:collection1] o.a.s.c.Config Beginning with Solr 5.5, <mergePolicy> is deprecated,
use <mergePolicyFactory> instead.
   [junit4]   2> 21034 INFO  (TEST-SoftAutoCommitTest.testSoftAndHardCommitMaxTimeDelete-seed#[670C956621E1A8C8])
[    x:collection1] o.a.s.c.SolrConfig Using Lucene MatchVersion: 6.3.0
   [junit4]   2> 21089 INFO  (TEST-SoftAutoCommitTest.testSoftAndHardCommitMaxTimeDelete-seed#[670C956621E1A8C8])
[    x:collection1] o.a.s.s.IndexSchema [collection1] Schema name=test
   [junit4]   2> 21214 WARN  (TEST-SoftAutoCommitTest.testSoftAndHardCommitMaxTimeDelete-seed#[670C956621E1A8C8])
[    x:collection1] o.a.s.s.IndexSchema [collection1] default search field in schema is text.
WARNING: Deprecated, please use 'df' on request instead.
   [junit4]   2> 21217 INFO  (TEST-SoftAutoCommitTest.testSoftAndHardCommitMaxTimeDelete-seed#[670C956621E1A8C8])
[    x:collection1] o.a.s.s.IndexSchema Loaded schema test/1.0 with uniqueid field id
   [junit4]   2> 21248 INFO  (TEST-SoftAutoCommitTest.testSoftAndHardCommitMaxTimeDelete-seed#[670C956621E1A8C8])
[    x:collection1] o.a.s.c.CoreContainer Reloading SolrCore 'collection1' using configuration
from instancedir /Users/jenkins/workspace/Lucene-Solr-6.x-MacOSX/solr/core/src/test-files/solr/collection1
   [junit4]   2> 21249 INFO  (TEST-SoftAutoCommitTest.testSoftAndHardCommitMaxTimeDelete-seed#[670C956621E1A8C8])
[    x:collection1] o.a.s.c.SolrCore [[collection1] ] Opening new SolrCore at [/Users/jenkins/workspace/Lucene-Solr-6.x-MacOSX/solr/core/src/test-files/solr/collection1],
dataDir=[/Users/jenkins/workspace/Lucene-Solr-6.x-MacOSX/solr/build/solr-core/test/J0/temp/solr.update.SoftAutoCommitTest_670C956621E1A8C8-001/init-core-data-001/]
   [junit4]   2> 21293 INFO  (TEST-SoftAutoCommitTest.testSoftAndHardCommitMaxTimeDelete-seed#[670C956621E1A8C8])
[    x:collection1] o.a.s.u.CommitTracker Hard AutoCommit: disabled
   [junit4]   2> 21293 INFO  (TEST-SoftAutoCommitTest.testSoftAndHardCommitMaxTimeDelete-seed#[670C956621E1A8C8])
[    x:collection1] o.a.s.u.CommitTracker Soft AutoCommit: disabled
   [junit4]   2> 21295 INFO  (TEST-SoftAutoCommitTest.testSoftAndHardCommitMaxTimeDelete-seed#[670C956621E1A8C8])
[    x:collection1] o.a.s.s.SolrIndexSearcher Opening [Searcher@329bb47e[collection1] main]
   [junit4]   2> 21296 INFO  (TEST-SoftAutoCommitTest.testSoftAndHardCommitMaxTimeDelete-seed#[670C956621E1A8C8])
[    x:collection1] o.a.s.h.c.SpellCheckComponent Initializing spell checkers
   [junit4]   2> 21300 INFO  (TEST-SoftAutoCommitTest.testSoftAndHardCommitMaxTimeDelete-seed#[670C956621E1A8C8])
[    x:collection1] o.a.s.s.DirectSolrSpellChecker init: {name=direct,classname=DirectSolrSpellChecker,field=lowerfilt,minQueryLength=3}
   [junit4]   2> 21310 INFO  (TEST-SoftAutoCommitTest.testSoftAndHardCommitMaxTimeDelete-seed#[670C956621E1A8C8])
[    x:collection1] o.a.s.h.ReplicationHandler Commits will be reserved for  10000
   [junit4]   2> 21310 INFO  (searcherExecutor-20-thread-1-processing-x:collection1) [
   x:collection1] o.a.s.h.c.SpellCheckComponent Loading spell index for spellchecker: default
   [junit4]   2> 21316 INFO  (searcherExecutor-20-thread-1-processing-x:collection1) [
   x:collection1] o.a.s.h.c.SpellCheckComponent Loading spell index for spellchecker: direct
   [junit4]   2> 21316 INFO  (searcherExecutor-20-thread-1-processing-x:collection1) [
   x:collection1] o.a.s.h.c.SpellCheckComponent Loading spell index for spellchecker: wordbreak
   [junit4]   2> 21316 INFO  (searcherExecutor-20-thread-1-processing-x:collection1) [
   x:collection1] o.a.s.h.c.SpellCheckComponent Loading spell index for spellchecker: multipleFields
   [junit4]   2> 21317 INFO  (searcherExecutor-20-thread-1-processing-x:collection1) [
   x:collection1] o.a.s.h.c.SpellCheckComponent Loading spell index for spellchecker: jarowinkler
   [junit4]   2> 21318 INFO  (searcherExecutor-20-thread-1-processing-x:collection1) [
   x:collection1] o.a.s.h.c.SpellCheckComponent Loading spell index for spellchecker: external
   [junit4]   2> 21320 INFO  (searcherExecutor-20-thread-1-processing-x:collection1) [
   x:collection1] o.a.s.h.c.SpellCheckComponent Loading spell index for spellchecker: freq
   [junit4]   2> 21322 INFO  (searcherExecutor-20-thread-1-processing-x:collection1) [
   x:collection1] o.a.s.h.c.SpellCheckComponent Loading spell index for spellchecker: fqcn
   [junit4]   2> 21324 INFO  (searcherExecutor-20-thread-1-processing-x:collection1) [
   x:collection1] o.a.s.h.c.SpellCheckComponent Loading spell index for spellchecker: perDict
   [junit4]   2> 21324 INFO  (searcherExecutor-20-thread-1-processing-x:collection1) [
   x:collection1] o.a.s.c.SolrCore [collection1] Registered new searcher Searcher@329bb47e[collection1]
main{ExitableDirectoryReader(UninvertingDirectoryReader(Uninverting(_0(6.3.0):c5) Uninverting(_1(6.3.0):c1)
Uninverting(_2(6.3.0):c1)))}
   [junit4]   2> 21352 INFO  (TEST-SoftAutoCommitTest.testSoftAndHardCommitMaxTimeDelete-seed#[670C956621E1A8C8])
[    x:collection1] o.a.s.u.RandomMergePolicy RandomMergePolicy wrapping class org.apache.lucene.index.TieredMergePolicy:
[TieredMergePolicy: maxMergeAtOnce=10, maxMergeAtOnceExplicit=20, maxMergedSegmentMB=49.2734375,
floorSegmentMB=1.1494140625, forceMergeDeletesPctAllowed=27.25278289004712, segmentsPerTier=12.0,
maxCFSSegmentSizeMB=8.796093022207999E12, noCFSRatio=1.0
   [junit4]   2> 21356 INFO  (TEST-SoftAutoCommitTest.testSoftAndHardCommitMaxTimeDelete-seed#[670C956621E1A8C8])
[    x:collection1] o.a.s.u.DefaultSolrCoreState New IndexWriter is ready to be used.
   [junit4]   2> 21364 INFO  (TEST-SoftAutoCommitTest.testSoftAndHardCommitMaxTimeDelete-seed#[670C956621E1A8C8])
[    x:collection1] o.a.s.s.SolrIndexSearcher Opening [Searcher@58a159aa[collection1] main]
   [junit4]   2> 21365 INFO  (TEST-SoftAutoCommitTest.testSoftAndHardCommitMaxTimeDelete-seed#[670C956621E1A8C8])
[    x:collection1] o.a.s.c.SolrCore [collection1]  CLOSING SolrCore org.apache.solr.core.SolrCore@2ec7d5fc
   [junit4]   2> 21365 INFO  (searcherExecutor-20-thread-1-processing-x:collection1) [
   x:collection1] o.a.s.c.SolrCore [collection1] Registered new searcher Searcher@58a159aa[collection1]
main{ExitableDirectoryReader(UninvertingDirectoryReader(Uninverting(_0(6.3.0):c5) Uninverting(_1(6.3.0):c1)
Uninverting(_2(6.3.0):c1)))}
   [junit4]   2> 21375 INFO  (TEST-SoftAutoCommitTest.testSoftAndHardCommitMaxTimeDelete-seed#[670C956621E1A8C8])
[    x:collection1] o.a.s.u.p.LogUpdateProcessorFactory [collection1]  webapp=null path=null
params={}{add=[529 (1549369172147830784)]} 0 5
   [junit4]   2> 21376 INFO  (TEST-SoftAutoCommitTest.testSoftAndHardCommitMaxTimeDelete-seed#[670C956621E1A8C8])
[    x:collection1] o.a.s.u.DirectUpdateHandler2 start commit{,optimize=false,openSearcher=true,waitSearcher=true,expungeDeletes=false,softCommit=false,prepareCommit=false}
   [junit4]   2> 21376 INFO  (TEST-SoftAutoCommitTest.testSoftAndHardCommitMaxTimeDelete-seed#[670C956621E1A8C8])
[    x:collection1] o.a.s.u.SolrIndexWriter Calling setCommitData with IW:org.apache.solr.update.SolrIndexWriter@6a06cdc1
   [junit4]   2> 21394 INFO  (TEST-SoftAutoCommitTest.testSoftAndHardCommitMaxTimeDelete-seed#[670C956621E1A8C8])
[    x:collection1] o.a.s.s.SolrIndexSearcher Opening [Searcher@cc1cb3c[collection1] main]
   [junit4]   2> 21395 INFO  (TEST-SoftAutoCommitTest.testSoftAndHardCommitMaxTimeDelete-seed#[670C956621E1A8C8])
[    x:collection1] o.a.s.u.DirectUpdateHandler2 end_commit_flush
   [junit4]   2> 21395 INFO  (searcherExecutor-20-thread-1-processing-x:collection1) [
   x:collection1] o.a.s.c.SolrCore [collection1] Registered new searcher Searcher@cc1cb3c[collection1]
main{ExitableDirectoryReader(UninvertingDirectoryReader(Uninverting(_0(6.3.0):c5) Uninverting(_2(6.3.0):c1)
Uninverting(_3(6.3.0):c1)))}
   [junit4]   2> 21397 INFO  (TEST-SoftAutoCommitTest.testSoftAndHardCommitMaxTimeDelete-seed#[670C956621E1A8C8])
[    x:collection1] o.a.s.u.p.LogUpdateProcessorFactory [collection1]  webapp=null path=null
params={}{commit=} 0 21
   [junit4]   2> 21402 INFO  (TEST-SoftAutoCommitTest.testSoftAndHardCommitMaxTimeDelete-seed#[670C956621E1A8C8])
[    x:collection1] o.a.s.u.p.LogUpdateProcessorFactory [collection1]  webapp=null path=null
params={}{delete=[529 (-1549369172179288064)]} 0 2
   [junit4]   2> 21905 INFO  (commitScheduler-23-thread-1) [    x:collection1] o.a.s.u.DirectUpdateHandler2
start commit{,optimize=false,openSearcher=true,waitSearcher=true,expungeDeletes=false,softCommit=true,prepareCommit=false}
   [junit4]   2> 21912 INFO  (commitScheduler-23-thread-1) [    x:collection1] o.a.s.s.SolrIndexSearcher
Opening [Searcher@1bfcecf8[collection1] main]
   [junit4]   2> 21913 INFO  (searcherExecutor-20-thread-1-processing-x:collection1) [
   x:collection1] o.a.s.c.SolrCore [collection1] Registered new searcher Searcher@1bfcecf8[collection1]
main{ExitableDirectoryReader(UninvertingDirectoryReader(Uninverting(_0(6.3.0):c5) Uninverting(_2(6.3.0):c1)))}
   [junit4]   2> 21913 INFO  (commitScheduler-23-thread-1) [    x:collection1] o.a.s.u.DirectUpdateHandler2
end_commit_flush
   [junit4]   2> 21919 INFO  (TEST-SoftAutoCommitTest.testSoftAndHardCommitMaxTimeDelete-seed#[670C956621E1A8C8])
[    x:collection1] o.a.s.u.p.LogUpdateProcessorFactory [collection1]  webapp=null path=null
params={}{add=[550 (1549369172719304704)]} 0 5
   [junit4]   2> 22422 INFO  (commitScheduler-23-thread-1) [    x:collection1] o.a.s.u.DirectUpdateHandler2
start commit{,optimize=false,openSearcher=true,waitSearcher=true,expungeDeletes=false,softCommit=true,prepareCommit=false}
   [junit4]   2> 22439 INFO  (commitScheduler-23-thread-1) [    x:collection1] o.a.s.s.SolrIndexSearcher
Opening [Searcher@11572493[collection1] main]
   [junit4]   2> 22440 INFO  (commitScheduler-23-thread-1) [    x:collection1] o.a.s.u.DirectUpdateHandler2
end_commit_flush
   [junit4]   2> 22440 INFO  (searcherExecutor-20-thread-1-processing-x:collection1) [
   x:collection1] o.a.s.c.SolrCore [collection1] Registered new searcher Searcher@11572493[collection1]
main{ExitableDirectoryReader(UninvertingDirectoryReader(Uninverting(_0(6.3.0):c5) Uninverting(_2(6.3.0):c1)
Uninverting(_4(6.3.0):c1)))}
   [junit4]   2> 22611 INFO  (commitScheduler-22-thread-1) [    x:collection1] o.a.s.u.DirectUpdateHandler2
start commit{,optimize=false,openSearcher=true,waitSearcher=true,expungeDeletes=false,softCommit=false,prepareCommit=false}
   [junit4]   2> 22612 INFO  (commitScheduler-22-thread-1) [    x:collection1] o.a.s.u.SolrIndexWriter
Calling setCommitData with IW:org.apache.solr.update.SolrIndexWriter@6a06cdc1
   [junit4]   2> 22615 INFO  (commitScheduler-22-thread-1) [    x:collection1] o.a.s.s.SolrIndexSearcher
Opening [Searcher@5fa4f2b[collection1] main]
   [junit4]   2> 22616 INFO  (searcherExecutor-20-thread-1-processing-x:collection1) [
   x:collection1] o.a.s.c.SolrCore [collection1] Registered new searcher Searcher@5fa4f2b[collection1]
main{ExitableDirectoryReader(UninvertingDirectoryReader(Uninverting(_0(6.3.0):c5) Uninverting(_2(6.3.0):c1)
Uninverting(_4(6.3.0):c1)))}
   [junit4]   2> 22616 INFO  (commitScheduler-22-thread-1) [    x:collection1] o.a.s.u.DirectUpdateHandler2
end_commit_flush
   [junit4]   2> 24624 INFO  (TEST-SoftAutoCommitTest.testSoftAndHardCommitMaxTimeDelete-seed#[670C956621E1A8C8])
[    x:collection1] o.a.s.SolrTestCaseJ4 ###Ending testSoftAndHardCommitMaxTimeDelete
   [junit4]   2> 24624 INFO  (SUITE-SoftAutoCommitTest-seed#[670C956621E1A8C8]-worker)
[    x:collection1] o.a.s.SolrTestCaseJ4 ###deleteCore
   [junit4]   2> 24625 INFO  (SUITE-SoftAutoCommitTest-seed#[670C956621E1A8C8]-worker)
[    x:collection1] o.a.s.c.CoreContainer Shutting down CoreContainer instance=79351458
   [junit4]   2> 24627 INFO  (coreCloseExecutor-24-thread-1-processing-x:collection1) [
   x:collection1] o.a.s.c.SolrCore [collection1]  CLOSING SolrCore org.apache.solr.core.SolrCore@16e7408b
   [junit4]   2> NOTE: leaving temporary files on disk at: /Users/jenkins/workspace/Lucene-Solr-6.x-MacOSX/solr/build/solr-core/test/J0/temp/solr.update.SoftAutoCommitTest_670C956621E1A8C8-001
   [junit4]   2> NOTE: test params are: codec=CheapBastard, sim=ClassicSimilarity, locale=vi-VN,
timezone=Pacific/Honolulu
   [junit4]   2> NOTE: Mac OS X 10.11.6 x86_64/Oracle Corporation 1.8.0_102 (64-bit)/cpus=3,threads=1,free=16892576,total=54788096
   [junit4]   2> NOTE: All tests run in this JVM: [SoftAutoCommitTest]
   [junit4] Completed [2/646 (1!)] on J0 in 28.18s, 3 tests, 1 failure <<< FAILURES!

[...truncated 62473 lines...]


Mime
View raw message