lucene-dev mailing list archives

Site index · List index
Message view « Date » · « Thread »
Top « Date » · « Thread »
From Policeman Jenkins Server <jenk...@thetaphi.de>
Subject [JENKINS] Lucene-Solr-6.x-Linux (32bit/jdk1.8.0_102) - Build # 2060 - Unstable!
Date Fri, 28 Oct 2016 18:57:58 GMT
Build: https://jenkins.thetaphi.de/job/Lucene-Solr-6.x-Linux/2060/
Java: 32bit/jdk1.8.0_102 -server -XX:+UseConcMarkSweepGC

1 tests failed.
FAILED:  org.apache.solr.cloud.ShardSplitTest.testSplitAfterFailedSplit

Error Message:
expected:<1> but was:<2>

Stack Trace:
java.lang.AssertionError: expected:<1> but was:<2>
	at __randomizedtesting.SeedInfo.seed([A78F4599CC12AA00:5EC2D636F067E78A]:0)
	at org.junit.Assert.fail(Assert.java:93)
	at org.junit.Assert.failNotEquals(Assert.java:647)
	at org.junit.Assert.assertEquals(Assert.java:128)
	at org.junit.Assert.assertEquals(Assert.java:472)
	at org.junit.Assert.assertEquals(Assert.java:456)
	at org.apache.solr.cloud.ShardSplitTest.testSplitAfterFailedSplit(ShardSplitTest.java:284)
	at sun.reflect.NativeMethodAccessorImpl.invoke0(Native Method)
	at sun.reflect.NativeMethodAccessorImpl.invoke(NativeMethodAccessorImpl.java:62)
	at sun.reflect.DelegatingMethodAccessorImpl.invoke(DelegatingMethodAccessorImpl.java:43)
	at java.lang.reflect.Method.invoke(Method.java:498)
	at com.carrotsearch.randomizedtesting.RandomizedRunner.invoke(RandomizedRunner.java:1713)
	at com.carrotsearch.randomizedtesting.RandomizedRunner$8.evaluate(RandomizedRunner.java:907)
	at com.carrotsearch.randomizedtesting.RandomizedRunner$9.evaluate(RandomizedRunner.java:943)
	at com.carrotsearch.randomizedtesting.RandomizedRunner$10.evaluate(RandomizedRunner.java:957)
	at org.apache.solr.BaseDistributedSearchTestCase$ShardsRepeatRule$ShardsFixedStatement.callStatement(BaseDistributedSearchTestCase.java:992)
	at org.apache.solr.BaseDistributedSearchTestCase$ShardsRepeatRule$ShardsStatement.evaluate(BaseDistributedSearchTestCase.java:967)
	at com.carrotsearch.randomizedtesting.rules.SystemPropertiesRestoreRule$1.evaluate(SystemPropertiesRestoreRule.java:57)
	at org.apache.lucene.util.TestRuleSetupTeardownChained$1.evaluate(TestRuleSetupTeardownChained.java:49)
	at org.apache.lucene.util.AbstractBeforeAfterRule$1.evaluate(AbstractBeforeAfterRule.java:45)
	at org.apache.lucene.util.TestRuleThreadAndTestName$1.evaluate(TestRuleThreadAndTestName.java:48)
	at org.apache.lucene.util.TestRuleIgnoreAfterMaxFailures$1.evaluate(TestRuleIgnoreAfterMaxFailures.java:64)
	at org.apache.lucene.util.TestRuleMarkFailure$1.evaluate(TestRuleMarkFailure.java:47)
	at com.carrotsearch.randomizedtesting.rules.StatementAdapter.evaluate(StatementAdapter.java:36)
	at com.carrotsearch.randomizedtesting.ThreadLeakControl$StatementRunner.run(ThreadLeakControl.java:367)
	at com.carrotsearch.randomizedtesting.ThreadLeakControl.forkTimeoutingTask(ThreadLeakControl.java:811)
	at com.carrotsearch.randomizedtesting.ThreadLeakControl$3.evaluate(ThreadLeakControl.java:462)
	at com.carrotsearch.randomizedtesting.RandomizedRunner.runSingleTest(RandomizedRunner.java:916)
	at com.carrotsearch.randomizedtesting.RandomizedRunner$5.evaluate(RandomizedRunner.java:802)
	at com.carrotsearch.randomizedtesting.RandomizedRunner$6.evaluate(RandomizedRunner.java:852)
	at com.carrotsearch.randomizedtesting.RandomizedRunner$7.evaluate(RandomizedRunner.java:863)
	at com.carrotsearch.randomizedtesting.rules.StatementAdapter.evaluate(StatementAdapter.java:36)
	at com.carrotsearch.randomizedtesting.rules.SystemPropertiesRestoreRule$1.evaluate(SystemPropertiesRestoreRule.java:57)
	at org.apache.lucene.util.AbstractBeforeAfterRule$1.evaluate(AbstractBeforeAfterRule.java:45)
	at com.carrotsearch.randomizedtesting.rules.StatementAdapter.evaluate(StatementAdapter.java:36)
	at org.apache.lucene.util.TestRuleStoreClassName$1.evaluate(TestRuleStoreClassName.java:41)
	at com.carrotsearch.randomizedtesting.rules.NoShadowingOrOverridesOnMethodsRule$1.evaluate(NoShadowingOrOverridesOnMethodsRule.java:40)
	at com.carrotsearch.randomizedtesting.rules.NoShadowingOrOverridesOnMethodsRule$1.evaluate(NoShadowingOrOverridesOnMethodsRule.java:40)
	at com.carrotsearch.randomizedtesting.rules.StatementAdapter.evaluate(StatementAdapter.java:36)
	at com.carrotsearch.randomizedtesting.rules.StatementAdapter.evaluate(StatementAdapter.java:36)
	at com.carrotsearch.randomizedtesting.rules.StatementAdapter.evaluate(StatementAdapter.java:36)
	at org.apache.lucene.util.TestRuleAssertionsRequired$1.evaluate(TestRuleAssertionsRequired.java:53)
	at org.apache.lucene.util.TestRuleMarkFailure$1.evaluate(TestRuleMarkFailure.java:47)
	at org.apache.lucene.util.TestRuleIgnoreAfterMaxFailures$1.evaluate(TestRuleIgnoreAfterMaxFailures.java:64)
	at org.apache.lucene.util.TestRuleIgnoreTestSuites$1.evaluate(TestRuleIgnoreTestSuites.java:54)
	at com.carrotsearch.randomizedtesting.rules.StatementAdapter.evaluate(StatementAdapter.java:36)
	at com.carrotsearch.randomizedtesting.ThreadLeakControl$StatementRunner.run(ThreadLeakControl.java:367)
	at java.lang.Thread.run(Thread.java:745)




Build Log:
[...truncated 11927 lines...]
   [junit4] Suite: org.apache.solr.cloud.ShardSplitTest
   [junit4]   2> Creating dataDir: /home/jenkins/workspace/Lucene-Solr-6.x-Linux/solr/build/solr-core/test/J2/temp/solr.cloud.ShardSplitTest_A78F4599CC12AA00-001/init-core-data-001
   [junit4]   2> 993958 INFO  (SUITE-ShardSplitTest-seed#[A78F4599CC12AA00]-worker) [    ] o.a.s.SolrTestCaseJ4 Randomized ssl (false) and clientAuth (false) via: @org.apache.solr.SolrTestCaseJ4$SuppressSSL(bugUrl=https://issues.apache.org/jira/browse/SOLR-5776)
   [junit4]   2> 993958 INFO  (SUITE-ShardSplitTest-seed#[A78F4599CC12AA00]-worker) [    ] o.a.s.BaseDistributedSearchTestCase Setting hostContext system property: /ak/
   [junit4]   2> 993960 INFO  (TEST-ShardSplitTest.test-seed#[A78F4599CC12AA00]) [    ] o.a.s.c.ZkTestServer STARTING ZK TEST SERVER
   [junit4]   2> 993960 INFO  (Thread-1810) [    ] o.a.s.c.ZkTestServer client port:0.0.0.0/0.0.0.0:0
   [junit4]   2> 993960 INFO  (Thread-1810) [    ] o.a.s.c.ZkTestServer Starting server
   [junit4]   2> 994060 INFO  (TEST-ShardSplitTest.test-seed#[A78F4599CC12AA00]) [    ] o.a.s.c.ZkTestServer start zk server on port:46495
   [junit4]   2> 994066 INFO  (TEST-ShardSplitTest.test-seed#[A78F4599CC12AA00]) [    ] o.a.s.c.AbstractZkTestCase put /home/jenkins/workspace/Lucene-Solr-6.x-Linux/solr/core/src/test-files/solr/collection1/conf/solrconfig-tlog.xml to /configs/conf1/solrconfig.xml
   [junit4]   2> 994066 INFO  (TEST-ShardSplitTest.test-seed#[A78F4599CC12AA00]) [    ] o.a.s.c.AbstractZkTestCase put /home/jenkins/workspace/Lucene-Solr-6.x-Linux/solr/core/src/test-files/solr/collection1/conf/schema15.xml to /configs/conf1/schema.xml
   [junit4]   2> 994067 INFO  (TEST-ShardSplitTest.test-seed#[A78F4599CC12AA00]) [    ] o.a.s.c.AbstractZkTestCase put /home/jenkins/workspace/Lucene-Solr-6.x-Linux/solr/core/src/test-files/solr/collection1/conf/solrconfig.snippet.randomindexconfig.xml to /configs/conf1/solrconfig.snippet.randomindexconfig.xml
   [junit4]   2> 994067 INFO  (TEST-ShardSplitTest.test-seed#[A78F4599CC12AA00]) [    ] o.a.s.c.AbstractZkTestCase put /home/jenkins/workspace/Lucene-Solr-6.x-Linux/solr/core/src/test-files/solr/collection1/conf/stopwords.txt to /configs/conf1/stopwords.txt
   [junit4]   2> 994068 INFO  (TEST-ShardSplitTest.test-seed#[A78F4599CC12AA00]) [    ] o.a.s.c.AbstractZkTestCase put /home/jenkins/workspace/Lucene-Solr-6.x-Linux/solr/core/src/test-files/solr/collection1/conf/protwords.txt to /configs/conf1/protwords.txt
   [junit4]   2> 994068 INFO  (TEST-ShardSplitTest.test-seed#[A78F4599CC12AA00]) [    ] o.a.s.c.AbstractZkTestCase put /home/jenkins/workspace/Lucene-Solr-6.x-Linux/solr/core/src/test-files/solr/collection1/conf/currency.xml to /configs/conf1/currency.xml
   [junit4]   2> 994069 INFO  (TEST-ShardSplitTest.test-seed#[A78F4599CC12AA00]) [    ] o.a.s.c.AbstractZkTestCase put /home/jenkins/workspace/Lucene-Solr-6.x-Linux/solr/core/src/test-files/solr/collection1/conf/enumsConfig.xml to /configs/conf1/enumsConfig.xml
   [junit4]   2> 994069 INFO  (TEST-ShardSplitTest.test-seed#[A78F4599CC12AA00]) [    ] o.a.s.c.AbstractZkTestCase put /home/jenkins/workspace/Lucene-Solr-6.x-Linux/solr/core/src/test-files/solr/collection1/conf/open-exchange-rates.json to /configs/conf1/open-exchange-rates.json
   [junit4]   2> 994070 INFO  (TEST-ShardSplitTest.test-seed#[A78F4599CC12AA00]) [    ] o.a.s.c.AbstractZkTestCase put /home/jenkins/workspace/Lucene-Solr-6.x-Linux/solr/core/src/test-files/solr/collection1/conf/mapping-ISOLatin1Accent.txt to /configs/conf1/mapping-ISOLatin1Accent.txt
   [junit4]   2> 994071 INFO  (TEST-ShardSplitTest.test-seed#[A78F4599CC12AA00]) [    ] o.a.s.c.AbstractZkTestCase put /home/jenkins/workspace/Lucene-Solr-6.x-Linux/solr/core/src/test-files/solr/collection1/conf/old_synonyms.txt to /configs/conf1/old_synonyms.txt
   [junit4]   2> 994071 INFO  (TEST-ShardSplitTest.test-seed#[A78F4599CC12AA00]) [    ] o.a.s.c.AbstractZkTestCase put /home/jenkins/workspace/Lucene-Solr-6.x-Linux/solr/core/src/test-files/solr/collection1/conf/synonyms.txt to /configs/conf1/synonyms.txt
   [junit4]   2> 994133 INFO  (TEST-ShardSplitTest.test-seed#[A78F4599CC12AA00]) [    ] o.a.s.SolrTestCaseJ4 Writing core.properties file to /home/jenkins/workspace/Lucene-Solr-6.x-Linux/solr/build/solr-core/test/J2/temp/solr.cloud.ShardSplitTest_A78F4599CC12AA00-001/control-001/cores/collection1
   [junit4]   2> 994134 INFO  (TEST-ShardSplitTest.test-seed#[A78F4599CC12AA00]) [    ] o.e.j.s.Server jetty-9.3.8.v20160314
   [junit4]   2> 994134 INFO  (TEST-ShardSplitTest.test-seed#[A78F4599CC12AA00]) [    ] o.e.j.s.h.ContextHandler Started o.e.j.s.ServletContextHandler@ad18ec{/ak,null,AVAILABLE}
   [junit4]   2> 994137 INFO  (TEST-ShardSplitTest.test-seed#[A78F4599CC12AA00]) [    ] o.e.j.s.ServerConnector Started ServerConnector@172b84b{HTTP/1.1,[http/1.1]}{127.0.0.1:33307}
   [junit4]   2> 994137 INFO  (TEST-ShardSplitTest.test-seed#[A78F4599CC12AA00]) [    ] o.e.j.s.Server Started @995787ms
   [junit4]   2> 994137 INFO  (TEST-ShardSplitTest.test-seed#[A78F4599CC12AA00]) [    ] o.a.s.c.s.e.JettySolrRunner Jetty properties: {solr.data.dir=/home/jenkins/workspace/Lucene-Solr-6.x-Linux/solr/build/solr-core/test/J2/temp/solr.cloud.ShardSplitTest_A78F4599CC12AA00-001/tempDir-001/control/data, hostContext=/ak, hostPort=33307, coreRootDirectory=/home/jenkins/workspace/Lucene-Solr-6.x-Linux/solr/build/solr-core/test/J2/temp/solr.cloud.ShardSplitTest_A78F4599CC12AA00-001/control-001/cores}
   [junit4]   2> 994137 ERROR (TEST-ShardSplitTest.test-seed#[A78F4599CC12AA00]) [    ] o.a.s.s.StartupLoggingUtils Missing Java Option solr.log.dir. Logging may be missing or incomplete.
   [junit4]   2> 994137 INFO  (TEST-ShardSplitTest.test-seed#[A78F4599CC12AA00]) [    ] o.a.s.s.SolrDispatchFilter  ___      _       Welcome to Apache Solr? version 6.3.0
   [junit4]   2> 994137 INFO  (TEST-ShardSplitTest.test-seed#[A78F4599CC12AA00]) [    ] o.a.s.s.SolrDispatchFilter / __| ___| |_ _   Starting in cloud mode on port null
   [junit4]   2> 994137 INFO  (TEST-ShardSplitTest.test-seed#[A78F4599CC12AA00]) [    ] o.a.s.s.SolrDispatchFilter \__ \/ _ \ | '_|  Install dir: null
   [junit4]   2> 994137 INFO  (TEST-ShardSplitTest.test-seed#[A78F4599CC12AA00]) [    ] o.a.s.s.SolrDispatchFilter |___/\___/_|_|    Start time: 2016-10-28T18:33:41.342Z
   [junit4]   2> 994139 INFO  (TEST-ShardSplitTest.test-seed#[A78F4599CC12AA00]) [    ] o.a.s.s.SolrDispatchFilter Loading solr.xml from SolrHome (not found in ZooKeeper)
   [junit4]   2> 994139 INFO  (TEST-ShardSplitTest.test-seed#[A78F4599CC12AA00]) [    ] o.a.s.c.SolrXmlConfig Loading container configuration from /home/jenkins/workspace/Lucene-Solr-6.x-Linux/solr/build/solr-core/test/J2/temp/solr.cloud.ShardSplitTest_A78F4599CC12AA00-001/control-001/solr.xml
   [junit4]   2> 994143 INFO  (TEST-ShardSplitTest.test-seed#[A78F4599CC12AA00]) [    ] o.a.s.u.UpdateShardHandler Creating UpdateShardHandler HTTP client with params: socketTimeout=340000&connTimeout=45000&retry=true
   [junit4]   2> 994143 INFO  (TEST-ShardSplitTest.test-seed#[A78F4599CC12AA00]) [    ] o.a.s.c.ZkContainer Zookeeper client=127.0.0.1:46495/solr
   [junit4]   2> 994152 INFO  (TEST-ShardSplitTest.test-seed#[A78F4599CC12AA00]) [n:127.0.0.1:33307_ak    ] o.a.s.c.OverseerElectionContext I am going to be the leader 127.0.0.1:33307_ak
   [junit4]   2> 994152 INFO  (TEST-ShardSplitTest.test-seed#[A78F4599CC12AA00]) [n:127.0.0.1:33307_ak    ] o.a.s.c.Overseer Overseer (id=96841211652734980-127.0.0.1:33307_ak-n_0000000000) starting
   [junit4]   2> 994154 INFO  (TEST-ShardSplitTest.test-seed#[A78F4599CC12AA00]) [n:127.0.0.1:33307_ak    ] o.a.s.c.ZkController Register node as live in ZooKeeper:/live_nodes/127.0.0.1:33307_ak
   [junit4]   2> 994155 INFO  (zkCallback-19447-thread-1-processing-n:127.0.0.1:33307_ak) [n:127.0.0.1:33307_ak    ] o.a.s.c.c.ZkStateReader Updated live nodes from ZooKeeper... (0) -> (1)
   [junit4]   2> 994175 INFO  (TEST-ShardSplitTest.test-seed#[A78F4599CC12AA00]) [n:127.0.0.1:33307_ak    ] o.a.s.c.CorePropertiesLocator Found 1 core definitions underneath /home/jenkins/workspace/Lucene-Solr-6.x-Linux/solr/build/solr-core/test/J2/temp/solr.cloud.ShardSplitTest_A78F4599CC12AA00-001/control-001/cores
   [junit4]   2> 994175 INFO  (TEST-ShardSplitTest.test-seed#[A78F4599CC12AA00]) [n:127.0.0.1:33307_ak    ] o.a.s.c.CorePropertiesLocator Cores are: [collection1]
   [junit4]   2> 994176 INFO  (OverseerStateUpdate-96841211652734980-127.0.0.1:33307_ak-n_0000000000) [n:127.0.0.1:33307_ak    ] o.a.s.c.o.ReplicaMutator Assigning new node to shard shard=shard1
   [junit4]   2> 995183 WARN  (coreLoadExecutor-7354-thread-1-processing-n:127.0.0.1:33307_ak) [n:127.0.0.1:33307_ak c:control_collection   x:collection1] o.a.s.c.Config Beginning with Solr 5.5, <mergePolicy> is deprecated, use <mergePolicyFactory> instead.
   [junit4]   2> 995183 INFO  (coreLoadExecutor-7354-thread-1-processing-n:127.0.0.1:33307_ak) [n:127.0.0.1:33307_ak c:control_collection   x:collection1] o.a.s.c.SolrConfig Using Lucene MatchVersion: 6.3.0
   [junit4]   2> 995197 INFO  (coreLoadExecutor-7354-thread-1-processing-n:127.0.0.1:33307_ak) [n:127.0.0.1:33307_ak c:control_collection   x:collection1] o.a.s.s.IndexSchema [collection1] Schema name=test
   [junit4]   2> 995240 WARN  (coreLoadExecutor-7354-thread-1-processing-n:127.0.0.1:33307_ak) [n:127.0.0.1:33307_ak c:control_collection   x:collection1] o.a.s.s.IndexSchema [collection1] default search field in schema is text. WARNING: Deprecated, please use 'df' on request instead.
   [junit4]   2> 995241 INFO  (coreLoadExecutor-7354-thread-1-processing-n:127.0.0.1:33307_ak) [n:127.0.0.1:33307_ak c:control_collection   x:collection1] o.a.s.s.IndexSchema Loaded schema test/1.6 with uniqueid field id
   [junit4]   2> 995248 INFO  (coreLoadExecutor-7354-thread-1-processing-n:127.0.0.1:33307_ak) [n:127.0.0.1:33307_ak c:control_collection   x:collection1] o.a.s.c.CoreContainer Creating SolrCore 'collection1' using configuration from collection control_collection
   [junit4]   2> 995248 INFO  (coreLoadExecutor-7354-thread-1-processing-n:127.0.0.1:33307_ak) [n:127.0.0.1:33307_ak c:control_collection s:shard1 r:core_node1 x:collection1] o.a.s.c.SolrCore [[collection1] ] Opening new SolrCore at [/home/jenkins/workspace/Lucene-Solr-6.x-Linux/solr/build/solr-core/test/J2/temp/solr.cloud.ShardSplitTest_A78F4599CC12AA00-001/control-001/cores/collection1], dataDir=[/home/jenkins/workspace/Lucene-Solr-6.x-Linux/solr/build/solr-core/test/J2/temp/solr.cloud.ShardSplitTest_A78F4599CC12AA00-001/control-001/cores/collection1/data/]
   [junit4]   2> 995248 INFO  (coreLoadExecutor-7354-thread-1-processing-n:127.0.0.1:33307_ak) [n:127.0.0.1:33307_ak c:control_collection s:shard1 r:core_node1 x:collection1] o.a.s.c.JmxMonitoredMap JMX monitoring is enabled. Adding Solr mbeans to JMX Server: com.sun.jmx.mbeanserver.JmxMBeanServer@3a923c
   [junit4]   2> 995249 INFO  (coreLoadExecutor-7354-thread-1-processing-n:127.0.0.1:33307_ak) [n:127.0.0.1:33307_ak c:control_collection s:shard1 r:core_node1 x:collection1] o.a.s.u.RandomMergePolicy RandomMergePolicy wrapping class org.apache.lucene.index.TieredMergePolicy: [TieredMergePolicy: maxMergeAtOnce=41, maxMergeAtOnceExplicit=17, maxMergedSegmentMB=44.576171875, floorSegmentMB=1.4130859375, forceMergeDeletesPctAllowed=16.73235720453438, segmentsPerTier=34.0, maxCFSSegmentSizeMB=8.796093022207999E12, noCFSRatio=0.5113851967143659
   [junit4]   2> 995276 WARN  (coreLoadExecutor-7354-thread-1-processing-n:127.0.0.1:33307_ak) [n:127.0.0.1:33307_ak c:control_collection s:shard1 r:core_node1 x:collection1] o.a.s.c.RequestHandlers INVALID paramSet a in requestHandler {type = requestHandler,name = /dump,class = DumpRequestHandler,args = {defaults={a=A,b=B}}}
   [junit4]   2> 995281 INFO  (coreLoadExecutor-7354-thread-1-processing-n:127.0.0.1:33307_ak) [n:127.0.0.1:33307_ak c:control_collection s:shard1 r:core_node1 x:collection1] o.a.s.u.UpdateHandler Using UpdateLog implementation: org.apache.solr.update.UpdateLog
   [junit4]   2> 995281 INFO  (coreLoadExecutor-7354-thread-1-processing-n:127.0.0.1:33307_ak) [n:127.0.0.1:33307_ak c:control_collection s:shard1 r:core_node1 x:collection1] o.a.s.u.UpdateLog Initializing UpdateLog: dataDir= defaultSyncLevel=FLUSH numRecordsToKeep=100 maxNumLogsToKeep=10 numVersionBuckets=65536
   [junit4]   2> 995281 INFO  (coreLoadExecutor-7354-thread-1-processing-n:127.0.0.1:33307_ak) [n:127.0.0.1:33307_ak c:control_collection s:shard1 r:core_node1 x:collection1] o.a.s.u.CommitTracker Hard AutoCommit: disabled
   [junit4]   2> 995281 INFO  (coreLoadExecutor-7354-thread-1-processing-n:127.0.0.1:33307_ak) [n:127.0.0.1:33307_ak c:control_collection s:shard1 r:core_node1 x:collection1] o.a.s.u.CommitTracker Soft AutoCommit: disabled
   [junit4]   2> 995282 INFO  (coreLoadExecutor-7354-thread-1-processing-n:127.0.0.1:33307_ak) [n:127.0.0.1:33307_ak c:control_collection s:shard1 r:core_node1 x:collection1] o.a.s.u.RandomMergePolicy RandomMergePolicy wrapping class org.apache.lucene.index.TieredMergePolicy: [TieredMergePolicy: maxMergeAtOnce=26, maxMergeAtOnceExplicit=38, maxMergedSegmentMB=90.8984375, floorSegmentMB=1.4189453125, forceMergeDeletesPctAllowed=19.07202341357811, segmentsPerTier=19.0, maxCFSSegmentSizeMB=8.796093022207999E12, noCFSRatio=0.5791185300775051
   [junit4]   2> 995282 INFO  (coreLoadExecutor-7354-thread-1-processing-n:127.0.0.1:33307_ak) [n:127.0.0.1:33307_ak c:control_collection s:shard1 r:core_node1 x:collection1] o.a.s.s.SolrIndexSearcher Opening [Searcher@1dff797[collection1] main]
   [junit4]   2> 995282 INFO  (coreLoadExecutor-7354-thread-1-processing-n:127.0.0.1:33307_ak) [n:127.0.0.1:33307_ak c:control_collection s:shard1 r:core_node1 x:collection1] o.a.s.r.ManagedResourceStorage Configured ZooKeeperStorageIO with znodeBase: /configs/conf1
   [junit4]   2> 995283 INFO  (coreLoadExecutor-7354-thread-1-processing-n:127.0.0.1:33307_ak) [n:127.0.0.1:33307_ak c:control_collection s:shard1 r:core_node1 x:collection1] o.a.s.r.ManagedResourceStorage Loaded null at path _rest_managed.json using ZooKeeperStorageIO:path=/configs/conf1
   [junit4]   2> 995283 INFO  (coreLoadExecutor-7354-thread-1-processing-n:127.0.0.1:33307_ak) [n:127.0.0.1:33307_ak c:control_collection s:shard1 r:core_node1 x:collection1] o.a.s.h.ReplicationHandler Commits will be reserved for  10000
   [junit4]   2> 995283 INFO  (searcherExecutor-7355-thread-1-processing-n:127.0.0.1:33307_ak x:collection1 s:shard1 c:control_collection r:core_node1) [n:127.0.0.1:33307_ak c:control_collection s:shard1 r:core_node1 x:collection1] o.a.s.c.SolrCore [collection1] Registered new searcher Searcher@1dff797[collection1] main{ExitableDirectoryReader(UninvertingDirectoryReader())}
   [junit4]   2> 995283 INFO  (coreLoadExecutor-7354-thread-1-processing-n:127.0.0.1:33307_ak) [n:127.0.0.1:33307_ak c:control_collection s:shard1 r:core_node1 x:collection1] o.a.s.u.UpdateLog Could not find max version in index or recent updates, using new clock 1549459387829977088
   [junit4]   2> 995287 INFO  (coreZkRegister-7347-thread-1-processing-n:127.0.0.1:33307_ak x:collection1 s:shard1 c:control_collection r:core_node1) [n:127.0.0.1:33307_ak c:control_collection s:shard1 r:core_node1 x:collection1] o.a.s.c.ShardLeaderElectionContext Enough replicas found to continue.
   [junit4]   2> 995287 INFO  (coreZkRegister-7347-thread-1-processing-n:127.0.0.1:33307_ak x:collection1 s:shard1 c:control_collection r:core_node1) [n:127.0.0.1:33307_ak c:control_collection s:shard1 r:core_node1 x:collection1] o.a.s.c.ShardLeaderElectionContext I may be the new leader - try and sync
   [junit4]   2> 995287 INFO  (coreZkRegister-7347-thread-1-processing-n:127.0.0.1:33307_ak x:collection1 s:shard1 c:control_collection r:core_node1) [n:127.0.0.1:33307_ak c:control_collection s:shard1 r:core_node1 x:collection1] o.a.s.c.SyncStrategy Sync replicas to http://127.0.0.1:33307/ak/collection1/
   [junit4]   2> 995287 INFO  (coreZkRegister-7347-thread-1-processing-n:127.0.0.1:33307_ak x:collection1 s:shard1 c:control_collection r:core_node1) [n:127.0.0.1:33307_ak c:control_collection s:shard1 r:core_node1 x:collection1] o.a.s.c.SyncStrategy Sync Success - now sync replicas to me
   [junit4]   2> 995287 INFO  (coreZkRegister-7347-thread-1-processing-n:127.0.0.1:33307_ak x:collection1 s:shard1 c:control_collection r:core_node1) [n:127.0.0.1:33307_ak c:control_collection s:shard1 r:core_node1 x:collection1] o.a.s.c.SyncStrategy http://127.0.0.1:33307/ak/collection1/ has no replicas
   [junit4]   2> 995289 INFO  (coreZkRegister-7347-thread-1-processing-n:127.0.0.1:33307_ak x:collection1 s:shard1 c:control_collection r:core_node1) [n:127.0.0.1:33307_ak c:control_collection s:shard1 r:core_node1 x:collection1] o.a.s.c.ShardLeaderElectionContext I am the new leader: http://127.0.0.1:33307/ak/collection1/ shard1
   [junit4]   2> 995439 INFO  (coreZkRegister-7347-thread-1-processing-n:127.0.0.1:33307_ak x:collection1 s:shard1 c:control_collection r:core_node1) [n:127.0.0.1:33307_ak c:control_collection s:shard1 r:core_node1 x:collection1] o.a.s.c.ZkController I am the leader, no recovery necessary
   [junit4]   2> 995678 INFO  (TEST-ShardSplitTest.test-seed#[A78F4599CC12AA00]) [    ] o.a.s.c.c.ZkStateReader Updated live nodes from ZooKeeper... (0) -> (1)
   [junit4]   2> 995678 INFO  (TEST-ShardSplitTest.test-seed#[A78F4599CC12AA00]) [    ] o.a.s.c.ChaosMonkey monkey: init - expire sessions:false cause connection loss:false
   [junit4]   2> 995678 INFO  (TEST-ShardSplitTest.test-seed#[A78F4599CC12AA00]) [    ] o.a.s.c.AbstractFullDistribZkTestBase Creating collection1 with stateFormat=2
   [junit4]   2> 995750 INFO  (TEST-ShardSplitTest.test-seed#[A78F4599CC12AA00]) [    ] o.a.s.SolrTestCaseJ4 Writing core.properties file to /home/jenkins/workspace/Lucene-Solr-6.x-Linux/solr/build/solr-core/test/J2/temp/solr.cloud.ShardSplitTest_A78F4599CC12AA00-001/shard-1-001/cores/collection1
   [junit4]   2> 995751 INFO  (TEST-ShardSplitTest.test-seed#[A78F4599CC12AA00]) [    ] o.a.s.c.AbstractFullDistribZkTestBase create jetty 1 in directory /home/jenkins/workspace/Lucene-Solr-6.x-Linux/solr/build/solr-core/test/J2/temp/solr.cloud.ShardSplitTest_A78F4599CC12AA00-001/shard-1-001
   [junit4]   2> 995751 INFO  (TEST-ShardSplitTest.test-seed#[A78F4599CC12AA00]) [    ] o.e.j.s.Server jetty-9.3.8.v20160314
   [junit4]   2> 995752 INFO  (TEST-ShardSplitTest.test-seed#[A78F4599CC12AA00]) [    ] o.e.j.s.h.ContextHandler Started o.e.j.s.ServletContextHandler@aa7f4a{/ak,null,AVAILABLE}
   [junit4]   2> 995753 INFO  (TEST-ShardSplitTest.test-seed#[A78F4599CC12AA00]) [    ] o.e.j.s.ServerConnector Started ServerConnector@1263d2a{HTTP/1.1,[http/1.1]}{127.0.0.1:42787}
   [junit4]   2> 995753 INFO  (TEST-ShardSplitTest.test-seed#[A78F4599CC12AA00]) [    ] o.e.j.s.Server Started @997404ms
   [junit4]   2> 995753 INFO  (TEST-ShardSplitTest.test-seed#[A78F4599CC12AA00]) [    ] o.a.s.c.s.e.JettySolrRunner Jetty properties: {solr.data.dir=/home/jenkins/workspace/Lucene-Solr-6.x-Linux/solr/build/solr-core/test/J2/temp/solr.cloud.ShardSplitTest_A78F4599CC12AA00-001/tempDir-001/jetty1, solrconfig=solrconfig.xml, hostContext=/ak, hostPort=42787, coreRootDirectory=/home/jenkins/workspace/Lucene-Solr-6.x-Linux/solr/build/solr-core/test/J2/temp/solr.cloud.ShardSplitTest_A78F4599CC12AA00-001/shard-1-001/cores}
   [junit4]   2> 995754 ERROR (TEST-ShardSplitTest.test-seed#[A78F4599CC12AA00]) [    ] o.a.s.s.StartupLoggingUtils Missing Java Option solr.log.dir. Logging may be missing or incomplete.
   [junit4]   2> 995754 INFO  (TEST-ShardSplitTest.test-seed#[A78F4599CC12AA00]) [    ] o.a.s.s.SolrDispatchFilter  ___      _       Welcome to Apache Solr? version 6.3.0
   [junit4]   2> 995754 INFO  (TEST-ShardSplitTest.test-seed#[A78F4599CC12AA00]) [    ] o.a.s.s.SolrDispatchFilter / __| ___| |_ _   Starting in cloud mode on port null
   [junit4]   2> 995754 INFO  (TEST-ShardSplitTest.test-seed#[A78F4599CC12AA00]) [    ] o.a.s.s.SolrDispatchFilter \__ \/ _ \ | '_|  Install dir: null
   [junit4]   2> 995754 INFO  (TEST-ShardSplitTest.test-seed#[A78F4599CC12AA00]) [    ] o.a.s.s.SolrDispatchFilter |___/\___/_|_|    Start time: 2016-10-28T18:33:42.959Z
   [junit4]   2> 995756 INFO  (TEST-ShardSplitTest.test-seed#[A78F4599CC12AA00]) [    ] o.a.s.s.SolrDispatchFilter Loading solr.xml from SolrHome (not found in ZooKeeper)
   [junit4]   2> 995756 INFO  (TEST-ShardSplitTest.test-seed#[A78F4599CC12AA00]) [    ] o.a.s.c.SolrXmlConfig Loading container configuration from /home/jenkins/workspace/Lucene-Solr-6.x-Linux/solr/build/solr-core/test/J2/temp/solr.cloud.ShardSplitTest_A78F4599CC12AA00-001/shard-1-001/solr.xml
   [junit4]   2> 995763 INFO  (TEST-ShardSplitTest.test-seed#[A78F4599CC12AA00]) [    ] o.a.s.u.UpdateShardHandler Creating UpdateShardHandler HTTP client with params: socketTimeout=340000&connTimeout=45000&retry=true
   [junit4]   2> 995764 INFO  (TEST-ShardSplitTest.test-seed#[A78F4599CC12AA00]) [    ] o.a.s.c.ZkContainer Zookeeper client=127.0.0.1:46495/solr
   [junit4]   2> 995770 INFO  (TEST-ShardSplitTest.test-seed#[A78F4599CC12AA00]) [n:127.0.0.1:42787_ak    ] o.a.s.c.c.ZkStateReader Updated live nodes from ZooKeeper... (0) -> (1)
   [junit4]   2> 995772 INFO  (TEST-ShardSplitTest.test-seed#[A78F4599CC12AA00]) [n:127.0.0.1:42787_ak    ] o.a.s.c.ZkController Register node as live in ZooKeeper:/live_nodes/127.0.0.1:42787_ak
   [junit4]   2> 995773 INFO  (zkCallback-19451-thread-1) [    ] o.a.s.c.c.ZkStateReader Updated live nodes from ZooKeeper... (1) -> (2)
   [junit4]   2> 995773 INFO  (zkCallback-19447-thread-1-processing-n:127.0.0.1:33307_ak) [n:127.0.0.1:33307_ak    ] o.a.s.c.c.ZkStateReader Updated live nodes from ZooKeeper... (1) -> (2)
   [junit4]   2> 995774 INFO  (zkCallback-19457-thread-1-processing-n:127.0.0.1:42787_ak) [n:127.0.0.1:42787_ak    ] o.a.s.c.c.ZkStateReader Updated live nodes from ZooKeeper... (1) -> (2)
   [junit4]   2> 995786 INFO  (TEST-ShardSplitTest.test-seed#[A78F4599CC12AA00]) [n:127.0.0.1:42787_ak    ] o.a.s.c.CorePropertiesLocator Found 1 core definitions underneath /home/jenkins/workspace/Lucene-Solr-6.x-Linux/solr/build/solr-core/test/J2/temp/solr.cloud.ShardSplitTest_A78F4599CC12AA00-001/shard-1-001/cores
   [junit4]   2> 995786 INFO  (TEST-ShardSplitTest.test-seed#[A78F4599CC12AA00]) [n:127.0.0.1:42787_ak    ] o.a.s.c.CorePropertiesLocator Cores are: [collection1]
   [junit4]   2> 995787 INFO  (OverseerStateUpdate-96841211652734980-127.0.0.1:33307_ak-n_0000000000) [n:127.0.0.1:33307_ak    ] o.a.s.c.o.ReplicaMutator Assigning new node to shard shard=shard2
   [junit4]   2> 995888 WARN  (OverseerStateUpdate-96841211652734980-127.0.0.1:33307_ak-n_0000000000) [n:127.0.0.1:33307_ak    ] o.a.s.c.Overseer Bad version writing to ZK using compare-and-set, will force refresh cluster state: KeeperErrorCode = BadVersion for /collections/collection1/state.json
   [junit4]   2> 995889 INFO  (zkCallback-19457-thread-1-processing-n:127.0.0.1:42787_ak) [n:127.0.0.1:42787_ak    ] o.a.s.c.c.ZkStateReader A cluster state change: [WatchedEvent state:SyncConnected type:NodeDataChanged path:/collections/collection1/state.json] for collection [collection1] has occurred - updating... (live nodes size: [2])
   [junit4]   2> 995889 INFO  (OverseerStateUpdate-96841211652734980-127.0.0.1:33307_ak-n_0000000000) [n:127.0.0.1:33307_ak    ] o.a.s.c.o.ReplicaMutator Assigning new node to shard shard=shard2
   [junit4]   2> 995890 INFO  (zkCallback-19457-thread-1-processing-n:127.0.0.1:42787_ak) [n:127.0.0.1:42787_ak    ] o.a.s.c.c.ZkStateReader A cluster state change: [WatchedEvent state:SyncConnected type:NodeDataChanged path:/collections/collection1/state.json] for collection [collection1] has occurred - updating... (live nodes size: [2])
   [junit4]   2> 996793 WARN  (coreLoadExecutor-7365-thread-1-processing-n:127.0.0.1:42787_ak) [n:127.0.0.1:42787_ak c:collection1   x:collection1] o.a.s.c.Config Beginning with Solr 5.5, <mergePolicy> is deprecated, use <mergePolicyFactory> instead.
   [junit4]   2> 996793 INFO  (coreLoadExecutor-7365-thread-1-processing-n:127.0.0.1:42787_ak) [n:127.0.0.1:42787_ak c:collection1   x:collection1] o.a.s.c.SolrConfig Using Lucene MatchVersion: 6.3.0
   [junit4]   2> 996802 INFO  (coreLoadExecutor-7365-thread-1-processing-n:127.0.0.1:42787_ak) [n:127.0.0.1:42787_ak c:collection1   x:collection1] o.a.s.s.IndexSchema [collection1] Schema name=test
   [junit4]   2> 996850 WARN  (coreLoadExecutor-7365-thread-1-processing-n:127.0.0.1:42787_ak) [n:127.0.0.1:42787_ak c:collection1   x:collection1] o.a.s.s.IndexSchema [collection1] default search field in schema is text. WARNING: Deprecated, please use 'df' on request instead.
   [junit4]   2> 996851 INFO  (coreLoadExecutor-7365-thread-1-processing-n:127.0.0.1:42787_ak) [n:127.0.0.1:42787_ak c:collection1   x:collection1] o.a.s.s.IndexSchema Loaded schema test/1.6 with uniqueid field id
   [junit4]   2> 996860 INFO  (coreLoadExecutor-7365-thread-1-processing-n:127.0.0.1:42787_ak) [n:127.0.0.1:42787_ak c:collection1   x:collection1] o.a.s.c.CoreContainer Creating SolrCore 'collection1' using configuration from collection collection1
   [junit4]   2> 996861 INFO  (coreLoadExecutor-7365-thread-1-processing-n:127.0.0.1:42787_ak) [n:127.0.0.1:42787_ak c:collection1 s:shard2 r:core_node1 x:collection1] o.a.s.c.SolrCore [[collection1] ] Opening new SolrCore at [/home/jenkins/workspace/Lucene-Solr-6.x-Linux/solr/build/solr-core/test/J2/temp/solr.cloud.ShardSplitTest_A78F4599CC12AA00-001/shard-1-001/cores/collection1], dataDir=[/home/jenkins/workspace/Lucene-Solr-6.x-Linux/solr/build/solr-core/test/J2/temp/solr.cloud.ShardSplitTest_A78F4599CC12AA00-001/shard-1-001/cores/collection1/data/]
   [junit4]   2> 996861 INFO  (coreLoadExecutor-7365-thread-1-processing-n:127.0.0.1:42787_ak) [n:127.0.0.1:42787_ak c:collection1 s:shard2 r:core_node1 x:collection1] o.a.s.c.JmxMonitoredMap JMX monitoring is enabled. Adding Solr mbeans to JMX Server: com.sun.jmx.mbeanserver.JmxMBeanServer@3a923c
   [junit4]   2> 996863 INFO  (coreLoadExecutor-7365-thread-1-processing-n:127.0.0.1:42787_ak) [n:127.0.0.1:42787_ak c:collection1 s:shard2 r:core_node1 x:collection1] o.a.s.u.RandomMergePolicy RandomMergePolicy wrapping class org.apache.lucene.index.TieredMergePolicy: [TieredMergePolicy: maxMergeAtOnce=41, maxMergeAtOnceExplicit=17, maxMergedSegmentMB=44.576171875, floorSegmentMB=1.4130859375, forceMergeDeletesPctAllowed=16.73235720453438, segmentsPerTier=34.0, maxCFSSegmentSizeMB=8.796093022207999E12, noCFSRatio=0.5113851967143659
   [junit4]   2> 996890 WARN  (coreLoadExecutor-7365-thread-1-processing-n:127.0.0.1:42787_ak) [n:127.0.0.1:42787_ak c:collection1 s:shard2 r:core_node1 x:collection1] o.a.s.c.RequestHandlers INVALID paramSet a in requestHandler {type = requestHandler,name = /dump,class = DumpRequestHandler,args = {defaults={a=A,b=B}}}
   [junit4]   2> 996896 INFO  (coreLoadExecutor-7365-thread-1-processing-n:127.0.0.1:42787_ak) [n:127.0.0.1:42787_ak c:collection1 s:shard2 r:core_node1 x:collection1] o.a.s.u.UpdateHandler Using UpdateLog implementation: org.apache.solr.update.UpdateLog
   [junit4]   2> 996896 INFO  (coreLoadExecutor-7365-thread-1-processing-n:127.0.0.1:42787_ak) [n:127.0.0.1:42787_ak c:collection1 s:shard2 r:core_node1 x:collection1] o.a.s.u.UpdateLog Initializing UpdateLog: dataDir= defaultSyncLevel=FLUSH numRecordsToKeep=100 maxNumLogsToKeep=10 numVersionBuckets=65536
   [junit4]   2> 996897 INFO  (coreLoadExecutor-7365-thread-1-processing-n:127.0.0.1:42787_ak) [n:127.0.0.1:42787_ak c:collection1 s:shard2 r:core_node1 x:collection1] o.a.s.u.CommitTracker Hard AutoCommit: disabled
   [junit4]   2> 996897 INFO  (coreLoadExecutor-7365-thread-1-processing-n:127.0.0.1:42787_ak) [n:127.0.0.1:42787_ak c:collection1 s:shard2 r:core_node1 x:collection1] o.a.s.u.CommitTracker Soft AutoCommit: disabled
   [junit4]   2> 996897 INFO  (coreLoadExecutor-7365-thread-1-processing-n:127.0.0.1:42787_ak) [n:127.0.0.1:42787_ak c:collection1 s:shard2 r:core_node1 x:collection1] o.a.s.u.RandomMergePolicy RandomMergePolicy wrapping class org.apache.lucene.index.TieredMergePolicy: [TieredMergePolicy: maxMergeAtOnce=26, maxMergeAtOnceExplicit=38, maxMergedSegmentMB=90.8984375, floorSegmentMB=1.4189453125, forceMergeDeletesPctAllowed=19.07202341357811, segmentsPerTier=19.0, maxCFSSegmentSizeMB=8.796093022207999E12, noCFSRatio=0.5791185300775051
   [junit4]   2> 996897 INFO  (coreLoadExecutor-7365-thread-1-processing-n:127.0.0.1:42787_ak) [n:127.0.0.1:42787_ak c:collection1 s:shard2 r:core_node1 x:collection1] o.a.s.s.SolrIndexSearcher Opening [Searcher@1342385[collection1] main]
   [junit4]   2> 996898 INFO  (coreLoadExecutor-7365-thread-1-processing-n:127.0.0.1:42787_ak) [n:127.0.0.1:42787_ak c:collection1 s:shard2 r:core_node1 x:collection1] o.a.s.r.ManagedResourceStorage Configured ZooKeeperStorageIO with znodeBase: /configs/conf1
   [junit4]   2> 996898 INFO  (coreLoadExecutor-7365-thread-1-processing-n:127.0.0.1:42787_ak) [n:127.0.0.1:42787_ak c:collection1 s:shard2 r:core_node1 x:collection1] o.a.s.r.ManagedResourceStorage Loaded null at path _rest_managed.json using ZooKeeperStorageIO:path=/configs/conf1
   [junit4]   2> 996898 INFO  (coreLoadExecutor-7365-thread-1-processing-n:127.0.0.1:42787_ak) [n:127.0.0.1:42787_ak c:collection1 s:shard2 r:core_node1 x:collection1] o.a.s.h.ReplicationHandler Commits will be reserved for  10000
   [junit4]   2> 996899 INFO  (searcherExecutor-7366-thread-1-processing-n:127.0.0.1:42787_ak x:collection1 s:shard2 c:collection1 r:core_node1) [n:127.0.0.1:42787_ak c:collection1 s:shard2 r:core_node1 x:collection1] o.a.s.c.SolrCore [collection1] Registered new searcher Searcher@1342385[collection1] main{ExitableDirectoryReader(UninvertingDirectoryReader())}
   [junit4]   2> 996899 INFO  (coreLoadExecutor-7365-thread-1-processing-n:127.0.0.1:42787_ak) [n:127.0.0.1:42787_ak c:collection1 s:shard2 r:core_node1 x:collection1] o.a.s.u.UpdateLog Could not find max version in index or recent updates, using new clock 1549459389524475904
   [junit4]   2> 996902 INFO  (coreZkRegister-7360-thread-1-processing-n:127.0.0.1:42787_ak x:collection1 s:shard2 c:collection1 r:core_node1) [n:127.0.0.1:42787_ak c:collection1 s:shard2 r:core_node1 x:collection1] o.a.s.c.ShardLeaderElectionContext Enough replicas found to continue.
   [junit4]   2> 996902 INFO  (coreZkRegister-7360-thread-1-processing-n:127.0.0.1:42787_ak x:collection1 s:shard2 c:collection1 r:core_node1) [n:127.0.0.1:42787_ak c:collection1 s:shard2 r:core_node1 x:collection1] o.a.s.c.ShardLeaderElectionContext I may be the new leader - try and sync
   [junit4]   2> 996902 INFO  (coreZkRegister-7360-thread-1-processing-n:127.0.0.1:42787_ak x:collection1 s:shard2 c:collection1 r:core_node1) [n:127.0.0.1:42787_ak c:collection1 s:shard2 r:core_node1 x:collection1] o.a.s.c.SyncStrategy Sync replicas to http://127.0.0.1:42787/ak/collection1/
   [junit4]   2> 996902 INFO  (coreZkRegister-7360-thread-1-processing-n:127.0.0.1:42787_ak x:collection1 s:shard2 c:collection1 r:core_node1) [n:127.0.0.1:42787_ak c:collection1 s:shard2 r:core_node1 x:collection1] o.a.s.c.SyncStrategy Sync Success - now sync replicas to me
   [junit4]   2> 996903 INFO  (coreZkRegister-7360-thread-1-processing-n:127.0.0.1:42787_ak x:collection1 s:shard2 c:collection1 r:core_node1) [n:127.0.0.1:42787_ak c:collection1 s:shard2 r:core_node1 x:collection1] o.a.s.c.SyncStrategy http://127.0.0.1:42787/ak/collection1/ has no replicas
   [junit4]   2> 996904 INFO  (coreZkRegister-7360-thread-1-processing-n:127.0.0.1:42787_ak x:collection1 s:shard2 c:collection1 r:core_node1) [n:127.0.0.1:42787_ak c:collection1 s:shard2 r:core_node1 x:collection1] o.a.s.c.ShardLeaderElectionContext I am the new leader: http://127.0.0.1:42787/ak/collection1/ shard2
   [junit4]   2> 997005 INFO  (zkCallback-19457-thread-1-processing-n:127.0.0.1:42787_ak) [n:127.0.0.1:42787_ak    ] o.a.s.c.c.ZkStateReader A cluster state change: [WatchedEvent state:SyncConnected type:NodeDataChanged path:/collections/collection1/state.json] for collection [collection1] has occurred - updating... (live nodes size: [2])
   [junit4]   2> 997054 INFO  (coreZkRegister-7360-thread-1-processing-n:127.0.0.1:42787_ak x:collection1 s:shard2 c:collection1 r:core_node1) [n:127.0.0.1:42787_ak c:collection1 s:shard2 r:core_node1 x:collection1] o.a.s.c.ZkController I am the leader, no recovery necessary
   [junit4]   2> 997156 INFO  (zkCallback-19457-thread-1-processing-n:127.0.0.1:42787_ak) [n:127.0.0.1:42787_ak    ] o.a.s.c.c.ZkStateReader A cluster state change: [WatchedEvent state:SyncConnected type:NodeDataChanged path:/collections/collection1/state.json] for collection [collection1] has occurred - updating... (live nodes size: [2])
   [junit4]   2> 997373 INFO  (TEST-ShardSplitTest.test-seed#[A78F4599CC12AA00]) [    ] o.a.s.SolrTestCaseJ4 Writing core.properties file to /home/jenkins/workspace/Lucene-Solr-6.x-Linux/solr/build/solr-core/test/J2/temp/solr.cloud.ShardSplitTest_A78F4599CC12AA00-001/shard-2-001/cores/collection1
   [junit4]   2> 997374 INFO  (TEST-ShardSplitTest.test-seed#[A78F4599CC12AA00]) [    ] o.a.s.c.AbstractFullDistribZkTestBase create jetty 2 in directory /home/jenkins/workspace/Lucene-Solr-6.x-Linux/solr/build/solr-core/test/J2/temp/solr.cloud.ShardSplitTest_A78F4599CC12AA00-001/shard-2-001
   [junit4]   2> 997374 INFO  (TEST-ShardSplitTest.test-seed#[A78F4599CC12AA00]) [    ] o.e.j.s.Server jetty-9.3.8.v20160314
   [junit4]   2> 997375 INFO  (TEST-ShardSplitTest.test-seed#[A78F4599CC12AA00]) [    ] o.e.j.s.h.ContextHandler Started o.e.j.s.ServletContextHandler@39ebc8{/ak,null,AVAILABLE}
   [junit4]   2> 997375 INFO  (TEST-ShardSplitTest.test-seed#[A78F4599CC12AA00]) [    ] o.e.j.s.ServerConnector Started ServerConnector@75c1f2{HTTP/1.1,[http/1.1]}{127.0.0.1:35783}
   [junit4]   2> 997375 INFO  (TEST-ShardSplitTest.test-seed#[A78F4599CC12AA00]) [    ] o.e.j.s.Server Started @999026ms
   [junit4]   2> 997375 INFO  (TEST-ShardSplitTest.test-seed#[A78F4599CC12AA00]) [    ] o.a.s.c.s.e.JettySolrRunner Jetty properties: {solr.data.dir=/home/jenkins/workspace/Lucene-Solr-6.x-Linux/solr/build/solr-core/test/J2/temp/solr.cloud.ShardSplitTest_A78F4599CC12AA00-001/tempDir-001/jetty2, solrconfig=solrconfig.xml, hostContext=/ak, hostPort=35783, coreRootDirectory=/home/jenkins/workspace/Lucene-Solr-6.x-Linux/solr/build/solr-core/test/J2/../../../../../../../../../home/jenkins/workspace/Lucene-Solr-6.x-Linux/solr/build/solr-core/test/J2/temp/solr.cloud.ShardSplitTest_A78F4599CC12AA00-001/shard-2-001/cores}
   [junit4]   2> 997375 ERROR (TEST-ShardSplitTest.test-seed#[A78F4599CC12AA00]) [    ] o.a.s.s.StartupLoggingUtils Missing Java Option solr.log.dir. Logging may be missing or incomplete.
   [junit4]   2> 997376 INFO  (TEST-ShardSplitTest.test-seed#[A78F4599CC12AA00]) [    ] o.a.s.s.SolrDispatchFilter  ___      _       Welcome to Apache Solr? version 6.3.0
   [junit4]   2> 997376 INFO  (TEST-ShardSplitTest.test-seed#[A78F4599CC12AA00]) [    ] o.a.s.s.SolrDispatchFilter / __| ___| |_ _   Starting in cloud mode on port null
   [junit4]   2> 997376 INFO  (TEST-ShardSplitTest.test-seed#[A78F4599CC12AA00]) [    ] o.a.s.s.SolrDispatchFilter \__ \/ _ \ | '_|  Install dir: null
   [junit4]   2> 997376 INFO  (TEST-ShardSplitTest.test-seed#[A78F4599CC12AA00]) [    ] o.a.s.s.SolrDispatchFilter |___/\___/_|_|    Start time: 2016-10-28T18:33:44.581Z
   [junit4]   2> 997378 INFO  (TEST-ShardSplitTest.test-seed#[A78F4599CC12AA00]) [    ] o.a.s.s.SolrDispatchFilter Loading solr.xml from SolrHome (not found in ZooKeeper)
   [junit4]   2> 997378 INFO  (TEST-ShardSplitTest.test-seed#[A78F4599CC12AA00]) [    ] o.a.s.c.SolrXmlConfig Loading container configuration from /home/jenkins/workspace/Lucene-Solr-6.x-Linux/solr/build/solr-core/test/J2/temp/solr.cloud.ShardSplitTest_A78F4599CC12AA00-001/shard-2-001/solr.xml
   [junit4]   2> 997382 INFO  (TEST-ShardSplitTest.test-seed#[A78F4599CC12AA00]) [    ] o.a.s.u.UpdateShardHandler Creating UpdateShardHandler HTTP client with params: socketTimeout=340000&connTimeout=45000&retry=true
   [junit4]   2> 997382 INFO  (TEST-ShardSplitTest.test-seed#[A78F4599CC12AA00]) [    ] o.a.s.c.ZkContainer Zookeeper client=127.0.0.1:46495/solr
   [junit4]   2> 997388 INFO  (TEST-ShardSplitTest.test-seed#[A78F4599CC12AA00]) [n:127.0.0.1:35783_ak    ] o.a.s.c.c.ZkStateReader Updated live nodes from ZooKeeper... (0) -> (2)
   [junit4]   2> 997389 INFO  (TEST-ShardSplitTest.test-seed#[A78F4599CC12AA00]) [n:127.0.0.1:35783_ak    ] o.a.s.c.ZkController Register node as live in ZooKeeper:/live_nodes/127.0.0.1:35783_ak
   [junit4]   2> 997390 INFO  (zkCallback-19447-thread-2-processing-n:127.0.0.1:33307_ak) [n:127.0.0.1:33307_ak    ] o.a.s.c.c.ZkStateReader Updated live nodes from ZooKeeper... (2) -> (3)
   [junit4]   2> 997390 INFO  (zkCallback-19457-thread-1-processing-n:127.0.0.1:42787_ak) [n:127.0.0.1:42787_ak    ] o.a.s.c.c.ZkStateReader Updated live nodes from ZooKeeper... (2) -> (3)
   [junit4]   2> 997390 INFO  (zkCallback-19451-thread-1) [    ] o.a.s.c.c.ZkStateReader Updated live nodes from ZooKeeper... (2) -> (3)
   [junit4]   2> 997390 INFO  (zkCallback-19463-thread-1-processing-n:127.0.0.1:35783_ak) [n:127.0.0.1:35783_ak    ] o.a.s.c.c.ZkStateReader Updated live nodes from ZooKeeper... (2) -> (3)
   [junit4]   2> 997415 INFO  (TEST-ShardSplitTest.test-seed#[A78F4599CC12AA00]) [n:127.0.0.1:35783_ak    ] o.a.s.c.CorePropertiesLocator Found 1 core definitions underneath /home/jenkins/workspace/Lucene-Solr-6.x-Linux/solr/build/solr-core/test/J2/../../../../../../../../../home/jenkins/workspace/Lucene-Solr-6.x-Linux/solr/build/solr-core/test/J2/temp/solr.cloud.ShardSplitTest_A78F4599CC12AA00-001/shard-2-001/cores
   [junit4]   2> 997415 INFO  (TEST-ShardSplitTest.test-seed#[A78F4599CC12AA00]) [n:127.0.0.1:35783_ak    ] o.a.s.c.CorePropertiesLocator Cores are: [collection1]
   [junit4]   2> 997416 INFO  (OverseerStateUpdate-96841211652734980-127.0.0.1:33307_ak-n_0000000000) [n:127.0.0.1:33307_ak    ] o.a.s.c.o.ReplicaMutator Assigning new node to shard shard=shard1
   [junit4]   2> 997518 INFO  (zkCallback-19457-thread-1-processing-n:127.0.0.1:42787_ak) [n:127.0.0.1:42787_ak    ] o.a.s.c.c.ZkStateReader A cluster state change: [WatchedEvent state:SyncConnected type:NodeDataChanged path:/collections/collection1/state.json] for collection [collection1] has occurred - updating... (live nodes size: [3])
   [junit4]   2> 997518 INFO  (zkCallback-19463-thread-1-processing-n:127.0.0.1:35783_ak) [n:127.0.0.1:35783_ak    ] o.a.s.c.c.ZkStateReader A cluster state change: [WatchedEvent state:SyncConnected type:NodeDataChanged path:/collections/collection1/state.json] for collection [collection1] has occurred - updating... (live nodes size: [3])
   [junit4]   2> 998422 WARN  (coreLoadExecutor-7376-thread-1-processing-n:127.0.0.1:35783_ak) [n:127.0.0.1:35783_ak c:collection1   x:collection1] o.a.s.c.Config Beginning with Solr 5.5, <mergePolicy> is deprecated, use <mergePolicyFactory> instead.
   [junit4]   2> 998423 INFO  (coreLoadExecutor-7376-thread-1-processing-n:127.0.0.1:35783_ak) [n:127.0.0.1:35783_ak c:collection1   x:collection1] o.a.s.c.SolrConfig Using Lucene MatchVersion: 6.3.0
   [junit4]   2> 998432 INFO  (coreLoadExecutor-7376-thread-1-processing-n:127.0.0.1:35783_ak) [n:127.0.0.1:35783_ak c:collection1   x:collection1] o.a.s.s.IndexSchema [collection1] Schema name=test
   [junit4]   2> 998488 WARN  (coreLoadExecutor-7376-thread-1-processing-n:127.0.0.1:35783_ak) [n:127.0.0.1:35783_ak c:collection1   x:collection1] o.a.s.s.IndexSchema [collection1] default search field in schema is text. WARNING: Deprecated, please use 'df' on request instead.
   [junit4]   2> 998489 INFO  (coreLoadExecutor-7376-thread-1-processing-n:127.0.0.1:35783_ak) [n:127.0.0.1:35783_ak c:collection1   x:collection1] o.a.s.s.IndexSchema Loaded schema test/1.6 with uniqueid field id
   [junit4]   2> 998497 INFO  (coreLoadExecutor-7376-thread-1-processing-n:127.0.0.1:35783_ak) [n:127.0.0.1:35783_ak c:collection1   x:collection1] o.a.s.c.CoreContainer Creating SolrCore 'collection1' using configuration from collection collection1
   [junit4]   2> 998497 INFO  (coreLoadExecutor-7376-thread-1-processing-n:127.0.0.1:35783_ak) [n:127.0.0.1:35783_ak c:collection1 s:shard1 r:core_node2 x:collection1] o.a.s.c.SolrCore [[collection1] ] Opening new SolrCore at [/home/jenkins/workspace/Lucene-Solr-6.x-Linux/solr/build/solr-core/test/J2/temp/solr.cloud.ShardSplitTest_A78F4599CC12AA00-001/shard-2-001/cores/collection1], dataDir=[/home/jenkins/workspace/Lucene-Solr-6.x-Linux/solr/build/solr-core/test/J2/../../../../../../../../../home/jenkins/workspace/Lucene-Solr-6.x-Linux/solr/build/solr-core/test/J2/temp/solr.cloud.ShardSplitTest_A78F4599CC12AA00-001/shard-2-001/cores/collection1/data/]
   [junit4]   2> 998497 INFO  (coreLoadExecutor-7376-thread-1-processing-n:127.0.0.1:35783_ak) [n:127.0.0.1:35783_ak c:collection1 s:shard1 r:core_node2 x:collection1] o.a.s.c.JmxMonitoredMap JMX monitoring is enabled. Adding Solr mbeans to JMX Server: com.sun.jmx.mbeanserver.JmxMBeanServer@3a923c
   [junit4]   2> 998499 INFO  (coreLoadExecutor-7376-thread-1-processing-n:127.0.0.1:35783_ak) [n:127.0.0.1:35783_ak c:collection1 s:shard1 r:core_node2 x:collection1] o.a.s.u.RandomMergePolicy RandomMergePolicy wrapping class org.apache.lucene.index.TieredMergePolicy: [TieredMergePolicy: maxMergeAtOnce=41, maxMergeAtOnceExplicit=17, maxMergedSegmentMB=44.576171875, floorSegmentMB=1.4130859375, forceMergeDeletesPctAllowed=16.73235720453438, segmentsPerTier=34.0, maxCFSSegmentSizeMB=8.796093022207999E12, noCFSRatio=0.5113851967143659
   [junit4]   2> 998531 WARN  (coreLoadExecutor-7376-thread-1-processing-n:127.0.0.1:35783_ak) [n:127.0.0.1:35783_ak c:collection1 s:shard1 r:core_node2 x:collection1] o.a.s.c.RequestHandlers INVALID paramSet a in requestHandler {type = requestHandler,name = /dump,class = DumpRequestHandler,args = {defaults={a=A,b=B}}}
   [junit4]   2> 998538 INFO  (coreLoadExecutor-7376-thread-1-processing-n:127.0.0.1:35783_ak) [n:127.0.0.1:35783_ak c:collection1 s:shard1 r:core_node2 x:collection1] o.a.s.u.UpdateHandler Using UpdateLog implementation: org.apache.solr.update.UpdateLog
   [junit4]   2> 998538 INFO  (coreLoadExecutor-7376-thread-1-processing-n:127.0.0.1:35783_ak) [n:127.0.0.1:35783_ak c:collection1 s:shard1 r:core_node2 x:collection1] o.a.s.u.UpdateLog Initializing UpdateLog: dataDir= defaultSyncLevel=FLUSH numRecordsToKeep=100 maxNumLogsToKeep=10 numVersionBuckets=65536
   [junit4]   2> 998539 INFO  (coreLoadExecutor-7376-thread-1-processing-n:127.0.0.1:35783_ak) [n:127.0.0.1:35783_ak c:collection1 s:shard1 r:core_node2 x:collection1] o.a.s.u.CommitTracker Hard AutoCommit: disabled
   [junit4]   2> 998539 INFO  (coreLoadExecutor-7376-thread-1-processing-n:127.0.0.1:35783_ak) [n:127.0.0.1:35783_ak c:collection1 s:shard1 r:core_node2 x:collection1] o.a.s.u.CommitTracker Soft AutoCommit: disabled
   [junit4]   2> 998540 INFO  (coreLoadExecutor-7376-thread-1-processing-n:127.0.0.1:35783_ak) [n:127.0.0.1:35783_ak c:collection1 s:shard1 r:core_node2 x:collection1] o.a.s.u.RandomMergePolicy RandomMergePolicy wrapping class org.apache.lucene.index.TieredMergePolicy: [TieredMergePolicy: maxMergeAtOnce=26, maxMergeAtOnceExplicit=38, maxMergedSegmentMB=90.8984375, floorSegmentMB=1.4189453125, forceMergeDeletesPctAllowed=19.07202341357811, segmentsPerTier=19.0, maxCFSSegmentSizeMB=8.796093022207999E12, noCFSRatio=0.5791185300775051
   [junit4]   2> 998540 INFO  (coreLoadExecutor-7376-thread-1-processing-n:127.0.0.1:35783_ak) [n:127.0.0.1:35783_ak c:collection1 s:shard1 r:core_node2 x:collection1] o.a.s.s.SolrIndexSearcher Opening [Searcher@1e71753[collection1] main]
   [junit4]   2> 998541 INFO  (coreLoadExecutor-7376-thread-1-processing-n:127.0.0.1:35783_ak) [n:127.0.0.1:35783_ak c:collection1 s:shard1 r:core_node2 x:collection1] o.a.s.r.ManagedResourceStorage Configured ZooKeeperStorageIO with znodeBase: /configs/conf1
   [junit4]   2> 998541 INFO  (coreLoadExecutor-7376-thread-1-processing-n:127.0.0.1:35783_ak) [n:127.0.0.1:35783_ak c:collection1 s:shard1 r:core_node2 x:collection1] o.a.s.r.ManagedResourceStorage Loaded null at path _rest_managed.json using ZooKeeperStorageIO:path=/configs/conf1
   [junit4]   2> 998541 INFO  (coreLoadExecutor-7376-thread-1-processing-n:127.0.0.1:35783_ak) [n:127.0.0.1:35783_ak c:collection1 s:shard1 r:core_node2 x:collection1] o.a.s.h.ReplicationHandler Commits will be reserved for  10000
   [junit4]   2> 998542 INFO  (searcherExecutor-7377-thread-1-processing-n:127.0.0.1:35783_ak x:collection1 s:shard1 c:collection1 r:core_node2) [n:127.0.0.1:35783_ak c:collection1 s:shard1 r:core_node2 x:collection1] o.a.s.c.SolrCore [collection1] Registered new searcher Searcher@1e71753[collection1] main{ExitableDirectoryReader(UninvertingDirectoryReader())}
   [junit4]   2> 998542 INFO  (coreLoadExecutor-7376-thread-1-processing-n:127.0.0.1:35783_ak) [n:127.0.0.1:35783_ak c:collection1 s:shard1 r:core_node2 x:collection1] o.a.s.u.UpdateLog Could not find max version in index or recent updates, using new clock 1549459391247286272
   [junit4]   2> 998545 INFO  (coreZkRegister-7371-thread-1-processing-n:127.0.0.1:35783_ak x:collection1 s:shard1 c:collection1 r:core_node2) [n:127.0.0.1:35783_ak c:collection1 s:shard1 r:core_node2 x:collection1] o.a.s.c.ShardLeaderElectionContext Enough replicas found to continue.
   [junit4]   2> 998545 INFO  (coreZkRegister-7371-thread-1-processing-n:127.0.0.1:35783_ak x:collection1 s:shard1 c:collection1 r:core_node2) [n:127.0.0.1:35783_ak c:collection1 s:shard1 r:core_node2 x:collection1] o.a.s.c.ShardLeaderElectionContext I may be the new leader - try and sync
   [junit4]   2> 998545 INFO  (coreZkRegister-7371-thread-1-processing-n:127.0.0.1:35783_ak x:collection1 s:shard1 c:collection1 r:core_node2) [n:127.0.0.1:35783_ak c:collection1 s:shard1 r:core_node2 x:collection1] o.a.s.c.SyncStrategy Sync replicas to http://127.0.0.1:35783/ak/collection1/
   [junit4]   2> 998545 INFO  (coreZkRegister-7371-thread-1-processing-n:127.0.0.1:35783_ak x:collection1 s:shard1 c:collection1 r:core_node2) [n:127.0.0.1:35783_ak c:collection1 s:shard1 r:core_node2 x:collection1] o.a.s.c.SyncStrategy Sync Success - now sync replicas to me
   [junit4]   2> 998545 INFO  (coreZkRegister-7371-thread-1-processing-n:127.0.0.1:35783_ak x:collection1 s:shard1 c:collection1 r:core_node2) [n:127.0.0.1:35783_ak c:collection1 s:shard1 r:core_node2 x:collection1] o.a.s.c.SyncStrategy http://127.0.0.1:35783/ak/collection1/ has no replicas
   [junit4]   2> 998547 INFO  (coreZkRegister-7371-thread-1-processing-n:127.0.0.1:35783_ak x:collection1 s:shard1 c:collection1 r:core_node2) [n:127.0.0.1:35783_ak c:collection1 s:shard1 r:core_node2 x:collection1] o.a.s.c.ShardLeaderElectionContext I am the new leader: http://127.0.0.1:35783/ak/collection1/ shard1
   [junit4]   2> 998648 INFO  (zkCallback-19457-thread-1-processing-n:127.0.0.1:42787_ak) [n:127.0.0.1:42787_ak    ] o.a.s.c.c.ZkStateReader A cluster state change: [WatchedEvent state:SyncConnected type:NodeDataChanged path:/collections/collection1/state.json] for collection [collection1] has occurred - updating... (live nodes size: [3])
   [junit4]   2> 998648 INFO  (zkCallback-19463-thread-1-processing-n:127.0.0.1:35783_ak) [n:127.0.0.1:35783_ak    ] o.a.s.c.c.ZkStateReader A cluster state change: [WatchedEvent state:SyncConnected type:NodeDataChanged path:/collections/collection1/state.json] for collection [collection1] has occurred - updating... (live nodes size: [3])
   [junit4]   2> 998697 INFO  (coreZkRegister-7371-thread-1-processing-n:127.0.0.1:35783_ak x:collection1 s:shard1 c:collection1 r:core_node2) [n:127.0.0.1:35783_ak c:collection1 s:shard1 r:core_node2 x:collection1] o.a.s.c.ZkController I am the leader, no recovery necessary
   [junit4]   2> 998799 INFO  (zkCallback-19457-thread-1-processing-n:127.0.0.1:42787_ak) [n:127.0.0.1:42787_ak    ] o.a.s.c.c.ZkStateReader A cluster state change: [WatchedEvent state:SyncConnected type:NodeDataChanged path:/collections/collection1/state.json] for collection [collection1] has occurred - updating... (live nodes size: [3])
   [junit4]   2> 998799 INFO  (zkCallback-19463-thread-1-processing-n:127.0.0.1:35783_ak) [n:127.0.0.1:35783_ak    ] o.a.s.c.c.ZkStateReader A cluster state change: [WatchedEvent state:SyncConnected type:NodeDataChanged path:/collections/collection1/state.json] for collection [collection1] has occurred - updating... (live nodes size: [3])
   [junit4]   2> 999054 INFO  (TEST-ShardSplitTest.test-seed#[A78F4599CC12AA00]) [    ] o.a.s.SolrTestCaseJ4 Writing core.properties file to /home/jenkins/workspace/Lucene-Solr-6.x-Linux/solr/build/solr-core/test/J2/temp/solr.cloud.ShardSplitTest_A78F4599CC12AA00-001/shard-3-001/cores/collection1
   [junit4]   2> 999054 INFO  (TEST-ShardSplitTest.test-seed#[A78F4599CC12AA00]) [    ] o.a.s.c.AbstractFullDistribZkTestBase create jetty 3 in directory /home/jenkins/workspace/Lucene-Solr-6.x-Linux/solr/build/solr-core/test/J2/temp/solr.cloud.ShardSplitTest_A78F4599CC12AA00-001/shard-3-001
   [junit4]   2> 999055 INFO  (TEST-ShardSplitTest.test-seed#[A78F4599CC12AA00]) [    ] o.e.j.s.Server jetty-9.3.8.v20160314
   [junit4]   2> 999056 INFO  (TEST-ShardSplitTest.test-seed#[A78F4599CC12AA00]) [    ] o.e.j.s.h.ContextHandler Started o.e.j.s.ServletContextHandler@1b5253c{/ak,null,AVAILABLE}
   [junit4]   2> 999056 INFO  (TEST-ShardSplitTest.test-seed#[A78F4599CC12AA00]) [    ] o.e.j.s.ServerConnector Started ServerConnector@c17f00{HTTP/1.1,[http/1.1]}{127.0.0.1:44257}
   [junit4]   2> 999056 INFO  (TEST-ShardSplitTest.test-seed#[A78F4599CC12AA00]) [    ] o.e.j.s.Server Started @1000706ms
   [junit4]   2> 999056 INFO  (TEST-ShardSplitTest.test-seed#[A78F4599CC12AA00]) [    ] o.a.s.c.s.e.JettySolrRunner Jetty properties: {solr.data.dir=/home/jenkins/workspace/Lucene-Solr-6.x-Linux/solr/build/solr-core/test/J2/temp/solr.cloud.ShardSplitTest_A78F4599CC12AA00-001/tempDir-001/jetty3, solrconfig=solrconfig.xml, hostContext=/ak, hostPort=44257, coreRootDirectory=/home/jenkins/workspace/Lucene-Solr-6.x-Linux/solr/build/solr-core/test/J2/../../../../../../../../../home/jenkins/workspace/Lucene-Solr-6.x-Linux/solr/build/solr-core/test/J2/temp/solr.cloud.ShardSplitTest_A78F4599CC12AA00-001/shard-3-001/cores}
   [junit4]   2> 999056 ERROR (TEST-ShardSplitTest.test-seed#[A78F4599CC12AA00]) [    ] o.a.s.s.StartupLoggingUtils Missing Java Option solr.log.dir. Logging may be missing or incomplete.
   [junit4]   2> 999057 INFO  (TEST-ShardSplitTest.test-seed#[A78F4599CC12AA00]) [    ] o.a.s.s.SolrDispatchFilter  ___      _       Welcome to Apache Solr? version 6.3.0
   [junit4]   2> 999057 INFO  (TEST-ShardSplitTest.test-seed#[A78F4599CC12AA00]) [    ] o.a.s.s.SolrDispatchFilter / __| ___| |_ _   Starting in cloud mode on port null
   [junit4]   2> 999057 INFO  (TEST-ShardSplitTest.test-seed#[A78F4599CC12AA00]) [    ] o.a.s.s.SolrDispatchFilter \__ \/ _ \ | '_|  Install dir: null
   [junit4]   2> 999057 INFO  (TEST-ShardSplitTest.test-seed#[A78F4599CC12AA00]) [    ] o.a.s.s.SolrDispatchFilter |___/\___/_|_|    Start time: 2016-10-28T18:33:46.262Z
   [junit4]   2> 999059 INFO  (TEST-ShardSplitTest.test-seed#[A78F4599CC12AA00]) [    ] o.a.s.s.SolrDispatchFilter Loading solr.xml from SolrHome (not found in ZooKeeper)
   [junit4]   2> 999059 INFO  (TEST-ShardSplitTest.test-seed#[A78F4599CC12AA00]) [    ] o.a.s.c.SolrXmlConfig Loading container configuration from /home/jenkins/workspace/Lucene-Solr-6.x-Linux/solr/build/solr-core/test/J2/temp/solr.cloud.ShardSplitTest_A78F4599CC12AA00-001/shard-3-001/solr.xml
   [junit4]   2> 999063 INFO  (TEST-ShardSplitTest.test-seed#[A78F4599CC12AA00]) [    ] o.a.s.u.UpdateShardHandler Creating UpdateShardHandler HTTP client with params: socketTimeout=340000&connTimeout=45000&retry=true
   [junit4]   2> 999063 INFO  (TEST-ShardSplitTest.test-seed#[A78F4599CC12AA00]) [    ] o.a.s.c.ZkContainer Zookeeper client=127.0.0.1:46495/solr
   [junit4]   2> 999086 INFO  (TEST-ShardSplitTest.test-seed#[A78F4599CC12AA00]) [n:127.0.0.1:44257_ak    ] o.a.s.c.c.ZkStateReader Updated live nodes from ZooKeeper... (0) -> (3)
   [junit4]   2> 999087 INFO  (TEST-ShardSplitTest.test-seed#[A78F4599CC12AA00]) [n:127.0.0.1:44257_ak    ] o.a.s.c.ZkController Register node as live in ZooKeeper:/live_nodes/127.0.0.1:44257_ak
   [junit4]   2> 999088 INFO  (zkCallback-19463-thread-1-processing-n:127.0.0.1:35783_ak) [n:127.0.0.1:35783_ak    ] o.a.s.c.c.ZkStateReader Updated live nodes from ZooKeeper... (3) -> (4)
   [junit4]   2> 999088 INFO  (zkCallback-19447-thread-3-processing-n:127.0.0.1:33307_ak) [n:127.0.0.1:33307_ak    ] o.a.s.c.c.ZkStateReader Updated live nodes from ZooKeeper... (3) -> (4)
   [junit4]   2> 999088 INFO  (zkCallback-19457-thread-1-processing-n:127.0.0.1:42787_ak) [n:127.0.0.1:42787_ak    ] o.a.s.c.c.ZkStateReader Updated live nodes from ZooKeeper... (3) -> (4)
   [junit4]   2> 999089 INFO  (zkCallback-19469-thread-1-processing-n:127.0.0.1:44257_ak) [n:127.0.0.1:44257_ak    ] o.a.s.c.c.ZkStateReader Updated live nodes from ZooKeeper... (3) -> (4)
   [junit4]   2> 999088 INFO  (zkCallback-19451-thread-1) [    ] o.a.s.c.c.ZkStateReader Updated live nodes from ZooKeeper... (3) -> (4)
   [junit4]   2> 999109 INFO  (TEST-ShardSplitTest.test-seed#[A78F4599CC12AA00]) [n:127.0.0.1:44257_ak    ] o.a.s.c.CorePropertiesLocator Found 1 core definitions underneath /home/jenkins/workspace/Lucene-Solr-6.x-Linux/solr/build/solr-core/test/J2/../../../../../../../../../home/jenkins/workspace/Lucene-Solr-6.x-Linux/solr/build/solr-core/test/J2/temp/solr.cloud.ShardSplitTest_A78F4599CC12AA00-001/shard-3-001/cores
   [junit4]   2> 999109 INFO  (TEST-ShardSplitTest.test-seed#[A78F4599CC12AA00]) [n:127.0.0.1:44257_ak    ] o.a.s.c.CorePropertiesLocator Cores are: [collection1]
   [junit4]   2> 999110 INFO  (OverseerStateUpdate-96841211652734980-127.0.0.1:33307_ak-n_0000000000) [n:127.0.0.1:33307_ak    ] o.a.s.c.o.ReplicaMutator Assigning new node to shard shard=shard2
   [junit4]   2> 999211 INFO  (zkCallback-19463-thread-1-processing-n:127.0.0.1:35783_ak) [n:127.0.0.1:35783_ak    ] o.a.s.c.c.ZkStateReader A cluster state change: [WatchedEvent state:SyncConnected type:NodeDataChanged path:/collections/collection1/state.json] for collection [collection1] has occurred - updating... (live nodes size: [4])
   [junit4]   2> 999211 INFO  (zkCallback-19469-thread-2-processing-n:127.0.0.1:44257_ak) [n:127.0.0.1:44257_ak    ] o.a.s.c.c.ZkStateReader A cluster state change: [WatchedEvent state:SyncConnected type:NodeDataChanged path:/collections/collection1/state.json] for collection [collection1] has occurred - updating... (live nodes size: [4])
   [junit4]   2> 999211 INFO  (zkCallback-19457-thread-1-processing-n:127.0.0.1:42787_ak) [n:127.0.0.1:42787_ak    ] o.a.s.c.c.ZkStateReader A cluster state change: [WatchedEvent state:SyncConnected type:NodeDataChanged path:/collections/collection1/state.json] for collection [collection1] has occurred - updating... (live nodes size: [4])
   [junit4]   2> 1000117 WARN  (coreLoadExecutor-7387-thread-1-processing-n:127.0.0.1:44257_ak) [n:127.0.0.1:44257_ak c:collection1   x:collection1] o.a.s.c.Config Beginning with Solr 5.5, <mergePolicy> is deprecated, use <mergePolicyFactory> instead.
   [junit4]   2> 1000117 INFO  (coreLoadExecutor-7387-thread-1-processing-n:127.0.0.1:44257_ak) [n:127.0.0.1:44257_ak c:collection1   x:collection1] o.a.s.c.SolrConfig Using Lucene MatchVersion: 6.3.0
   [junit4]   2> 1000127 INFO  (coreLoadExecutor-7387-thread-1-processing-n:127.0.0.1:44257_ak) [n:127.0.0.1:44257_ak c:collection1   x:collection1] o.a.s.s.IndexSchema [collection1] Schema name=test
   [junit4]   2> 1000187 WARN  (coreLoadExecutor-7387-thread-1-processing-n:127.0.0.1:44257_ak) [n:127.0.0.1:44257_ak c:collection1   x:collection1] o.a.s.s.IndexSchema [collection1] default search field in schema is text. WARNING: Deprecated, please use 'df' on request instead.
   [junit4]   2> 1000188 INFO  (coreLoadExecutor-7387-thread-1-processing-n:127.0.0.1:44257_ak) [n:127.0.0.1:44257_ak c:collection1   x:collection1] o.a.s.s.IndexSchema Loaded schema test/1.6 with uniqueid field id
   [junit4]   2> 1000195 INFO  (coreLoadExecutor-7387-thread-1-processing-n:127.0.0.1:44257_ak) [n:127.0.0.1:44257_ak c:collection1   x:collection1] o.a.s.c.CoreContainer Creating SolrCore 'collection1' using configuration from collection collection1
   [junit4]   2> 1000195 INFO  (coreLoadExecutor-7387-thread-1-processing-n:127.0.0.1:44257_ak) [n:127.0.0.1:44257_ak c:collection1 s:shard2 r:core_node3 x:collection1] o.a.s.c.SolrCore [[collection1] ] Opening new SolrCore at [/home/jenkins/workspace/Lucene-Solr-6.x-Linux/solr/build/solr-core/test/J2/temp/solr.cloud.ShardSplitTest_A78F4599CC12AA00-001/shard-3-001/cores/collection1], dataDir=[/home/jenkins/workspace/Lucene-Solr-6.x-Linux/solr/build/solr-core/test/J2/../../../../../../../../../home/jenkins/workspace/Lucene-Solr-6.x-Linux/solr/build/solr-core/test/J2/temp/solr.cloud.ShardSplitTest_A78F4599CC12AA00-001/shard-3-001/cores/collection1/data/]
   [junit4]   2> 1000195 INFO  (coreLoadExecutor-7387-thread-1-processing-n:127.0.0.1:44257_ak) [n:127.0.0.1:44257_ak c:collection1 s:shard2 r:core_node3 x:collection1] o.a.s.c.JmxMonitoredMap JMX monitoring is enabled. Adding Solr mbeans to JMX Server: com.sun.jmx.mbeanserver.JmxMBeanServer@3a923c
   [junit4]   2> 1000197 INFO  (coreLoadExecutor-7387-thread-1-processing-n:127.0.0.1:44257_ak) [n:127.0.0.1:44257_ak c:collection1 s:shard2 r:core_node3 x:collection1] o.a.s.u.RandomMergePolicy RandomMergePolicy wrapping class org.apache.lucene.index.TieredMergePolicy: [TieredMergePolicy: maxMergeAtOnce=41, maxMergeAtOnceExplicit=17, maxMergedSegmentMB=44.576171875, floorSegmentMB=1.4130859375, forceMergeDeletesPctAllowed=16.73235720453438, segmentsPerTier=34.0, maxCFSSegmentSizeMB=8.796093022207999E12, noCFSRatio=0.5113851967143659
   [junit4]   2> 1000239 WARN  (coreLoadExecutor-7387-thread-1-processing-n:127.0.0.1:44257_ak) [n:127.0.0.1:44257_ak c:collection1 s:shard2 r:core_node3 x:collection1] o.a.s.c.RequestHandlers INVALID paramSet a in requestHandler {type = requestHandler,name = /dump,class = DumpRequestHandler,args = {defaults={a=A,b=B}}}
   [junit4]   2> 1000246 INFO  (coreLoadExecutor-7387-thread-1-processing-n:127.0.0.1:44257_ak) [n:127.0.0.1:44257_ak c:collection1 s:shard2 r:core_node3 x:collection1] o.a.s.u.UpdateHandler Using UpdateLog implementation: org.apache.solr.update.UpdateLog
   [junit4]   2> 1000246 INFO  (coreLoadExecutor-7387-thread-1-processing-n:127.0.0.1:44257_ak) [n:127.0.0.1:44257_ak c:collection1 s:shard2 r:core_node3 x:collection1] o.a.s.u.UpdateLog Initializing UpdateLog: dataDir= defaultSyncLevel=FLUSH numRecordsToKeep=100 maxNumLogsToKeep=10 numVersionBuckets=65536
   [junit4]   2> 1000246 INFO  (coreLoadExecutor-7387-thread-1-processing-n:127.0.0.1:44257_ak) [n:127.0.0.1:44257_ak c:collection1 s:shard2 r:core_node3 x:collection1] o.a.s.u.CommitTracker Hard AutoCommit: disabled
   [junit4]   2> 1000246 INFO  (coreLoadExecutor-7387-thread-1-processing-n:127.0.0.1:44257_ak) [n:127.0.0.1:44257_ak c:collection1 s:shard2 r:core_node3 x:collection1] o.a.s.u.CommitTracker Soft AutoCommit: disabled
   [junit4]   2> 1000247 INFO  (coreLoadExecutor-7387-thread-1-processing-n:127.0.0.1:44257_ak) [n:127.0.0.1:44257_ak c:collection1 s:shard2 r:core_node3 x:collection1] o.a.s.u.RandomMergePolicy RandomMergePolicy wrapping class org.apache.lucene.index.TieredMergePolicy: [TieredMergePolicy: maxMergeAtOnce=26, maxMergeAtOnceExplicit=38, maxMergedSegmentMB=90.8984375, floorSegmentMB=1.4189453125, forceMergeDeletesPctAllowed=19.07202341357811, segmentsPerTier=19.0, maxCFSSegmentSizeMB=8.796093022207999E12, noCFSRatio=0.5791185300775051
   [junit4]   2> 1000247 INFO  (coreLoadExecutor-7387-thread-1-processing-n:127.0.0.1:44257_ak) [n:127.0.0.1:44257_ak c:collection1 s:shard2 r:core_node3 x:collection1] o.a.s.s.SolrIndexSearcher Opening [Searcher@460adc[collection1] main]
   [junit4]   2> 1000247 INFO  (coreLoadExecutor-7387-thread-1-processing-n:127.0.0.1:44257_ak) [n:127.0.0.1:44257_ak c:collection1 s:shard2 r:core_node3 x:collection1] o.a.s.r.ManagedResourceStorage Configured ZooKeeperStorageIO with znodeBase: /configs/conf1
   [junit4]   2> 1000247 INFO  (coreLoadExecutor-7387-thread-1-processing-n:127.0.0.1:44257_ak) [n:127.0.0.1:44257_ak c:collection1 s:shard2 r:core_node3 x:collection1] o.a.s.r.ManagedResourceStorage Loaded null at path _rest_managed.json using ZooKeeperStorageIO:path=/configs/conf1
   [junit4]   2> 1000248 INFO  (coreLoadExecutor-7387-thread-1-processing-n:127.0.0.1:44257_ak) [n:127.0.0.1:44257_ak c:collection1 s:shard2 r:core_node3 x:collection1] o.a.s.h.ReplicationHandler Commits will be reserved for  10000
   [junit4]   2> 1000248 INFO  (searcherExecutor-7388-thread-1-processing-n:127.0.0.1:44257_ak x:collection1 s:shard2 c:collection1 r:core_node3) [n:127.0.0.1:44257_ak c:collection1 s:shard2 r:core_node3 x:collection1] o.a.s.c.SolrCore [collection1] Registered new searcher Searcher@460adc[collection1] main{ExitableDirectoryReader(UninvertingDirectoryReader())}
   [junit4]   2> 1000249 INFO  (coreLoadExecutor-7387-thread-1-processing-n:127.0.0.1:44257_ak) [n:127.0.0.1:44257_ak c:collection1 s:shard2 r:core_node3 x:collection1] o.a.s.u.UpdateLog Could not find max version in index or recent updates, using new clock 1549459393037205504
   [junit4]   2> 1000251 INFO  (coreZkRegister-7382-thread-1-processing-n:127.0.0.1:44257_ak x:collection1 s:shard2 c:collection1 r:core_node3) [n:127.0.0.1:44257_ak c:collection1 s:shard2 r:core_node3 x:collection1] o.a.s.c.ZkController Core needs to recover:collection1
   [junit4]   2> 1000251 INFO  (updateExecutor-19466-thread-1-processing-n:127.0.0.1:44257_ak x:collection1 s:shard2 c:collection1 r:core_node3) [n:127.0.0.1:44257_ak c:collection1 s:shard2 r:core_node3 x:collection1] o.a.s.u.DefaultSolrCoreState Running recovery
   [junit4]   2> 1000252 INFO  (recoveryExecutor-19467-thread-1-processing-n:127.0.0.1:44257_ak x:collection1 s:shard2 c:collection1 r:core_node3) [n:127.0.0.1:44257_ak c:collection1 s:shard2 r:core_node3 x:collection1] o.a.s.c.RecoveryStrategy Starting recovery process. recoveringAfterStartup=true
   [junit4]   2> 1000252 INFO  (recoveryExecutor-19467-thread-1-processing-n:127.0.0.1:44257_ak x:collection1 s:shard2 c:collection1 r:core_node3) [n:127.0.0.1:44257_ak c:collection1 s:shard2 r:core_node3 x:collection1] o.a.s.c.RecoveryStrategy ###### startupVersions=[[]]
   [junit4]   2> 1000252 INFO  (recoveryExecutor-19467-thread-1-processing-n:127.0.0.1:44257_ak x:collection1 s:shard2 c:collection1 r:core_node3) [n:127.0.0.1:44257_ak c:collection1 s:shard2 r:core_node3 x:collection1] o.a.s.c.RecoveryStrategy Begin buffering updates. core=[collection1]
   [junit4]   2> 1000252 INFO  (recoveryExecutor-19467-thread-1-processing-n:127.0.0.1:44257_ak x:collection1 s:shard2 c:collection1 r:core_node3) [n:127.0.0.1:44257_ak c:collection1 s:shard2 r:core_node3 x:collection1] o.a.s.u.UpdateLog Starting to buffer updates. FSUpdateLog{state=ACTIVE, tlog=null}
   [junit4]   2> 1000252 INFO  (recoveryExecutor-19467-thread-1-processing-n:127.0.0.1:44257_ak x:collection1 s:shard2 c:collection1 r:core_node3) [n:127.0.0.1:44257_ak c:collection1 s:shard2 r:core_node3 x:collection1] o.a.s.c.RecoveryStrategy Publishing state of core [collection1] as recovering, leader is [http://127.0.0.1:42787/ak/collection1/] and I am [http://127.0.0.1:44257/ak/collection1/]
   [junit4]   2> 1000253 INFO  (recoveryExecutor-19467-thread-1-processing-n:127.0.0.1:44257_ak x:collection1 s:shard2 c:collection1 r:core_node3) [n:127.0.0.1:44257_ak c:collection1 s:shard2 r:core_node3 x:collection1] o.a.s.c.RecoveryStrategy Sending prep recovery command to [http://127.0.0.1:42787/ak]; [WaitForState: action=PREPRECOVERY&core=collection1&nodeName=127.0.0.1:44257_ak&coreNodeName=core_node3&state=recovering&checkLive=true&onlyIfLeader=true&onlyIfLeaderActive=true]
   [junit4]   2> 1000255 INFO  (qtp18280608-73708) [n:127.0.0.1:42787_ak    ] o.a.s.h.a.PrepRecoveryOp Going to wait for coreNodeName: core_node3, state: recovering, checkLive: true, onlyIfLeader: true, onlyIfLeaderActive: true
   [junit4]   2> 1000256 INFO  (qtp18280608-73708) [n:127.0.0.1:42787_ak    ] o.a.s.h.a.PrepRecoveryOp Will wait a max of 183 seconds to see collection1 (shard2 of collection1) have state: recovering
   [junit4]   2> 1000256 INFO  (qtp18280608-73708) [n:127.0.0.1:42787_ak    ] o.a.s.h.a.PrepRecoveryOp In WaitForState(recovering): collection=collection1, shard=shard2, thisCore=collection1, leaderDoesNotNeedRecovery=false, isLeader? true, live=true, checkLive=true, currentState=down, localState=active, nodeName=127.0.0.1:44257_ak, coreNodeName=core_node3, onlyIfActiveCheckResult=false, nodeProps: core_node3:{"core":"collection1","base_url":"http://127.0.0.1:44257/ak","node_name":"127.0.0.1:44257_ak","state":"down"}
   [junit4]   2> 1000355 INFO  (zkCallback-19457-thread-1-processing-n:127.0.0.1:42787_ak) [n:127.0.0.1:42787_ak    ] o.a.s.c.c.ZkStateReader A cluster state change: [WatchedEvent state:SyncConnected type:NodeDataChanged path:/collections/collection1/state.json] for collection [collection1] has occurred - updating... (live nodes size: [4])
   [junit4]   2> 1000355 INFO  (zkCallback-19463-thread-1-processing-n:127.0.0.1:35783_ak) [n:127.0.0.1:35783_ak    ] o.a.s.c.c.ZkStateReader A cluster state change: [WatchedEvent state:SyncConnected type:NodeDataChanged path:/collections/collection1/state.json] for collection [collection1] has occurred - updating... (live nodes size: [4])
   [junit4]   2> 1000355 INFO  (zkCallback-19469-thread-2-processing-n:127.0.0.1:44257_ak) [n:127.0.0.1:44257_ak    ] o.a.s.c.c.ZkStateReader A cluster state change: [WatchedEvent state:SyncConnected type:NodeDataChanged path:/collections/collection1/state.json] for collection [collection1] has occurred - updating... (live nodes size: [4])
   [junit4]   2> 1000700 INFO  (TEST-ShardSplitTest.test-seed#[A78F4599CC12AA00]) [    ] o.a.s.SolrTestCaseJ4 Writing core.properties file to /home/jenkins/workspace/Lucene-Solr-6.x-Linux/solr/build/solr-core/test/J2/temp/solr.cloud.ShardSplitTest_A78F4599CC12AA00-001/shard-4-001/cores/collection1
   [junit4]   2> 1000701 INFO  (TEST-ShardSplitTest.test-seed#[A78F4599CC12AA00]) [    ] o.a.s.c.AbstractFullDistribZkTestBase create jetty 4 in directory /home/jenkins/workspace/Lucene-Solr-6.x-Linux/solr/build/solr-core/test/J2/temp/solr.cloud.ShardSplitTest_A78F4599CC12AA00-001/shard-4-001
   [junit4]   2> 1000701 INFO  (TEST-ShardSplitTest.test-seed#[A78F4599CC12AA00]) [    ] o.e.j.s.Server jetty-9.3.8.v20160314
   [junit4]   2> 1000702 INFO  (TEST-ShardSplitTest.test-seed#[A78F4599CC12AA00]) [    ] o.e.j.s.h.ContextHandler Started o.e.j.s.ServletContextHandler@891c9b{/ak,null,AVAILABLE}
   [junit4]   2> 1000702 INFO  (TEST-ShardSplitTest.test-seed#[A78F4599CC12AA00]) [    ] o.e.j.s.ServerConnector Started ServerConnector@127a152{HTTP/1.1,[http/1.1]}{127.0.0.1:33691}
   [junit4]   2> 1000702 INFO  (TEST-ShardSplitTest.test-seed#[A78F4599CC12AA00]) [    ] o.e.j.s.Server Started @1002352ms
   [junit4]   2> 1000702 INFO  (TEST-ShardSplitTest.test-seed#[A78F4599CC12AA00]) [    ] o.a.s.c.s.e.JettySolrRunner Jetty properties: {solr.data.dir=/home/jenkins/workspace/Lucene-Solr-6.x-Linux/solr/build/solr-core/test/J2/temp/solr.cloud.ShardSplitTest_A78F4599CC12AA00-001/tempDir-001/jetty4, solrconfig=solrconfig.xml, hostContext=/ak, hostPort=33691, coreRootDirectory=/home/jenkins/workspace/Lucene-Solr-6.x-Linux/solr/build/solr-core/test/J2/temp/solr.cloud.ShardSplitTest_A78F4599CC12AA00-001/shard-4-001/cores}
   [junit4]   2> 1000702 ERROR (TEST-ShardSplitTest.test-seed#[A78F4599CC12AA00]) [    ] o.a.s.s.StartupLoggingUtils Missing Java Option solr.log.dir. Logging may be missing or incomplete.
   [junit4]   2> 1000702 INFO  (TEST-ShardSplitTest.test-seed#[A78F4599CC12AA00]) [    ] o.a.s.s.SolrDispatchFilter  ___      _       Welcome to Apache Solr? version 6.3.0
   [junit4]   2> 1000703 INFO  (TEST-ShardSplitTest.test-seed#[A78F4599CC12AA00]) [    ] o.a.s.s.SolrDispatchFilter / __| ___| |_ _   Starting in cloud mode on port null
   [junit4]   2> 1000703 INFO  (TEST-ShardSplitTest.test-seed#[A78F4599CC12AA00]) [    ] o.a.s.s.SolrDispatchFilter \__ \/ _ \ | '_|  Install dir: null
   [junit4]   2> 1000703 INFO  (TEST-ShardSplitTest.test-seed#[A78F4599CC12AA00]) [    ] o.a.s.s.SolrDispatchFilter |___/\___/_|_|    Start time: 2016-10-28T18:33:47.908Z
   [junit4]   2> 1000705 INFO  (TEST-ShardSplitTest.test-seed#[A78F4599CC12AA00]) [    ] o.a.s.s.SolrDispatchFilter Loading solr.xml from SolrHome (not found in ZooKeeper)
   [junit4]   2> 1000705 INFO  (TEST-ShardSplitTest.test-seed#[A78F4599CC12AA00]) [    ] o.a.s.c.SolrXmlConfig Loading container configuration from /home/jenkins/workspace/Lucene-Solr-6.x-Linux/solr/build/solr-core/test/J2/temp/solr.cloud.ShardSplitTest_A78F4599CC12AA00-001/shard-4-001/solr.xml
   [junit4]   2> 1000714 INFO  (TEST-ShardSplitTest.test-seed#[A78F4599CC12AA00]) [    ] o.a.s.u.UpdateShardHandler Creating UpdateShardHandler HTTP client with params: socketTimeout=340000&connTimeout=45000&retry=true
   [junit4]   2> 1000715 INFO  (TEST-ShardSplitTest.test-seed#[A78F4599CC12AA00]) [    ] o.a.s.c.ZkContainer Zookeeper client=127.0.0.1:46495/solr
   [junit4]   2> 1000719 INFO  (TEST-ShardSplitTest.test-seed#[A78F4599CC12AA00]) [n:127.0.0.1:33691_ak    ] o.a.s.c.c.ZkStateReader Updated live nodes from ZooKeeper... (0) -> (4)
   [junit4]   2> 1000720 INFO  (TEST-ShardSplitTest.test-seed#[A78F4599CC12AA00]) [n:127.0.0.1:33691_ak    ] o.a.s.c.ZkController Register node as live in ZooKeeper:/live_nodes/127.0.0.1:33691_ak
   [junit4]   2> 1000721 INFO  (zkCallback-19469-thread-2-processing-n:127.0.0.1:44257_ak) [n:127.0.0.1:44257_ak    ] o.a.s.c.c.ZkStateReader Updated live nodes from ZooKeeper... (4) -> (5)
   [junit4]   2> 1000722 INFO  (zkCallback-19457-thread-1-processing-n:127.0.0.1:42787_ak) [n:127.0.0.1:42787_ak    ] o.a.s.c.c.ZkStateReader Updated live nodes from ZooKeeper... (4) -> (5)
   [junit4]   2> 1000722 INFO  (zkCallback-19451-thread-1) [    ] o.a.s.c.c.ZkStateReader Updated live nodes from ZooKeeper... (4) -> (5)
   [junit4]   2> 1000722 INFO  (zkCallback-19447-thread-2-processing-n:127.0.0.1:33307_ak) [n:127.0.0.1:33307_ak    ] o.a.s.c.c.ZkStateReader Updated live nodes from ZooKeeper... (4) -> (5)
   [junit4]   2> 1000722 INFO  (zkCallback-19463-thread-1-processing-n:127.0.0.1:35783_ak) [n:127.0.0.1:35783_ak    ] o.a.s.c.c.ZkStateReader Updated live nodes from ZooKeeper... (4) -> (5)
   [junit4]   2> 1000722 INFO  (zkCallback-19476-thread-1-processing-n:127.0.0.1:33691_ak) [n:127.0.0.1:33691_ak    ] o.a.s.c.c.ZkStateReader Updated live nodes from ZooKeeper... (4) -> (5)
   [junit4]   2> 1000733 INFO  (TEST-ShardSplitTest.test-seed#[A78F4599CC12AA00]) [n:127.0.0.1:33691_ak    ] o.a.s.c.CorePropertiesLocator Found 1 core definitions underneath /home/jenkins/workspace/Lucene-Solr-6.x-Linux/solr/build/solr-core/test/J2/temp/solr.cloud.ShardSplitTest_A78F4599CC12AA00-001/shard-4-001/cores
   [junit4]   2> 1000733 INFO  (TEST-ShardSplitTest.test-seed#[A78F4599CC12AA00]) [n:127.0.0.1:33691_ak    ] o.a.s.c.CorePropertiesLocator Cores are: [collection1]
   [junit4]   2> 1000734 INFO  (OverseerStateUpdate-96841211652734980-127.0.0.1:33307_ak-n_0000000000) [n:127.0.0.1:33307_ak    ] o.a.s.c.o.ReplicaMutator Assigning new node to shard shard=shard1
   [junit4]   2> 1000835 INFO  (zkCallback-19463-thread-1-processing-n:127.0.0.1:35783_ak) [n:127.0.0.1:35783_ak    ] o.a.s.c.c.ZkStateReader A cluster state change: [WatchedEvent state:SyncConnected type:NodeDataChanged path:/collections/collection1/state.json] for collection [collection1] has occurred - updating... (live nodes size: [5])
   [junit4]   2> 1000835 INFO  (zkCallback-19476-thread-1-processing-n:127.0.0.1:33691_ak) [n:127.0.0.1:33691_ak    ] o.a.s.c.c.ZkStateReader A cluster state change: [WatchedEvent state:SyncConnected type:NodeDataChanged path:/collections/collection1/state.json] for collection [collection1] has occurred - updating... (live nodes size: [5])
   [junit4]   2> 1000835 INFO  (zkCallback-19457-thread-1-processing-n:127.0.0.1:42787_ak) [n:127.0.0.1:42787_ak    ] o.a.s.c.c.ZkStateReader A cluster state change: [WatchedEvent state:SyncConnected type:NodeDataChanged path:/collections/collection1/state.json] for collection [collection1] has occurred - updating... (live nodes size: [5])
   [junit4]   2> 1000835 INFO  (zkCallback-19469-thread-2-processing-n:127.0.0.1:44257_ak) [n:127.0.0.1:44257_ak    ] o.a.s.c.c.ZkStateReader A cluster state change: [WatchedEvent state:SyncConnected type:NodeDataChanged path:/collections/collection1/state.json] for collection [collection1] has occurred - updating... (live nodes size: [5])
   [junit4]   2> 1001256 INFO  (qtp18280608-73708) [n:127.0.0.1:42787_ak    ] o.a.s.h.a.PrepRecoveryOp In WaitForState(recovering): collection=collection1, shard=shard2, thisCore=collection1, leaderDoesNotNeedRecovery=false, isLeader? true, live=true, checkLive=true, currentState=recovering, localState=active, nodeName=127.0.0.1:44257_ak, coreNodeName=core_node3, onlyIfActiveCheckResult=false, nodeProps: core_node3:{"core":"collection1","base_url":"http://127.0.0.1:44257/ak","node_name":"127.0.0.1:44257_ak","state":"recovering"}
   [junit4]   2> 1001256 INFO  (qtp18280608-73708) [n:127.0.0.1:42787_ak    ] o.a.s.h.a.PrepRecoveryOp Waited coreNodeName: core_node3, state: recovering, checkLive: true, onlyIfLeader: true for: 1 seconds.
   [junit4]   2> 1001256 INFO  (qtp18280608-73708) [n:127.0.0.1:42787_ak    ] o.a.s.s.HttpSolrCall [admin] webapp=null path=/admin/cores params={nodeName=127.0.0.1:44257_ak&onlyIfLeaderActive=true&core=collection1&coreNodeName=core_node3&action=PREPRECOVERY&checkLive=true&state=recovering&onlyIfLeader=true&wt=javabin&version=2} status=0 QTime=1000
   [junit4]   2> 1001743 WARN  (coreLoadExecutor-7398-thread-1-processing-n:127.0.0.1:33691_ak) [n:127.0.0.1:33691_ak c:collection1   x:collection1] o.a.s.c.Config Beginning with Solr 5.5, <mergePolicy> is deprecated, use <mergePolicyFactory> instead.
   [junit4]   2> 1001743 INFO  (coreLoadExecutor-7398-thread-1-processing-n:127.0.0.1:33691_ak) [n:127.0.0.1:33691_ak c:collection1   x:collection1] o.a.s.c.SolrConfig Using Lucene MatchVersion: 6.3.0
   [junit4]   2> 1001754 INFO  (coreLoadExecutor-7398-thread-1-processing-n:127.0.0.1:33691_ak) [n:127.0.0.1:33691_ak c:collection1   x:collection1] o.a.s.s.IndexSchema [collection1] Schema name=test
   [junit4]   2> 1001804 WARN  (coreLoadExecutor-7398-thread-1-processing-n:127.0.0.1:33691_ak) [n:127.0.0.1:33691_ak c:collection1   x:collection1] o.a.s.s.IndexSchema [collection1] default search field in schema is text. WARNING: Deprecated, please use 'df' on request instead.
   [junit4]   2> 1001805 INFO  (coreLoadExecutor-7398-thread-1-processing-n:127.0.0.1:33691_ak) [n:127.0.0.1:33691_ak c:collection1   x:collection1] o.a.s.s.IndexSchema Loaded schema test/1.6 with uniqueid field id
   [junit4]   2> 1001813 INFO  (coreLoadExecutor-7398-thread-1-processing-n:127.0.0.1:33691_ak) [n:127.0.0.1:33691_ak c:collection1   x:collection1] o.a.s.c.CoreContainer Creating SolrCore 'collection1' using configuration from collection collection1
   [junit4]   2> 1001813 INFO  (coreLoadExecutor-7398-thread-1-processing-n:127.0.0.1:33691_ak) [n:127.0.0.1:33691_ak c:collection1 s:shard1 r:core_node4 x:collection1] o.a.s.c.SolrCore [[collection1] ] Opening new SolrCore at [/home/jenkins/workspace/Lucene-Solr-6.x-Linux/solr/build/solr-core/test/J2/temp/solr.cloud.ShardSplitTest_A78F4599CC12AA00-001/shard-4-001/cores/collection1], dataDir=[/home/jenkins/workspace/Lucene-Solr-6.x-Linux/solr/build/solr-core/test/J2/temp/solr.cloud.ShardSplitTest_A78F4599CC12AA00-001/shard-4-001/cores/collection1/data/]
   [junit4]   2> 1001813 INFO  (coreLoadExecutor-7398-thread-1-processing-n:127.0.0.1:33691_ak) [n:127.0.0.1:33691_ak c:collection1 s:shard1 r:core_node4 x:collection1] o.a.s.c.JmxMonitoredMap JMX monitoring is enabled. Adding Solr mbeans to JMX Server: com.sun.jmx.mbeanserver.JmxMBeanServer@3a923c
   [junit4]   2> 1001815 INFO  (coreLoadExecutor-7398-thread-1-processing-n:127.0.0.1:33691_ak) [n:127.0.0.1:33691_ak c:collection1 s:shard1 r:core_node4 x:collection1] o.a.s.u.RandomMergePolicy RandomMergePolicy wrapping class org.apache.lucene.index.TieredMergePolicy: [TieredMergePolicy: maxMergeAtOnce=41, maxMergeAtOnceExplicit=17, maxMergedSegmentMB=44.576171875, floorSegmentMB=1.4130859375, forceMergeDeletesPctAllowed=16.73235720453438, segmentsPerTier=34.0, maxCFSSegmentSizeMB=8.796093022207999E12, noCFSRatio=0.5113851967143659
   [junit4]   2> 1001891 WARN  (coreLoadExecutor-7398-thread-1-processing-n:127.0.0.1:33691_ak) [n:127.0.0.1:33691_ak c:collection1 s:shard1 r:core_node4 x:collection1] o.a.s.c.RequestHandlers INVALID paramSet a in requestHandler {type = requestHandler,name = /dump,class = DumpRequestHandler,args = {defaults={a=A,b=B}}}
   [junit4]   2> 1001906 INFO  (coreLoadExecutor-7398-thread-1-processing-n:127.0.0.1:33691_ak) [n:127.0.0.1:33691_ak c:collection1 s:shard1 r:core_node4 x:collection1] o.a.s.u.UpdateHandler Using UpdateLog implementation: org.apache.solr.update.UpdateLog
   [junit4]   2> 1001906 INFO  (coreLoadExecutor-7398-thread-1-processing-n:127.0.0.1:33691_ak) [n:127.0.0.1:33691_ak c:collection1 s:shard1 r:core_node4 x:collection1] o.a.s.u.UpdateLog Initializing UpdateLog: dataDir= defaultSyncLevel=FLUSH numRecordsToKeep=100 maxNumLogsToKeep=10 numVersionBuckets=65536
   [junit4]   2> 1001906 INFO  (coreLoadExecutor-7398-thread-1-processing-n:127.0.0.1:33691_ak) [n:127.0.0.1:33691_ak c:collection1 s:shard1 r:core_node4 x:collection1] o.a.s.u.CommitTracker Hard AutoCommit: disabled
   [junit4]   2> 1001906 INFO  (coreLoadExecutor-7398-thread-1-processing-n:127.0.0.1:33691_ak) [n:127.0.0.1:33691_ak c:collection1 s:shard1 r:core_node4 x:collection1] o.a.s.u.CommitTracker Soft AutoCommit: disabled
   [junit4]   2> 1001906 INFO  (coreLoadExecutor-7398-thread-1-processing-n:127.0.0.1:33691_ak) [n:127.0.0.1:33691_ak c:collection1 s:shard1 r:core_node4 x:collection1] o.a.s.u.RandomMergePolicy RandomMergePolicy wrapping class org.apache.lucene.index.TieredMergePolicy: [TieredMergePolicy: maxMergeAtOnce=26, maxMergeAtOnceExplicit=38, maxMergedSegmentMB=90.8984375, floorSegmentMB=1.4189453125, forceMergeDeletesPctAllowed=19.07202341357811, segmentsPerTier=19.0, maxCFSSegmentSizeMB=8.796093022207999E12, noCFSRatio=0.5791185300775051
   [junit4]   2> 1001907 INFO  (coreLoadExecutor-7398-thread-1-processing-n:127.0.0.1:33691_ak) [n:127.0.0.1:33691_ak c:collection1 s:shard1 r:core_node4 x:collection1] o.a.s.s.SolrIndexSearcher Opening [Searcher@108d3b5[collection1] main]
   [junit4]   2> 1001907 INFO  (coreLoadExecutor-7398-thread-1-processing-n:127.0.0.1:33691_ak) [n:127.0.0.1:33691_ak c:collection1 s:shard1 r:core_node4 x:collection1] o.a.s.r.ManagedResourceStorage Configured ZooKeeperStorageIO with znodeBase: /configs/conf1
   [junit4]   2> 1001907 INFO  (coreLoadExecutor-7398-thread-1-processing-n:127.0.0.1:33691_ak) [n:127.0.0.1:33691_ak c:collection1 s:shard1 r:core_node4 x:collection1] o.a.s.r.ManagedResourceStorage Loaded null at path _rest_managed.json using ZooKeeperStorageIO:path=/configs/conf1
   [junit4]   2> 1001907 INFO  (coreLoadExecutor-7398-thread-1-processing-n:127.0.0.1:33691_ak) [n:127.0.0.1:33691_ak c:collection1 s:shard1 r:core_node4 x:collection1] o.a.s.h.ReplicationHandler Commits will be reserved for  10000
   [junit4]   2> 1001909 INFO  (searcherExecutor-7399-thread-1-processing-n:127.0.0.1:33691_ak x:collection1 s:shard1 c:collection1 r:core_node4) [n:127.0.0.1:33691_ak c:collection1 s:shard1 r:core_node4 x:collection1] o.a.s.c.SolrCore [collection1] Registered new searcher Searcher@108d3b5[collection1] main{ExitableDirectoryReader(UninvertingDirectoryReader())}
   [junit4]   2> 1001909 INFO  (coreLoadExecutor-7398-thread-1-processing-n:127.0.0.1:33691_ak) [n:127.0.0.1:33691_ak c:collection1 s:shard1 r:core_node4 x:collection1] o.a.s.u.UpdateLog Could not find max version in index or recent updates, using new clock 1549459394777841664
   [junit4]   2> 1001911 INFO  (coreZkRegister-7393-thread-1-processing-n:127.0.0.1:33691_ak x:collection1 s:shard1 c:collection1 r:core_node4) [n:127.0.0.1:33691_ak c:collection1 s:shard1 r:core_node4 x:collection1] o.a.s.c.ZkController Core needs to recover:collection1
   [junit4]   2> 1001912 INFO  (updateExecutor-19473-thread-1-processing-n:127.0.0.1:33691_ak x:collection1 s:shard1 c:collection1 r:core_node4) [n:127.0.0.1:33691_ak c:collection1 s:shard1 r:core_node4 x:collection1] o.a.s.u.DefaultSolrCoreState Running recovery
   [junit4]   2> 1001912 INFO  (recoveryExecutor-19474-thread-1-processing-n:127.0.0.1:33691_ak x:collection1 s:shard1 c:collection1 r:core_node4) [n:127.0.0.1:33691_ak c:collection1 s:shard1 r:core_node4 x:collection1] o.a.s.c.RecoveryStrategy Starting recovery process. recoveringAfterStartup=true
   [junit4]   2> 1001912 INFO  (recoveryExecutor-19474-thread-1-processing-n:127.0.0.1:33691_ak x:collection1 s:shard1 c:collection1 r:core_node4) [n:127.0.0.1:33691_ak c:collection1 s:shard1 r:core_node4 x:collection1] o.a.s.c.RecoveryStrategy ###### startupVersions=[[]]
   [junit4]   2> 1001912 INFO  (recoveryExecutor-19474-thread-1-processing-n:127.0.0.1:33691_ak x:collection1 s:shard1 c:collection1 r:core_node4) [n:127.0.0.1:33691_ak c:collection1 s:shard1 r:core_node4 x:collection1] o.a.s.c.RecoveryStrategy Begin buffering updates. core=[collection1]
   [junit4]   2> 1001912 INFO  (recoveryExecutor-19474-thread-1-processing-n:127.0.0.1:33691_ak x:collection1 s:shard1 c:collection1 r:core_node4) [n:127.0.0.1:33691_ak c:collection1 s:shard1 r:core_node4 x:collection1] o.a.s.u.UpdateLog Starting to buffer updates. FSUpdateLog{state=ACTIVE, tlog=null}
   [junit4]   2> 1001912 INFO  (recoveryExecutor-19474-thread-1-processing-n:127.0.0.1:33691_ak x:collection1 s:shard1 c:collection1 r:core_node4) [n:127.0.0.1:33691_ak c:collection1 s:shard1 r:core_node4 x:collection1] o.a.s.c.RecoveryStrategy Publishing state of core [collection1] as recovering, leader is [http://127.0.0.1:35783/ak/collection1/] and I am [http://127.0.0.1:33691/ak/collection1/]
   [junit4]   2> 1001913 INFO  (recoveryExecutor-19474-thread-1-processing-n:127.0.0.1:33691_ak x:collection1 s:shard1 c:collection1 r:core_node4) [n:127.0.0.1:33691_ak c:collection1 s:shard1 r:core_node4 x:collection1] o.a.s.c.RecoveryStrategy Sending prep recovery command to [http://127.0.0.1:35783/ak]; [WaitForState: action=PREPRECOVERY&core=collection1&nodeName=127.0.0.1:33691_ak&coreNodeName=core_node4&state=recovering&checkLive=true&onlyIfLeader=true&onlyIfLeaderActive=true]
   [junit4]   2> 1001915 INFO  (qtp2639237-73736) [n:127.0.0.1:35783_ak    ] o.a.s.h.a.PrepRecoveryOp Going to wait for coreNodeName: core_node4, state: recovering, checkLive: true, onlyIfLeader: true, onlyIfLeaderActive: true
   [junit4]   2> 1001915 INFO  (qtp2639237-73736) [n:127.0.0.1:35783_ak    ] o.a.s.h.a.PrepRecoveryOp Will wait a max of 183 seconds to see collection1 (shard1 of collection1) have state: recovering
   [junit4]   2> 1001915 INFO  (qtp2639237-73736) [n:127.0.0.1:35783_ak    ] o.a.s.h.a.PrepRecoveryOp In WaitForState(recovering): collection=collection1, shard=shard1, thisCore=collection1, leaderDoesNotNeedRecovery=false, isLeader? true, live=true, checkLive=true, currentState=down, localState=active, nodeName=127.0.0.1:33691_ak, coreNodeName=core_node4, onlyIfActiveCheckResult=false, nodeProps: core_node4:{"core":"collection1","base_url":"http://127.0.0.1:33691/ak","node_name":"127.0.0.1:33691_ak","state":"down"}
   [junit4]   2> 1002014 INFO  (zkCallback-19457-thread-1-processing-n:127.0.0.1:42787_ak) [n:127.0.0.1:42787_ak    ] o.a.s.c.c.ZkStateReader A cluster state change: [WatchedEvent state:SyncConnected type:NodeDataChanged path:/collections/collection1/state.json] for collection [collection1] has occurred - updating... (live nodes size: [5])
   [junit4]   2> 1002014 INFO  (zkCallback-19463-thread-1-processing-n:127.0.0.1:35783_ak) [n:127.0.0.1:35783_ak    ] o.a.s.c.c.ZkStateReader A cluster state change: [WatchedEvent state:SyncConnected type:NodeDataChanged path:/collections/collection1/state.json] for collection [collection1] has occurred - updating... (live nodes size: [5])
   [junit4]   2> 1002014 INFO  (zkCallback-19469-thread-2-processing-n:127.0.0.1:44257_ak) [n:127.0.0.1:44257_ak    ] o.a.s.c.c.ZkStateReader A cluster state change: [WatchedEvent state:SyncConnected type:NodeDataChanged path:/collections/collection1/state.json] for collection [collection1] has occurred - updating... (live nodes size: [5])
   [junit4]   2> 1002014 INFO  (zkCallback-19476-thread-1-processin

[...truncated too long message...]

0 s:shard1_1 c:shardSplitWithRule r:core_node5) [n:127.0.0.1:38677_ak c:shardSplitWithRule s:shard1_1 r:core_node5 x:shardSplitWithRule_shard1_1_replica0] o.a.s.c.RecoveryStrategy Replay not started, or was not successful... still buffering updates.
   [junit4]   2> 1378635 INFO  (recoveryExecutor-19658-thread-1-processing-n:127.0.0.1:38677_ak x:shardSplitWithRule_shard1_1_replica0 s:shard1_1 c:shardSplitWithRule r:core_node5) [n:127.0.0.1:38677_ak c:shardSplitWithRule s:shard1_1 r:core_node5 x:shardSplitWithRule_shard1_1_replica0] o.a.s.c.RecoveryStrategy RecoveryStrategy has been closed
   [junit4]   2> 1378635 INFO  (recoveryExecutor-19658-thread-1-processing-n:127.0.0.1:38677_ak x:shardSplitWithRule_shard1_1_replica0 s:shard1_1 c:shardSplitWithRule r:core_node5) [n:127.0.0.1:38677_ak c:shardSplitWithRule s:shard1_1 r:core_node5 x:shardSplitWithRule_shard1_1_replica0] o.a.s.c.RecoveryStrategy Finished recovery process, successful=[false]
   [junit4]   2> 1378635 INFO  (recoveryExecutor-19658-thread-1-processing-n:127.0.0.1:38677_ak x:shardSplitWithRule_shard1_1_replica0 s:shard1_1 c:shardSplitWithRule r:core_node5) [n:127.0.0.1:38677_ak c:shardSplitWithRule s:shard1_1 r:core_node5 x:shardSplitWithRule_shard1_1_replica0] o.a.s.c.SolrCore [shardSplitWithRule_shard1_1_replica0]  CLOSING SolrCore org.apache.solr.core.SolrCore@f0e9f9
   [junit4]   2> 1378635 WARN  (recoveryExecutor-19658-thread-1-processing-n:127.0.0.1:38677_ak x:shardSplitWithRule_shard1_1_replica0 s:shard1_1 c:shardSplitWithRule r:core_node5) [n:127.0.0.1:38677_ak c:shardSplitWithRule s:shard1_1 r:core_node5 x:shardSplitWithRule_shard1_1_replica0] o.a.s.c.RecoveryStrategy Stopping recovery for core=[shardSplitWithRule_shard1_1_replica0] coreNodeName=[core_node5]
   [junit4]   2> 1378641 INFO  (TEST-ShardSplitTest.testSplitShardWithRule-seed#[A78F4599CC12AA00]) [    ] o.a.s.c.Overseer Overseer (id=96841234625396750-127.0.0.1:38677_ak-n_0000000003) closing
   [junit4]   2> 1378641 INFO  (OverseerStateUpdate-96841234625396750-127.0.0.1:38677_ak-n_0000000003) [n:127.0.0.1:38677_ak    ] o.a.s.c.Overseer Overseer Loop exiting : 127.0.0.1:38677_ak
   [junit4]   2> 1378647 INFO  (zkCallback-19643-thread-1) [    ] o.a.s.c.c.ZkStateReader Updated live nodes from ZooKeeper... (2) -> (1)
   [junit4]   2> 1378647 INFO  (zkCallback-19667-thread-2-processing-n:127.0.0.1:39478_ak) [n:127.0.0.1:39478_ak    ] o.a.s.c.c.ZkStateReader Updated live nodes from ZooKeeper... (2) -> (1)
   [junit4]   2> 1378647 INFO  (zkCallback-19667-thread-1-processing-n:127.0.0.1:39478_ak) [n:127.0.0.1:39478_ak    ] o.a.s.c.OverseerElectionContext I am going to be the leader 127.0.0.1:39478_ak
   [junit4]   2> 1378647 INFO  (zkCallback-19667-thread-1-processing-n:127.0.0.1:39478_ak) [n:127.0.0.1:39478_ak    ] o.a.s.c.Overseer Overseer (id=96841234625396753-127.0.0.1:39478_ak-n_0000000004) starting
   [junit4]   2> 1380147 WARN  (zkCallback-19660-thread-3-processing-n:127.0.0.1:38677_ak) [n:127.0.0.1:38677_ak    ] o.a.s.c.c.ZkStateReader ZooKeeper watch triggered, but Solr cannot talk to ZK: [KeeperErrorCode = Session expired for /live_nodes]
   [junit4]   2> 1380147 INFO  (TEST-ShardSplitTest.testSplitShardWithRule-seed#[A78F4599CC12AA00]) [    ] o.e.j.s.ServerConnector Stopped ServerConnector@1c211af{HTTP/1.1,[http/1.1]}{127.0.0.1:0}
   [junit4]   2> 1380148 INFO  (TEST-ShardSplitTest.testSplitShardWithRule-seed#[A78F4599CC12AA00]) [    ] o.e.j.s.h.ContextHandler Stopped o.e.j.s.ServletContextHandler@1a54703{/ak,null,UNAVAILABLE}
   [junit4]   2> 1380148 INFO  (TEST-ShardSplitTest.testSplitShardWithRule-seed#[A78F4599CC12AA00]) [    ] o.a.s.c.ChaosMonkey monkey: stop shard! 39478
   [junit4]   2> 1380148 INFO  (TEST-ShardSplitTest.testSplitShardWithRule-seed#[A78F4599CC12AA00]) [    ] o.a.s.c.CoreContainer Shutting down CoreContainer instance=9759063
   [junit4]   2> 1380149 INFO  (coreCloseExecutor-8015-thread-1) [n:127.0.0.1:39478_ak c:collection1 s:shard1 r:core_node4 x:collection1] o.a.s.c.SolrCore [collection1]  CLOSING SolrCore org.apache.solr.core.SolrCore@5b5b30
   [junit4]   2> 1380156 INFO  (TEST-ShardSplitTest.testSplitShardWithRule-seed#[A78F4599CC12AA00]) [    ] o.a.s.c.Overseer Overseer (id=96841234625396753-127.0.0.1:39478_ak-n_0000000004) closing
   [junit4]   2> 1380156 INFO  (OverseerStateUpdate-96841234625396753-127.0.0.1:39478_ak-n_0000000004) [n:127.0.0.1:39478_ak    ] o.a.s.c.Overseer Overseer Loop exiting : 127.0.0.1:39478_ak
   [junit4]   2> 1380156 WARN  (zkCallback-19667-thread-2-processing-n:127.0.0.1:39478_ak) [n:127.0.0.1:39478_ak    ] o.a.s.c.c.ZkStateReader ZooKeeper watch triggered, but Solr cannot talk to ZK: [KeeperErrorCode = Session expired for /live_nodes]
   [junit4]   2> 1380156 INFO  (zkCallback-19643-thread-1) [    ] o.a.s.c.c.ZkStateReader Updated live nodes from ZooKeeper... (1) -> (0)
   [junit4]   2> 1380157 INFO  (TEST-ShardSplitTest.testSplitShardWithRule-seed#[A78F4599CC12AA00]) [    ] o.e.j.s.ServerConnector Stopped ServerConnector@84424d{HTTP/1.1,[http/1.1]}{127.0.0.1:0}
   [junit4]   2> 1380157 INFO  (TEST-ShardSplitTest.testSplitShardWithRule-seed#[A78F4599CC12AA00]) [    ] o.e.j.s.h.ContextHandler Stopped o.e.j.s.ServletContextHandler@1627ff9{/ak,null,UNAVAILABLE}
   [junit4]   2> 1380158 INFO  (TEST-ShardSplitTest.testSplitShardWithRule-seed#[A78F4599CC12AA00]) [    ] o.a.s.c.ChaosMonkey monkey: stop shard! 43126
   [junit4]   2> 1380158 INFO  (TEST-ShardSplitTest.testSplitShardWithRule-seed#[A78F4599CC12AA00]) [    ] o.a.s.c.ZkTestServer connecting to 127.0.0.1:46282 46282
   [junit4]   2> 1380182 INFO  (Thread-2101) [    ] o.a.s.c.ZkTestServer connecting to 127.0.0.1:46282 46282
   [junit4]   2> 1380182 WARN  (Thread-2101) [    ] o.a.s.c.ZkTestServer Watch limit violations: 
   [junit4]   2> Maximum concurrent create/delete watches above limit:
   [junit4]   2> 
   [junit4]   2> 	6	/solr/aliases.json
   [junit4]   2> 	6	/solr/clusterprops.json
   [junit4]   2> 	5	/solr/security.json
   [junit4]   2> 	5	/solr/configs/conf1
   [junit4]   2> 	4	/solr/collections/collection1/state.json
   [junit4]   2> 
   [junit4]   2> Maximum concurrent data watches above limit:
   [junit4]   2> 
   [junit4]   2> 	64	/solr/collections/shardSplitWithRule/state.json
   [junit4]   2> 	6	/solr/clusterprops.json
   [junit4]   2> 	6	/solr/clusterstate.json
   [junit4]   2> 
   [junit4]   2> Maximum concurrent children watches above limit:
   [junit4]   2> 
   [junit4]   2> 	50	/solr/overseer/queue
   [junit4]   2> 	27	/solr/overseer/collection-queue-work
   [junit4]   2> 	10	/solr/overseer/queue-work
   [junit4]   2> 	6	/solr/live_nodes
   [junit4]   2> 	6	/solr/collections
   [junit4]   2> 
   [junit4]   2> 1380184 INFO  (SUITE-ShardSplitTest-seed#[A78F4599CC12AA00]-worker) [    ] o.a.s.SolrTestCaseJ4 ###deleteCore
   [junit4]   2> NOTE: leaving temporary files on disk at: /home/jenkins/workspace/Lucene-Solr-6.x-Linux/solr/build/solr-core/test/J2/temp/solr.cloud.ShardSplitTest_A78F4599CC12AA00-001
   [junit4]   2> Oct 28, 2016 6:40:07 PM com.carrotsearch.randomizedtesting.ThreadLeakControl checkThreadLeaks
   [junit4]   2> WARNING: Will linger awaiting termination of 3 leaked thread(s).
   [junit4]   2> NOTE: test params are: codec=Lucene62, sim=ClassicSimilarity, locale=bg-BG, timezone=America/Blanc-Sablon
   [junit4]   2> NOTE: Linux 4.4.0-42-generic i386/Oracle Corporation 1.8.0_102 (32-bit)/cpus=12,threads=1,free=68352088,total=333664256
   [junit4]   2> NOTE: All tests run in this JVM: [TestRestoreCore, CurrencyFieldXmlFileTest, AutoCommitTest, TestLeaderElectionWithEmptyReplica, TestXmlQParserPlugin, CloneFieldUpdateProcessorFactoryTest, XmlUpdateRequestHandlerTest, HttpPartitionTest, DistanceUnitsTest, TestCollationFieldDocValues, TestCloudInspectUtil, EnumFieldTest, BlobRepositoryCloudTest, TestMissingGroups, ResponseHeaderTest, TestDynamicLoading, HdfsRecoverLeaseTest, TimeZoneUtilsTest, TestQueryWrapperFilter, FullSolrCloudDistribCmdsTest, TestIndexSearcher, TestCoreDiscovery, DistributedFacetPivotLargeTest, LeaderElectionTest, TestExceedMaxTermLength, TestCryptoKeys, PreAnalyzedFieldTest, BasicDistributedZk2Test, TestZkChroot, TestHighFrequencyDictionaryFactory, TestNumericTerms32, ConnectionManagerTest, CollectionsAPISolrJTest, SOLR749Test, TestUtils, TestSolrJ, TestTrackingShardHandlerFactory, DistribCursorPagingTest, TestLFUCache, StatelessScriptUpdateProcessorFactoryTest, TestLMJelinekMercerSimilarityFactory, PrimUtilsTest, TestXIncludeConfig, TestExactSharedStatsCache, TestSolr4Spatial2, HdfsChaosMonkeySafeLeaderTest, TestConfigSets, PingRequestHandlerTest, TestSolrQueryParser, SpatialHeatmapFacetsTest, CdcrBootstrapTest, TestCloudManagedSchema, CdcrRequestHandlerTest, CursorMarkTest, DistributedDebugComponentTest, AddSchemaFieldsUpdateProcessorFactoryTest, TestSchemaVersionResource, PeerSyncReplicationTest, TestReversedWildcardFilterFactory, ReplaceNodeTest, BinaryUpdateRequestHandlerTest, CircularListTest, LukeRequestHandlerTest, BlockJoinFacetSimpleTest, TestPhraseSuggestions, TestSolrCLIRunExample, TestPostingsSolrHighlighter, TestLocalFSCloudBackupRestore, TestDynamicFieldCollectionResource, DirectUpdateHandlerTest, ParsingFieldUpdateProcessorsTest, TestManagedResourceStorage, TestDownShardTolerantSearch, SpellPossibilityIteratorTest, TestMinMaxOnMultiValuedField, DistributedQueueTest, TlogReplayBufferedWhileIndexingTest, TestWriterPerf, CollectionStateFormat2Test, PrimitiveFieldTypeTest, TestSort, TestRecovery, ResponseLogComponentTest, SolrXmlInZkTest, SimpleFacetsTest, QueryParsingTest, SuggesterTest, TestDFRSimilarityFactory, BigEndianAscendingWordDeserializerTest, TestHdfsBackupRestoreCore, TestSchemaNameResource, SuggesterTSTTest, TestStressLiveNodes, TestReplicaProperties, SecurityConfHandlerTest, ChangedSchemaMergeTest, BufferStoreTest, BadIndexSchemaTest, TestManagedSchemaThreadSafety, ShardSplitTest]
   [junit4] Completed [393/648 (1!)] on J2 in 387.00s, 5 tests, 1 failure <<< FAILURES!

[...truncated 53580 lines...]


Mime
View raw message