lucene-dev mailing list archives

Site index · List index
Message view « Date » · « Thread »
Top « Date » · « Thread »
From Policeman Jenkins Server <jenk...@thetaphi.de>
Subject [JENKINS-EA] Lucene-Solr-master-Linux (32bit/jdk-9-ea+140) - Build # 18183 - Still Unstable!
Date Mon, 31 Oct 2016 07:48:25 GMT
Build: https://jenkins.thetaphi.de/job/Lucene-Solr-master-Linux/18183/
Java: 32bit/jdk-9-ea+140 -client -XX:+UseSerialGC

1 tests failed.
FAILED:  org.apache.solr.handler.component.SpellCheckComponentTest.testThresholdTokenFrequency

Error Message:
Path not found: /spellcheck/suggestions/[1]/suggestion

Stack Trace:
java.lang.RuntimeException: Path not found: /spellcheck/suggestions/[1]/suggestion
	at __randomizedtesting.SeedInfo.seed([4B1CF67E50479C63:C1BB798FDFACA518]:0)
	at org.apache.solr.SolrTestCaseJ4.assertJQ(SolrTestCaseJ4.java:900)
	at org.apache.solr.SolrTestCaseJ4.assertJQ(SolrTestCaseJ4.java:847)
	at org.apache.solr.handler.component.SpellCheckComponentTest.testThresholdTokenFrequency(SpellCheckComponentTest.java:277)
	at jdk.internal.reflect.NativeMethodAccessorImpl.invoke0(java.base@9-ea/Native Method)
	at jdk.internal.reflect.NativeMethodAccessorImpl.invoke(java.base@9-ea/NativeMethodAccessorImpl.java:62)
	at jdk.internal.reflect.DelegatingMethodAccessorImpl.invoke(java.base@9-ea/DelegatingMethodAccessorImpl.java:43)
	at java.lang.reflect.Method.invoke(java.base@9-ea/Method.java:535)
	at com.carrotsearch.randomizedtesting.RandomizedRunner.invoke(RandomizedRunner.java:1713)
	at com.carrotsearch.randomizedtesting.RandomizedRunner$8.evaluate(RandomizedRunner.java:907)
	at com.carrotsearch.randomizedtesting.RandomizedRunner$9.evaluate(RandomizedRunner.java:943)
	at com.carrotsearch.randomizedtesting.RandomizedRunner$10.evaluate(RandomizedRunner.java:957)
	at com.carrotsearch.randomizedtesting.rules.SystemPropertiesRestoreRule$1.evaluate(SystemPropertiesRestoreRule.java:57)
	at org.apache.lucene.util.TestRuleSetupTeardownChained$1.evaluate(TestRuleSetupTeardownChained.java:49)
	at org.apache.lucene.util.AbstractBeforeAfterRule$1.evaluate(AbstractBeforeAfterRule.java:45)
	at org.apache.lucene.util.TestRuleThreadAndTestName$1.evaluate(TestRuleThreadAndTestName.java:48)
	at org.apache.lucene.util.TestRuleIgnoreAfterMaxFailures$1.evaluate(TestRuleIgnoreAfterMaxFailures.java:64)
	at org.apache.lucene.util.TestRuleMarkFailure$1.evaluate(TestRuleMarkFailure.java:47)
	at com.carrotsearch.randomizedtesting.rules.StatementAdapter.evaluate(StatementAdapter.java:36)
	at com.carrotsearch.randomizedtesting.ThreadLeakControl$StatementRunner.run(ThreadLeakControl.java:367)
	at com.carrotsearch.randomizedtesting.ThreadLeakControl.forkTimeoutingTask(ThreadLeakControl.java:811)
	at com.carrotsearch.randomizedtesting.ThreadLeakControl$3.evaluate(ThreadLeakControl.java:462)
	at com.carrotsearch.randomizedtesting.RandomizedRunner.runSingleTest(RandomizedRunner.java:916)
	at com.carrotsearch.randomizedtesting.RandomizedRunner$5.evaluate(RandomizedRunner.java:802)
	at com.carrotsearch.randomizedtesting.RandomizedRunner$6.evaluate(RandomizedRunner.java:852)
	at com.carrotsearch.randomizedtesting.RandomizedRunner$7.evaluate(RandomizedRunner.java:863)
	at com.carrotsearch.randomizedtesting.rules.StatementAdapter.evaluate(StatementAdapter.java:36)
	at com.carrotsearch.randomizedtesting.rules.SystemPropertiesRestoreRule$1.evaluate(SystemPropertiesRestoreRule.java:57)
	at org.apache.lucene.util.AbstractBeforeAfterRule$1.evaluate(AbstractBeforeAfterRule.java:45)
	at com.carrotsearch.randomizedtesting.rules.StatementAdapter.evaluate(StatementAdapter.java:36)
	at org.apache.lucene.util.TestRuleStoreClassName$1.evaluate(TestRuleStoreClassName.java:41)
	at com.carrotsearch.randomizedtesting.rules.NoShadowingOrOverridesOnMethodsRule$1.evaluate(NoShadowingOrOverridesOnMethodsRule.java:40)
	at com.carrotsearch.randomizedtesting.rules.NoShadowingOrOverridesOnMethodsRule$1.evaluate(NoShadowingOrOverridesOnMethodsRule.java:40)
	at com.carrotsearch.randomizedtesting.rules.StatementAdapter.evaluate(StatementAdapter.java:36)
	at com.carrotsearch.randomizedtesting.rules.StatementAdapter.evaluate(StatementAdapter.java:36)
	at com.carrotsearch.randomizedtesting.rules.StatementAdapter.evaluate(StatementAdapter.java:36)
	at org.apache.lucene.util.TestRuleAssertionsRequired$1.evaluate(TestRuleAssertionsRequired.java:53)
	at org.apache.lucene.util.TestRuleMarkFailure$1.evaluate(TestRuleMarkFailure.java:47)
	at org.apache.lucene.util.TestRuleIgnoreAfterMaxFailures$1.evaluate(TestRuleIgnoreAfterMaxFailures.java:64)
	at org.apache.lucene.util.TestRuleIgnoreTestSuites$1.evaluate(TestRuleIgnoreTestSuites.java:54)
	at com.carrotsearch.randomizedtesting.rules.StatementAdapter.evaluate(StatementAdapter.java:36)
	at com.carrotsearch.randomizedtesting.ThreadLeakControl$StatementRunner.run(ThreadLeakControl.java:367)
	at java.lang.Thread.run(java.base@9-ea/Thread.java:843)




Build Log:
[...truncated 11050 lines...]
   [junit4] Suite: org.apache.solr.handler.component.SpellCheckComponentTest
   [junit4]   2> Creating dataDir: /home/jenkins/workspace/Lucene-Solr-master-Linux/solr/build/solr-core/test/J1/temp/solr.handler.component.SpellCheckComponentTest_4B1CF67E50479C63-001/init-core-data-001
   [junit4]   2> 455984 INFO  (SUITE-SpellCheckComponentTest-seed#[4B1CF67E50479C63]-worker) [    ] o.a.s.SolrTestCaseJ4 Randomized ssl (false) and clientAuth (true) via: @org.apache.solr.util.RandomizeSSL(reason="", ssl=0.0/0.0, value=0.0/0.0, clientAuth=0.0/0.0)
   [junit4]   2> 455984 INFO  (SUITE-SpellCheckComponentTest-seed#[4B1CF67E50479C63]-worker) [    ] o.a.s.SolrTestCaseJ4 ####initCore
   [junit4]   2> 455986 INFO  (SUITE-SpellCheckComponentTest-seed#[4B1CF67E50479C63]-worker) [    ] o.a.s.c.SolrResourceLoader [null] Added 2 libs to classloader, from paths: [/home/jenkins/workspace/Lucene-Solr-master-Linux/solr/core/src/test-files/solr/collection1/lib, /home/jenkins/workspace/Lucene-Solr-master-Linux/solr/core/src/test-files/solr/collection1/lib/classes]
   [junit4]   2> 456070 WARN  (SUITE-SpellCheckComponentTest-seed#[4B1CF67E50479C63]-worker) [    ] o.a.s.c.Config Beginning with Solr 5.5, <mergePolicy> is deprecated, use <mergePolicyFactory> instead.
   [junit4]   2> 456075 INFO  (SUITE-SpellCheckComponentTest-seed#[4B1CF67E50479C63]-worker) [    ] o.a.s.c.SolrConfig Using Lucene MatchVersion: 7.0.0
   [junit4]   2> 456085 INFO  (SUITE-SpellCheckComponentTest-seed#[4B1CF67E50479C63]-worker) [    ] o.a.s.s.IndexSchema [null] Schema name=test
   [junit4]   2> 456148 WARN  (SUITE-SpellCheckComponentTest-seed#[4B1CF67E50479C63]-worker) [    ] o.a.s.s.IndexSchema [null] default search field in schema is text. WARNING: Deprecated, please use 'df' on request instead.
   [junit4]   2> 456150 INFO  (SUITE-SpellCheckComponentTest-seed#[4B1CF67E50479C63]-worker) [    ] o.a.s.s.IndexSchema Loaded schema test/1.0 with uniqueid field id
   [junit4]   2> 456180 INFO  (coreLoadExecutor-1801-thread-1) [    ] o.a.s.c.SolrResourceLoader [null] Added 2 libs to classloader, from paths: [/home/jenkins/workspace/Lucene-Solr-master-Linux/solr/core/src/test-files/solr/collection1/lib, /home/jenkins/workspace/Lucene-Solr-master-Linux/solr/core/src/test-files/solr/collection1/lib/classes]
   [junit4]   2> 456260 WARN  (coreLoadExecutor-1801-thread-1) [    ] o.a.s.c.Config Beginning with Solr 5.5, <mergePolicy> is deprecated, use <mergePolicyFactory> instead.
   [junit4]   2> 456261 INFO  (coreLoadExecutor-1801-thread-1) [    ] o.a.s.c.SolrConfig Using Lucene MatchVersion: 7.0.0
   [junit4]   2> 456276 INFO  (coreLoadExecutor-1801-thread-1) [    ] o.a.s.s.IndexSchema [collection1] Schema name=test
   [junit4]   2> 456338 WARN  (coreLoadExecutor-1801-thread-1) [    ] o.a.s.s.IndexSchema [collection1] default search field in schema is text. WARNING: Deprecated, please use 'df' on request instead.
   [junit4]   2> 456340 INFO  (coreLoadExecutor-1801-thread-1) [    ] o.a.s.s.IndexSchema Loaded schema test/1.0 with uniqueid field id
   [junit4]   2> 456362 INFO  (coreLoadExecutor-1801-thread-1) [    ] o.a.s.c.CoreContainer Creating SolrCore 'collection1' using configuration from instancedir /home/jenkins/workspace/Lucene-Solr-master-Linux/solr/core/src/test-files/solr/collection1
   [junit4]   2> 456362 INFO  (coreLoadExecutor-1801-thread-1) [    ] o.a.s.c.SolrCore [[collection1] ] Opening new SolrCore at [/home/jenkins/workspace/Lucene-Solr-master-Linux/solr/core/src/test-files/solr/collection1], dataDir=[/home/jenkins/workspace/Lucene-Solr-master-Linux/solr/build/solr-core/test/J1/temp/solr.handler.component.SpellCheckComponentTest_4B1CF67E50479C63-001/init-core-data-001/]
   [junit4]   2> 456363 INFO  (coreLoadExecutor-1801-thread-1) [    ] o.a.s.u.RandomMergePolicy RandomMergePolicy wrapping class org.apache.lucene.index.LogByteSizeMergePolicy: [LogByteSizeMergePolicy: minMergeSize=1677721, mergeFactor=21, maxMergeSize=2147483648, maxMergeSizeForForcedMerge=9223372036854775807, calibrateSizeByDeletes=true, maxMergeDocs=2147483647, maxCFSSegmentSizeMB=8.796093022207999E12, noCFSRatio=1.0]
   [junit4]   2> 456367 INFO  (coreLoadExecutor-1801-thread-1) [    ] o.a.s.u.CommitTracker Hard AutoCommit: disabled
   [junit4]   2> 456367 INFO  (coreLoadExecutor-1801-thread-1) [    ] o.a.s.u.CommitTracker Soft AutoCommit: disabled
   [junit4]   2> 456367 INFO  (coreLoadExecutor-1801-thread-1) [    ] o.a.s.u.RandomMergePolicy RandomMergePolicy wrapping class org.apache.lucene.index.LogDocMergePolicy: [LogDocMergePolicy: minMergeSize=1000, mergeFactor=43, maxMergeSize=9223372036854775807, maxMergeSizeForForcedMerge=9223372036854775807, calibrateSizeByDeletes=false, maxMergeDocs=2147483647, maxCFSSegmentSizeMB=8.796093022207999E12, noCFSRatio=1.0]
   [junit4]   2> 456367 INFO  (coreLoadExecutor-1801-thread-1) [    ] o.a.s.s.SolrIndexSearcher Opening [Searcher@106bc82[collection1] main]
   [junit4]   2> 456368 WARN  (coreLoadExecutor-1801-thread-1) [    ] o.a.s.r.ManagedResourceStorage Cannot write to config directory /home/jenkins/workspace/Lucene-Solr-master-Linux/solr/core/src/test-files/solr/collection1/conf; switching to use InMemory storage instead.
   [junit4]   2> 456368 INFO  (coreLoadExecutor-1801-thread-1) [    ] o.a.s.h.c.SpellCheckComponent Initializing spell checkers
   [junit4]   2> 456416 INFO  (coreLoadExecutor-1801-thread-1) [    ] o.a.s.h.c.SpellCheckComponent Registering newSearcher listener for spellchecker: default
   [junit4]   2> 456462 INFO  (coreLoadExecutor-1801-thread-1) [    ] o.a.s.h.c.SpellCheckComponent Registering newSearcher listener for spellchecker: default_teststop
   [junit4]   2> 456462 INFO  (coreLoadExecutor-1801-thread-1) [    ] o.a.s.s.DirectSolrSpellChecker init: {name=direct,classname=solr.DirectSolrSpellChecker,minQueryLength=3,maxQueryFrequency=100.0,field=teststop}
   [junit4]   2> 456463 INFO  (coreLoadExecutor-1801-thread-1) [    ] o.a.s.s.DirectSolrSpellChecker init: {name=direct_lowerfilt,classname=solr.DirectSolrSpellChecker,minQueryLength=3,maxQueryFrequency=100.0,field=lowerfilt}
   [junit4]   2> 456510 INFO  (coreLoadExecutor-1801-thread-1) [    ] o.a.s.h.c.SpellCheckComponent Registering newSearcher listener for spellchecker: threshold
   [junit4]   2> 456510 INFO  (coreLoadExecutor-1801-thread-1) [    ] o.a.s.s.DirectSolrSpellChecker init: {name=threshold_direct,classname=solr.DirectSolrSpellChecker,field=lowerfilt,spellcheckIndexDir=spellcheckerThreshold,buildOnCommit=true,thresholdTokenFrequency=0.29}
   [junit4]   2> 456510 INFO  (coreLoadExecutor-1801-thread-1) [    ] o.a.s.h.c.SpellCheckComponent Registering newSearcher listener for spellchecker: threshold_direct
   [junit4]   2> 456553 INFO  (coreLoadExecutor-1801-thread-1) [    ] o.a.s.h.c.SpellCheckComponent Registering newSearcher listener for spellchecker: multipleFields
   [junit4]   2> 456679 INFO  (coreLoadExecutor-1801-thread-1) [    ] o.a.s.h.c.SpellCheckComponent Registering newSearcher listener for spellchecker: freq
   [junit4]   2> 456712 INFO  (coreLoadExecutor-1801-thread-1) [    ] o.a.s.h.c.SpellCheckComponent Registering newSearcher listener for spellchecker: fqcn
   [junit4]   2> 456712 INFO  (coreLoadExecutor-1801-thread-1) [    ] o.a.s.h.ReplicationHandler Commits will be reserved for  10000
   [junit4]   2> 456712 INFO  (searcherExecutor-1802-thread-1) [    ] o.a.s.h.c.SpellCheckComponent Loading spell index for spellchecker: default
   [junit4]   2> 456713 INFO  (SUITE-SpellCheckComponentTest-seed#[4B1CF67E50479C63]-worker) [    ] o.a.s.SolrTestCaseJ4 ####initCore end
   [junit4]   2> 456714 INFO  (searcherExecutor-1802-thread-1) [    ] o.a.s.h.c.SpellCheckComponent Loading spell index for spellchecker: default_teststop
   [junit4]   2> 456715 INFO  (TEST-SpellCheckComponentTest.testThresholdTokenFrequency-seed#[4B1CF67E50479C63]) [    ] o.a.s.SolrTestCaseJ4 ###Starting testThresholdTokenFrequency
   [junit4]   2> 456716 INFO  (searcherExecutor-1802-thread-1) [    ] o.a.s.h.c.SpellCheckComponent Loading spell index for spellchecker: direct
   [junit4]   2> 456716 INFO  (searcherExecutor-1802-thread-1) [    ] o.a.s.h.c.SpellCheckComponent Loading spell index for spellchecker: direct_lowerfilt
   [junit4]   2> 456716 INFO  (searcherExecutor-1802-thread-1) [    ] o.a.s.h.c.SpellCheckComponent Loading spell index for spellchecker: wordbreak
   [junit4]   2> 456716 INFO  (searcherExecutor-1802-thread-1) [    ] o.a.s.h.c.SpellCheckComponent Loading spell index for spellchecker: threshold
   [junit4]   2> 456716 INFO  (TEST-SpellCheckComponentTest.testThresholdTokenFrequency-seed#[4B1CF67E50479C63]) [    ] o.a.s.u.p.LogUpdateProcessorFactory [collection1]  webapp=null path=null params={}{add=[0]} 0 1
   [junit4]   2> 456717 INFO  (searcherExecutor-1802-thread-1) [    ] o.a.s.h.c.SpellCheckComponent Loading spell index for spellchecker: threshold_direct
   [junit4]   2> 456717 INFO  (searcherExecutor-1802-thread-1) [    ] o.a.s.h.c.SpellCheckComponent Loading spell index for spellchecker: multipleFields
   [junit4]   2> 456717 INFO  (TEST-SpellCheckComponentTest.testThresholdTokenFrequency-seed#[4B1CF67E50479C63]) [    ] o.a.s.u.p.LogUpdateProcessorFactory [collection1]  webapp=null path=null params={}{add=[1]} 0 0
   [junit4]   2> 456718 INFO  (TEST-SpellCheckComponentTest.testThresholdTokenFrequency-seed#[4B1CF67E50479C63]) [    ] o.a.s.u.p.LogUpdateProcessorFactory [collection1]  webapp=null path=null params={}{add=[2]} 0 0
   [junit4]   2> 456718 INFO  (TEST-SpellCheckComponentTest.testThresholdTokenFrequency-seed#[4B1CF67E50479C63]) [    ] o.a.s.u.p.LogUpdateProcessorFactory [collection1]  webapp=null path=null params={}{add=[3]} 0 0
   [junit4]   2> 456718 INFO  (searcherExecutor-1802-thread-1) [    ] o.a.s.h.c.SpellCheckComponent Loading spell index for spellchecker: jarowinkler
   [junit4]   2> 456718 INFO  (TEST-SpellCheckComponentTest.testThresholdTokenFrequency-seed#[4B1CF67E50479C63]) [    ] o.a.s.u.p.LogUpdateProcessorFactory [collection1]  webapp=null path=null params={}{add=[4]} 0 0
   [junit4]   2> 456718 INFO  (TEST-SpellCheckComponentTest.testThresholdTokenFrequency-seed#[4B1CF67E50479C63]) [    ] o.a.s.u.p.LogUpdateProcessorFactory [collection1]  webapp=null path=null params={}{add=[5]} 0 0
   [junit4]   2> 456719 INFO  (TEST-SpellCheckComponentTest.testThresholdTokenFrequency-seed#[4B1CF67E50479C63]) [    ] o.a.s.u.p.LogUpdateProcessorFactory [collection1]  webapp=null path=null params={}{add=[6]} 0 0
   [junit4]   2> 456719 INFO  (TEST-SpellCheckComponentTest.testThresholdTokenFrequency-seed#[4B1CF67E50479C63]) [    ] o.a.s.u.p.LogUpdateProcessorFactory [collection1]  webapp=null path=null params={}{add=[7]} 0 0
   [junit4]   2> 456719 INFO  (searcherExecutor-1802-thread-1) [    ] o.a.s.h.c.SpellCheckComponent Loading spell index for spellchecker: external
   [junit4]   2> 456719 INFO  (TEST-SpellCheckComponentTest.testThresholdTokenFrequency-seed#[4B1CF67E50479C63]) [    ] o.a.s.u.p.LogUpdateProcessorFactory [collection1]  webapp=null path=null params={}{add=[8]} 0 0
   [junit4]   2> 456720 INFO  (TEST-SpellCheckComponentTest.testThresholdTokenFrequency-seed#[4B1CF67E50479C63]) [    ] o.a.s.u.p.LogUpdateProcessorFactory [collection1]  webapp=null path=null params={}{add=[9]} 0 0
   [junit4]   2> 456726 INFO  (TEST-SpellCheckComponentTest.testThresholdTokenFrequency-seed#[4B1CF67E50479C63]) [    ] o.a.s.u.DirectUpdateHandler2 start commit{,optimize=false,openSearcher=true,waitSearcher=true,expungeDeletes=false,softCommit=false,prepareCommit=false}
   [junit4]   2> 456726 INFO  (TEST-SpellCheckComponentTest.testThresholdTokenFrequency-seed#[4B1CF67E50479C63]) [    ] o.a.s.u.SolrIndexWriter Calling setCommitData with IW:org.apache.solr.update.SolrIndexWriter@159a2ff
   [junit4]   2> 456727 INFO  (searcherExecutor-1802-thread-1) [    ] o.a.s.h.c.SpellCheckComponent Loading spell index for spellchecker: freq
   [junit4]   2> 456728 INFO  (searcherExecutor-1802-thread-1) [    ] o.a.s.h.c.SpellCheckComponent Loading spell index for spellchecker: fqcn
   [junit4]   2> 456729 WARN  (TEST-SpellCheckComponentTest.testThresholdTokenFrequency-seed#[4B1CF67E50479C63]) [    ] o.a.s.c.SolrCore [collection1] PERFORMANCE WARNING: Overlapping onDeckSearchers=2
   [junit4]   2> 456730 INFO  (TEST-SpellCheckComponentTest.testThresholdTokenFrequency-seed#[4B1CF67E50479C63]) [    ] o.a.s.s.SolrIndexSearcher Opening [Searcher@574889[collection1] main]
   [junit4]   2> 456730 INFO  (TEST-SpellCheckComponentTest.testThresholdTokenFrequency-seed#[4B1CF67E50479C63]) [    ] o.a.s.u.DirectUpdateHandler2 end_commit_flush
   [junit4]   2> 456731 INFO  (searcherExecutor-1802-thread-1) [    ] o.a.s.h.c.SpellCheckComponent Loading spell index for spellchecker: perDict
   [junit4]   2> 456731 INFO  (searcherExecutor-1802-thread-1) [    ] o.a.s.c.SolrCore [collection1] Registered new searcher Searcher@106bc82[collection1] main{ExitableDirectoryReader(UninvertingDirectoryReader())}
   [junit4]   2> 456731 INFO  (searcherExecutor-1802-thread-1) [    ] o.a.s.h.c.SpellCheckComponent Loading spell index for spellchecker: default
   [junit4]   2> 456733 INFO  (searcherExecutor-1802-thread-1) [    ] o.a.s.h.c.SpellCheckComponent Loading spell index for spellchecker: default_teststop
   [junit4]   2> 456735 INFO  (searcherExecutor-1802-thread-1) [    ] o.a.s.h.c.SpellCheckComponent Loading spell index for spellchecker: direct
   [junit4]   2> 456735 INFO  (searcherExecutor-1802-thread-1) [    ] o.a.s.h.c.SpellCheckComponent Loading spell index for spellchecker: direct_lowerfilt
   [junit4]   2> 456735 INFO  (searcherExecutor-1802-thread-1) [    ] o.a.s.h.c.SpellCheckComponent Loading spell index for spellchecker: wordbreak
   [junit4]   2> 456736 INFO  (searcherExecutor-1802-thread-1) [    ] o.a.s.h.c.SpellCheckComponent Loading spell index for spellchecker: threshold
   [junit4]   2> 456738 INFO  (searcherExecutor-1802-thread-1) [    ] o.a.s.h.c.SpellCheckComponent Loading spell index for spellchecker: threshold_direct
   [junit4]   2> 456738 INFO  (searcherExecutor-1802-thread-1) [    ] o.a.s.h.c.SpellCheckComponent Loading spell index for spellchecker: multipleFields
   [junit4]   2> 456740 INFO  (searcherExecutor-1802-thread-1) [    ] o.a.s.h.c.SpellCheckComponent Loading spell index for spellchecker: jarowinkler
   [junit4]   2> 456741 INFO  (searcherExecutor-1802-thread-1) [    ] o.a.s.h.c.SpellCheckComponent Loading spell index for spellchecker: external
   [junit4]   2> 456743 INFO  (searcherExecutor-1802-thread-1) [    ] o.a.s.h.c.SpellCheckComponent Loading spell index for spellchecker: freq
   [junit4]   2> 456744 INFO  (searcherExecutor-1802-thread-1) [    ] o.a.s.h.c.SpellCheckComponent Loading spell index for spellchecker: fqcn
   [junit4]   2> 456745 INFO  (searcherExecutor-1802-thread-1) [    ] o.a.s.h.c.SpellCheckComponent Loading spell index for spellchecker: perDict
   [junit4]   2> 456745 INFO  (searcherExecutor-1802-thread-1) [    ] o.a.s.c.SolrCore [collection1] Registered new searcher Searcher@574889[collection1] main{ExitableDirectoryReader(UninvertingDirectoryReader(Uninverting(_0(7.0.0):C10)))}
   [junit4]   2> 456745 INFO  (TEST-SpellCheckComponentTest.testThresholdTokenFrequency-seed#[4B1CF67E50479C63]) [    ] o.a.s.u.p.LogUpdateProcessorFactory [collection1]  webapp=null path=null params={}{commit=} 0 19
   [junit4]   2> 456746 INFO  (TEST-SpellCheckComponentTest.testThresholdTokenFrequency-seed#[4B1CF67E50479C63]) [    ] o.a.s.c.S.Request [collection1]  webapp=null path=null params={q=documenq&qt=spellCheckCompRH&spellcheck.dictionary=threshold&spellcheck=true&spellcheck.count=5&wt=xml&spellcheck.extendedResults=true} hits=0 status=0 QTime=0
   [junit4]   2> 456747 ERROR (TEST-SpellCheckComponentTest.testThresholdTokenFrequency-seed#[4B1CF67E50479C63]) [    ] o.a.s.SolrTestCaseJ4 query failed JSON validation. error=Path not found: /spellcheck/suggestions/[1]/suggestion
   [junit4]   2>  expected =/spellcheck/suggestions/[1]/suggestion==[{'word':'document','freq':2}]
   [junit4]   2>  response = {
   [junit4]   2>   "responseHeader":{
   [junit4]   2>     "status":0,
   [junit4]   2>     "QTime":0},
   [junit4]   2>   "response":{"numFound":0,"start":0,"docs":[]
   [junit4]   2>   },
   [junit4]   2>   "spellcheck":{
   [junit4]   2>     "suggestions":[],
   [junit4]   2>     "correctlySpelled":false}}
   [junit4]   2> 
   [junit4]   2>  request = q=documenq&qt=spellCheckCompRH&spellcheck.dictionary=threshold&spellcheck=true&spellcheck.count=5&wt=xml&spellcheck.extendedResults=true
   [junit4]   2> 456747 INFO  (TEST-SpellCheckComponentTest.testThresholdTokenFrequency-seed#[4B1CF67E50479C63]) [    ] o.a.s.SolrTestCaseJ4 ###Ending testThresholdTokenFrequency
   [junit4]   2> 456747 INFO  (TEST-SpellCheckComponentTest.testThresholdTokenFrequency-seed#[4B1CF67E50479C63]) [    ] o.a.s.u.DirectUpdateHandler2 [collection1] REMOVING ALL DOCUMENTS FROM INDEX
   [junit4]   2> 456748 INFO  (TEST-SpellCheckComponentTest.testThresholdTokenFrequency-seed#[4B1CF67E50479C63]) [    ] o.a.s.u.p.LogUpdateProcessorFactory [collection1]  webapp=null path=null params={}{deleteByQuery=*:*} 0 0
   [junit4]   2> 456748 INFO  (TEST-SpellCheckComponentTest.testThresholdTokenFrequency-seed#[4B1CF67E50479C63]) [    ] o.a.s.u.DirectUpdateHandler2 start commit{,optimize=false,openSearcher=true,waitSearcher=true,expungeDeletes=false,softCommit=false,prepareCommit=false}
   [junit4]   2> 456748 INFO  (TEST-SpellCheckComponentTest.testThresholdTokenFrequency-seed#[4B1CF67E50479C63]) [    ] o.a.s.u.SolrIndexWriter Calling setCommitData with IW:org.apache.solr.update.SolrIndexWriter@159a2ff
   [junit4]   2> 456748 INFO  (TEST-SpellCheckComponentTest.testThresholdTokenFrequency-seed#[4B1CF67E50479C63]) [    ] o.a.s.s.SolrIndexSearcher Opening [Searcher@71e0e0[collection1] main]
   [junit4]   2> 456748 INFO  (TEST-SpellCheckComponentTest.testThresholdTokenFrequency-seed#[4B1CF67E50479C63]) [    ] o.a.s.u.DirectUpdateHandler2 end_commit_flush
   [junit4]   2> 456748 INFO  (searcherExecutor-1802-thread-1) [    ] o.a.s.h.c.SpellCheckComponent Building spell index for spell checker: default
   [junit4]   2> 456816 INFO  (searcherExecutor-1802-thread-1) [    ] o.a.s.h.c.SpellCheckComponent Building spell index for spell checker: default_teststop
   [junit4]   2> 456883 INFO  (searcherExecutor-1802-thread-1) [    ] o.a.s.h.c.SpellCheckComponent Building spell index for spell checker: threshold
   [junit4]   2> 456930 INFO  (searcherExecutor-1802-thread-1) [    ] o.a.s.h.c.SpellCheckComponent Building spell index for spell checker: threshold_direct
   [junit4]   2> 456930 INFO  (searcherExecutor-1802-thread-1) [    ] o.a.s.h.c.SpellCheckComponent Building spell index for spell checker: multipleFields
   [junit4]   2> 456995 INFO  (searcherExecutor-1802-thread-1) [    ] o.a.s.h.c.SpellCheckComponent Building spell index for spell checker: freq
   [junit4]   2> 457044 INFO  (searcherExecutor-1802-thread-1) [    ] o.a.s.h.c.SpellCheckComponent Building spell index for spell checker: fqcn
   [junit4]   2> 457113 INFO  (searcherExecutor-1802-thread-1) [    ] o.a.s.c.SolrCore [collection1] Registered new searcher Searcher@71e0e0[collection1] main{ExitableDirectoryReader(UninvertingDirectoryReader())}
   [junit4]   2> 457113 INFO  (TEST-SpellCheckComponentTest.testThresholdTokenFrequency-seed#[4B1CF67E50479C63]) [    ] o.a.s.u.p.LogUpdateProcessorFactory [collection1]  webapp=null path=null params={}{commit=} 0 365
   [junit4]   2> NOTE: reproduce with: ant test  -Dtestcase=SpellCheckComponentTest -Dtests.method=testThresholdTokenFrequency -Dtests.seed=4B1CF67E50479C63 -Dtests.multiplier=3 -Dtests.slow=true -Dtests.locale=mer-KE -Dtests.timezone=America/Guyana -Dtests.asserts=true -Dtests.file.encoding=UTF-8
   [junit4] ERROR   0.40s J1 | SpellCheckComponentTest.testThresholdTokenFrequency <<<
   [junit4]    > Throwable #1: java.lang.RuntimeException: Path not found: /spellcheck/suggestions/[1]/suggestion
   [junit4]    > 	at __randomizedtesting.SeedInfo.seed([4B1CF67E50479C63:C1BB798FDFACA518]:0)
   [junit4]    > 	at org.apache.solr.SolrTestCaseJ4.assertJQ(SolrTestCaseJ4.java:900)
   [junit4]    > 	at org.apache.solr.SolrTestCaseJ4.assertJQ(SolrTestCaseJ4.java:847)
   [junit4]    > 	at org.apache.solr.handler.component.SpellCheckComponentTest.testThresholdTokenFrequency(SpellCheckComponentTest.java:277)
   [junit4]    > 	at jdk.internal.reflect.NativeMethodAccessorImpl.invoke0(java.base@9-ea/Native Method)
   [junit4]    > 	at jdk.internal.reflect.NativeMethodAccessorImpl.invoke(java.base@9-ea/NativeMethodAccessorImpl.java:62)
   [junit4]    > 	at jdk.internal.reflect.DelegatingMethodAccessorImpl.invoke(java.base@9-ea/DelegatingMethodAccessorImpl.java:43)
   [junit4]    > 	at java.lang.Thread.run(java.base@9-ea/Thread.java:843)
   [junit4]   2> 457116 INFO  (TEST-SpellCheckComponentTest.testPerDictionary-seed#[4B1CF67E50479C63]) [    ] o.a.s.SolrTestCaseJ4 ###Starting testPerDictionary
   [junit4]   2> 457116 INFO  (TEST-SpellCheckComponentTest.testPerDictionary-seed#[4B1CF67E50479C63]) [    ] o.a.s.u.p.LogUpdateProcessorFactory [collection1]  webapp=null path=null params={}{add=[0]} 0 0
   [junit4]   2> 457116 INFO  (TEST-SpellCheckComponentTest.testPerDictionary-seed#[4B1CF67E50479C63]) [    ] o.a.s.u.p.LogUpdateProcessorFactory [collection1]  webapp=null path=null params={}{add=[1]} 0 0
   [junit4]   2> 457117 INFO  (TEST-SpellCheckComponentTest.testPerDictionary-seed#[4B1CF67E50479C63]) [    ] o.a.s.u.p.LogUpdateProcessorFactory [collection1]  webapp=null path=null params={}{add=[2]} 0 0
   [junit4]   2> 457117 INFO  (TEST-SpellCheckComponentTest.testPerDictionary-seed#[4B1CF67E50479C63]) [    ] o.a.s.u.p.LogUpdateProcessorFactory [collection1]  webapp=null path=null params={}{add=[3]} 0 0
   [junit4]   2> 457117 INFO  (TEST-SpellCheckComponentTest.testPerDictionary-seed#[4B1CF67E50479C63]) [    ] o.a.s.u.p.LogUpdateProcessorFactory [collection1]  webapp=null path=null params={}{add=[4]} 0 0
   [junit4]   2> 457117 INFO  (TEST-SpellCheckComponentTest.testPerDictionary-seed#[4B1CF67E50479C63]) [    ] o.a.s.u.p.LogUpdateProcessorFactory [collection1]  webapp=null path=null params={}{add=[5]} 0 0
   [junit4]   2> 457118 INFO  (TEST-SpellCheckComponentTest.testPerDictionary-seed#[4B1CF67E50479C63]) [    ] o.a.s.u.p.LogUpdateProcessorFactory [collection1]  webapp=null path=null params={}{add=[6]} 0 0
   [junit4]   2> 457118 INFO  (TEST-SpellCheckComponentTest.testPerDictionary-seed#[4B1CF67E50479C63]) [    ] o.a.s.u.p.LogUpdateProcessorFactory [collection1]  webapp=null path=null params={}{add=[7]} 0 0
   [junit4]   2> 457118 INFO  (TEST-SpellCheckComponentTest.testPerDictionary-seed#[4B1CF67E50479C63]) [    ] o.a.s.u.p.LogUpdateProcessorFactory [collection1]  webapp=null path=null params={}{add=[8]} 0 0
   [junit4]   2> 457118 INFO  (TEST-SpellCheckComponentTest.testPerDictionary-seed#[4B1CF67E50479C63]) [    ] o.a.s.u.p.LogUpdateProcessorFactory [collection1]  webapp=null path=null params={}{add=[9]} 0 0
   [junit4]   2> 457118 INFO  (TEST-SpellCheckComponentTest.testPerDictionary-seed#[4B1CF67E50479C63]) [    ] o.a.s.u.DirectUpdateHandler2 start commit{,optimize=false,openSearcher=true,waitSearcher=true,expungeDeletes=false,softCommit=false,prepareCommit=false}
   [junit4]   2> 457118 INFO  (TEST-SpellCheckComponentTest.testPerDictionary-seed#[4B1CF67E50479C63]) [    ] o.a.s.u.SolrIndexWriter Calling setCommitData with IW:org.apache.solr.update.SolrIndexWriter@159a2ff
   [junit4]   2> 457121 INFO  (TEST-SpellCheckComponentTest.testPerDictionary-seed#[4B1CF67E50479C63]) [    ] o.a.s.s.SolrIndexSearcher Opening [Searcher@26fa08[collection1] main]
   [junit4]   2> 457121 INFO  (TEST-SpellCheckComponentTest.testPerDictionary-seed#[4B1CF67E50479C63]) [    ] o.a.s.u.DirectUpdateHandler2 end_commit_flush
   [junit4]   2> 457121 INFO  (searcherExecutor-1802-thread-1) [    ] o.a.s.h.c.SpellCheckComponent Building spell index for spell checker: default
   [junit4]   2> 457276 INFO  (searcherExecutor-1802-thread-1) [    ] o.a.s.h.c.SpellCheckComponent Building spell index for spell checker: default_teststop
   [junit4]   2> 457316 INFO  (searcherExecutor-1802-thread-1) [    ] o.a.s.h.c.SpellCheckComponent Building spell index for spell checker: threshold
   [junit4]   2> 457418 INFO  (searcherExecutor-1802-thread-1) [    ] o.a.s.h.c.SpellCheckComponent Building spell index for spell checker: threshold_direct
   [junit4]   2> 457418 INFO  (searcherExecutor-1802-thread-1) [    ] o.a.s.h.c.SpellCheckComponent Building spell index for spell checker: multipleFields
   [junit4]   2> 457542 INFO  (searcherExecutor-1802-thread-1) [    ] o.a.s.h.c.SpellCheckComponent Building spell index for spell checker: freq
   [junit4]   2> 457726 INFO  (searcherExecutor-1802-thread-1) [    ] o.a.s.h.c.SpellCheckComponent Building spell index for spell checker: fqcn
   [junit4]   2> 457913 INFO  (searcherExecutor-1802-thread-1) [    ] o.a.s.c.SolrCore [collection1] Registered new searcher Searcher@26fa08[collection1] main{ExitableDirectoryReader(UninvertingDirectoryReader(Uninverting(_1(7.0.0):C10)))}
   [junit4]   2> 457914 INFO  (TEST-SpellCheckComponentTest.testPerDictionary-seed#[4B1CF67E50479C63]) [    ] o.a.s.u.p.LogUpdateProcessorFactory [collection1]  webapp=null path=null params={}{commit=} 0 795
   [junit4]   2> 457914 INFO  (TEST-SpellCheckComponentTest.testPerDictionary-seed#[4B1CF67E50479C63]) [    ] o.a.s.c.S.Request [collection1]  webapp=null path=null params={q=documemt&qt=spellCheckCompRH&spellcheck.dictionary=perDict&json.nl=map&spellcheck..perDict.foo=bar&spellcheck=true&spellcheck..perDict.bar=foo&wt=xml&spellcheck.build=true} hits=0 status=0 QTime=0
   [junit4]   2> 457915 INFO  (TEST-SpellCheckComponentTest.testPerDictionary-seed#[4B1CF67E50479C63]) [    ] o.a.s.SolrTestCaseJ4 ###Ending testPerDictionary
   [junit4]   2> 457915 INFO  (TEST-SpellCheckComponentTest.testPerDictionary-seed#[4B1CF67E50479C63]) [    ] o.a.s.u.DirectUpdateHandler2 [collection1] REMOVING ALL DOCUMENTS FROM INDEX
   [junit4]   2> 457915 INFO  (TEST-SpellCheckComponentTest.testPerDictionary-seed#[4B1CF67E50479C63]) [    ] o.a.s.u.p.LogUpdateProcessorFactory [collection1]  webapp=null path=null params={}{deleteByQuery=*:*} 0 0
   [junit4]   2> 457915 INFO  (TEST-SpellCheckComponentTest.testPerDictionary-seed#[4B1CF67E50479C63]) [    ] o.a.s.u.DirectUpdateHandler2 start commit{,optimize=false,openSearcher=true,waitSearcher=true,expungeDeletes=false,softCommit=false,prepareCommit=false}
   [junit4]   2> 457915 INFO  (TEST-SpellCheckComponentTest.testPerDictionary-seed#[4B1CF67E50479C63]) [    ] o.a.s.u.SolrIndexWriter Calling setCommitData with IW:org.apache.solr.update.SolrIndexWriter@159a2ff
   [junit4]   2> 457915 INFO  (TEST-SpellCheckComponentTest.testPerDictionary-seed#[4B1CF67E50479C63]) [    ] o.a.s.s.SolrIndexSearcher Opening [Searcher@1d8d99d[collection1] main]
   [junit4]   2> 457916 INFO  (TEST-SpellCheckComponentTest.testPerDictionary-seed#[4B1CF67E50479C63]) [    ] o.a.s.u.DirectUpdateHandler2 end_commit_flush
   [junit4]   2> 457916 INFO  (searcherExecutor-1802-thread-1) [    ] o.a.s.h.c.SpellCheckComponent Building spell index for spell checker: default
   [junit4]   2> 457958 INFO  (searcherExecutor-1802-thread-1) [    ] o.a.s.h.c.SpellCheckComponent Building spell index for spell checker: default_teststop
   [junit4]   2> 458023 INFO  (searcherExecutor-1802-thread-1) [    ] o.a.s.h.c.SpellCheckComponent Building spell index for spell checker: threshold
   [junit4]   2> 458080 INFO  (searcherExecutor-1802-thread-1) [    ] o.a.s.h.c.SpellCheckComponent Building spell index for spell checker: threshold_direct
   [junit4]   2> 458080 INFO  (searcherExecutor-1802-thread-1) [    ] o.a.s.h.c.SpellCheckComponent Building spell index for spell checker: multipleFields
   [junit4]   2> 458134 INFO  (searcherExecutor-1802-thread-1) [    ] o.a.s.h.c.SpellCheckComponent Building spell index for spell checker: freq
   [junit4]   2> 458189 INFO  (searcherExecutor-1802-thread-1) [    ] o.a.s.h.c.SpellCheckComponent Building spell index for spell checker: fqcn
   [junit4]   2> 458251 INFO  (searcherExecutor-1802-thread-1) [    ] o.a.s.c.SolrCore [collection1] Registered new searcher Searcher@1d8d99d[collection1] main{ExitableDirectoryReader(UninvertingDirectoryReader())}
   [junit4]   2> 458252 INFO  (TEST-SpellCheckComponentTest.testPerDictionary-seed#[4B1CF67E50479C63]) [    ] o.a.s.u.p.LogUpdateProcessorFactory [collection1]  webapp=null path=null params={}{commit=} 0 336
   [junit4]   2> 458253 INFO  (TEST-SpellCheckComponentTest.test-seed#[4B1CF67E50479C63]) [    ] o.a.s.SolrTestCaseJ4 ###Starting test
   [junit4]   2> 458254 INFO  (TEST-SpellCheckComponentTest.test-seed#[4B1CF67E50479C63]) [    ] o.a.s.u.p.LogUpdateProcessorFactory [collection1]  webapp=null path=null params={}{add=[0]} 0 0
   [junit4]   2> 458255 INFO  (TEST-SpellCheckComponentTest.test-seed#[4B1CF67E50479C63]) [    ] o.a.s.u.p.LogUpdateProcessorFactory [collection1]  webapp=null path=null params={}{add=[1]} 0 0
   [junit4]   2> 458255 INFO  (TEST-SpellCheckComponentTest.test-seed#[4B1CF67E50479C63]) [    ] o.a.s.u.p.LogUpdateProcessorFactory [collection1]  webapp=null path=null params={}{add=[2]} 0 0
   [junit4]   2> 458255 INFO  (TEST-SpellCheckComponentTest.test-seed#[4B1CF67E50479C63]) [    ] o.a.s.u.p.LogUpdateProcessorFactory [collection1]  webapp=null path=null params={}{add=[3]} 0 0
   [junit4]   2> 458256 INFO  (TEST-SpellCheckComponentTest.test-seed#[4B1CF67E50479C63]) [    ] o.a.s.u.p.LogUpdateProcessorFactory [collection1]  webapp=null path=null params={}{add=[4]} 0 0
   [junit4]   2> 458256 INFO  (TEST-SpellCheckComponentTest.test-seed#[4B1CF67E50479C63]) [    ] o.a.s.u.p.LogUpdateProcessorFactory [collection1]  webapp=null path=null params={}{add=[5]} 0 0
   [junit4]   2> 458256 INFO  (TEST-SpellCheckComponentTest.test-seed#[4B1CF67E50479C63]) [    ] o.a.s.u.p.LogUpdateProcessorFactory [collection1]  webapp=null path=null params={}{add=[6]} 0 0
   [junit4]   2> 458257 INFO  (TEST-SpellCheckComponentTest.test-seed#[4B1CF67E50479C63]) [    ] o.a.s.u.p.LogUpdateProcessorFactory [collection1]  webapp=null path=null params={}{add=[7]} 0 0
   [junit4]   2> 458257 INFO  (TEST-SpellCheckComponentTest.test-seed#[4B1CF67E50479C63]) [    ] o.a.s.u.p.LogUpdateProcessorFactory [collection1]  webapp=null path=null params={}{add=[8]} 0 0
   [junit4]   2> 458257 INFO  (TEST-SpellCheckComponentTest.test-seed#[4B1CF67E50479C63]) [    ] o.a.s.u.p.LogUpdateProcessorFactory [collection1]  webapp=null path=null params={}{add=[9]} 0 0
   [junit4]   2> 458258 INFO  (TEST-SpellCheckComponentTest.test-seed#[4B1CF67E50479C63]) [    ] o.a.s.u.DirectUpdateHandler2 start commit{,optimize=false,openSearcher=true,waitSearcher=true,expungeDeletes=false,softCommit=false,prepareCommit=false}
   [junit4]   2> 458258 INFO  (TEST-SpellCheckComponentTest.test-seed#[4B1CF67E50479C63]) [    ] o.a.s.u.SolrIndexWriter Calling setCommitData with IW:org.apache.solr.update.SolrIndexWriter@159a2ff
   [junit4]   2> 458261 INFO  (TEST-SpellCheckComponentTest.test-seed#[4B1CF67E50479C63]) [    ] o.a.s.s.SolrIndexSearcher Opening [Searcher@220172[collection1] main]
   [junit4]   2> 458261 INFO  (TEST-SpellCheckComponentTest.test-seed#[4B1CF67E50479C63]) [    ] o.a.s.u.DirectUpdateHandler2 end_commit_flush
   [junit4]   2> 458261 INFO  (searcherExecutor-1802-thread-1) [    ] o.a.s.h.c.SpellCheckComponent Building spell index for spell checker: default
   [junit4]   2> 458368 INFO  (searcherExecutor-1802-thread-1) [    ] o.a.s.h.c.SpellCheckComponent Building spell index for spell checker: default_teststop
   [junit4]   2> 458407 INFO  (searcherExecutor-1802-thread-1) [    ] o.a.s.h.c.SpellCheckComponent Building spell index for spell checker: threshold
   [junit4]   2> 458549 INFO  (searcherExecutor-1802-thread-1) [    ] o.a.s.h.c.SpellCheckComponent Building spell index for spell checker: threshold_direct
   [junit4]   2> 458549 INFO  (searcherExecutor-1802-thread-1) [    ] o.a.s.h.c.SpellCheckComponent Building spell index for spell checker: multipleFields
   [junit4]   2> 458677 INFO  (searcherExecutor-1802-thread-1) [    ] o.a.s.h.c.SpellCheckComponent Building spell index for spell checker: freq
   [junit4]   2> 458804 INFO  (searcherExecutor-1802-thread-1) [    ] o.a.s.h.c.SpellCheckComponent Building spell index for spell checker: fqcn
   [junit4]   2> 458906 INFO  (searcherExecutor-1802-thread-1) [    ] o.a.s.c.SolrCore [collection1] Registered new searcher Searcher@220172[collection1] main{ExitableDirectoryReader(UninvertingDirectoryReader(Uninverting(_2(7.0.0):C10)))}
   [junit4]   2> 458906 INFO  (TEST-SpellCheckComponentTest.test-seed#[4B1CF67E50479C63]) [    ] o.a.s.u.p.LogUpdateProcessorFactory [collection1]  webapp=null path=null params={}{commit=} 0 648
   [junit4]   2> 458908 INFO  (TEST-SpellCheckComponentTest.test-seed#[4B1CF67E50479C63]) [    ] o.a.s.c.S.Request [collection1]  webapp=null path=null params={q=documemt&qt=spellCheckCompRH&spellcheck=true&wt=xml} hits=0 status=0 QTime=1
   [junit4]   2> 458908 INFO  (TEST-SpellCheckComponentTest.test-seed#[4B1CF67E50479C63]) [    ] o.a.s.SolrTestCaseJ4 ###Ending test
   [junit4]   2> 458908 INFO  (TEST-SpellCheckComponentTest.test-seed#[4B1CF67E50479C63]) [    ] o.a.s.u.DirectUpdateHandler2 [collection1] REMOVING ALL DOCUMENTS FROM INDEX
   [junit4]   2> 458909 INFO  (TEST-SpellCheckComponentTest.test-seed#[4B1CF67E50479C63]) [    ] o.a.s.u.p.LogUpdateProcessorFactory [collection1]  webapp=null path=null params={}{deleteByQuery=*:*} 0 0
   [junit4]   2> 458909 INFO  (TEST-SpellCheckComponentTest.test-seed#[4B1CF67E50479C63]) [    ] o.a.s.u.DirectUpdateHandler2 start commit{,optimize=false,openSearcher=true,waitSearcher=true,expungeDeletes=false,softCommit=false,prepareCommit=false}
   [junit4]   2> 458909 INFO  (TEST-SpellCheckComponentTest.test-seed#[4B1CF67E50479C63]) [    ] o.a.s.u.SolrIndexWriter Calling setCommitData with IW:org.apache.solr.update.SolrIndexWriter@159a2ff
   [junit4]   2> 458909 INFO  (TEST-SpellCheckComponentTest.test-seed#[4B1CF67E50479C63]) [    ] o.a.s.s.SolrIndexSearcher Opening [Searcher@18b5173[collection1] main]
   [junit4]   2> 458909 INFO  (TEST-SpellCheckComponentTest.test-seed#[4B1CF67E50479C63]) [    ] o.a.s.u.DirectUpdateHandler2 end_commit_flush
   [junit4]   2> 458909 INFO  (searcherExecutor-1802-thread-1) [    ] o.a.s.h.c.SpellCheckComponent Building spell index for spell checker: default
   [junit4]   2> 458968 INFO  (searcherExecutor-1802-thread-1) [    ] o.a.s.h.c.SpellCheckComponent Building spell index for spell checker: default_teststop
   [junit4]   2> 459007 INFO  (searcherExecutor-1802-thread-1) [    ] o.a.s.h.c.SpellCheckComponent Building spell index for spell checker: threshold
   [junit4]   2> 459056 INFO  (searcherExecutor-1802-thread-1) [    ] o.a.s.h.c.SpellCheckComponent Building spell index for spell checker: threshold_direct
   [junit4]   2> 459056 INFO  (searcherExecutor-1802-thread-1) [    ] o.a.s.h.c.SpellCheckComponent Building spell index for spell checker: multipleFields
   [junit4]   2> 459125 INFO  (searcherExecutor-1802-thread-1) [    ] o.a.s.h.c.SpellCheckComponent Building spell index for spell checker: freq
   [junit4]   2> 459172 INFO  (searcherExecutor-1802-thread-1) [    ] o.a.s.h.c.SpellCheckComponent Building spell index for spell checker: fqcn
   [junit4]   2> 459221 INFO  (searcherExecutor-1802-thread-1) [    ] o.a.s.c.SolrCore [collection1] Registered new searcher Searcher@18b5173[collection1] main{ExitableDirectoryReader(UninvertingDirectoryReader())}
   [junit4]   2> 459221 INFO  (TEST-SpellCheckComponentTest.test-seed#[4B1CF67E50479C63]) [    ] o.a.s.u.p.LogUpdateProcessorFactory [collection1]  webapp=null path=null params={}{commit=} 0 312
   [junit4]   2> 459223 INFO  (TEST-SpellCheckComponentTest.testRebuildOnCommit-seed#[4B1CF67E50479C63]) [    ] o.a.s.SolrTestCaseJ4 ###Starting testRebuildOnCommit
   [junit4]   2> 459223 INFO  (TEST-SpellCheckComponentTest.testRebuildOnCommit-seed#[4B1CF67E50479C63]) [    ] o.a.s.u.p.LogUpdateProcessorFactory [collection1]  webapp=null path=null params={}{add=[0]} 0 0
   [junit4]   2> 459224 INFO  (TEST-SpellCheckComponentTest.testRebuildOnCommit-seed#[4B1CF67E50479C63]) [    ] o.a.s.u.p.LogUpdateProcessorFactory [collection1]  webapp=null path=null params={}{add=[1]} 0 0
   [junit4]   2> 459224 INFO  (TEST-SpellCheckComponentTest.testRebuildOnCommit-seed#[4B1CF67E50479C63]) [    ] o.a.s.u.p.LogUpdateProcessorFactory [collection1]  webapp=null path=null params={}{add=[2]} 0 0
   [junit4]   2> 459224 INFO  (TEST-SpellCheckComponentTest.testRebuildOnCommit-seed#[4B1CF67E50479C63]) [    ] o.a.s.u.p.LogUpdateProcessorFactory [collection1]  webapp=null path=null params={}{add=[3]} 0 0
   [junit4]   2> 459224 INFO  (TEST-SpellCheckComponentTest.testRebuildOnCommit-seed#[4B1CF67E50479C63]) [    ] o.a.s.u.p.LogUpdateProcessorFactory [collection1]  webapp=null path=null params={}{add=[4]} 0 0
   [junit4]   2> 459225 INFO  (TEST-SpellCheckComponentTest.testRebuildOnCommit-seed#[4B1CF67E50479C63]) [    ] o.a.s.u.p.LogUpdateProcessorFactory [collection1]  webapp=null path=null params={}{add=[5]} 0 0
   [junit4]   2> 459225 INFO  (TEST-SpellCheckComponentTest.testRebuildOnCommit-seed#[4B1CF67E50479C63]) [    ] o.a.s.u.p.LogUpdateProcessorFactory [collection1]  webapp=null path=null params={}{add=[6]} 0 0
   [junit4]   2> 459225 INFO  (TEST-SpellCheckComponentTest.testRebuildOnCommit-seed#[4B1CF67E50479C63]) [    ] o.a.s.u.p.LogUpdateProcessorFactory [collection1]  webapp=null path=null params={}{add=[7]} 0 0
   [junit4]   2> 459225 INFO  (TEST-SpellCheckComponentTest.testRebuildOnCommit-seed#[4B1CF67E50479C63]) [    ] o.a.s.u.p.LogUpdateProcessorFactory [collection1]  webapp=null path=null params={}{add=[8]} 0 0
   [junit4]   2> 459226 INFO  (TEST-SpellCheckComponentTest.testRebuildOnCommit-seed#[4B1CF67E50479C63]) [    ] o.a.s.u.p.LogUpdateProcessorFactory [collection1]  webapp=null path=null params={}{add=[9]} 0 0
   [junit4]   2> 459226 INFO  (TEST-SpellCheckComponentTest.testRebuildOnCommit-seed#[4B1CF67E50479C63]) [    ] o.a.s.u.DirectUpdateHandler2 start commit{,optimize=false,openSearcher=true,waitSearcher=true,expungeDeletes=false,softCommit=false,prepareCommit=false}
   [junit4]   2> 459226 INFO  (TEST-SpellCheckComponentTest.testRebuildOnCommit-seed#[4B1CF67E50479C63]) [    ] o.a.s.u.SolrIndexWriter Calling setCommitData with IW:org.apache.solr.update.SolrIndexWriter@159a2ff
   [junit4]   2> 459230 INFO  (TEST-SpellCheckComponentTest.testRebuildOnCommit-seed#[4B1CF67E50479C63]) [    ] o.a.s.s.SolrIndexSearcher Opening [Searcher@8fbccd[collection1] main]
   [junit4]   2> 459230 INFO  (TEST-SpellCheckComponentTest.testRebuildOnCommit-seed#[4B1CF67E50479C63]) [    ] o.a.s.u.DirectUpdateHandler2 end_commit_flush
   [junit4]   2> 459230 INFO  (searcherExecutor-1802-thread-1) [    ] o.a.s.h.c.SpellCheckComponent Building spell index for spell checker: default
   [junit4]   2> 459368 INFO  (searcherExecutor-1802-thread-1) [    ] o.a.s.h.c.SpellCheckComponent Building spell index for spell checker: default_teststop
   [junit4]   2> 459428 INFO  (searcherExecutor-1802-thread-1) [    ] o.a.s.h.c.SpellCheckComponent Building spell index for spell checker: threshold
   [junit4]   2> 459581 INFO  (searcherExecutor-1802-thread-1) [    ] o.a.s.h.c.SpellCheckComponent Building spell index for spell checker: threshold_direct
   [junit4]   2> 459581 INFO  (searcherExecutor-1802-thread-1) [    ] o.a.s.h.c.SpellCheckComponent Building spell index for spell checker: multipleFields
   [junit4]   2> 459679 INFO  (searcherExecutor-1802-thread-1) [    ] o.a.s.h.c.SpellCheckComponent Building spell index for spell checker: freq
   [junit4]   2> 459830 INFO  (searcherExecutor-1802-thread-1) [    ] o.a.s.h.c.SpellCheckComponent Building spell index for spell checker: fqcn
   [junit4]   2> 459934 INFO  (searcherExecutor-1802-thread-1) [    ] o.a.s.c.SolrCore [collection1] Registered new searcher Searcher@8fbccd[collection1] main{ExitableDirectoryReader(UninvertingDirectoryReader(Uninverting(_3(7.0.0):C10)))}
   [junit4]   2> 459935 INFO  (TEST-SpellCheckComponentTest.testRebuildOnCommit-seed#[4B1CF67E50479C63]) [    ] o.a.s.u.p.LogUpdateProcessorFactory [collection1]  webapp=null path=null params={}{commit=} 0 708
   [junit4]   2> 459937 INFO  (TEST-SpellCheckComponentTest.testRebuildOnCommit-seed#[4B1CF67E50479C63]) [    ] o.a.s.c.S.Request [collection1]  webapp=null path=null params={q=lowerfilt:lucenejavt&qt=spellCheckCompRH&spellcheck=true&wt=xml} hits=0 status=0 QTime=1
   [junit4]   2> 459937 INFO  (TEST-SpellCheckComponentTest.testRebuildOnCommit-seed#[4B1CF67E50479C63]) [    ] o.a.s.u.p.LogUpdateProcessorFactory [collection1]  webapp=null path=null params={}{add=[11231]} 0 0
   [junit4]   2> 459938 INFO  (TEST-SpellCheckComponentTest.testRebuildOnCommit-seed#[4B1CF67E50479C63]) [    ] o.a.s.u.DirectUpdateHandler2 start commit{,optimize=false,openSearcher=true,waitSearcher=true,expungeDeletes=false,softCommit=false,prepareCommit=false}
   [junit4]   2> 459938 INFO  (TEST-SpellCheckComponentTest.testRebuildOnCommit-seed#[4B1CF67E50479C63]) [    ] o.a.s.u.SolrIndexWriter Calling setCommitData with IW:org.apache.solr.update.SolrIndexWriter@159a2ff
   [junit4]   2> 459941 INFO  (TEST-SpellCheckComponentTest.testRebuildOnCommit-seed#[4B1CF67E50479C63]) [    ] o.a.s.s.SolrIndexSearcher Opening [Searcher@1300014[collection1] main]
   [junit4]   2> 459941 INFO  (searcherExecutor-1802-thread-1) [    ] o.a.s.h.c.SpellCheckComponent Building spell index for spell checker: default
   [junit4]   2> 459941 INFO  (TEST-SpellCheckComponentTest.testRebuildOnCommit-seed#[4B1CF67E50479C63]) [    ] o.a.s.u.DirectUpdateHandler2 end_commit_flush
   [junit4]   2> 460045 INFO  (searcherExecutor-1802-thread-1) [    ] o.a.s.h.c.SpellCheckComponent Building spell index for spell checker: default_teststop
   [junit4]   2> 460118 INFO  (searcherExecutor-1802-thread-1) [    ] o.a.s.h.c.SpellCheckComponent Building spell index for spell checker: threshold
   [junit4]   2> 460300 INFO  (searcherExecutor-1802-thread-1) [    ] o.a.s.h.c.SpellCheckComponent Building spell index for spell checker: threshold_direct
   [junit4]   2> 460300 INFO  (searcherExecutor-1802-thread-1) [    ] o.a.s.h.c.SpellCheckComponent Building spell index for spell checker: multipleFields
   [junit4]   2> 460461 INFO  (searcherExecutor-1802-thread-1) [    ] o.a.s.h.c.SpellCheckComponent Building spell index for spell checker: freq
   [junit4]   2> 460561 INFO  (searcherExecutor-1802-thread-1) [    ] o.a.s.h.c.SpellCheckComponent Building spell index for spell checker: fqcn
   [junit4]   2> 460703 INFO  (searcherExecutor-1802-thread-1) [    ] o.a.s.c.SolrCore [collection1] Registered new searcher Searcher@1300014[collection1] main{ExitableDirectoryReader(UninvertingDirectoryReader(Uninverting(_3(7.0.0):C10) Uninverting(_4(7.0.0):C1)))}
   [junit4]   2> 460703 INFO  (TEST-SpellCheckComponentTest.testRebuildOnCommit-seed#[4B1CF67E50479C63]) [    ] o.a.s.u.p.LogUpdateProcessorFactory [collection1]  webapp=null path=null params={}{commit=} 0 765
   [junit4]   2> 460705 INFO  (TEST-SpellCheckComponentTest.testRebuildOnCommit-seed#[4B1CF67E50479C63]) [    ] o.a.s.c.S.Request [collection1]  webapp=null path=null params={q=lowerfilt:lucenejavt&qt=spellCheckCompRH&spellcheck=true&wt=xml} hits=0 status=0 QTime=770
   [junit4]   2> 460706 INFO  (TEST-SpellCheckComponentTest.testRebuildOnCommit-seed#[4B1CF67E50479C63]) [    ] o.a.s.SolrTestCaseJ4 ###Ending testRebuildOnCommit
   [junit4]   2> 460706 INFO  (TEST-SpellCheckComponentTest.testRebuildOnCommit-seed#[4B1CF67E50479C63]) [    ] o.a.s.u.DirectUpdateHandler2 [collection1] REMOVING ALL DOCUMENTS FROM INDEX
   [junit4]   2> 460706 INFO  (TEST-SpellCheckComponentTest.testRebuildOnCommit-seed#[4B1CF67E50479C63]) [    ] o.a.s.u.p.LogUpdateProcessorFactory [collection1]  webapp=null path=null params={}{deleteByQuery=*:*} 0 0
   [junit4]   2> 460706 INFO  (TEST-SpellCheckComponentTest.testRebuildOnCommit-seed#[4B1CF67E50479C63]) [    ] o.a.s.u.DirectUpdateHandler2 start commit{,optimize=false,openSearcher=true,waitSearcher=true,expungeDeletes=false,softCommit=false,prepareCommit=false}
   [junit4]   2> 460706 INFO  (TEST-SpellCheckComponentTest.testRebuildOnCommit-seed#[4B1CF67E50479C63]) [    ] o.a.s.u.SolrIndexWriter Calling setCommitData with IW:org.apache.solr.update.SolrIndexWriter@159a2ff
   [junit4]   2> 460707 INFO  (TEST-SpellCheckComponentTest.testRebuildOnCommit-seed#[4B1CF67E50479C63]) [    ] o.a.s.s.SolrIndexSearcher Opening [Searcher@13610bf[collection1] main]
   [junit4]   2> 460707 INFO  (TEST-SpellCheckComponentTest.testRebuildOnCommit-seed#[4B1CF67E50479C63]) [    ] o.a.s.u.DirectUpdateHandler2 end_commit_flush
   [junit4]   2> 460707 INFO  (searcherExecutor-1802-thread-1) [    ] o.a.s.h.c.SpellCheckComponent Building spell index for spell checker: default
   [junit4]   2> 460770 INFO  (searcherExecutor-1802-thread-1) [    ] o.a.s.h.c.SpellCheckComponent Building spell index for spell checker: default_teststop
   [junit4]   2> 460839 INFO  (searcherExecutor-1802-thread-1) [    ] o.a.s.h.c.SpellCheckComponent Building spell index for spell checker: threshold
   [junit4]   2> 460900 INFO  (searcherExecutor-1802-thread-1) [    ] o.a.s.h.c.SpellCheckComponent Building spell index for spell checker: threshold_direct
   [junit4]   2> 460900 INFO  (searcherExecutor-1802-thread-1) [    ] o.a.s.h.c.SpellCheckComponent Building spell index for spell checker: multipleFields
   [junit4]   2> 460949 INFO  (searcherExecutor-1802-thread-1) [    ] o.a.s.h.c.SpellCheckComponent Building spell index for spell checker: freq
   [junit4]   2> 461027 INFO  (searcherExecutor-1802-thread-1) [    ] o.a.s.h.c.SpellCheckComponent Building spell index for spell checker: fqcn
   [junit4]   2> 461090 INFO  (searcherExecutor-1802-thread-1) [    ] o.a.s.c.SolrCore [collection1] Registered new searcher Searcher@13610bf[collection1] main{ExitableDirectoryReader(UninvertingDirectoryReader())}
   [junit4]   2> 461090 INFO  (TEST-SpellCheckComponentTest.testRebuildOnCommit-seed#[4B1CF67E50479C63]) [    ] o.a.s.u.p.LogUpdateProcessorFactory [collection1]  webapp=null path=null params={}{commit=} 0 384
   [junit4]   2> 461092 INFO  (TEST-SpellCheckComponentTest.testMaximumResultsForSuggest-seed#[4B1CF67E50479C63]) [    ] o.a.s.SolrTestCaseJ4 ###Starting testMaximumResultsForSuggest
   [junit4]   2> 461093 INFO  (TEST-SpellCheckComponentTest.testMaximumResultsForSuggest-seed#[4B1CF67E50479C63]) [    ] o.a.s.u.p.LogUpdateProcessorFactory [collection1]  webapp=null path=null params={}{add=[0]} 0 0
   [junit4]   2> 461094 INFO  (TEST-SpellCheckComponentTest.testMaximumResultsForSuggest-seed#[4B1CF67E50479C63]) [    ] o.a.s.u.p.LogUpdateProcessorFactory [collection1]  webapp=null path=null params={}{add=[1]} 0 0
   [junit4]   2> 461094 INFO  (TEST-SpellCheckComponentTest.testMaximumResultsForSuggest-seed#[4B1CF67E50479C63]) [    ] o.a.s.u.p.LogUpdateProcessorFactory [collection1]  webapp=null path=null params={}{add=[2]} 0 0
   [junit4]   2> 461094 INFO  (TEST-SpellCheckComponentTest.testMaximumResultsForSuggest-seed#[4B1CF67E50479C63]) [    ] o.a.s.u.p.LogUpdateProcessorFactory [collection1]  webapp=null path=null params={}{add=[3]} 0 0
   [junit4]   2> 461095 INFO  (TEST-SpellCheckComponentTest.testMaximumResultsForSuggest-seed#[4B1CF67E50479C63]) [    ] o.a.s.u.p.LogUpdateProcessorFactory [collection1]  webapp=null path=null params={}{add=[4]} 0 0
   [junit4]   2> 461095 INFO  (TEST-SpellCheckComponentTest.testMaximumResultsForSuggest-seed#[4B1CF67E50479C63]) [    ] o.a.s.u.p.LogUpdateProcessorFactory [collection1]  webapp=null path=null params={}{add=[5]} 0 0
   [junit4]   2> 461095 INFO  (TEST-SpellCheckComponentTest.testMaximumResultsForSuggest-seed#[4B1CF67E50479C63]) [    ] o.a.s.u.p.LogUpdateProcessorFactory [collection1]  webapp=null path=null params={}{add=[6]} 0 0
   [junit4]   2> 461096 INFO  (TEST-SpellCheckComponentTest.testMaximumResultsForSuggest-seed#[4B1CF67E50479C63]) [    ] o.a.s.u.p.LogUpdateProcessorFactory [collection1]  webapp=null path=null params={}{add=[7]} 0 0
   [junit4]   2> 461096 INFO  (TEST-SpellCheckComponentTest.testMaximumResultsForSuggest-seed#[4B1CF67E50479C63]) [    ] o.a.s.u.p.LogUpdateProcessorFactory [collection1]  webapp=null path=null params={}{add=[8]} 0 0
   [junit4]   2> 461096 INFO  (TEST-SpellCheckComponentTest.testMaximumResultsForSuggest-seed#[4B1CF67E50479C63]) [    ] o.a.s.u.p.LogUpdateProcessorFactory [collection1]  webapp=null path=null params={}{add=[9]} 0 0
   [junit4]   2> 461096 INFO  (TEST-SpellCheckComponentTest.testMaximumResultsForSuggest-seed#[4B1CF67E50479C63]) [    ] o.a.s.u.DirectUpdateHandler2 start commit{,optimize=false,openSearcher=true,waitSearcher=true,expungeDeletes=false,softCommit=false,prepareCommit=false}
   [junit4]   2> 461097 INFO  (TEST-SpellCheckComponentTest.testMaximumResultsForSuggest-seed#[4B1CF67E50479C63]) [    ] o.a.s.u.SolrIndexWriter Calling setCommitData with IW:org.apache.solr.update.SolrIndexWriter@159a2ff
   [junit4]   2> 461100 INFO  (TEST-SpellCheckComponentTest.testMaximumResultsForSuggest-seed#[4B1CF67E50479C63]) [    ] o.a.s.s.SolrIndexSearcher Opening [Searcher@18d940c[collection1] main]
   [junit4]   2> 461100 INFO  (TEST-SpellCheckComponentTest.testMaximumResultsForSuggest-seed#[4B1CF67E50479C63]) [    ] o.a.s.u.DirectUpdateHandler2 end_commit_flush
   [junit4]   2> 461100 INFO  (searcherExecutor-1802-thread-1) [    ] o.a.s.h.c.SpellCheckComponent Building spell index for spell checker: default
   [junit4]   2> 461236 INFO  (searcherExecutor-1802-thread-1) [    ] o.a.s.h.c.SpellCheckComponent Building spell index for spell checker: default_teststop
   [junit4]   2> 461303 INFO  (searcherExecutor-1802-thread-1) [    ] o.a.s.h.c.SpellCheckComponent Building spell index for spell checker: threshold
   [junit4]   2> 461494 INFO  (searcherExecutor-1802-thread-1) [    ] o.a.s.h.c.SpellCheckComponent Building spell index for spell checker: threshold_direct
   [junit4]   2> 461494 INFO  (searcherExecutor-1802-thread-1) [    ] o.a.s.h.c.SpellCheckComponent Building spell index for spell checker: multipleFields
   [junit4]   2> 461644 INFO  (searcherExecutor-1802-thread-1) [    ] o.a.s.h.c.SpellCheckComponent Building spell index for spell checker: freq
   [junit4]   2> 461842 INFO  (searcherExecutor-1802-thread-1) [    ] o.a.s.h.c.SpellCheckComponent Building spell index for spell checker: fqcn
   [junit4]   2> 462005 INFO  (searcherExecutor-1802-thread-1) [    ] o.a.s.c.SolrCore [collection1] Registered new searcher Searcher@18d940c[collection1] main{ExitableDirectoryReader(UninvertingDirectoryReader(Uninverting(_5(7.0.0):C10)))}
   [junit4]   2> 462005 INFO  (TEST-SpellCheckComponentTest.testMaximumResultsForSuggest-seed#[4B1CF67E50479C63]) [    ] o.a.s.u.p.LogUpdateProcessorFactory [collection1]  webapp=null path=null params={}{commit=} 0 909
   [junit4]   2> 462137 INFO  (TEST-SpellCheckComponentTest.testMaximumResultsForSuggest-seed#[4B1CF67E50479C63]) [    ] o.a.s.c.S.Request [collection1]  webapp=null path=null params={q=lowerfilt:(this+OR+brwn)&spellcheck.maxResultsForSuggest=7&qt=spellCheckCompRH&spellcheck=true&spellcheck.count=5&wt=xml&spellcheck.build=true&spellcheck.extendedResults=false} hits=7 status=0 QTime=131
   [junit4]   2> 462273 INFO  (TEST-SpellCheckComponentTest.testMaximumResultsForSuggest-seed#[4B1CF67E50479C63]) [    ] o.a.s.c.S.Request [collection1]  webapp=null path=null params={q=lowerfilt:(this+OR+brwn)&spellcheck.maxResultsForSuggest=6&qt=spellCheckCompRH&spellcheck=true&spellcheck.count=5&wt=xml&spellcheck.build=true&spellcheck.extendedResults=false} hits=7 status=0 QTime=135
   [junit4]   2> 462274 ERROR (TEST-SpellCheckComponentTest.testMaximumResultsForSuggest-seed#[4B1CF67E50479C63]) [    ] o.a.s.SolrTestCaseJ4 query failed JSON validation. error=Path not found: /spellcheck/suggestions/[1]/numFound
   [junit4]   2>  expected =/spellcheck/suggestions/[1]/numFound==1
   [junit4]   2>  response = {
   [junit4]   2>   "responseHeader":{
   [junit4]   2>     "status":0,
   [junit4]   2>     "QTime":135},
   [junit4]   2>   "command":"build",
   [junit4]   2>   "response":{"numFound":7,"start":0,"docs":[
   [junit4]   2>       {
   [junit4]   2>         "id":4,
   [junit4]   2>         "range_facet_l":[4],
   [junit4]   2>         "range_facet_l_dv":[4],
   [junit4]   2>         "range_facet_i_dv":[4],
   [junit4]   2>         "lowerfilt":["this blue"],
   [junit4]   2>         "lowerfilt1and2":["this blue"],
   [junit4]   2>         "multiDefault":["muLti-Default"],
   [junit4]   2>         "intDefault":42,
   [junit4]   2>         "timestamp":"2016-10-31T07:13:54.408Z"},
   [junit4]   2>       {
   [junit4]   2>         "id":5,
   [junit4]   2>         "range_facet_l":[5],
   [junit4]   2>         "range_facet_l_dv":[5],
   [junit4]   2>         "range_facet_i_dv":[5],
   [junit4]   2>         "lowerfilt":["this blud"],
   [junit4]   2>         "lowerfilt1and2":["this blud"],
   [junit4]   2>         "multiDefault":["muLti-Default"],
   [junit4]   2>         "intDefault":42,
   [junit4]   2>         "timestamp":"2016-10-31T07:13:54.409Z"},
   [junit4]   2>       {
   [junit4]   2>         "id":6,
   [junit4]   2>         "range_facet_l":[6],
   [junit4]   2>         "range_facet_l_dv":[6],
   [junit4]   2>         "range_facet_i_dv":[6],
   [junit4]   2>         "lowerfilt":["this boue"],
   [junit4]   2>         "lowerfilt1and2":["this boue"],
   [junit4]   2>         "multiDefault":["muLti-Default"],
   [junit4]   2>         "intDefault":42,
   [junit4]   2>         "timestamp":"2016-10-31T07:13:54.409Z"},
   [junit4]   2>       {
   [junit4]   2>         "id":7,
   [junit4]   2>         "range_facet_l":[7],
   [junit4]   2>         "range_facet_l_dv":[7],
   [junit4]   2>         "range_facet_i_dv":[7],
   [junit4]   2>         "lowerfilt":["this glue"],
   [junit4]   2>         "lowerfilt1and2":["this glue"],
   [junit4]   2>         "multiDefault":["muLti-Default"],
   [junit4]   2>         "intDefault":42,
   [junit4]   2>         "timestamp":"2016-10-31T07:13:54.409Z"},
   [junit4]   2>       {
   [junit4]   2>         "id":8,
   [junit4]   2>         "range_facet_l":[8],
   [junit4]   2>         "range_facet_l_dv":[8],
   [junit4]   2>         "range_facet_i_dv":[8],
   [junit4]   2>         "lowerfilt":["this blee"],
   [junit4]   2>         "lowerfilt1and2":["this blee"],
   [junit4]   2>         "multiDefault":["muLti-Default"],
   [junit4]   2>         "intDefault":42,
   [junit4]   2>         "timestamp":"2016-10-31T07:13:54.410Z"},
   [junit4]   2>       {
   [junit4]   2>         "id":0,
   [junit4]   2>         "range_facet_l":[0],
   [junit4]   2>         "range_facet_l_dv":[0],
   [junit4]   2>         "range_facet_i_dv":[0],
   [junit4]   2>         "lowerfilt":["This is a title"],
   [junit4]   2>         "lowerfilt1and2":["This is a title"],
   [junit4]   2>         "multiDefault":["muLti-Default"],
   [junit4]   2>         "intDefault":42,
   [junit4]   2>         "timestamp":"2016-10-31T07:13:54.407Z"},
   [junit4]   2>       {
   [junit4]   2>         "id":2,
   [junit4]   2>         "range_facet_l":[2],
   [junit4]   2>         "range_facet_l_dv":[2],
   [junit4]   2>         "range_facet_i_dv":[2],
   [junit4]   2>         "lowerfilt":["This is a document"],
   [junit4]   2>         "lowerfilt1and2":["This is a document"],
   [junit4]   2>         "multiDefault":["muLti-Default"],
   [junit4]   2>         "intDefault":42,
   [junit4]   2>         "timestamp":"2016-10-31T07:13:54.408Z"}]
   [junit4]   2>   },
   [junit4]   2>   "spellcheck":{
   [junit4]   2>     "suggestions":[]}}
   [junit4]   2> 
   [junit4]   2>  request = q=lowerfilt:(this+OR+brwn)&spellcheck.maxResultsForSuggest=6&qt=spellCheckCompRH&spellcheck=true&spellcheck.count=5&wt=xml&spellcheck.build=true&spellcheck.extendedResults=false
   [junit4]   2> 462445 INFO  (TEST-SpellCheckComponentTest.testMaximumResultsForSuggest-seed#[4B1CF67E50479C63]) [    ] o.a.s.c.S.Request [collection1]  webapp=null path=null params={q=lowerfilt:(this+OR+brwn)&spellcheck.maxResultsForSuggest=.90&qt=spellCheckCompRH&spellcheck=true&fq=id:[0+TO+9]&fq=lowerfilt:th*&spellcheck.count=5&wt=xml&spellcheck.build=true&spellcheck.extendedResults=false} hits=7 status=0 QTime=170
   [junit4]   2> 462582 INFO  (TEST-SpellCheckComponentTest.testMaximumResultsForSuggest-seed#[4B1CF67E50479C63]) [    ] o.a.s.c.S.Request [collection1]  webapp=null path=null params={q=lowerfilt:(this+OR+brwn)&spellcheck.maxResultsForSuggest=.80&qt=spellCheckCompRH&spellcheck=true&fq=id:[0+TO+9]&fq=lowerfilt:th*&spellcheck.count=5&wt=xml&spellcheck.build=true&spellcheck.extendedResults=false} hits=7 status=0 QTime=137
   [junit4]   2> 462583 ERROR (TEST-SpellCheckComponentTest.testMaximumResultsForSuggest-seed#[4B1CF67E50479C63]) [    ] o.a.s.SolrTestCaseJ4 query failed JSON validation. error=Path not found: /spellcheck/suggestions/[1]/numFound
   [junit4]   2>  expected =/spellcheck/suggestions/[1]/numFound==1
   [junit4]   2>  response = {
   [junit4]   2>   "responseHeader":{
   [junit4]   2>     "status":0,
   [junit4]   2>     "QTime":137},
   [junit4]   2>   "command":"build",
   [junit4]   2>   "response":{"numFound":7,"start":0,"docs":[
   [junit4]   2>       {
   [junit4]   2>         "id":4,
   [junit4]   2>         "range_facet_l":[4],
   [junit4]   2>         "range_facet_l_dv":[4],
   [junit4]   2>         "range_facet_i_dv":[4],
   [junit4]   2>         "lowerfilt":["this blue"],
   [junit4]   2>         "lowerfilt1and2":["this blue"],
   [junit4]   2>         "multiDefault":["muLti-Default"],
   [junit4]   2>         "intDefault":42,
   [junit4]   2>         "timestamp":"2016-10-31T07:13:54.408Z"},
   [junit4]   2>       {
   [junit4]   2>         "id":5,
   [junit4]   2>         "range_facet_l":[5],
   [junit4]   2>         "range_facet_l_dv":[5],
   [junit4]   2>         "range_facet_i_dv":[5],
   [junit4]   2>         "lowerfilt":["this blud"],
   [junit4]   2>         "lowerfilt1and2":["this blud"],
   [junit4]   2>         "multiDefault":["muLti-Default"],
   [junit4]   2>         "intDefault":42,
   [junit4]   2>         "timestamp":"2016-10-31T07:13:54.409Z"},
   [junit4]   2>       {
   [junit4]   2>         "id":6,
   [junit4]   2>         "range_facet_l":[6],
   [junit4]   2>         "range_facet_l_dv":[6],
   [junit4]   2>         "range_facet_i_dv":[6],
   [junit4]   2>         "lowerfilt":["this boue"],
   [junit4]   2>         "lowerfilt1and2":["this boue"],
   [junit4]   2>         "multiDefault":["muLti-Default"],
   [junit4]   2>         "intDefault":42,
   [junit4]   2>         "timestamp":"2016-10-31T07:13:54.409Z"},
   [junit4]   2>       {
   [junit4]   2>         "id":7,
   [junit4]   2>         "range_facet_l":[7],
   [junit4]   2>         "range_facet_l_dv":[7],
   [junit4]   2>         "range_facet_i_dv":[7],
   [junit4]   2>         "lowerfilt":["this glue"],
   [junit4]   2>         "lowerfilt1and2":["this glue"],
   [junit4]   2>         "multiDefault":["muLti-Default"],
   [junit4]   2>         "intDefault":42,
   [junit4]   2>         "timestamp":"2016-10-31T07:13:54.409Z"},
   [junit4]   2>       {
   [junit4]   2>         "id":8,
   [junit4]   2>         "range_facet_l":[8],
   [junit4]   2>         "range_facet_l_dv":[8],
   [junit4]   2>         "range_facet_i_dv":[8],
   [junit4]   2>         "lowerfilt":["this blee"],
   [junit4]   2>         "lowerfilt1and2":["this blee"],
   [junit4]   2>         "multiDefault":["muLti-Default"],
   [junit4]   2>         "intDefault":42,
   [junit4]   2>         "timestamp":"2016-10-31T07:13:54.410Z"},
   [junit4]   2>       {
   [junit4]   2>         "id":0,
   [junit4]   2>         "range_facet_l":[0],
   [junit4]   2>         "range_facet_l_dv":[0],
   [junit4]   2>         "range_facet_i_dv":[0],
   [junit4]   2>         "lowerfilt":["This is a title"],
   [junit4]   2>         "lowerfilt1and2":["This is a title"],
   [junit4]   2>         "multiDefault":["muLti-Default"],
   [junit4]   2>         "intDefault":42,
   [junit4]   2>         "timestamp":"2016-10-31T07:13:54.407Z"},
   [junit4]   2>       {
   [junit4]   2>         "id":2,
   [junit4]   2>         "range_facet_l":[2],
   [junit4]   2>         "range_facet_l_dv":[2],
   [junit4]   2>         "range_facet_i_dv":[2],
   [junit4]   2>         "lowerfilt":["This is a document"],
   [junit4]   2>         "lowerfilt1and2":["This is a document"],
   [junit4]   2>         "multiDefault":["muLti-Default"],
   [junit4]   2>         "intDefault":42,
   [junit4]   2>         "timestamp":"2016-10-31T07:13:54.408Z"}]
   [junit4]   2>   },
   [junit4]   2>   "spellcheck":{
   [junit4]   2>     "suggestions":[]}}
   [junit4]   2> 
   [junit4]   2>  request = q=lowerfilt:(this+OR+brwn)&spellcheck.maxResultsForSuggest=.80&qt=spellCheckCompRH&spellcheck=true&fq=id:[0+TO+9]&fq=lowerfilt:th*&spellcheck.count=5&wt=xml&spellcheck.build=true&spellcheck.extendedResults=false
   [junit4]   2> 462721 INFO  (TEST-SpellCheckComponentTest.testMaximumResultsForSuggest-seed#[4B1CF67E50479C63]) [    ] o.a.s.c.S.Request [collection1]  webapp=null path=null params={q=lowerfilt:(this+OR+brwn)&spellcheck.maxResultsForSuggest=.70&qt=spellCheckCompRH&spellcheck=true&fq=id:[0+TO+9]&spellcheck.count=5&wt=xml&spellcheck.build=true&spellcheck.maxResultsForSuggest.fq=id:[0+TO+9]&spellcheck.extendedResults=false} hits=7 status=0 QTime=137
   [junit4]   2> 462860 INFO  (TEST-SpellCheckComponentTest.testMaximumResultsForSuggest-seed#[4B1CF67E50479C63]) [    ] o.a.s.c.S.Request [collection1]  webapp=null path=null params={q=lowerfilt:(this+OR+brwn)&spellcheck.maxResultsForSuggest=.64&qt=spellCheckCompRH&spellcheck=true&fq=id:[0+TO+9]&spellcheck.count=5&wt=xml&spellcheck.build=true&spellcheck.maxResultsForSuggest.fq=lowerfilt:th*&spellcheck.extendedResults=false} hits=7 status=0 QTime=137
   [junit4]   2> 462860 ERROR (TEST-SpellCheckComponentTest.testMaximumResultsForSuggest-seed#[4B1CF67E50479C63]) [    ] o.a.s.SolrTestCaseJ4 query failed JSON validation. error=Path not found: /spellcheck/suggestions/[1]/numFound
   [junit4]   2>  expected =/spellcheck/suggestions/[1]/numFound==1
   [junit4]   2>  response = {
   [junit4]   2>   "responseHeader":{
   [junit4]   2>     "status":0,
   [junit4]   2>     "QTime":137},
   [junit4]   2>   "command":"build",
   [junit4]   2>   "response":{"numFound":7,"start":0,"docs":[
   [junit4]   2>       {
   [junit4]   2>         "id":4,
   [junit4]   2>         "range_facet_l":[4],
   [junit4]   2>         "range_facet_l_dv":[4],
   [junit4]   2>         "range_facet_i_dv":[4],
   [junit4]   2>         "lowerfilt":["this blue"],
   [junit4]   2>         "lowerfilt1and2":["this blue"],
   [junit4]   2>         "multiDefault":["muLti-Default"],
   [junit4]   2>         "intDefault":42,
   [junit4]   2>         "timestamp":"2016-10-31T07:13:54.408Z"},
   [junit4]   2>       {
   [junit4]   2>         "id":5,
   [junit4]   2>         "range_facet_l":[5],
   [junit4]   2>         "range_facet_l_dv":[5],
   [junit4]   2>         "range_facet_i_dv":[5],
   [junit4]   2>         "lowerfilt":["this blud"],
   [junit4]   2>         "lowerfilt1and2":["this blud"],
   [junit4]   2>         "multiDefault":["muLti-Default"],
   [junit4]   2>         "intDefault":42,
   [junit4]   2>         "timestamp":"2016-10-31T07:13:54.409Z"},
   [junit4]   2>       {
   [junit4]   2>         "id":6,
   [junit4]   2>         "range_facet_l":[6],
   [junit4]   2>         "range_facet_l_dv":[6],
   [junit4]   2>         "range_facet_i_dv":[6],
   [junit4]   2>         "lowerfilt":["this boue"],
   [junit4]   2>         "lowerfilt1and2":["this boue"],
   [junit4]   2>         "multiDefault":["muLti-Default"],
   [junit4]   2>         "intDefault":42,
   [junit4]   2>         "timestamp":"2016-10-31T07:13:54.409Z"},
   [junit4]   2>       {
   [junit4]   2>         "id":7,
   [junit4]   2>         "range_facet_l":[7],
   [junit4]   2>         "range_facet_l_dv":[7],
   [junit4]   2>         "range_facet_i_dv":[7],
   [junit4]   2>         "lowerfilt":["this glue"],
   [junit4]   2>         "lowerfilt1and2":["this glue"],
   [junit4]   2>         "multiDefault":["muLti-Default"],
   [junit4]   2>         "intDefault":42,
   [junit4]   2>         "timestamp":"2016-10-31T07:13:54.409Z"},
   [junit4]   2>       {
   [junit4]   2>         "id":8,
   [junit4]   2>         "range_facet_l":[8],
   [junit4]   2>         "range_facet_l_dv":[8],
   [junit4]   2>         "range_facet_i_dv":[8],
   [junit4]   2>         "lowerfilt":["this blee"],
   [junit4]   2>         "lowerfilt1and2":["this blee"],
   [junit4]   2>         "multiDefault":["muLti-Default"],
   [junit4]   2>         "intDefault":42,
   [junit4]   2>         "timestamp":"2016-10-31T07:13:54.410Z"},
   [junit4]   2>       {
   [junit4]   2>         "id":0,
   [junit4]   2>         "range_facet_l":[0],
   [junit4]   2>         "range_facet_l_dv":[0],
   [junit4]   2>         "range_facet_i_dv":[0],
   [junit4]   2>         "lowerfilt":["This is a title"],
   [junit4]   2>         "lowerfilt1and2":["This is a title"],
   [junit4]   2>         "multiDefault":["muLti-Default"],
   [junit4]   2>         "intDefault":42,
   [junit4]   2>         "timestamp":"2016-10-31T07:13:54.407Z"},
   [junit4]   2>       {
   [junit4]   2>         "id":2,
   [junit4]   2>         "range_facet_l":[2],
   [junit4]   2>         "range_facet_l_dv":[2],
   [junit4]   2>         "range_facet_i_dv":[2],
   [junit4]   2>         "lowerfilt":["This is a document"],
   [junit4]   2>         "lowerfilt1and2":["This is a document"],
   [junit4]   2>         "multiDefault":["muLti-Default"],
   [junit4]   2>         "intDefault":42,
   [junit4]   2>         "timestamp":"2016-10-31T07:13:54.408Z"}]
   [junit4]   2>   },
   [junit4]   2>   "spellcheck":{
   [junit4]   2>     "suggestions":[]}}
   [junit4]   2> 
   [junit4]   2>  request = q=lowerfilt:(this+OR+brwn)&spellcheck.maxResultsForSuggest=.64&qt=spellCheckCompRH&spellcheck=true&fq=id:[0+TO+9]&spellcheck.count=5&wt=xml&spellcheck.build=true&spellcheck.maxResultsForSuggest.fq=lowerfilt:th*&spellcheck.extendedResults=false
   [junit4]   2> 462860 INFO  (TEST-SpellCheckComponentTest.testMaximumResultsForSuggest-seed#[4B1CF67E50479C63]) [    ] o.a.s.SolrTestCaseJ4 ###Ending testMaximumResultsForSuggest
   [junit4]   2> 462860 INFO  (TEST-SpellCheckComponentTest.testMaximumResultsForSuggest-seed#[4B1CF67E50479C63]) [    ] o.a.s.u.DirectUpdateHandler2 [collection1] REMOVING ALL DOCUMENTS FROM INDEX
   [junit4]   2> 462861 INFO  (TEST-SpellCheckComponentTest.testMaximumResultsForSuggest-seed#[4B1CF67E50479C63]) [    ] o.a.s.u.p.LogUpdateProcessorFactory [collection1]  webapp=null path=null params={}{deleteByQuery=*:*} 0 0
   [junit4]   2> 462861 INFO  (TEST-SpellCheckComponentTest.testMaximumResultsForSuggest-seed#[4B1CF67E50479C63]) [    ] o.a.s.u.DirectUpdateHandler2 start commit{,optimize=false,openSearcher=true,waitSearcher=true,expungeDeletes=false,softCommit=false,prepareCommit=false}
   [junit4]   2> 462861 INFO  (TEST-SpellCheckComponentTest.testMaximumResultsForSuggest-seed#[4B1CF67E50479C63]) [    ] o.a.s.u.SolrIndexWriter Calling setCommitData with IW:org.apache.solr.update.SolrIndexWriter@159a2ff
   [junit4]   2> 462861 INFO  (TEST-SpellCheckComponentTest.testMaximumResultsForSuggest-seed#[4B1CF67E50479C63]) [    ] o.a.s.s.SolrIndexSearcher Opening [Searcher@4e80f[collection1] main]
   [junit4]   2> 462861 INFO  (TEST-SpellCheckComponentTest.testMaximumResultsForSuggest-seed#[4B1CF67E50479C63]) [    ] o.a.s.u.DirectUpdateHandler2 end_commit_flush
   [junit4]   2> 462861 INFO  (searcherExecutor-1802-thread-1) [    ] o.a.s.h.c.SpellCheckComponent Building spell index for spell checker: default
   [junit4]   2> 462918 INFO  (searcherExecutor-1802-thread-1) [    ] o.a.s.h.c.SpellCheckComponent Building spell index for spell checker: default_teststop
   [junit4]   2> 462958 INFO  (searcherExecutor-1802-thread-1) [    ] o.a.s.h.c.SpellCheckComponent Building spell index for spell checker: threshold
   [junit4]   2> 463029 INFO  (searcherExecutor-1802-thread-1) [    ] o.a.s.h.c.SpellCheckComponent Building spell index for spell checker: threshold_direct
   [junit4]   2> 463029 INFO  (searcherExecutor-1802-thread-1) [    ] o.a.s.h.c.SpellCheckComponent Building spell index for spell checker: multipleFields
   [junit4]   2> 463101 INFO  (searcherExecutor-1802-thread-1) [    ] o.a.s.h.c.SpellCheckComponent Building spell index for spell checker: freq
   [junit4]   2> 463157 INFO  (searcherExecutor-1802-thread-1) [    ] o.a.s.h.c.SpellCheckComponent Building spell index for spell checker: fqcn
   [junit4]   2> 463221 INFO  (searcherExecutor-1802-thread-1) [    ] o.a.s.c.SolrCore [collection1] Registered new searcher Searcher@4e80f[collection1] main{ExitableDirectoryReader(UninvertingDirectoryReader())}
   [junit4]   2> 463221 INFO  (TEST-SpellCheckComponentTest.testMaximumResultsForSuggest-seed#[4B1CF67E50479C63]) [    ] o.a.s.u.p.LogUpdateProcessorFactory [collection1]  webapp=null path=null params={}{commit=} 0 360
   [junit4]   2> 463223 INFO  (TEST-SpellCheckComponentTest.testNumericQuery-seed#[4B1CF67E50479C63]) [    ] o.a.s.SolrTestCaseJ4 ###Starting testNumericQuery
   [junit4]   2> 463223 INFO  (TEST-SpellCheckComponentTest.testNumericQuery-seed#[4B1CF67E50479C63]) [    ] o.a.s.u.p.LogUpdateProcessorFactory [collection1]  webapp=null path=null params={}{add=[0]} 0 0
   [junit4]   2> 463224 INFO  (TEST-SpellCheckComponentTest.testNumericQuery-seed#[4B1CF67E50479C63]) [    ] o.a.s.u.p.LogUpdateProcessorFactory [collection1]  webapp=null path=null params={}{add=[1]} 0 0
   [junit4]   2> 463224 INFO  (TEST-SpellCheckComponentTest.testNumericQuery-seed#[4B1CF67E50479C63]) [    ] o.a.s.u.p.LogUpdateProcessorFactory [collection1]  webapp=null path=null params={}{add=[2]} 0 0
   [junit4]   2> 463224 INFO  (TEST-SpellCheckComponentTest.testNumericQuery-seed#[4B1CF67E50479C63]) [    ] o.a.s.u.p.LogUpdateProcessorFactory [collection1]  webapp=null path=null params={}{add=[3]} 0 0
   [junit4]   2> 463224 INFO  (TEST-SpellCheckComponentTest.testNumericQuery-seed#[4B1CF67E50479C63]) [    ] o.a.s.u.p.LogUpdateProcessorFactory [collection1]  webapp=null path=null params={}{add=[4]} 0 0
   [junit4]   2> 463224 INFO  (TEST-SpellCheckComponentTest.testNumericQuery-seed#[4B1CF67E50479C63]) [    ] o.a.s.u.p.LogUpdateProcessorFactory [collection1]  webapp=null path=null params={}{add=[5]} 0 0
   [junit4]   2> 463225 INFO  (TEST-SpellCheckComponentTest.testNumericQuery-seed#[4B1CF67E50479C63]) [    ] o.a.s.u.p.LogUpdateProcessorFactory [collection1]  webapp=null path=null params={}{add=[6]} 0 0
   [junit4]   2> 463225 INFO  (TEST-SpellCheckComponentTest.testNumericQuery-seed#[4B1CF67E50479C63]) [    ] o.a.s.u.p.LogUpdateProcessorFactory [collection1]  webapp=null path=null params={}{add=[7]} 0 0
   [junit4]   2> 463225 INFO  (TEST-SpellCheckComponentTest.testNumericQuery-seed#[4B1CF67E50479C63]) [    ] o.a.s.u.p.LogUpdateProcessorFactory [collection1]  webapp=null path=null params={}{add=[8]} 0 0
   [junit4]   2> 463225 INFO  (TEST-SpellCheckComponentTest.testNumericQuery-seed#[4B1CF67E50479C63]) [    ] o.a.s.u.p.LogUpdateProcessorFactory [collection1]  webapp=null path=null params={}{add=[9]} 0 0
   [junit4]   2> 463225 INFO  (TEST-SpellCheckComponentTest.testNumericQuery-seed#[4B1CF67E50479C63]) [    ] o.a.s.u.DirectUpdateHandler2 start commit{,optimize=false,openSearcher=true,waitSearcher=true,expungeDeletes=false,softCommit=false,prepareCommit=false}
   [junit4]   2> 463225 INFO  (TEST-SpellCheckComponentTest.testNumericQuery-seed#[4B1CF67E50479C63]) [    ] o.a.s.u.SolrIndexWriter Calling setCommitData with IW:org.apache.solr.update.SolrIndexWriter@159a2ff
   [junit4]   2> 463229 INFO  (TEST-SpellCheckComponentTest.testNumericQuery-seed#[4B1CF67E50479C63]) [    ] o.a.s.s.SolrIndexSearcher Opening [Searcher@1958564[collection1] main]
   [junit4]   2> 463229 INFO  (TEST-SpellCheckComponentTest.testNumericQuery-seed#[4B1CF67E50479C63]) [    ] o.a.s.u.DirectUpdateHandler2 end_commit_flush
   [junit4]   2> 463229 INFO  (searcherExecutor-1802-thread-1) [    ] o.a.s.h.c.SpellCheckComponent Building spell index for spell checker: default
   [junit4]   2> 463416 INFO  (searcherExecutor-1802-thread-1) [    ] o.a.s.h.c.SpellCheckComponent Building spell index for spell checker: default_teststop
   [junit4]   2> 463470 INFO  (searcherExecutor-1802-thread-1) [    ] o.a.s.h.c.SpellCheckComponent Building spell index for spell checker: threshold
   [junit4]   2> 463613 INFO  (searcherExecutor-1802-thread-1) [    ] o.a.s.h.c.SpellCheckComponent Building spell index for spell checker: threshold_direct
   [junit4]   2> 463613 INFO  (searcherExecutor-1802-thread-1) [    ] o.a.s.h.c.SpellCheckComponent Building spell index for spell checker: multipleFields
   [junit4]   2> 463716 INFO  (searcherExecutor-1802-thread-1) [    ] o.a.s.h.c.SpellCheckComponent Building spell index for spell checker: freq
   [junit4]   2> 463859 INFO  (searcherExecutor-1802-thread-1) [    ] o.a.s.h.c.SpellCheckComponent Building spell index for spell checker: fqcn
   [junit4]   2> 464050 INFO  (searcherExecutor-1802-thread-1) [    ] o.a.s.c.SolrCore [collection1] Registered new searcher Searcher@1958564[collection1] main{ExitableDirectoryReader(UninvertingDirectoryReader(Uninverting(_6(7.0.0):C10)))}
   [junit4]   2> 464050 INFO  (TEST-SpellCheckComponentTest.testNumericQuery-seed#[4B1CF67E50479C63]) [    ] o.a.s.u.p.LogUpdateProcessorFactory [collection1]  webapp=null path=null params={}{commit=} 0 824
   [junit4]   2> 464051 INFO  (TEST-SpellCheckComponentTest.testNumericQuery-seed#[4B1CF67E50479C63]) [    ] o.a.s.c.S.Request [collection1]  webapp=null path=null params={q=12346&qt=spellCheckCompRH&spellcheck=true&wt=xml} hits=0 status=0 QTime=0
   [junit4]   2> 464051 INFO  (TEST-SpellCheckComponentTest.testNumericQuery-seed#[4B1CF67E50479C63]) [    ] o.a.s.SolrTestCaseJ4 ###Ending testNumericQuery
   [junit4]   2> 464052 INFO  (TEST-SpellCheckComponentTest.testNumericQuery-seed#[4B1CF67E50479C63]) [    ] o.a.s.u.DirectUpdateHandler2 [collection1] REMOVING ALL DOCUMENTS FROM INDEX
   [junit4]   2> 464052 INFO  (TEST-SpellCheckComponentTest.testNumericQuery-seed#[4B1CF67E50479C63]) [    ] o.a.s.u.p.LogUpdateProcessorFactory [collection1]  webapp=null path=null params={}{deleteByQuery=*:*} 0 0
   [junit4]   2> 464052 INFO  (TEST-SpellCheckComponentTest.testNumericQuery-seed#[4B1CF67E50479C63]) [    ] o.a.s.u.DirectUpdateHandler2 start commit{,optimize=false,openSearcher=true,waitSearcher=true,expungeDeletes=false,softCommit=false,prepareCommit=false}
   [junit4]   2> 464052 INFO  (TEST-SpellCheckComponentTest.testNumericQuery-seed#[4B1CF67E50479C63]) [    ] o.a.s.u.SolrIndexWriter Calling setCommitData with IW:org.apache.solr.update.SolrIndexWriter@159a2ff
   [junit4]   2> 464052 INFO  (TEST-SpellCheckComponentTest.testNumericQuery-seed#[4B1CF67E50479C63]) [    ] o.a.s.s.SolrIndexSearcher Opening [Searcher@8a31a1[collection1] main]
   [junit4]   2> 464052 INFO  (TEST-SpellCheckComponentTest.testNumericQuery-seed#[4B1CF67E50479C63]) [    ] o.a.s.u.DirectUpdateHandler2 end_commit_flush
   [junit4]   2> 464052 INFO  (searcherExecutor-1802-thread-1) [    ] o.a.s.h.c.SpellCheckComponent Building spell index for spell checker: default
   [junit4]   2> 464108 INFO  (searcherExecutor-1802-thread-1) [    ] o.a.s.h.c.SpellCheckComponent Building spell index for spell checker: default_teststop
   [junit4]   2> 464170 INFO  (searcherExecutor-1802-thread-1) [    ] o.a.s.h.c.SpellCheckComponent Building spell index for spell checker: threshold
   [junit4]   2> 464226 INFO  (searcherExecutor-1802-thread-1) [    ] o.a.s.h.c.SpellCheckComponent Building spell index for spell checker: threshold_direct
   [junit4]   2> 464226 INFO  (searcherExecutor-1802-thread-1) [    ] o.a.s.h.c.SpellCheckComponent Building spell index for spell checker: multipleFields
   [junit4]   2> 464267 INFO  (searcherExecutor-1802-thread-1) [    ] o.a.s.h.c.SpellCheckComponent Building spell index for spell checker: freq
   [junit4]   2> 464312 INFO  (searcherExecutor-1802-thread-1) [    ] o.a.s.h.c.SpellCheckComponent Building spell index for spell checker: fqcn
   [junit4]   2> 464370 INFO  (searcherExecutor-1802-thread-1) [    ] o.a.s.c.SolrCore [collection1] Registered new searcher Searcher@8a31a1[collection1] main{ExitableDirectoryReader(UninvertingDirectoryReader())}
   [junit4]   2> 464371 INFO  (TEST-SpellCheckComponentTest.testNumericQuery-seed#[4B1CF67E50479C63]) [    ] o.a.s.u.p.LogUpdateProcessorFactory [collection1]  webapp=null path=null params={}{commit=} 0 318
   [junit4]   2> 464372 INFO  (TEST-SpellCheckComponentTest.testCollate-seed#[4B1CF67E50479C63]) [    ] o.a.s.SolrTestCaseJ4 ###Starting testCollate
   [junit4]   2> 464373 INFO  (TEST-SpellCheckComponentTest.testCollate-seed#[4B1CF67E50479C63]) [    ] o.a.s.u.p.LogUpdateProcessorFactory [collection1]  webapp=null path=null params={}{add=[0]} 0 0
   [junit4]   2> 464373 INFO  (TEST-SpellCheckComponentTest.testCollate-seed#[4B1CF67E50479C63]) [    ] o.a.s.u.p.LogUpdateProcessorFactory [collection1]  webapp=null path=null params={}{add=[1]} 0 0
   [junit4]   2> 464373 INFO  (TEST-SpellCheckComponentTest.testCollate-seed#[4B1CF67E50479C63]) [    ] o.a.s.u.p.LogUpdateProcessorFactory [collection1]  webapp=null path=null params={}{add=[2]} 0 0
   [junit4]   2> 464374 INFO  (TEST-SpellCheckComponentTest.testCollate-seed#[4B1CF67E50479C63]) [    ] o.a.s.u.p.LogUpdateProcessorFactory [collection1]  webapp=null path=null params={}{add=[3]} 0 0
   [junit4]   2> 464374 INFO  (TEST-SpellCheckComponentTest.testCollate-seed#[4B1CF67E50479C63]) [    ] o.a.s.u.p.LogUpdateProcessorFactory [collection1]  webapp=null path=null params={}{add=[4]} 0 0
   [junit4]   2> 464374 INFO  (TEST-SpellCheckComponentTest.testCollate-seed#[4B1CF67E50479C63]) [    ] o.a.s.u.p.LogUpdateProcessorFactory [collection1]  webapp=null path=null params={}{add=[5]} 0 0
   [junit4]   2> 464374 INFO  (TEST-SpellCheckComponentTest.testCollate-seed#[4B1CF67E50479C63]) [    ] o.a.s.u.p.LogUpdateProcessorFactory [collection1]  webapp=null path=null params={}{add=[6]} 0 0
   [junit4]   2> 464374 INFO  (TEST-SpellCheckComponentTest.testCollate-seed#[4B1CF67E50479C63]) [    ] o.a.s.u.p.LogUpdateProcessorFactory [collection1]  webapp=null path=null params={}{add=[7]} 0 0
   [junit4]   2> 464375 INFO  (TEST-SpellCheckComponentTest.testCollate-seed#[4B1CF67E50479C63]) [    ] o.a.s.u.p.LogUpdateProcessorFactory [collection1]  webapp=null path=null params={}{add=[8]} 0 0
   [junit4]   2> 464375 INFO  (TEST-SpellCheckComponentTest.testCollate-seed#[4B1CF67E50479C63]) [    ] o.a.s.u.p.LogUpdateProcessorFactory [collection1]  webapp=null path=null params={}{add=[9]} 0 0
   [junit4]   2> 464375 INFO  (TEST-SpellCheckComponentTest.testCollate-seed#[4B1CF67E50479C63]) [    ] o.a.s.u.DirectUpdateHandler2 start commit{,optimize=false,openSearcher=true,waitSearcher=true,expungeDeletes=false,softCommit=false,prepareCommit=false}
   [junit4]   2> 464375 INFO  (TEST-SpellCheckComponentTest.testCollate-seed#[4B1CF67E50479C63]) [    ] o.a.s.u.SolrIndexWriter Calling setCommitData with IW:org.apache.solr.update.SolrIndexWriter@159a2ff
   [junit4]   2> 464377 INFO  (TEST-SpellCheckComponentTest.testCollate-seed#[4B1CF67E50479C63]) [    ] o.a.s.s.SolrIndexSearcher Opening [Searcher@1787620[collection1] main]
   [junit4]   2> 464377 INFO  (TEST-SpellCheckComponentTest.testCollate-seed#[4B1CF67E50479C63]) [    ] o.a.s.u.DirectUpdateHandler2 end_commit_flush
   [junit4]   2> 464377 INFO  (searcherExecutor-1802-thread-1) [    ] o.a.s.h.c.SpellCheckComponent Building spell index for spell checker: default
   [junit4]   2> 464526 INFO  (searcherExecutor-1802-thread-1) [    ] o.a.s.h.c.SpellCheckComponent Building spell index for spell checker: default_teststop
   [junit4]   2> 464587 INFO  (searcherExecutor-1802-thread-1) [    ] o.a.s.h.c.SpellCheckComponent Building spell index for spell checker: threshold
   [junit4]   2> 464790 INFO  (searcherExecutor-1802-thread-1) [    ] o.a.s.h.c.SpellCheckComponent Building spell index for spell checker: threshold_direct
   [junit4]   2> 464790 INFO  (searcherExecutor-1802-thread-1) [    ] o.a.s.h.c.SpellCheckComponent Building spell index for spell checker: multipleFields
   [junit4]   2> 464934 INFO  (searcherExecutor-1802-thread-1) [    ] o.a.s.h.c.SpellCheckComponent Building spell index for spell checker: freq
   [junit4]   2> 465062 INFO  (searcherExecutor-1802-thread-1) [    ] o.a.s.h.c.SpellCheckComponent Building spell index for spell checker: fqcn
   [junit4]   2> 465206 INFO  (searcherExecutor-1802-thread-1) [    ] o.a.s.c.SolrCore [collection1] Registered new searcher Searcher@1787620[collection1] main{ExitableDirectoryReader(UninvertingDirectoryReader(Uninverting(_7(7.0.0):C10)))}
   [junit4]   2> 465206 INFO  (TEST-SpellCheckComponentTest.testCollate-seed#[4B1CF67E50479C63]) [    ] o.a.s.u.p.LogUpdateProcessorFactory [collection1]  webapp=null path=null params={}{commit=} 0 830
   [junit4]   2> 465400 INFO  (TEST-SpellCheckComponentTest.testCollate-seed#[4B1CF67E50479C63]) [    ] o.a.s.c.S.Request [collection1]  webapp=null path=null params={q=documemt&qt=spellCheckCompRH&json.nl=map&spellcheck=true&wt=xml&spellcheck.build=true&spellcheck.collate=true} hits=0 status=0 QTime=194
   [junit4]   2> 465402 INFO  (TEST-SpellCheckComponentTest.testCollate-seed#[4B1CF67E50479C63]) [    ] o.a.s.c.S.Request [collection1]  webapp=null path=null params={q=documemt+lowerfilt:broen^4&qt=spellCheckCompRH&json.nl=map&spellcheck=true&wt=xml&spellcheck.collate=true} hits=0 status=0 QTime=1
   [junit4]   2> 465404 INFO  (TEST-SpellCheckComponentTest.testCollate-seed#[4B1CF67E50479C63]) [    ] o.a.s.c.S.Request [collection1]  webapp=null path=null params={q=documemtsss+broens&qt=spellCheckCompRH&json.nl=map&spellcheck=true&wt=xml&spellcheck.collate=true} hits=0 status=0 QTime=1
   [junit4]   2> 465405 INFO  (TEST-SpellCheckComponentTest.testCollate-seed#[4B1CF67E50479C63]) [    ] o.a.s.c.S.Request [collection1]  webapp=null path=null params={q=pixma&qt=spellCheckCompRH&json.nl=map&spellcheck=true&wt=xml&spellcheck.collate=true} hits=0 status=0 QTime=0
   [junit4]   2> 465405 INFO  (TEST-SpellCheckComponentTest.testCollate-seed#[4B1CF67E50479C63]) [    ] o.a.s.SolrTestCaseJ4 ###Ending testCollate
   [junit4]   2> 465405 INFO  (TEST-SpellCheckComponentTest.testCollate-seed#[4B1CF67E50479C63]) [    ] o.a.s.u.DirectUpdateHandler2 [collection1] REMOVING ALL DOCUMENTS FROM INDEX
   [junit4]   2> 465405 INFO  (TEST-SpellCheckComponentTest.testCollate-seed#[4B1CF67E50479C63]) [    ] o.a.s.u.p.LogUpdateProcessorFactory [collection1]  webapp=null path=null params={}{deleteByQuery=*:*} 0 0
   [junit4]   2> 465406 INFO  (TEST-SpellCheckComponentTest.testCollate-seed#[4B1CF67E50479C63]) [    ] o.a.s.u.DirectUpdateHandler2 start commit{,optimize=false,openSearcher=true,waitSearcher=true,expungeDeletes=false,softCommit=false,prepareCommit=false}
   [junit4]   2> 465406 INFO  (TEST-SpellCheckComponentTest.testCollate-seed#[4B1CF67E50479C63]) [    ] o.a.s.u.SolrIndexWriter Calling setCommitData with IW:org.apache.solr.update.SolrIndexWriter@159a2ff
   [junit4]   2> 465406 INFO  (TEST-SpellCheckComponentTest.testCollate-seed#[4B1CF67E50479C63]) [    ] o.a.s.s.SolrIndexSearcher Opening [Searcher@14ce3df[collection1] main]
   [junit4]   2> 465406 INFO  (TEST-SpellCheckComponentTest.testCollate-seed#[4B1CF67E50479C63]) [    ] o.a.s.u.DirectUpdateHandler2 end_commit_flush
   [junit4]   2> 465406 INFO  (searcherExecutor-1802-thread-1) [    ] o.a.s.h.c.SpellCheckComponent Building spell index for spell checker: default
   [junit4]   2> 465459 INFO  (searcherExecutor-1802-thread-1) [    ] o.a.s.h.c.SpellCheckComponent Building spell index for spell checker: default_teststop
   [junit4]   2> 465530 INFO  (searcherExecutor-1802-thread-1) [    ] o.a.s.h.c.SpellCheckComponent Building spell index for spell checker: threshold
   [junit4]   2> 465598 INFO  (searcherExecutor-1802-thread-1) [    ] o.a.s.h.c.SpellCheckComponent Building spell index for spell checker: threshold_direct
   [junit4]   2> 465598 INFO  (searcherExecutor-1802-thread-1) [    ] o.a.s.h.c.SpellCheckComponent Building spell index for spell checker: multipleFields
   [junit4]   2> 465664 INFO  (searcherExecutor-1802-thread-1) [    ] o.a.s.h.c.SpellCheckComponent Building spell index for spell checker: freq
   [junit4]   2> 465716 INFO  (searcherExecutor-1802-thread-1) [    ] o.a.s.h.c.SpellCheckComponent Building spell index for spell checker: fqcn
   [junit4]   2> 465805 INFO  (searcherExecutor-1802-thread-1) [    ] o.a.s.c.SolrCore [collection1] Registered new searcher Searcher@14ce3df[collection1] main{ExitableDirectoryReader(UninvertingDirectoryReader())}
   [junit4]   2> 465805 INFO  (TEST-SpellCheckComponentTest.test

[...truncated too long message...]

d#[4B1CF67E50479C63]) [    ] o.a.s.u.p.LogUpdateProcessorFactory [collection1]  webapp=null path=null params={}{add=[2]} 0 0
   [junit4]   2> 470376 INFO  (TEST-SpellCheckComponentTest.testCorrectSpelling-seed#[4B1CF67E50479C63]) [    ] o.a.s.u.p.LogUpdateProcessorFactory [collection1]  webapp=null path=null params={}{add=[3]} 0 0
   [junit4]   2> 470376 INFO  (TEST-SpellCheckComponentTest.testCorrectSpelling-seed#[4B1CF67E50479C63]) [    ] o.a.s.u.p.LogUpdateProcessorFactory [collection1]  webapp=null path=null params={}{add=[4]} 0 0
   [junit4]   2> 470377 INFO  (TEST-SpellCheckComponentTest.testCorrectSpelling-seed#[4B1CF67E50479C63]) [    ] o.a.s.u.p.LogUpdateProcessorFactory [collection1]  webapp=null path=null params={}{add=[5]} 0 0
   [junit4]   2> 470377 INFO  (TEST-SpellCheckComponentTest.testCorrectSpelling-seed#[4B1CF67E50479C63]) [    ] o.a.s.u.p.LogUpdateProcessorFactory [collection1]  webapp=null path=null params={}{add=[6]} 0 0
   [junit4]   2> 470377 INFO  (TEST-SpellCheckComponentTest.testCorrectSpelling-seed#[4B1CF67E50479C63]) [    ] o.a.s.u.p.LogUpdateProcessorFactory [collection1]  webapp=null path=null params={}{add=[7]} 0 0
   [junit4]   2> 470377 INFO  (TEST-SpellCheckComponentTest.testCorrectSpelling-seed#[4B1CF67E50479C63]) [    ] o.a.s.u.p.LogUpdateProcessorFactory [collection1]  webapp=null path=null params={}{add=[8]} 0 0
   [junit4]   2> 470377 INFO  (TEST-SpellCheckComponentTest.testCorrectSpelling-seed#[4B1CF67E50479C63]) [    ] o.a.s.u.p.LogUpdateProcessorFactory [collection1]  webapp=null path=null params={}{add=[9]} 0 0
   [junit4]   2> 470378 INFO  (TEST-SpellCheckComponentTest.testCorrectSpelling-seed#[4B1CF67E50479C63]) [    ] o.a.s.u.DirectUpdateHandler2 start commit{,optimize=false,openSearcher=true,waitSearcher=true,expungeDeletes=false,softCommit=false,prepareCommit=false}
   [junit4]   2> 470378 INFO  (TEST-SpellCheckComponentTest.testCorrectSpelling-seed#[4B1CF67E50479C63]) [    ] o.a.s.u.SolrIndexWriter Calling setCommitData with IW:org.apache.solr.update.SolrIndexWriter@159a2ff
   [junit4]   2> 470380 INFO  (TEST-SpellCheckComponentTest.testCorrectSpelling-seed#[4B1CF67E50479C63]) [    ] o.a.s.s.SolrIndexSearcher Opening [Searcher@de7844[collection1] main]
   [junit4]   2> 470380 INFO  (TEST-SpellCheckComponentTest.testCorrectSpelling-seed#[4B1CF67E50479C63]) [    ] o.a.s.u.DirectUpdateHandler2 end_commit_flush
   [junit4]   2> 470380 INFO  (searcherExecutor-1802-thread-1) [    ] o.a.s.h.c.SpellCheckComponent Building spell index for spell checker: default
   [junit4]   2> 470529 INFO  (searcherExecutor-1802-thread-1) [    ] o.a.s.h.c.SpellCheckComponent Building spell index for spell checker: default_teststop
   [junit4]   2> 470568 INFO  (searcherExecutor-1802-thread-1) [    ] o.a.s.h.c.SpellCheckComponent Building spell index for spell checker: threshold
   [junit4]   2> 470715 INFO  (searcherExecutor-1802-thread-1) [    ] o.a.s.h.c.SpellCheckComponent Building spell index for spell checker: threshold_direct
   [junit4]   2> 470715 INFO  (searcherExecutor-1802-thread-1) [    ] o.a.s.h.c.SpellCheckComponent Building spell index for spell checker: multipleFields
   [junit4]   2> 470899 INFO  (searcherExecutor-1802-thread-1) [    ] o.a.s.h.c.SpellCheckComponent Building spell index for spell checker: freq
   [junit4]   2> 471093 INFO  (searcherExecutor-1802-thread-1) [    ] o.a.s.h.c.SpellCheckComponent Building spell index for spell checker: fqcn
   [junit4]   2> 471281 INFO  (searcherExecutor-1802-thread-1) [    ] o.a.s.c.SolrCore [collection1] Registered new searcher Searcher@de7844[collection1] main{ExitableDirectoryReader(UninvertingDirectoryReader(Uninverting(_c(7.0.0):C10)))}
   [junit4]   2> 471282 INFO  (TEST-SpellCheckComponentTest.testCorrectSpelling-seed#[4B1CF67E50479C63]) [    ] o.a.s.u.p.LogUpdateProcessorFactory [collection1]  webapp=null path=null params={}{commit=} 0 904
   [junit4]   2> 471283 INFO  (TEST-SpellCheckComponentTest.testCorrectSpelling-seed#[4B1CF67E50479C63]) [    ] o.a.s.c.S.Request [collection1]  webapp=null path=null params={q=lowerfilt:lazy+lowerfilt:brown&qt=spellCheckCompRH&json.nl=map&spellcheck=true&wt=xml&spellcheck.extendedResults=true} hits=1 status=0 QTime=0
   [junit4]   2> 471284 INFO  (TEST-SpellCheckComponentTest.testCorrectSpelling-seed#[4B1CF67E50479C63]) [    ] o.a.s.c.S.Request [collection1]  webapp=null path=null params={q=lowerfilt:lazy+lowerfilt:brown&qt=spellCheckCompRH&spellcheck.dictionary=direct_lowerfilt&json.nl=map&spellcheck=true&wt=xml&spellcheck.extendedResults=true} hits=1 status=0 QTime=0
   [junit4]   2> 471285 INFO  (TEST-SpellCheckComponentTest.testCorrectSpelling-seed#[4B1CF67E50479C63]) [    ] o.a.s.c.S.Request [collection1]  webapp=null path=null params={q=lakkle&qt=spellCheckCompRH&spellcheck.dictionary=direct_lowerfilt&json.nl=map&spellcheck=true&wt=xml&spellcheck.extendedResults=true} hits=0 status=0 QTime=1
   [junit4]   2> 471285 INFO  (TEST-SpellCheckComponentTest.testCorrectSpelling-seed#[4B1CF67E50479C63]) [    ] o.a.s.SolrTestCaseJ4 ###Ending testCorrectSpelling
   [junit4]   2> 471285 INFO  (TEST-SpellCheckComponentTest.testCorrectSpelling-seed#[4B1CF67E50479C63]) [    ] o.a.s.u.DirectUpdateHandler2 [collection1] REMOVING ALL DOCUMENTS FROM INDEX
   [junit4]   2> 471285 INFO  (TEST-SpellCheckComponentTest.testCorrectSpelling-seed#[4B1CF67E50479C63]) [    ] o.a.s.u.p.LogUpdateProcessorFactory [collection1]  webapp=null path=null params={}{deleteByQuery=*:*} 0 0
   [junit4]   2> 471286 INFO  (TEST-SpellCheckComponentTest.testCorrectSpelling-seed#[4B1CF67E50479C63]) [    ] o.a.s.u.DirectUpdateHandler2 start commit{,optimize=false,openSearcher=true,waitSearcher=true,expungeDeletes=false,softCommit=false,prepareCommit=false}
   [junit4]   2> 471286 INFO  (TEST-SpellCheckComponentTest.testCorrectSpelling-seed#[4B1CF67E50479C63]) [    ] o.a.s.u.SolrIndexWriter Calling setCommitData with IW:org.apache.solr.update.SolrIndexWriter@159a2ff
   [junit4]   2> 471286 INFO  (TEST-SpellCheckComponentTest.testCorrectSpelling-seed#[4B1CF67E50479C63]) [    ] o.a.s.s.SolrIndexSearcher Opening [Searcher@243885[collection1] main]
   [junit4]   2> 471286 INFO  (TEST-SpellCheckComponentTest.testCorrectSpelling-seed#[4B1CF67E50479C63]) [    ] o.a.s.u.DirectUpdateHandler2 end_commit_flush
   [junit4]   2> 471286 INFO  (searcherExecutor-1802-thread-1) [    ] o.a.s.h.c.SpellCheckComponent Building spell index for spell checker: default
   [junit4]   2> 471371 INFO  (searcherExecutor-1802-thread-1) [    ] o.a.s.h.c.SpellCheckComponent Building spell index for spell checker: default_teststop
   [junit4]   2> 471449 INFO  (searcherExecutor-1802-thread-1) [    ] o.a.s.h.c.SpellCheckComponent Building spell index for spell checker: threshold
   [junit4]   2> 471513 INFO  (searcherExecutor-1802-thread-1) [    ] o.a.s.h.c.SpellCheckComponent Building spell index for spell checker: threshold_direct
   [junit4]   2> 471513 INFO  (searcherExecutor-1802-thread-1) [    ] o.a.s.h.c.SpellCheckComponent Building spell index for spell checker: multipleFields
   [junit4]   2> 471576 INFO  (searcherExecutor-1802-thread-1) [    ] o.a.s.h.c.SpellCheckComponent Building spell index for spell checker: freq
   [junit4]   2> 471633 INFO  (searcherExecutor-1802-thread-1) [    ] o.a.s.h.c.SpellCheckComponent Building spell index for spell checker: fqcn
   [junit4]   2> 471689 INFO  (searcherExecutor-1802-thread-1) [    ] o.a.s.c.SolrCore [collection1] Registered new searcher Searcher@243885[collection1] main{ExitableDirectoryReader(UninvertingDirectoryReader())}
   [junit4]   2> 471689 INFO  (TEST-SpellCheckComponentTest.testCorrectSpelling-seed#[4B1CF67E50479C63]) [    ] o.a.s.u.p.LogUpdateProcessorFactory [collection1]  webapp=null path=null params={}{commit=} 0 403
   [junit4]   2> 471690 INFO  (SUITE-SpellCheckComponentTest-seed#[4B1CF67E50479C63]-worker) [    ] o.a.s.SolrTestCaseJ4 ###deleteCore
   [junit4]   2> 471690 INFO  (SUITE-SpellCheckComponentTest-seed#[4B1CF67E50479C63]-worker) [    ] o.a.s.c.CoreContainer Shutting down CoreContainer instance=10727064
   [junit4]   2> 471690 INFO  (coreCloseExecutor-1806-thread-1) [    ] o.a.s.c.SolrCore [collection1]  CLOSING SolrCore org.apache.solr.core.SolrCore@a907ee
   [junit4]   2> NOTE: leaving temporary files on disk at: /home/jenkins/workspace/Lucene-Solr-master-Linux/solr/build/solr-core/test/J1/temp/solr.handler.component.SpellCheckComponentTest_4B1CF67E50479C63-001
   [junit4]   2> NOTE: test params are: codec=Lucene70, sim=ClassicSimilarity, locale=mer-KE, timezone=America/Guyana
   [junit4]   2> NOTE: Linux 4.4.0-42-generic i386/Oracle Corporation 9-ea (32-bit)/cpus=12,threads=1,free=104012064,total=211226624
   [junit4]   2> NOTE: All tests run in this JVM: [DistributedSuggestComponentTest, DistanceFunctionTest, JavabinLoaderTest, AlternateDirectoryTest, HdfsDirectoryTest, QueryParsingTest, TestXIncludeConfig, TestImplicitCoreProperties, WrapperMergePolicyFactoryTest, SoftAutoCommitTest, FileUtilsTest, SpellCheckCollatorTest, TestStressRecovery, HdfsBasicDistributedZkTest, TestSolrConfigHandlerConcurrent, SharedFSAutoReplicaFailoverUtilsTest, ChaosMonkeySafeLeaderTest, ForceLeaderTest, SimplePostToolTest, TestFieldCacheWithThreads, IndexBasedSpellCheckerTest, TestCoreContainer, TestCustomSort, BlockCacheTest, AnalyticsQueryTest, SolrInfoMBeanTest, GraphQueryTest, SparseHLLTest, SuggestComponentContextFilterQueryTest, TestOnReconnectListenerSupport, TestBulkSchemaConcurrent, TestOrdValues, TestFieldCollectionResource, BlockJoinFacetDistribTest, TestBulkSchemaAPI, TestPerFieldSimilarityWithDefaultOverride, DirectSolrConnectionTest, TestPerFieldSimilarity, TestUpdate, DOMUtilTest, TestMiniSolrCloudCluster, TestRuleBasedAuthorizationPlugin, TestCloudPseudoReturnFields, DistributedFacetPivotLongTailTest, DistributedFacetPivotWhiteBoxTest, SpellCheckComponentTest]
   [junit4] Completed [133/647 (1!)] on J1 in 15.72s, 11 tests, 1 error <<< FAILURES!

[...truncated 51571 lines...]


Mime
View raw message