lucene-dev mailing list archives

Site index · List index
Message view « Date » · « Thread »
Top « Date » · « Thread »
From Policeman Jenkins Server <jenk...@thetaphi.de>
Subject [JENKINS] Lucene-Solr-master-Linux (64bit/jdk1.8.0_102) - Build # 18185 - Still Unstable!
Date Mon, 31 Oct 2016 13:41:29 GMT
Build: https://jenkins.thetaphi.de/job/Lucene-Solr-master-Linux/18185/
Java: 64bit/jdk1.8.0_102 -XX:-UseCompressedOops -XX:+UseG1GC

1 tests failed.
FAILED:  org.apache.solr.cloud.TestSolrCloudWithDelegationTokens.testDelegationTokenCancelFail

Error Message:
expected:<200> but was:<404>

Stack Trace:
java.lang.AssertionError: expected:<200> but was:<404>
	at __randomizedtesting.SeedInfo.seed([73D32783679D0714:1B6C12A9B70715F8]:0)
	at org.junit.Assert.fail(Assert.java:93)
	at org.junit.Assert.failNotEquals(Assert.java:647)
	at org.junit.Assert.assertEquals(Assert.java:128)
	at org.junit.Assert.assertEquals(Assert.java:472)
	at org.junit.Assert.assertEquals(Assert.java:456)
	at org.apache.solr.cloud.TestSolrCloudWithDelegationTokens.cancelDelegationToken(TestSolrCloudWithDelegationTokens.java:140)
	at org.apache.solr.cloud.TestSolrCloudWithDelegationTokens.testDelegationTokenCancelFail(TestSolrCloudWithDelegationTokens.java:294)
	at sun.reflect.NativeMethodAccessorImpl.invoke0(Native Method)
	at sun.reflect.NativeMethodAccessorImpl.invoke(NativeMethodAccessorImpl.java:62)
	at sun.reflect.DelegatingMethodAccessorImpl.invoke(DelegatingMethodAccessorImpl.java:43)
	at java.lang.reflect.Method.invoke(Method.java:498)
	at com.carrotsearch.randomizedtesting.RandomizedRunner.invoke(RandomizedRunner.java:1713)
	at com.carrotsearch.randomizedtesting.RandomizedRunner$8.evaluate(RandomizedRunner.java:907)
	at com.carrotsearch.randomizedtesting.RandomizedRunner$9.evaluate(RandomizedRunner.java:943)
	at com.carrotsearch.randomizedtesting.RandomizedRunner$10.evaluate(RandomizedRunner.java:957)
	at com.carrotsearch.randomizedtesting.rules.SystemPropertiesRestoreRule$1.evaluate(SystemPropertiesRestoreRule.java:57)
	at org.apache.lucene.util.TestRuleSetupTeardownChained$1.evaluate(TestRuleSetupTeardownChained.java:49)
	at org.apache.lucene.util.AbstractBeforeAfterRule$1.evaluate(AbstractBeforeAfterRule.java:45)
	at org.apache.lucene.util.TestRuleThreadAndTestName$1.evaluate(TestRuleThreadAndTestName.java:48)
	at org.apache.lucene.util.TestRuleIgnoreAfterMaxFailures$1.evaluate(TestRuleIgnoreAfterMaxFailures.java:64)
	at org.apache.lucene.util.TestRuleMarkFailure$1.evaluate(TestRuleMarkFailure.java:47)
	at com.carrotsearch.randomizedtesting.rules.StatementAdapter.evaluate(StatementAdapter.java:36)
	at com.carrotsearch.randomizedtesting.ThreadLeakControl$StatementRunner.run(ThreadLeakControl.java:367)
	at com.carrotsearch.randomizedtesting.ThreadLeakControl.forkTimeoutingTask(ThreadLeakControl.java:811)
	at com.carrotsearch.randomizedtesting.ThreadLeakControl$3.evaluate(ThreadLeakControl.java:462)
	at com.carrotsearch.randomizedtesting.RandomizedRunner.runSingleTest(RandomizedRunner.java:916)
	at com.carrotsearch.randomizedtesting.RandomizedRunner$5.evaluate(RandomizedRunner.java:802)
	at com.carrotsearch.randomizedtesting.RandomizedRunner$6.evaluate(RandomizedRunner.java:852)
	at com.carrotsearch.randomizedtesting.RandomizedRunner$7.evaluate(RandomizedRunner.java:863)
	at com.carrotsearch.randomizedtesting.rules.StatementAdapter.evaluate(StatementAdapter.java:36)
	at com.carrotsearch.randomizedtesting.rules.SystemPropertiesRestoreRule$1.evaluate(SystemPropertiesRestoreRule.java:57)
	at org.apache.lucene.util.AbstractBeforeAfterRule$1.evaluate(AbstractBeforeAfterRule.java:45)
	at com.carrotsearch.randomizedtesting.rules.StatementAdapter.evaluate(StatementAdapter.java:36)
	at org.apache.lucene.util.TestRuleStoreClassName$1.evaluate(TestRuleStoreClassName.java:41)
	at com.carrotsearch.randomizedtesting.rules.NoShadowingOrOverridesOnMethodsRule$1.evaluate(NoShadowingOrOverridesOnMethodsRule.java:40)
	at com.carrotsearch.randomizedtesting.rules.NoShadowingOrOverridesOnMethodsRule$1.evaluate(NoShadowingOrOverridesOnMethodsRule.java:40)
	at com.carrotsearch.randomizedtesting.rules.StatementAdapter.evaluate(StatementAdapter.java:36)
	at com.carrotsearch.randomizedtesting.rules.StatementAdapter.evaluate(StatementAdapter.java:36)
	at com.carrotsearch.randomizedtesting.rules.StatementAdapter.evaluate(StatementAdapter.java:36)
	at org.apache.lucene.util.TestRuleAssertionsRequired$1.evaluate(TestRuleAssertionsRequired.java:53)
	at org.apache.lucene.util.TestRuleMarkFailure$1.evaluate(TestRuleMarkFailure.java:47)
	at org.apache.lucene.util.TestRuleIgnoreAfterMaxFailures$1.evaluate(TestRuleIgnoreAfterMaxFailures.java:64)
	at org.apache.lucene.util.TestRuleIgnoreTestSuites$1.evaluate(TestRuleIgnoreTestSuites.java:54)
	at com.carrotsearch.randomizedtesting.rules.StatementAdapter.evaluate(StatementAdapter.java:36)
	at com.carrotsearch.randomizedtesting.ThreadLeakControl$StatementRunner.run(ThreadLeakControl.java:367)
	at java.lang.Thread.run(Thread.java:745)




Build Log:
[...truncated 10839 lines...]
   [junit4] Suite: org.apache.solr.cloud.TestSolrCloudWithDelegationTokens
   [junit4]   2> Creating dataDir: /home/jenkins/workspace/Lucene-Solr-master-Linux/solr/build/solr-core/test/J2/temp/solr.cloud.TestSolrCloudWithDelegationTokens_73D32783679D0714-001/init-core-data-001
   [junit4]   2> 153065 INFO  (SUITE-TestSolrCloudWithDelegationTokens-seed#[73D32783679D0714]-worker)
[    ] o.a.s.SolrTestCaseJ4 Randomized ssl (false) and clientAuth (false) via: @org.apache.solr.util.RandomizeSSL(reason=,
value=NaN, ssl=NaN, clientAuth=NaN)
   [junit4]   2> 153067 INFO  (SUITE-TestSolrCloudWithDelegationTokens-seed#[73D32783679D0714]-worker)
[    ] o.a.s.c.MiniSolrCloudCluster Starting cluster of 2 servers in /home/jenkins/workspace/Lucene-Solr-master-Linux/solr/build/solr-core/test/J2/temp/solr.cloud.TestSolrCloudWithDelegationTokens_73D32783679D0714-001/tempDir-001
   [junit4]   2> 153067 INFO  (SUITE-TestSolrCloudWithDelegationTokens-seed#[73D32783679D0714]-worker)
[    ] o.a.s.c.ZkTestServer STARTING ZK TEST SERVER
   [junit4]   2> 153067 INFO  (Thread-355) [    ] o.a.s.c.ZkTestServer client port:0.0.0.0/0.0.0.0:0
   [junit4]   2> 153067 INFO  (Thread-355) [    ] o.a.s.c.ZkTestServer Starting server
   [junit4]   2> 153167 INFO  (SUITE-TestSolrCloudWithDelegationTokens-seed#[73D32783679D0714]-worker)
[    ] o.a.s.c.ZkTestServer start zk server on port:32889
   [junit4]   2> 153176 INFO  (jetty-launcher-225-thread-2) [    ] o.e.j.s.Server jetty-9.3.8.v20160314
   [junit4]   2> 153177 INFO  (jetty-launcher-225-thread-1) [    ] o.e.j.s.Server jetty-9.3.8.v20160314
   [junit4]   2> 153177 INFO  (jetty-launcher-225-thread-2) [    ] o.e.j.s.h.ContextHandler
Started o.e.j.s.ServletContextHandler@14cb8d23{/solr,null,AVAILABLE}
   [junit4]   2> 153179 INFO  (jetty-launcher-225-thread-1) [    ] o.e.j.s.h.ContextHandler
Started o.e.j.s.ServletContextHandler@32fa9995{/solr,null,AVAILABLE}
   [junit4]   2> 153179 INFO  (jetty-launcher-225-thread-2) [    ] o.e.j.s.ServerConnector
Started ServerConnector@3d4d6386{HTTP/1.1,[http/1.1]}{127.0.0.1:44229}
   [junit4]   2> 153179 INFO  (jetty-launcher-225-thread-2) [    ] o.e.j.s.Server Started
@154898ms
   [junit4]   2> 153179 INFO  (jetty-launcher-225-thread-2) [    ] o.a.s.c.s.e.JettySolrRunner
Jetty properties: {hostContext=/solr, hostPort=44229}
   [junit4]   2> 153179 INFO  (jetty-launcher-225-thread-1) [    ] o.e.j.s.ServerConnector
Started ServerConnector@600a960{HTTP/1.1,[http/1.1]}{127.0.0.1:35828}
   [junit4]   2> 153179 INFO  (jetty-launcher-225-thread-1) [    ] o.e.j.s.Server Started
@154898ms
   [junit4]   2> 153179 INFO  (jetty-launcher-225-thread-1) [    ] o.a.s.c.s.e.JettySolrRunner
Jetty properties: {hostContext=/solr, hostPort=35828}
   [junit4]   2> 153179 ERROR (jetty-launcher-225-thread-2) [    ] o.a.s.s.StartupLoggingUtils
Missing Java Option solr.log.dir. Logging may be missing or incomplete.
   [junit4]   2> 153180 INFO  (jetty-launcher-225-thread-2) [    ] o.a.s.s.SolrDispatchFilter
 ___      _       Welcome to Apache Solr™ version 7.0.0
   [junit4]   2> 153180 INFO  (jetty-launcher-225-thread-2) [    ] o.a.s.s.SolrDispatchFilter
/ __| ___| |_ _   Starting in cloud mode on port null
   [junit4]   2> 153180 INFO  (jetty-launcher-225-thread-2) [    ] o.a.s.s.SolrDispatchFilter
\__ \/ _ \ | '_|  Install dir: null
   [junit4]   2> 153180 INFO  (jetty-launcher-225-thread-2) [    ] o.a.s.s.SolrDispatchFilter
|___/\___/_|_|    Start time: 2016-10-31T12:56:32.420Z
   [junit4]   2> 153180 ERROR (jetty-launcher-225-thread-1) [    ] o.a.s.s.StartupLoggingUtils
Missing Java Option solr.log.dir. Logging may be missing or incomplete.
   [junit4]   2> 153180 INFO  (jetty-launcher-225-thread-1) [    ] o.a.s.s.SolrDispatchFilter
 ___      _       Welcome to Apache Solr™ version 7.0.0
   [junit4]   2> 153180 INFO  (jetty-launcher-225-thread-1) [    ] o.a.s.s.SolrDispatchFilter
/ __| ___| |_ _   Starting in cloud mode on port null
   [junit4]   2> 153180 INFO  (jetty-launcher-225-thread-1) [    ] o.a.s.s.SolrDispatchFilter
\__ \/ _ \ | '_|  Install dir: null
   [junit4]   2> 153180 INFO  (jetty-launcher-225-thread-1) [    ] o.a.s.s.SolrDispatchFilter
|___/\___/_|_|    Start time: 2016-10-31T12:56:32.420Z
   [junit4]   2> 153183 INFO  (jetty-launcher-225-thread-2) [    ] o.a.s.s.SolrDispatchFilter
solr.xml found in ZooKeeper. Loading...
   [junit4]   2> 153183 INFO  (jetty-launcher-225-thread-1) [    ] o.a.s.s.SolrDispatchFilter
solr.xml found in ZooKeeper. Loading...
   [junit4]   2> 153188 WARN  (NIOServerCxn.Factory:0.0.0.0/0.0.0.0:0) [    ] o.a.z.s.NIOServerCnxn
caught end of stream exception
   [junit4]   2> EndOfStreamException: Unable to read additional data from client sessionid
0x1581ad00d340002, likely client has closed socket
   [junit4]   2> 	at org.apache.zookeeper.server.NIOServerCnxn.doIO(NIOServerCnxn.java:228)
   [junit4]   2> 	at org.apache.zookeeper.server.NIOServerCnxnFactory.run(NIOServerCnxnFactory.java:208)
   [junit4]   2> 	at java.lang.Thread.run(Thread.java:745)
   [junit4]   2> 153190 INFO  (jetty-launcher-225-thread-2) [    ] o.a.s.c.ZkContainer
Zookeeper client=127.0.0.1:32889/solr
   [junit4]   2> 153190 INFO  (jetty-launcher-225-thread-1) [    ] o.a.s.c.ZkContainer
Zookeeper client=127.0.0.1:32889/solr
   [junit4]   2> 153192 WARN  (NIOServerCxn.Factory:0.0.0.0/0.0.0.0:0) [    ] o.a.z.s.NIOServerCnxn
caught end of stream exception
   [junit4]   2> EndOfStreamException: Unable to read additional data from client sessionid
0x1581ad00d340003, likely client has closed socket
   [junit4]   2> 	at org.apache.zookeeper.server.NIOServerCnxn.doIO(NIOServerCnxn.java:228)
   [junit4]   2> 	at org.apache.zookeeper.server.NIOServerCnxnFactory.run(NIOServerCnxnFactory.java:208)
   [junit4]   2> 	at java.lang.Thread.run(Thread.java:745)
   [junit4]   2> 153208 INFO  (jetty-launcher-225-thread-2) [n:127.0.0.1:44229_solr   
] o.a.s.c.OverseerElectionContext I am going to be the leader 127.0.0.1:44229_solr
   [junit4]   2> 153209 INFO  (jetty-launcher-225-thread-2) [n:127.0.0.1:44229_solr   
] o.a.s.c.Overseer Overseer (id=96856872865497093-127.0.0.1:44229_solr-n_0000000000) starting
   [junit4]   2> 153214 INFO  (jetty-launcher-225-thread-2) [n:127.0.0.1:44229_solr   
] o.a.s.c.ZkController Register node as live in ZooKeeper:/live_nodes/127.0.0.1:44229_solr
   [junit4]   2> 153216 INFO  (zkCallback-235-thread-1-processing-n:127.0.0.1:44229_solr)
[n:127.0.0.1:44229_solr    ] o.a.s.c.c.ZkStateReader Updated live nodes from ZooKeeper...
(0) -> (1)
   [junit4]   2> 153216 INFO  (zkCallback-236-thread-1-processing-n:127.0.0.1:35828_solr)
[n:127.0.0.1:35828_solr    ] o.a.s.c.c.ZkStateReader Updated live nodes from ZooKeeper...
(0) -> (1)
   [junit4]   2> 153220 INFO  (jetty-launcher-225-thread-1) [n:127.0.0.1:35828_solr   
] o.a.s.c.ZkController Register node as live in ZooKeeper:/live_nodes/127.0.0.1:35828_solr
   [junit4]   2> 153222 INFO  (zkCallback-236-thread-1-processing-n:127.0.0.1:35828_solr)
[n:127.0.0.1:35828_solr    ] o.a.s.c.c.ZkStateReader Updated live nodes from ZooKeeper...
(1) -> (2)
   [junit4]   2> 153222 INFO  (zkCallback-235-thread-1-processing-n:127.0.0.1:44229_solr)
[n:127.0.0.1:44229_solr    ] o.a.s.c.c.ZkStateReader Updated live nodes from ZooKeeper...
(1) -> (2)
   [junit4]   2> 153228 INFO  (jetty-launcher-225-thread-2) [n:127.0.0.1:44229_solr   
] o.a.s.c.CoreContainer Initializing authentication plugin: org.apache.solr.security.HttpParamDelegationTokenPlugin
   [junit4]   2> 153233 INFO  (jetty-launcher-225-thread-1) [n:127.0.0.1:35828_solr   
] o.a.s.c.CoreContainer Initializing authentication plugin: org.apache.solr.security.HttpParamDelegationTokenPlugin
   [junit4]   2> 153249 INFO  (jetty-launcher-225-thread-2) [n:127.0.0.1:44229_solr   
] o.a.s.s.KerberosPlugin Params: {token.valid=30, delegation-token.token-kind=solr-dt, cookie.domain=127.0.0.1,
cookie.path=/, zk-dt-secret-manager.znodeWorkingPath=solr/security/zkdtsm, token.validity=36000,
signer.secret.provider.zookeeper.path=/token, type=kerberos, zk-dt-secret-manager.enable=true,
kerberos.name.rules=DEFAULT, signer.secret.provider=zookeeper}
   [junit4]   2> 153249 INFO  (jetty-launcher-225-thread-1) [n:127.0.0.1:35828_solr   
] o.a.s.s.KerberosPlugin Params: {token.valid=30, delegation-token.token-kind=solr-dt, cookie.domain=127.0.0.1,
cookie.path=/, zk-dt-secret-manager.znodeWorkingPath=solr/security/zkdtsm, token.validity=36000,
signer.secret.provider.zookeeper.path=/token, type=kerberos, zk-dt-secret-manager.enable=true,
kerberos.name.rules=DEFAULT, signer.secret.provider=zookeeper}
   [junit4]   2> 153348 INFO  (jetty-launcher-225-thread-2) [n:127.0.0.1:44229_solr   
] o.a.c.f.i.CuratorFrameworkImpl Starting
   [junit4]   2> 153348 INFO  (jetty-launcher-225-thread-1) [n:127.0.0.1:35828_solr   
] o.a.c.f.i.CuratorFrameworkImpl Starting
   [junit4]   2> 153378 INFO  (jetty-launcher-225-thread-1-EventThread) [n:127.0.0.1:35828_solr
   ] o.a.c.f.s.ConnectionStateManager State change: CONNECTED
   [junit4]   2> 153378 INFO  (jetty-launcher-225-thread-2-EventThread) [n:127.0.0.1:44229_solr
   ] o.a.c.f.s.ConnectionStateManager State change: CONNECTED
   [junit4]   2> 153583 INFO  (jetty-launcher-225-thread-1) [n:127.0.0.1:35828_solr   
] o.a.s.c.CorePropertiesLocator Found 0 core definitions underneath /home/jenkins/workspace/Lucene-Solr-master-Linux/solr/build/solr-core/test/J2/temp/solr.cloud.TestSolrCloudWithDelegationTokens_73D32783679D0714-001/tempDir-001/node1/.
   [junit4]   2> 153583 INFO  (jetty-launcher-225-thread-2) [n:127.0.0.1:44229_solr   
] o.a.s.c.CorePropertiesLocator Found 0 core definitions underneath /home/jenkins/workspace/Lucene-Solr-master-Linux/solr/build/solr-core/test/J2/temp/solr.cloud.TestSolrCloudWithDelegationTokens_73D32783679D0714-001/tempDir-001/node2/.
   [junit4]   2> 153602 INFO  (TEST-TestSolrCloudWithDelegationTokens.testDelegationTokenCancelFail-seed#[73D32783679D0714])
[    ] o.a.s.SolrTestCaseJ4 ###Starting testDelegationTokenCancelFail
   [junit4]   2> 154093 INFO  (TEST-TestSolrCloudWithDelegationTokens.testDelegationTokenCancelFail-seed#[73D32783679D0714])
[    ] o.a.s.SolrTestCaseJ4 ###Ending testDelegationTokenCancelFail
   [junit4]   2> NOTE: reproduce with: ant test  -Dtestcase=TestSolrCloudWithDelegationTokens
-Dtests.method=testDelegationTokenCancelFail -Dtests.seed=73D32783679D0714 -Dtests.multiplier=3
-Dtests.slow=true -Dtests.locale=ar-MA -Dtests.timezone=Africa/Mogadishu -Dtests.asserts=true
-Dtests.file.encoding=UTF-8
   [junit4] FAILURE 0.51s J2 | TestSolrCloudWithDelegationTokens.testDelegationTokenCancelFail
<<<
   [junit4]    > Throwable #1: java.lang.AssertionError: expected:<200> but was:<404>
   [junit4]    > 	at __randomizedtesting.SeedInfo.seed([73D32783679D0714:1B6C12A9B70715F8]:0)
   [junit4]    > 	at org.apache.solr.cloud.TestSolrCloudWithDelegationTokens.cancelDelegationToken(TestSolrCloudWithDelegationTokens.java:140)
   [junit4]    > 	at org.apache.solr.cloud.TestSolrCloudWithDelegationTokens.testDelegationTokenCancelFail(TestSolrCloudWithDelegationTokens.java:294)
   [junit4]    > 	at java.lang.Thread.run(Thread.java:745)
   [junit4]   2> 154107 INFO  (TEST-TestSolrCloudWithDelegationTokens.testDelegationTokenRenew-seed#[73D32783679D0714])
[    ] o.a.s.SolrTestCaseJ4 ###Starting testDelegationTokenRenew
   [junit4]   2> 154160 INFO  (qtp1108933276-1425) [n:127.0.0.1:35828_solr    ] o.a.s.h.a.CollectionsHandler
Invoked Collection Action :list with params action=LIST&delegation=GgADYmFyA2JhcgCKAVga0BFEigFYPtyVRAIEFLYdyWx9Oz0BWDmOYJ0y1ybhCFI9B3NvbHItZHQA&wt=javabin&version=2
and sendToOCPQueue=true
   [junit4]   2> 154161 INFO  (qtp1108933276-1425) [n:127.0.0.1:35828_solr    ] o.a.s.s.HttpSolrCall
[admin] webapp=null path=/admin/collections params={action=LIST&delegation=GgADYmFyA2JhcgCKAVga0BFEigFYPtyVRAIEFLYdyWx9Oz0BWDmOYJ0y1ybhCFI9B3NvbHItZHQA&wt=javabin&version=2}
status=0 QTime=0
   [junit4]   2> 154175 WARN  (TEST-TestSolrCloudWithDelegationTokens.testDelegationTokenRenew-seed#[73D32783679D0714])
[    ] o.a.h.c.p.ResponseProcessCookies Invalid cookie header: "Set-Cookie: hadoop.auth=;
Path=/; Domain=127.0.0.1; Expires= , 01-   -1970 00:00:00 GMT; HttpOnly". Invalid 'expires'
attribute: , 01- -1970 00:00:00 GMT
   [junit4]   2> 154180 INFO  (qtp1060310775-1410) [n:127.0.0.1:44229_solr    ] o.a.s.h.a.CollectionsHandler
Invoked Collection Action :list with params action=LIST&delegation=GgADYmFyA2JhcgCKAVga0BFEigFYPtyVRAIEFLYdyWx9Oz0BWDmOYJ0y1ybhCFI9B3NvbHItZHQA&wt=javabin&version=2
and sendToOCPQueue=true
   [junit4]   2> 154180 INFO  (qtp1060310775-1410) [n:127.0.0.1:44229_solr    ] o.a.s.s.HttpSolrCall
[admin] webapp=null path=/admin/collections params={action=LIST&delegation=GgADYmFyA2JhcgCKAVga0BFEigFYPtyVRAIEFLYdyWx9Oz0BWDmOYJ0y1ybhCFI9B3NvbHItZHQA&wt=javabin&version=2}
status=0 QTime=0
   [junit4]   2> 154183 WARN  (TEST-TestSolrCloudWithDelegationTokens.testDelegationTokenRenew-seed#[73D32783679D0714])
[    ] o.a.h.c.p.ResponseProcessCookies Invalid cookie header: "Set-Cookie: hadoop.auth=;
Path=/; Domain=127.0.0.1; Expires= , 01-   -1970 00:00:00 GMT; HttpOnly". Invalid 'expires'
attribute: , 01- -1970 00:00:00 GMT
   [junit4]   2> 154201 INFO  (qtp1108933276-1421) [n:127.0.0.1:35828_solr    ] o.a.s.h.a.CollectionsHandler
Invoked Collection Action :list with params action=LIST&delegation=GgADYmFyA2JhcgCKAVga0BGQigFYPtyVkAMEFKX-CTDgdjLtXsxzhlFlgeBkqHoEB3NvbHItZHQA&wt=javabin&version=2
and sendToOCPQueue=true
   [junit4]   2> 154202 INFO  (qtp1108933276-1421) [n:127.0.0.1:35828_solr    ] o.a.s.s.HttpSolrCall
[admin] webapp=null path=/admin/collections params={action=LIST&delegation=GgADYmFyA2JhcgCKAVga0BGQigFYPtyVkAMEFKX-CTDgdjLtXsxzhlFlgeBkqHoEB3NvbHItZHQA&wt=javabin&version=2}
status=0 QTime=1
   [junit4]   2> 154206 WARN  (TEST-TestSolrCloudWithDelegationTokens.testDelegationTokenRenew-seed#[73D32783679D0714])
[    ] o.a.h.c.p.ResponseProcessCookies Invalid cookie header: "Set-Cookie: hadoop.auth=;
Path=/; Domain=127.0.0.1; Expires= , 01-   -1970 00:00:00 GMT; HttpOnly". Invalid 'expires'
attribute: , 01- -1970 00:00:00 GMT
   [junit4]   2> 154210 INFO  (qtp1060310775-1411) [n:127.0.0.1:44229_solr    ] o.a.s.h.a.CollectionsHandler
Invoked Collection Action :list with params action=LIST&delegation=GgADYmFyA2JhcgCKAVga0BGQigFYPtyVkAMEFKX-CTDgdjLtXsxzhlFlgeBkqHoEB3NvbHItZHQA&wt=javabin&version=2
and sendToOCPQueue=true
   [junit4]   2> 154210 INFO  (qtp1060310775-1411) [n:127.0.0.1:44229_solr    ] o.a.s.s.HttpSolrCall
[admin] webapp=null path=/admin/collections params={action=LIST&delegation=GgADYmFyA2JhcgCKAVga0BGQigFYPtyVkAMEFKX-CTDgdjLtXsxzhlFlgeBkqHoEB3NvbHItZHQA&wt=javabin&version=2}
status=0 QTime=0
   [junit4]   2> 154216 INFO  (TEST-TestSolrCloudWithDelegationTokens.testDelegationTokenRenew-seed#[73D32783679D0714])
[    ] o.a.s.c.c.ZkStateReader Updated live nodes from ZooKeeper... (0) -> (2)
   [junit4]   2> 154219 WARN  (TEST-TestSolrCloudWithDelegationTokens.testDelegationTokenRenew-seed#[73D32783679D0714])
[    ] o.a.h.c.p.ResponseProcessCookies Invalid cookie header: "Set-Cookie: hadoop.auth=;
Path=/; Domain=127.0.0.1; Expires= , 01-   -1970 00:00:00 GMT; HttpOnly". Invalid 'expires'
attribute: , 01- -1970 00:00:00 GMT
   [junit4]   2> 154236 INFO  (qtp1108933276-1418) [n:127.0.0.1:35828_solr    ] o.a.s.h.a.CollectionsHandler
Invoked Collection Action :list with params action=LIST&delegation=GgADYmFyA2JhcgCKAVga0BG1igFYPtyVtQQEFBuwRXFdCv3RED_wt1huzpwDKsYEB3NvbHItZHQA&wt=javabin&version=2
and sendToOCPQueue=true
   [junit4]   2> 154236 INFO  (qtp1108933276-1418) [n:127.0.0.1:35828_solr    ] o.a.s.s.HttpSolrCall
[admin] webapp=null path=/admin/collections params={action=LIST&delegation=GgADYmFyA2JhcgCKAVga0BG1igFYPtyVtQQEFBuwRXFdCv3RED_wt1huzpwDKsYEB3NvbHItZHQA&wt=javabin&version=2}
status=0 QTime=0
   [junit4]   2> 154242 INFO  (TEST-TestSolrCloudWithDelegationTokens.testDelegationTokenRenew-seed#[73D32783679D0714])
[    ] o.a.s.c.c.ZkStateReader Updated live nodes from ZooKeeper... (0) -> (2)
   [junit4]   2> 154246 WARN  (TEST-TestSolrCloudWithDelegationTokens.testDelegationTokenRenew-seed#[73D32783679D0714])
[    ] o.a.h.c.p.ResponseProcessCookies Invalid cookie header: "Set-Cookie: hadoop.auth=;
Path=/; Domain=127.0.0.1; Expires= , 01-   -1970 00:00:00 GMT; HttpOnly". Invalid 'expires'
attribute: , 01- -1970 00:00:00 GMT
   [junit4]   2> 154251 INFO  (TEST-TestSolrCloudWithDelegationTokens.testDelegationTokenRenew-seed#[73D32783679D0714])
[    ] o.a.s.c.c.ZkStateReader Updated live nodes from ZooKeeper... (0) -> (2)
   [junit4]   2> 154253 INFO  (qtp1060310775-1411) [n:127.0.0.1:44229_solr    ] o.a.s.h.a.CollectionsHandler
Invoked Collection Action :list with params action=LIST&delegation=GgADYmFyA2JhcgCKAVga0BG1igFYPtyVtQQEFBuwRXFdCv3RED_wt1huzpwDKsYEB3NvbHItZHQA&wt=javabin&version=2
and sendToOCPQueue=true
   [junit4]   2> 154254 INFO  (qtp1060310775-1411) [n:127.0.0.1:44229_solr    ] o.a.s.s.HttpSolrCall
[admin] webapp=null path=/admin/collections params={action=LIST&delegation=GgADYmFyA2JhcgCKAVga0BG1igFYPtyVtQQEFBuwRXFdCv3RED_wt1huzpwDKsYEB3NvbHItZHQA&wt=javabin&version=2}
status=0 QTime=0
   [junit4]   2> 154260 INFO  (TEST-TestSolrCloudWithDelegationTokens.testDelegationTokenRenew-seed#[73D32783679D0714])
[    ] o.a.s.c.c.ZkStateReader Updated live nodes from ZooKeeper... (0) -> (2)
   [junit4]   2> 154263 WARN  (TEST-TestSolrCloudWithDelegationTokens.testDelegationTokenRenew-seed#[73D32783679D0714])
[    ] o.a.h.c.p.ResponseProcessCookies Invalid cookie header: "Set-Cookie: hadoop.auth=;
Path=/; Domain=127.0.0.1; Expires= , 01-   -1970 00:00:00 GMT; HttpOnly". Invalid 'expires'
attribute: , 01- -1970 00:00:00 GMT
   [junit4]   2> 154278 INFO  (qtp1108933276-1423) [n:127.0.0.1:35828_solr    ] o.a.s.h.a.CollectionsHandler
Invoked Collection Action :list with params action=LIST&delegation=GgADYmFyA2JhcgCKAVga0BHhigFYPtyV4QUEFJo_yEgwos524ZrOhtwOiNGzPxI4B3NvbHItZHQA&wt=javabin&version=2
and sendToOCPQueue=true
   [junit4]   2> 154278 INFO  (qtp1108933276-1423) [n:127.0.0.1:35828_solr    ] o.a.s.s.HttpSolrCall
[admin] webapp=null path=/admin/collections params={action=LIST&delegation=GgADYmFyA2JhcgCKAVga0BHhigFYPtyV4QUEFJo_yEgwos524ZrOhtwOiNGzPxI4B3NvbHItZHQA&wt=javabin&version=2}
status=0 QTime=0
   [junit4]   2> 154281 WARN  (TEST-TestSolrCloudWithDelegationTokens.testDelegationTokenRenew-seed#[73D32783679D0714])
[    ] o.a.h.c.p.ResponseProcessCookies Invalid cookie header: "Set-Cookie: hadoop.auth=;
Path=/; Domain=127.0.0.1; Expires= , 01-   -1970 00:00:00 GMT; HttpOnly". Invalid 'expires'
attribute: , 01- -1970 00:00:00 GMT
   [junit4]   2> 154284 INFO  (qtp1060310775-1414) [n:127.0.0.1:44229_solr    ] o.a.s.h.a.CollectionsHandler
Invoked Collection Action :list with params action=LIST&delegation=GgADYmFyA2JhcgCKAVga0BHhigFYPtyV4QUEFJo_yEgwos524ZrOhtwOiNGzPxI4B3NvbHItZHQA&wt=javabin&version=2
and sendToOCPQueue=true
   [junit4]   2> 154284 INFO  (qtp1060310775-1414) [n:127.0.0.1:44229_solr    ] o.a.s.s.HttpSolrCall
[admin] webapp=null path=/admin/collections params={action=LIST&delegation=GgADYmFyA2JhcgCKAVga0BHhigFYPtyV4QUEFJo_yEgwos524ZrOhtwOiNGzPxI4B3NvbHItZHQA&wt=javabin&version=2}
status=0 QTime=0
   [junit4]   2> 154289 INFO  (TEST-TestSolrCloudWithDelegationTokens.testDelegationTokenRenew-seed#[73D32783679D0714])
[    ] o.a.s.c.c.ZkStateReader Updated live nodes from ZooKeeper... (0) -> (2)
   [junit4]   2> 154291 WARN  (TEST-TestSolrCloudWithDelegationTokens.testDelegationTokenRenew-seed#[73D32783679D0714])
[    ] o.a.h.c.p.ResponseProcessCookies Invalid cookie header: "Set-Cookie: hadoop.auth=;
Path=/; Domain=127.0.0.1; Expires= , 01-   -1970 00:00:00 GMT; HttpOnly". Invalid 'expires'
attribute: , 01- -1970 00:00:00 GMT
   [junit4]   2> 154292 INFO  (TEST-TestSolrCloudWithDelegationTokens.testDelegationTokenRenew-seed#[73D32783679D0714])
[    ] o.a.s.SolrTestCaseJ4 ###Ending testDelegationTokenRenew
   [junit4]   2> 154312 INFO  (TEST-TestSolrCloudWithDelegationTokens.testDelegationTokenVerify-seed#[73D32783679D0714])
[    ] o.a.s.SolrTestCaseJ4 ###Starting testDelegationTokenVerify
   [junit4]   2> 154321 INFO  (TEST-TestSolrCloudWithDelegationTokens.testDelegationTokenVerify-seed#[73D32783679D0714])
[    ] o.a.s.c.c.ZkStateReader Updated live nodes from ZooKeeper... (0) -> (2)
   [junit4]   2> 154325 INFO  (qtp1060310775-1414) [n:127.0.0.1:44229_solr    ] o.a.s.h.a.CollectionsHandler
Invoked Collection Action :list with params action=LIST&delegation=GgADYmFyA2JhcgCKAVga0BIRigFYPtyWEQYEFEB7ooyCCpAy337MdxmPAb05boosB3NvbHItZHQA&wt=javabin&version=2
and sendToOCPQueue=true
   [junit4]   2> 154325 INFO  (qtp1060310775-1414) [n:127.0.0.1:44229_solr    ] o.a.s.s.HttpSolrCall
[admin] webapp=null path=/admin/collections params={action=LIST&delegation=GgADYmFyA2JhcgCKAVga0BIRigFYPtyWEQYEFEB7ooyCCpAy337MdxmPAb05boosB3NvbHItZHQA&wt=javabin&version=2}
status=0 QTime=0
   [junit4]   2> 154332 INFO  (TEST-TestSolrCloudWithDelegationTokens.testDelegationTokenVerify-seed#[73D32783679D0714])
[    ] o.a.s.c.c.ZkStateReader Updated live nodes from ZooKeeper... (0) -> (2)
   [junit4]   2> 154336 WARN  (TEST-TestSolrCloudWithDelegationTokens.testDelegationTokenVerify-seed#[73D32783679D0714])
[    ] o.a.h.c.p.ResponseProcessCookies Invalid cookie header: "Set-Cookie: hadoop.auth=;
Path=/; Domain=127.0.0.1; Expires= , 01-   -1970 00:00:00 GMT; HttpOnly". Invalid 'expires'
attribute: , 01- -1970 00:00:00 GMT
   [junit4]   2> 154348 INFO  (qtp1060310775-1414) [n:127.0.0.1:44229_solr    ] o.a.s.h.a.CollectionsHandler
Invoked Collection Action :list with params action=LIST&delegation=GgADYmFyA2JhcgCKAVga0BIRigFYPtyWEQYEFEB7ooyCCpAy337MdxmPAb05boosB3NvbHItZHQA&wt=javabin&version=2
and sendToOCPQueue=true
   [junit4]   2> 154348 INFO  (qtp1060310775-1414) [n:127.0.0.1:44229_solr    ] o.a.s.s.HttpSolrCall
[admin] webapp=null path=/admin/collections params={action=LIST&delegation=GgADYmFyA2JhcgCKAVga0BIRigFYPtyWEQYEFEB7ooyCCpAy337MdxmPAb05boosB3NvbHItZHQA&wt=javabin&version=2}
status=0 QTime=0
   [junit4]   2> 154352 INFO  (TEST-TestSolrCloudWithDelegationTokens.testDelegationTokenVerify-seed#[73D32783679D0714])
[    ] o.a.s.c.c.ZkStateReader Updated live nodes from ZooKeeper... (0) -> (2)
   [junit4]   2> 154359 WARN  (TEST-TestSolrCloudWithDelegationTokens.testDelegationTokenVerify-seed#[73D32783679D0714])
[    ] o.a.h.c.p.ResponseProcessCookies Invalid cookie header: "Set-Cookie: hadoop.auth=;
Path=/; Domain=127.0.0.1; Expires= , 01-   -1970 00:00:00 GMT; HttpOnly". Invalid 'expires'
attribute: , 01- -1970 00:00:00 GMT
   [junit4]   2> 154360 INFO  (TEST-TestSolrCloudWithDelegationTokens.testDelegationTokenVerify-seed#[73D32783679D0714])
[    ] o.a.s.SolrTestCaseJ4 ###Ending testDelegationTokenVerify
   [junit4]   2> 154378 INFO  (TEST-TestSolrCloudWithDelegationTokens.testDelegationTokenCancel-seed#[73D32783679D0714])
[    ] o.a.s.SolrTestCaseJ4 ###Starting testDelegationTokenCancel
   [junit4]   2> 154390 INFO  (TEST-TestSolrCloudWithDelegationTokens.testDelegationTokenCancel-seed#[73D32783679D0714])
[    ] o.a.s.c.c.ZkStateReader Updated live nodes from ZooKeeper... (0) -> (2)
   [junit4]   2> 154394 ERROR (qtp1060310775-1415) [    ] o.a.h.s.t.d.ZKDelegationTokenSecretManager
No node in path [/ZKDTSMTokensRoot/DT_7]
   [junit4]   2> 154412 WARN  (TEST-TestSolrCloudWithDelegationTokens.testDelegationTokenCancel-seed#[73D32783679D0714])
[    ] o.a.h.c.p.ResponseProcessCookies Invalid cookie header: "Set-Cookie: hadoop.auth=;
Path=/; Domain=127.0.0.1; Expires= , 01-   -1970 00:00:00 GMT; HttpOnly". Invalid 'expires'
attribute: , 01- -1970 00:00:00 GMT
   [junit4]   2> 154415 WARN  (TEST-TestSolrCloudWithDelegationTokens.testDelegationTokenCancel-seed#[73D32783679D0714])
[    ] o.a.h.c.p.ResponseProcessCookies Invalid cookie header: "Set-Cookie: hadoop.auth=;
Path=/; Domain=127.0.0.1; Expires= , 01-   -1970 00:00:00 GMT; HttpOnly". Invalid 'expires'
attribute: , 01- -1970 00:00:00 GMT
   [junit4]   2> 154434 ERROR (qtp1060310775-1415) [    ] o.a.h.s.t.d.ZKDelegationTokenSecretManager
No node in path [/ZKDTSMTokensRoot/DT_8]
   [junit4]   2> 154440 WARN  (TEST-TestSolrCloudWithDelegationTokens.testDelegationTokenCancel-seed#[73D32783679D0714])
[    ] o.a.h.c.p.ResponseProcessCookies Invalid cookie header: "Set-Cookie: hadoop.auth=;
Path=/; Domain=127.0.0.1; Expires= , 01-   -1970 00:00:00 GMT; HttpOnly". Invalid 'expires'
attribute: , 01- -1970 00:00:00 GMT
   [junit4]   2> 154445 INFO  (TEST-TestSolrCloudWithDelegationTokens.testDelegationTokenCancel-seed#[73D32783679D0714])
[    ] o.a.s.c.c.ZkStateReader Updated live nodes from ZooKeeper... (0) -> (2)
   [junit4]   2> 154448 WARN  (TEST-TestSolrCloudWithDelegationTokens.testDelegationTokenCancel-seed#[73D32783679D0714])
[    ] o.a.h.c.p.ResponseProcessCookies Invalid cookie header: "Set-Cookie: hadoop.auth=;
Path=/; Domain=127.0.0.1; Expires= , 01-   -1970 00:00:00 GMT; HttpOnly". Invalid 'expires'
attribute: , 01- -1970 00:00:00 GMT
   [junit4]   2> 154448 INFO  (TEST-TestSolrCloudWithDelegationTokens.testDelegationTokenCancel-seed#[73D32783679D0714])
[    ] o.a.s.SolrTestCaseJ4 ###Ending testDelegationTokenCancel
   [junit4]   2> 154460 INFO  (TEST-TestSolrCloudWithDelegationTokens.testDelegationTokenRenewFail-seed#[73D32783679D0714])
[    ] o.a.s.SolrTestCaseJ4 ###Starting testDelegationTokenRenewFail
   [junit4]   2> 154466 WARN  (qtp1108933276-1423) [n:127.0.0.1:35828_solr    ] o.a.h.s.a.s.AuthenticationFilter
Authentication exception: org.apache.hadoop.security.AccessControlException: foo tries to
renew a token with renewer bar
   [junit4]   2> 154466 WARN  (qtp1108933276-1423) [n:127.0.0.1:35828_solr    ] o.a.s.s.KerberosPlugin
Could not find org.apache.solr.security.kerberosplugin.requestcontinues
   [junit4]   2> 154467 WARN  (TEST-TestSolrCloudWithDelegationTokens.testDelegationTokenRenewFail-seed#[73D32783679D0714])
[    ] o.a.h.c.p.ResponseProcessCookies Invalid cookie header: "Set-Cookie: hadoop.auth=;
Path=/; Domain=127.0.0.1; Expires= , 01-   -1970 00:00:00 GMT; HttpOnly". Invalid 'expires'
attribute: , 01- -1970 00:00:00 GMT
   [junit4]   2> 154468 WARN  (qtp1060310775-1416) [    ] o.a.h.s.a.s.AuthenticationFilter
Authentication exception: org.apache.hadoop.security.AccessControlException: foo tries to
renew a token with renewer bar
   [junit4]   2> 154469 WARN  (qtp1060310775-1416) [    ] o.a.s.s.KerberosPlugin Could
not find org.apache.solr.security.kerberosplugin.requestcontinues
   [junit4]   2> 154469 WARN  (TEST-TestSolrCloudWithDelegationTokens.testDelegationTokenRenewFail-seed#[73D32783679D0714])
[    ] o.a.h.c.p.ResponseProcessCookies Invalid cookie header: "Set-Cookie: hadoop.auth=;
Path=/; Domain=127.0.0.1; Expires= , 01-   -1970 00:00:00 GMT; HttpOnly". Invalid 'expires'
attribute: , 01- -1970 00:00:00 GMT
   [junit4]   2> 154474 WARN  (qtp1108933276-1419) [    ] o.a.h.s.a.s.AuthenticationFilter
Authentication exception: org.apache.hadoop.security.AccessControlException: notRenewUser
tries to renew a token with renewer renewUser
   [junit4]   2> 154475 WARN  (qtp1108933276-1419) [    ] o.a.s.s.KerberosPlugin Could
not find org.apache.solr.security.kerberosplugin.requestcontinues
   [junit4]   2> 154475 WARN  (TEST-TestSolrCloudWithDelegationTokens.testDelegationTokenRenewFail-seed#[73D32783679D0714])
[    ] o.a.h.c.p.ResponseProcessCookies Invalid cookie header: "Set-Cookie: hadoop.auth=;
Path=/; Domain=127.0.0.1; Expires= , 01-   -1970 00:00:00 GMT; HttpOnly". Invalid 'expires'
attribute: , 01- -1970 00:00:00 GMT
   [junit4]   2> 154476 WARN  (qtp1060310775-1410) [n:127.0.0.1:44229_solr    ] o.a.h.s.a.s.AuthenticationFilter
Authentication exception: org.apache.hadoop.security.AccessControlException: notRenewUser
tries to renew a token with renewer renewUser
   [junit4]   2> 154477 WARN  (qtp1060310775-1410) [n:127.0.0.1:44229_solr    ] o.a.s.s.KerberosPlugin
Could not find org.apache.solr.security.kerberosplugin.requestcontinues
   [junit4]   2> 154477 WARN  (TEST-TestSolrCloudWithDelegationTokens.testDelegationTokenRenewFail-seed#[73D32783679D0714])
[    ] o.a.h.c.p.ResponseProcessCookies Invalid cookie header: "Set-Cookie: hadoop.auth=;
Path=/; Domain=127.0.0.1; Expires= , 01-   -1970 00:00:00 GMT; HttpOnly". Invalid 'expires'
attribute: , 01- -1970 00:00:00 GMT
   [junit4]   2> 154478 INFO  (TEST-TestSolrCloudWithDelegationTokens.testDelegationTokenRenewFail-seed#[73D32783679D0714])
[    ] o.a.s.SolrTestCaseJ4 ###Ending testDelegationTokenRenewFail
   [junit4]   2> 154491 INFO  (TEST-TestSolrCloudWithDelegationTokens.testDelegationOtherOp-seed#[73D32783679D0714])
[    ] o.a.s.SolrTestCaseJ4 ###Starting testDelegationOtherOp
   [junit4]   2> 154493 INFO  (qtp1108933276-1423) [n:127.0.0.1:35828_solr    ] o.a.s.h.a.CollectionsHandler
Invoked Collection Action :list with params op=someSolrOperation&action=LIST&wt=javabin&version=2
and sendToOCPQueue=true
   [junit4]   2> 154494 INFO  (qtp1108933276-1423) [n:127.0.0.1:35828_solr    ] o.a.s.s.HttpSolrCall
[admin] webapp=null path=/admin/collections params={op=someSolrOperation&action=LIST&wt=javabin&version=2}
status=0 QTime=0
   [junit4]   2> 154494 WARN  (TEST-TestSolrCloudWithDelegationTokens.testDelegationOtherOp-seed#[73D32783679D0714])
[    ] o.a.h.c.p.ResponseProcessCookies Invalid cookie header: "Set-Cookie: hadoop.auth="u=bar&p=bar&t=test&e=1477954593733&s=CzhSP494LgsA4hgPzx2w6x7n5LE=";
Path=/; Domain=127.0.0.1; Expires= , 31-   -2016 22:56:33 GMT; HttpOnly". Invalid 'expires'
attribute: , 31- -2016 22:56:33 GMT
   [junit4]   2> 154494 INFO  (TEST-TestSolrCloudWithDelegationTokens.testDelegationOtherOp-seed#[73D32783679D0714])
[    ] o.a.s.SolrTestCaseJ4 ###Ending testDelegationOtherOp
   [junit4]   2> 154515 INFO  (TEST-TestSolrCloudWithDelegationTokens.testDelegationTokenSolrClient-seed#[73D32783679D0714])
[    ] o.a.s.SolrTestCaseJ4 ###Starting testDelegationTokenSolrClient
   [junit4]   2> 154522 WARN  (TEST-TestSolrCloudWithDelegationTokens.testDelegationTokenSolrClient-seed#[73D32783679D0714])
[    ] o.a.h.c.p.ResponseProcessCookies Invalid cookie header: "Set-Cookie: hadoop.auth=;
Path=/; Domain=127.0.0.1; Expires= , 01-   -1970 00:00:00 GMT; HttpOnly". Invalid 'expires'
attribute: , 01- -1970 00:00:00 GMT
   [junit4]   2> 154527 INFO  (qtp1108933276-1421) [n:127.0.0.1:35828_solr    ] o.a.s.h.a.CollectionsHandler
Invoked Collection Action :list with params action=LIST&delegation=GgADYmFyA2JhcgCKAVga0BLcigFYPtyW3AsEFAOxZjSAmydUUs1VNSssTUOicx3VB3NvbHItZHQA&wt=javabin&version=2
and sendToOCPQueue=true
   [junit4]   2> 154527 INFO  (qtp1108933276-1421) [n:127.0.0.1:35828_solr    ] o.a.s.s.HttpSolrCall
[admin] webapp=null path=/admin/collections params={action=LIST&delegation=GgADYmFyA2JhcgCKAVga0BLcigFYPtyW3AsEFAOxZjSAmydUUs1VNSssTUOicx3VB3NvbHItZHQA&wt=javabin&version=2}
status=0 QTime=0
   [junit4]   2> 154528 INFO  (TEST-TestSolrCloudWithDelegationTokens.testDelegationTokenSolrClient-seed#[73D32783679D0714])
[    ] o.a.s.SolrTestCaseJ4 ###Ending testDelegationTokenSolrClient
   [junit4]   2> 154540 INFO  (TEST-TestSolrCloudWithDelegationTokens.testZNodePaths-seed#[73D32783679D0714])
[    ] o.a.s.SolrTestCaseJ4 ###Starting testZNodePaths
   [junit4]   2> 154547 INFO  (TEST-TestSolrCloudWithDelegationTokens.testZNodePaths-seed#[73D32783679D0714])
[    ] o.a.s.SolrTestCaseJ4 ###Ending testZNodePaths
   [junit4]   2> 154548 INFO  (jetty-launcher-225-thread-1) [    ] o.e.j.s.ServerConnector
Stopped ServerConnector@600a960{HTTP/1.1,[http/1.1]}{127.0.0.1:0}
   [junit4]   2> 154548 INFO  (jetty-launcher-225-thread-1) [    ] o.a.s.c.CoreContainer
Shutting down CoreContainer instance=1037347470
   [junit4]   2> 154548 INFO  (jetty-launcher-225-thread-2) [    ] o.e.j.s.ServerConnector
Stopped ServerConnector@3d4d6386{HTTP/1.1,[http/1.1]}{127.0.0.1:0}
   [junit4]   2> 154548 INFO  (jetty-launcher-225-thread-2) [    ] o.a.s.c.CoreContainer
Shutting down CoreContainer instance=1478028875
   [junit4]   2> 154551 WARN  (zkCallback-236-thread-1-processing-n:127.0.0.1:35828_solr)
[n:127.0.0.1:35828_solr    ] o.a.s.c.c.ZkStateReader ZooKeeper watch triggered, but Solr cannot
talk to ZK: [KeeperErrorCode = Session expired for /live_nodes]
   [junit4]   2> 154551 ERROR (Thread[Thread-373,5,TGRP-TestSolrCloudWithDelegationTokens])
[n:127.0.0.1:35828_solr    ] o.a.h.s.t.d.AbstractDelegationTokenSecretManager ExpiredTokenRemover
received java.lang.InterruptedException: sleep interrupted
   [junit4]   2> 154552 INFO  (jetty-launcher-225-thread-2) [    ] o.a.s.c.Overseer Overseer
(id=96856872865497093-127.0.0.1:44229_solr-n_0000000000) closing
   [junit4]   2> 154552 INFO  (OverseerStateUpdate-96856872865497093-127.0.0.1:44229_solr-n_0000000000)
[n:127.0.0.1:44229_solr    ] o.a.s.c.Overseer Overseer Loop exiting : 127.0.0.1:44229_solr
   [junit4]   2> 154560 INFO  (jetty-launcher-225-thread-1) [    ] o.e.j.s.h.ContextHandler
Stopped o.e.j.s.ServletContextHandler@32fa9995{/solr,null,UNAVAILABLE}
   [junit4]   2> 156052 WARN  (zkCallback-235-thread-1-processing-n:127.0.0.1:44229_solr)
[n:127.0.0.1:44229_solr    ] o.a.s.c.c.ZkStateReader ZooKeeper watch triggered, but Solr cannot
talk to ZK: [KeeperErrorCode = Session expired for /live_nodes]
   [junit4]   2> 156052 ERROR (Thread[Thread-374,5,TGRP-TestSolrCloudWithDelegationTokens])
[n:127.0.0.1:44229_solr    ] o.a.h.s.t.d.AbstractDelegationTokenSecretManager ExpiredTokenRemover
received java.lang.InterruptedException: sleep interrupted
   [junit4]   2> 156054 INFO  (jetty-launcher-225-thread-2) [    ] o.e.j.s.h.ContextHandler
Stopped o.e.j.s.ServletContextHandler@14cb8d23{/solr,null,UNAVAILABLE}
   [junit4]   2> 156054 INFO  (SUITE-TestSolrCloudWithDelegationTokens-seed#[73D32783679D0714]-worker)
[    ] o.a.s.c.ZkTestServer connecting to 127.0.0.1:32889 32889
   [junit4]   2> 156118 INFO  (Thread-355) [    ] o.a.s.c.ZkTestServer connecting to 127.0.0.1:32889
32889
   [junit4]   2> 156118 WARN  (Thread-355) [    ] o.a.s.c.ZkTestServer Watch limit violations:

   [junit4]   2> Maximum concurrent create/delete watches above limit:
   [junit4]   2> 
   [junit4]   2> 	12	/solr/aliases.json
   [junit4]   2> 	12	/solr/clusterprops.json
   [junit4]   2> 	2	/solr/security.json
   [junit4]   2> 
   [junit4]   2> Maximum concurrent data watches above limit:
   [junit4]   2> 
   [junit4]   2> 	12	/solr/clusterstate.json
   [junit4]   2> 	4	/solr/security/zkdtsm/ZKDTSMRoot/ZKDTSMKeyIdRoot
   [junit4]   2> 	2	/solr/security/zkdtsm/ZKDTSMRoot/ZKDTSMTokensRoot/DT_7
   [junit4]   2> 	2	/solr/security/zkdtsm/ZKDTSMRoot/ZKDTSMTokensRoot/DT_6
   [junit4]   2> 	2	/solr/security/zkdtsm/ZKDTSMRoot/ZKDTSMTokensRoot/DT_9
   [junit4]   2> 	2	/solr/security/zkdtsm/ZKDTSMRoot/ZKDTSMTokensRoot/DT_8
   [junit4]   2> 	2	/solr/security/zkdtsm/ZKDTSMRoot/ZKDTSMMasterKeyRoot/DK_1
   [junit4]   2> 	2	/solr/security/zkdtsm/ZKDTSMRoot/ZKDTSMTokensRoot/DT_1
   [junit4]   2> 	2	/solr/security/zkdtsm/ZKDTSMRoot/ZKDTSMMasterKeyRoot/DK_3
   [junit4]   2> 	2	/solr/security/zkdtsm/ZKDTSMRoot/ZKDTSMTokensRoot/DT_3
   [junit4]   2> 	2	/solr/security/zkdtsm/ZKDTSMRoot/ZKDTSMMasterKeyRoot/DK_2
   [junit4]   2> 	2	/solr/security/zkdtsm/ZKDTSMRoot/ZKDTSMTokensRoot/DT_2
   [junit4]   2> 	2	/solr/security/zkdtsm/ZKDTSMRoot/ZKDTSMTokensRoot/DT_5
   [junit4]   2> 	2	/solr/security/zkdtsm/ZKDTSMRoot/ZKDTSMMasterKeyRoot/DK_4
   [junit4]   2> 	2	/solr/security/zkdtsm/ZKDTSMRoot/ZKDTSMTokensRoot/DT_4
   [junit4]   2> 	2	/solr/security/zkdtsm/ZKDTSMRoot/ZKDTSMTokensRoot/DT_12
   [junit4]   2> 	2	/solr/security/zkdtsm/ZKDTSMRoot/ZKDTSMSeqNumRoot
   [junit4]   2> 	2	/solr/security/zkdtsm/ZKDTSMRoot/ZKDTSMTokensRoot/DT_11
   [junit4]   2> 	2	/solr/security/zkdtsm/ZKDTSMRoot/ZKDTSMTokensRoot/DT_10
   [junit4]   2> 
   [junit4]   2> Maximum concurrent children watches above limit:
   [junit4]   2> 
   [junit4]   2> 	12	/solr/live_nodes
   [junit4]   2> 	12	/solr/collections
   [junit4]   2> 	2	/solr/overseer/queue
   [junit4]   2> 	2	/solr/security/zkdtsm/ZKDTSMRoot/ZKDTSMMasterKeyRoot
   [junit4]   2> 	2	/solr/overseer/queue-work
   [junit4]   2> 	2	/solr/security/zkdtsm/ZKDTSMRoot/ZKDTSMTokensRoot
   [junit4]   2> 
   [junit4]   2> 156119 INFO  (SUITE-TestSolrCloudWithDelegationTokens-seed#[73D32783679D0714]-worker)
[    ] o.a.s.SolrTestCaseJ4 ###deleteCore
   [junit4]   2> NOTE: leaving temporary files on disk at: /home/jenkins/workspace/Lucene-Solr-master-Linux/solr/build/solr-core/test/J2/temp/solr.cloud.TestSolrCloudWithDelegationTokens_73D32783679D0714-001
   [junit4]   2> Oct 31, 2016 12:56:35 PM com.carrotsearch.randomizedtesting.ThreadLeakControl
checkThreadLeaks
   [junit4]   2> WARNING: Will linger awaiting termination of 2 leaked thread(s).
   [junit4]   2> NOTE: test params are: codec=Asserting(Lucene70): {}, docValues:{}, maxPointsInLeafNode=310,
maxMBSortInHeap=6.431054123297628, sim=ClassicSimilarity, locale=ar-MA, timezone=Africa/Mogadishu
   [junit4]   2> NOTE: Linux 4.4.0-42-generic amd64/Oracle Corporation 1.8.0_102 (32-bit)/cpus=12,threads=1,free=134169136,total=526385152
   [junit4]   2> NOTE: All tests run in this JVM: [CursorMarkTest, TestXmlQParser, TestCSVResponseWriter,
UnloadDistributedZkTest, CdcrRequestHandlerTest, TestRecovery, TestExtendedDismaxParser, CollectionStateFormat2Test,
TestSchemaNameResource, TestConfigReload, DirectUpdateHandlerOptimizeTest, TestZkChroot, TestExactSharedStatsCache,
DistributedFacetExistsSmallTest, TestPhraseSuggestions, TestSolrQueryParserResource, TestPHPSerializedResponseWriter,
TestSolrCloudWithDelegationTokens]
   [junit4] Completed [66/647 (1!)] on J2 in 3.83s, 8 tests, 1 failure <<< FAILURES!

[...truncated 62250 lines...]


Mime
View raw message