lucene-dev mailing list archives

Site index · List index
Message view « Date » · « Thread »
Top « Date » · « Thread »
From Policeman Jenkins Server <jenk...@thetaphi.de>
Subject [JENKINS-EA] Lucene-Solr-6.3-Linux (64bit/jdk-9-ea+140) - Build # 1 - Unstable!
Date Mon, 31 Oct 2016 20:52:50 GMT
Build: https://jenkins.thetaphi.de/job/Lucene-Solr-6.3-Linux/1/
Java: 64bit/jdk-9-ea+140 -XX:-UseCompressedOops -XX:+UseG1GC

1 tests failed.
FAILED:  org.apache.solr.cloud.OverseerTaskQueueTest.testPeekElements

Error Message:


Stack Trace:
java.lang.AssertionError
	at __randomizedtesting.SeedInfo.seed([E3A3816B211942F8:1E8D3B4AF12016E5]:0)
	at org.junit.Assert.fail(Assert.java:92)
	at org.junit.Assert.assertTrue(Assert.java:43)
	at org.junit.Assert.assertTrue(Assert.java:54)
	at org.apache.solr.cloud.DistributedQueueTest.testPeekElements(DistributedQueueTest.java:181)
	at jdk.internal.reflect.NativeMethodAccessorImpl.invoke0(java.base@9-ea/Native Method)
	at jdk.internal.reflect.NativeMethodAccessorImpl.invoke(java.base@9-ea/NativeMethodAccessorImpl.java:62)
	at jdk.internal.reflect.DelegatingMethodAccessorImpl.invoke(java.base@9-ea/DelegatingMethodAccessorImpl.java:43)
	at java.lang.reflect.Method.invoke(java.base@9-ea/Method.java:535)
	at com.carrotsearch.randomizedtesting.RandomizedRunner.invoke(RandomizedRunner.java:1713)
	at com.carrotsearch.randomizedtesting.RandomizedRunner$8.evaluate(RandomizedRunner.java:907)
	at com.carrotsearch.randomizedtesting.RandomizedRunner$9.evaluate(RandomizedRunner.java:943)
	at com.carrotsearch.randomizedtesting.RandomizedRunner$10.evaluate(RandomizedRunner.java:957)
	at com.carrotsearch.randomizedtesting.rules.SystemPropertiesRestoreRule$1.evaluate(SystemPropertiesRestoreRule.java:57)
	at org.apache.lucene.util.TestRuleSetupTeardownChained$1.evaluate(TestRuleSetupTeardownChained.java:49)
	at org.apache.lucene.util.AbstractBeforeAfterRule$1.evaluate(AbstractBeforeAfterRule.java:45)
	at org.apache.lucene.util.TestRuleThreadAndTestName$1.evaluate(TestRuleThreadAndTestName.java:48)
	at org.apache.lucene.util.TestRuleIgnoreAfterMaxFailures$1.evaluate(TestRuleIgnoreAfterMaxFailures.java:64)
	at org.apache.lucene.util.TestRuleMarkFailure$1.evaluate(TestRuleMarkFailure.java:47)
	at com.carrotsearch.randomizedtesting.rules.StatementAdapter.evaluate(StatementAdapter.java:36)
	at com.carrotsearch.randomizedtesting.ThreadLeakControl$StatementRunner.run(ThreadLeakControl.java:367)
	at com.carrotsearch.randomizedtesting.ThreadLeakControl.forkTimeoutingTask(ThreadLeakControl.java:811)
	at com.carrotsearch.randomizedtesting.ThreadLeakControl$3.evaluate(ThreadLeakControl.java:462)
	at com.carrotsearch.randomizedtesting.RandomizedRunner.runSingleTest(RandomizedRunner.java:916)
	at com.carrotsearch.randomizedtesting.RandomizedRunner$5.evaluate(RandomizedRunner.java:802)
	at com.carrotsearch.randomizedtesting.RandomizedRunner$6.evaluate(RandomizedRunner.java:852)
	at com.carrotsearch.randomizedtesting.RandomizedRunner$7.evaluate(RandomizedRunner.java:863)
	at com.carrotsearch.randomizedtesting.rules.StatementAdapter.evaluate(StatementAdapter.java:36)
	at com.carrotsearch.randomizedtesting.rules.SystemPropertiesRestoreRule$1.evaluate(SystemPropertiesRestoreRule.java:57)
	at org.apache.lucene.util.AbstractBeforeAfterRule$1.evaluate(AbstractBeforeAfterRule.java:45)
	at com.carrotsearch.randomizedtesting.rules.StatementAdapter.evaluate(StatementAdapter.java:36)
	at org.apache.lucene.util.TestRuleStoreClassName$1.evaluate(TestRuleStoreClassName.java:41)
	at com.carrotsearch.randomizedtesting.rules.NoShadowingOrOverridesOnMethodsRule$1.evaluate(NoShadowingOrOverridesOnMethodsRule.java:40)
	at com.carrotsearch.randomizedtesting.rules.NoShadowingOrOverridesOnMethodsRule$1.evaluate(NoShadowingOrOverridesOnMethodsRule.java:40)
	at com.carrotsearch.randomizedtesting.rules.StatementAdapter.evaluate(StatementAdapter.java:36)
	at com.carrotsearch.randomizedtesting.rules.StatementAdapter.evaluate(StatementAdapter.java:36)
	at com.carrotsearch.randomizedtesting.rules.StatementAdapter.evaluate(StatementAdapter.java:36)
	at org.apache.lucene.util.TestRuleAssertionsRequired$1.evaluate(TestRuleAssertionsRequired.java:53)
	at org.apache.lucene.util.TestRuleMarkFailure$1.evaluate(TestRuleMarkFailure.java:47)
	at org.apache.lucene.util.TestRuleIgnoreAfterMaxFailures$1.evaluate(TestRuleIgnoreAfterMaxFailures.java:64)
	at org.apache.lucene.util.TestRuleIgnoreTestSuites$1.evaluate(TestRuleIgnoreTestSuites.java:54)
	at com.carrotsearch.randomizedtesting.rules.StatementAdapter.evaluate(StatementAdapter.java:36)
	at com.carrotsearch.randomizedtesting.ThreadLeakControl$StatementRunner.run(ThreadLeakControl.java:367)
	at java.lang.Thread.run(java.base@9-ea/Thread.java:843)




Build Log:
[...truncated 11269 lines...]
   [junit4] Suite: org.apache.solr.cloud.OverseerTaskQueueTest
   [junit4]   2> Creating dataDir: /home/jenkins/workspace/Lucene-Solr-6.3-Linux/solr/build/solr-core/test/J1/temp/solr.cloud.OverseerTaskQueueTest_E3A3816B211942F8-001/init-core-data-001
   [junit4]   2> 660381 INFO  (SUITE-OverseerTaskQueueTest-seed#[E3A3816B211942F8]-worker)
[    ] o.a.s.SolrTestCaseJ4 Randomized ssl (true) and clientAuth (false) via: @org.apache.solr.util.RandomizeSSL(reason="",
ssl=0.0/0.0, value=0.0/0.0, clientAuth=0.0/0.0)
   [junit4]   2> 660384 INFO  (TEST-OverseerTaskQueueTest.testDistributedQueueBlocking-seed#[E3A3816B211942F8])
[    ] o.a.s.SolrTestCaseJ4 ###Starting testDistributedQueueBlocking
   [junit4]   2> 660384 INFO  (TEST-OverseerTaskQueueTest.testDistributedQueueBlocking-seed#[E3A3816B211942F8])
[    ] o.a.s.c.ZkTestServer STARTING ZK TEST SERVER
   [junit4]   2> 660384 INFO  (Thread-1314) [    ] o.a.s.c.ZkTestServer client port:0.0.0.0/0.0.0.0:0
   [junit4]   2> 660384 INFO  (Thread-1314) [    ] o.a.s.c.ZkTestServer Starting server
   [junit4]   2> 660484 INFO  (TEST-OverseerTaskQueueTest.testDistributedQueueBlocking-seed#[E3A3816B211942F8])
[    ] o.a.s.c.ZkTestServer start zk server on port:36765
   [junit4]   2> 661692 WARN  (zkCallback-859-thread-2) [    ] o.a.s.c.c.ConnectionManager
Watcher org.apache.solr.common.cloud.ConnectionManager@5e22b066 name: ZooKeeperConnection
Watcher:127.0.0.1:36765/solr got event WatchedEvent state:Disconnected type:None path:null
path: null type: None
   [junit4]   2> 661692 WARN  (zkCallback-859-thread-2) [    ] o.a.s.c.c.ConnectionManager
zkClient has disconnected
   [junit4]   2> 662752 WARN  (zkCallback-859-thread-2) [    ] o.a.s.c.c.ConnectionManager
Watcher org.apache.solr.common.cloud.ConnectionManager@5e22b066 name: ZooKeeperConnection
Watcher:127.0.0.1:36765/solr got event WatchedEvent state:Expired type:None path:null path:
null type: None
   [junit4]   2> 662752 WARN  (zkCallback-859-thread-2) [    ] o.a.s.c.c.ConnectionManager
Our previous ZooKeeper session was expired. Attempting to reconnect to recover relationship
with ZooKeeper...
   [junit4]   2> 662752 WARN  (zkCallback-859-thread-2) [    ] o.a.s.c.c.DefaultConnectionStrategy
Connection expired - starting a new one...
   [junit4]   2> 662753 INFO  (zkCallback-859-thread-2) [    ] o.a.s.c.c.ConnectionManager
Connection with ZooKeeper reestablished.
   [junit4]   2> 662753 INFO  (zkCallback-859-thread-2) [    ] o.a.s.c.c.DefaultConnectionStrategy
Reconnected to ZooKeeper
   [junit4]   2> 662753 INFO  (zkCallback-859-thread-2) [    ] o.a.s.c.c.ConnectionManager
Connected:true
   [junit4]   2> 663905 INFO  (TEST-OverseerTaskQueueTest.testDistributedQueueBlocking-seed#[E3A3816B211942F8])
[    ] o.a.s.SolrTestCaseJ4 ###Ending testDistributedQueueBlocking
   [junit4]   2> 663906 INFO  (TEST-OverseerTaskQueueTest.testDistributedQueueBlocking-seed#[E3A3816B211942F8])
[    ] o.a.s.c.ZkTestServer connecting to 127.0.0.1:36765 36765
   [junit4]   2> 663999 INFO  (Thread-1314) [    ] o.a.s.c.ZkTestServer connecting to 127.0.0.1:36765
36765
   [junit4]   2> 664000 WARN  (Thread-1314) [    ] o.a.s.c.ZkTestServer Watch limit violations:

   [junit4]   2> Maximum concurrent children watches above limit:
   [junit4]   2> 
   [junit4]   2> 	3	/solr/distqueue/test
   [junit4]   2> 
   [junit4]   2> 664001 INFO  (TEST-OverseerTaskQueueTest.testPeekElements-seed#[E3A3816B211942F8])
[    ] o.a.s.SolrTestCaseJ4 ###Starting testPeekElements
   [junit4]   2> 664001 INFO  (TEST-OverseerTaskQueueTest.testPeekElements-seed#[E3A3816B211942F8])
[    ] o.a.s.c.ZkTestServer STARTING ZK TEST SERVER
   [junit4]   2> 664001 INFO  (Thread-1315) [    ] o.a.s.c.ZkTestServer client port:0.0.0.0/0.0.0.0:0
   [junit4]   2> 664001 INFO  (Thread-1315) [    ] o.a.s.c.ZkTestServer Starting server
   [junit4]   2> 664101 INFO  (TEST-OverseerTaskQueueTest.testPeekElements-seed#[E3A3816B211942F8])
[    ] o.a.s.c.ZkTestServer start zk server on port:41391
   [junit4]   2> 666903 INFO  (TEST-OverseerTaskQueueTest.testPeekElements-seed#[E3A3816B211942F8])
[    ] o.a.s.SolrTestCaseJ4 ###Ending testPeekElements
   [junit4]   2> 666904 INFO  (TEST-OverseerTaskQueueTest.testPeekElements-seed#[E3A3816B211942F8])
[    ] o.a.s.c.ZkTestServer connecting to 127.0.0.1:41391 41391
   [junit4]   2> 666996 INFO  (Thread-1315) [    ] o.a.s.c.ZkTestServer connecting to 127.0.0.1:41391
41391
   [junit4]   2> NOTE: reproduce with: ant test  -Dtestcase=OverseerTaskQueueTest -Dtests.method=testPeekElements
-Dtests.seed=E3A3816B211942F8 -Dtests.multiplier=3 -Dtests.slow=true -Dtests.locale=ksh-DE
-Dtests.timezone=Africa/Timbuktu -Dtests.asserts=true -Dtests.file.encoding=US-ASCII
   [junit4] FAILURE 3.00s J1 | OverseerTaskQueueTest.testPeekElements <<<
   [junit4]    > Throwable #1: java.lang.AssertionError
   [junit4]    > 	at __randomizedtesting.SeedInfo.seed([E3A3816B211942F8:1E8D3B4AF12016E5]:0)
   [junit4]    > 	at org.apache.solr.cloud.DistributedQueueTest.testPeekElements(DistributedQueueTest.java:181)
   [junit4]    > 	at jdk.internal.reflect.NativeMethodAccessorImpl.invoke0(java.base@9-ea/Native
Method)
   [junit4]    > 	at jdk.internal.reflect.NativeMethodAccessorImpl.invoke(java.base@9-ea/NativeMethodAccessorImpl.java:62)
   [junit4]    > 	at jdk.internal.reflect.DelegatingMethodAccessorImpl.invoke(java.base@9-ea/DelegatingMethodAccessorImpl.java:43)
   [junit4]    > 	at java.lang.Thread.run(java.base@9-ea/Thread.java:843)
   [junit4]   2> 666999 INFO  (TEST-OverseerTaskQueueTest.testContainsTaskWithRequestId-seed#[E3A3816B211942F8])
[    ] o.a.s.SolrTestCaseJ4 ###Starting testContainsTaskWithRequestId
   [junit4]   2> 667000 INFO  (TEST-OverseerTaskQueueTest.testContainsTaskWithRequestId-seed#[E3A3816B211942F8])
[    ] o.a.s.c.ZkTestServer STARTING ZK TEST SERVER
   [junit4]   2> 667000 INFO  (Thread-1316) [    ] o.a.s.c.ZkTestServer client port:0.0.0.0/0.0.0.0:0
   [junit4]   2> 667000 INFO  (Thread-1316) [    ] o.a.s.c.ZkTestServer Starting server
   [junit4]   2> 667100 INFO  (TEST-OverseerTaskQueueTest.testContainsTaskWithRequestId-seed#[E3A3816B211942F8])
[    ] o.a.s.c.ZkTestServer start zk server on port:42893
   [junit4]   2> 667108 INFO  (TEST-OverseerTaskQueueTest.testContainsTaskWithRequestId-seed#[E3A3816B211942F8])
[    ] o.a.s.SolrTestCaseJ4 ###Ending testContainsTaskWithRequestId
   [junit4]   2> 667108 INFO  (TEST-OverseerTaskQueueTest.testContainsTaskWithRequestId-seed#[E3A3816B211942F8])
[    ] o.a.s.c.ZkTestServer connecting to 127.0.0.1:42893 42893
   [junit4]   2> 667288 INFO  (Thread-1316) [    ] o.a.s.c.ZkTestServer connecting to 127.0.0.1:42893
42893
   [junit4]   2> 667289 INFO  (TEST-OverseerTaskQueueTest.testDistributedQueue-seed#[E3A3816B211942F8])
[    ] o.a.s.SolrTestCaseJ4 ###Starting testDistributedQueue
   [junit4]   2> 667290 INFO  (TEST-OverseerTaskQueueTest.testDistributedQueue-seed#[E3A3816B211942F8])
[    ] o.a.s.c.ZkTestServer STARTING ZK TEST SERVER
   [junit4]   2> 667290 INFO  (Thread-1317) [    ] o.a.s.c.ZkTestServer client port:0.0.0.0/0.0.0.0:0
   [junit4]   2> 667290 INFO  (Thread-1317) [    ] o.a.s.c.ZkTestServer Starting server
   [junit4]   2> 667390 INFO  (TEST-OverseerTaskQueueTest.testDistributedQueue-seed#[E3A3816B211942F8])
[    ] o.a.s.c.ZkTestServer start zk server on port:37139
   [junit4]   2> 669400 INFO  (TEST-OverseerTaskQueueTest.testDistributedQueue-seed#[E3A3816B211942F8])
[    ] o.a.s.SolrTestCaseJ4 ###Ending testDistributedQueue
   [junit4]   2> 669401 INFO  (TEST-OverseerTaskQueueTest.testDistributedQueue-seed#[E3A3816B211942F8])
[    ] o.a.s.c.ZkTestServer connecting to 127.0.0.1:37139 37139
   [junit4]   2> 669413 INFO  (Thread-1317) [    ] o.a.s.c.ZkTestServer connecting to 127.0.0.1:37139
37139
   [junit4]   2> 669413 WARN  (Thread-1317) [    ] o.a.s.c.ZkTestServer Watch limit violations:

   [junit4]   2> Maximum concurrent children watches above limit:
   [junit4]   2> 
   [junit4]   2> 	4	/solr/distqueue/test
   [junit4]   2> 
   [junit4]   2> 669414 INFO  (SUITE-OverseerTaskQueueTest-seed#[E3A3816B211942F8]-worker)
[    ] o.a.s.SolrTestCaseJ4 ###deleteCore
   [junit4]   2> NOTE: leaving temporary files on disk at: /home/jenkins/workspace/Lucene-Solr-6.3-Linux/solr/build/solr-core/test/J1/temp/solr.cloud.OverseerTaskQueueTest_E3A3816B211942F8-001
   [junit4]   2> Oct 31, 2016 8:17:52 PM com.carrotsearch.randomizedtesting.ThreadLeakControl
checkThreadLeaks
   [junit4]   2> WARNING: Will linger awaiting termination of 2 leaked thread(s).
   [junit4]   2> NOTE: test params are: codec=Asserting(Lucene62): {}, docValues:{}, maxPointsInLeafNode=1479,
maxMBSortInHeap=5.858694014075795, sim=ClassicSimilarity, locale=ksh-DE, timezone=Africa/Timbuktu
   [junit4]   2> NOTE: Linux 4.4.0-42-generic amd64/Oracle Corporation 9-ea (64-bit)/cpus=12,threads=1,free=327613840,total=536870912
   [junit4]   2> NOTE: All tests run in this JVM: [TestCloudDeleteByQuery, TestFastOutputStream,
SmileWriterTest, SampleTest, TestExactStatsCache, BasicFunctionalityTest, CoreMergeIndexesAdminHandlerTest,
TestCharFilters, SuggestComponentContextFilterQueryTest, TestNumericTerms64, TestHashPartitioner,
TestFieldTypeCollectionResource, DocValuesTest, MoreLikeThisHandlerTest, SearchHandlerTest,
QueryResultKeyTest, TestWordDelimiterFilterFactory, BlockCacheTest, CollectionReloadTest,
TestObjectReleaseTracker, CollectionsAPIAsyncDistributedZkTest, DistributedTermsComponentTest,
DistribJoinFromCollectionTest, TestCursorMarkWithoutUniqueKey, TestFilteredDocIdSet, HdfsBasicDistributedZkTest,
HdfsWriteToMultipleCollectionsTest, TestMacroExpander, TestExpandComponent, TestReplicationHandlerBackup,
AliasIntegrationTest, ZkControllerTest, LeaderFailoverAfterPartitionTest, TestQueryTypes,
TestRestManager, CollectionsAPIDistributedZkTest, TestManagedSchema, SegmentsInfoRequestHandlerTest,
TestFieldCacheWithThreads, TestSearchPerf, TestRequestForwarding, PreAnalyzedUpdateProcessorTest,
AnalysisErrorHandlingTest, TestSchemaResource, TestSchemaManager, TestElisionMultitermQuery,
BigEndianAscendingWordSerializerTest, TestTestInjection, LeaderInitiatedRecoveryOnShardRestartTest,
TestAddFieldRealTimeGet, DistributedFacetPivotWhiteBoxTest, ZkSolrClientTest, TestStressVersions,
SpellingQueryConverterTest, TestFieldCacheSort, TestHdfsUpdateLog, WrapperMergePolicyFactoryTest,
TestTrie, TestSimpleTrackingShardHandler, DeleteNodeTest, ChaosMonkeySafeLeaderTest, DirectSolrSpellCheckerTest,
AnalyticsMergeStrategyTest, ZkCLITest, TestLuceneMatchVersion, TestCSVResponseWriter, RestartWhileUpdatingTest,
DistributedMLTComponentTest, TestCopyFieldCollectionResource, DistributedExpandComponentTest,
TestMiniSolrCloudClusterSSL, TestLRUCache, TestBlobHandler, TestDynamicFieldResource, TermVectorComponentTest,
OverseerTaskQueueTest]
   [junit4] Completed [184/646 (1!)] on J1 in 9.55s, 4 tests, 1 failure <<< FAILURES!

[...truncated 51416 lines...]


Mime
View raw message