lucene-dev mailing list archives

Site index · List index
Message view « Date » · « Thread »
Top « Date » · « Thread »
From Policeman Jenkins Server <jenk...@thetaphi.de>
Subject [JENKINS-EA] Lucene-Solr-master-Linux (32bit/jdk-9-ea+147) - Build # 18570 - Unstable!
Date Tue, 20 Dec 2016 02:42:22 GMT
Build: https://jenkins.thetaphi.de/job/Lucene-Solr-master-Linux/18570/
Java: 32bit/jdk-9-ea+147 -server -XX:+UseParallelGC

2 tests failed.
FAILED:  junit.framework.TestSuite.org.apache.solr.security.hadoop.TestSolrCloudWithHadoopAuthPlugin

Error Message:
FIXME: SOLR-8182: This test fails under Java 9

Stack Trace:
com.carrotsearch.randomizedtesting.InternalAssumptionViolatedException: FIXME: SOLR-8182:
This test fails under Java 9
	at __randomizedtesting.SeedInfo.seed([AFF024E1892A1E18]:0)
	at com.carrotsearch.randomizedtesting.RandomizedTest.assumeTrue(RandomizedTest.java:667)
	at com.carrotsearch.randomizedtesting.RandomizedTest.assumeFalse(RandomizedTest.java:675)
	at org.apache.lucene.util.LuceneTestCase.assumeFalse(LuceneTestCase.java:850)
	at org.apache.solr.security.hadoop.TestSolrCloudWithHadoopAuthPlugin.setupClass(TestSolrCloudWithHadoopAuthPlugin.java:45)
	at java.base/jdk.internal.reflect.NativeMethodAccessorImpl.invoke0(Native Method)
	at java.base/jdk.internal.reflect.NativeMethodAccessorImpl.invoke(NativeMethodAccessorImpl.java:62)
	at java.base/jdk.internal.reflect.DelegatingMethodAccessorImpl.invoke(DelegatingMethodAccessorImpl.java:43)
	at java.base/java.lang.reflect.Method.invoke(Method.java:538)
	at com.carrotsearch.randomizedtesting.RandomizedRunner.invoke(RandomizedRunner.java:1713)
	at com.carrotsearch.randomizedtesting.RandomizedRunner$6.evaluate(RandomizedRunner.java:847)
	at com.carrotsearch.randomizedtesting.RandomizedRunner$7.evaluate(RandomizedRunner.java:863)
	at com.carrotsearch.randomizedtesting.rules.StatementAdapter.evaluate(StatementAdapter.java:36)
	at com.carrotsearch.randomizedtesting.rules.SystemPropertiesRestoreRule$1.evaluate(SystemPropertiesRestoreRule.java:57)
	at org.apache.lucene.util.AbstractBeforeAfterRule$1.evaluate(AbstractBeforeAfterRule.java:45)
	at com.carrotsearch.randomizedtesting.rules.StatementAdapter.evaluate(StatementAdapter.java:36)
	at org.apache.lucene.util.TestRuleStoreClassName$1.evaluate(TestRuleStoreClassName.java:41)
	at com.carrotsearch.randomizedtesting.rules.NoShadowingOrOverridesOnMethodsRule$1.evaluate(NoShadowingOrOverridesOnMethodsRule.java:40)
	at com.carrotsearch.randomizedtesting.rules.NoShadowingOrOverridesOnMethodsRule$1.evaluate(NoShadowingOrOverridesOnMethodsRule.java:40)
	at com.carrotsearch.randomizedtesting.rules.StatementAdapter.evaluate(StatementAdapter.java:36)
	at com.carrotsearch.randomizedtesting.rules.StatementAdapter.evaluate(StatementAdapter.java:36)
	at com.carrotsearch.randomizedtesting.rules.StatementAdapter.evaluate(StatementAdapter.java:36)
	at org.apache.lucene.util.TestRuleAssertionsRequired$1.evaluate(TestRuleAssertionsRequired.java:53)
	at org.apache.lucene.util.TestRuleMarkFailure$1.evaluate(TestRuleMarkFailure.java:47)
	at org.apache.lucene.util.TestRuleIgnoreAfterMaxFailures$1.evaluate(TestRuleIgnoreAfterMaxFailures.java:64)
	at org.apache.lucene.util.TestRuleIgnoreTestSuites$1.evaluate(TestRuleIgnoreTestSuites.java:54)
	at com.carrotsearch.randomizedtesting.rules.StatementAdapter.evaluate(StatementAdapter.java:36)
	at com.carrotsearch.randomizedtesting.ThreadLeakControl$StatementRunner.run(ThreadLeakControl.java:367)
	at java.base/java.lang.Thread.run(Thread.java:844)


FAILED:  junit.framework.TestSuite.org.apache.solr.security.hadoop.TestSolrCloudWithHadoopAuthPlugin

Error Message:


Stack Trace:
java.lang.NullPointerException
	at __randomizedtesting.SeedInfo.seed([AFF024E1892A1E18]:0)
	at org.apache.solr.security.hadoop.TestSolrCloudWithHadoopAuthPlugin.tearDownClass(TestSolrCloudWithHadoopAuthPlugin.java:62)
	at java.base/jdk.internal.reflect.NativeMethodAccessorImpl.invoke0(Native Method)
	at java.base/jdk.internal.reflect.NativeMethodAccessorImpl.invoke(NativeMethodAccessorImpl.java:62)
	at java.base/jdk.internal.reflect.DelegatingMethodAccessorImpl.invoke(DelegatingMethodAccessorImpl.java:43)
	at java.base/java.lang.reflect.Method.invoke(Method.java:538)
	at com.carrotsearch.randomizedtesting.RandomizedRunner.invoke(RandomizedRunner.java:1713)
	at com.carrotsearch.randomizedtesting.RandomizedRunner$7.evaluate(RandomizedRunner.java:870)
	at com.carrotsearch.randomizedtesting.rules.StatementAdapter.evaluate(StatementAdapter.java:36)
	at com.carrotsearch.randomizedtesting.rules.SystemPropertiesRestoreRule$1.evaluate(SystemPropertiesRestoreRule.java:57)
	at org.apache.lucene.util.AbstractBeforeAfterRule$1.evaluate(AbstractBeforeAfterRule.java:45)
	at com.carrotsearch.randomizedtesting.rules.StatementAdapter.evaluate(StatementAdapter.java:36)
	at org.apache.lucene.util.TestRuleStoreClassName$1.evaluate(TestRuleStoreClassName.java:41)
	at com.carrotsearch.randomizedtesting.rules.NoShadowingOrOverridesOnMethodsRule$1.evaluate(NoShadowingOrOverridesOnMethodsRule.java:40)
	at com.carrotsearch.randomizedtesting.rules.NoShadowingOrOverridesOnMethodsRule$1.evaluate(NoShadowingOrOverridesOnMethodsRule.java:40)
	at com.carrotsearch.randomizedtesting.rules.StatementAdapter.evaluate(StatementAdapter.java:36)
	at com.carrotsearch.randomizedtesting.rules.StatementAdapter.evaluate(StatementAdapter.java:36)
	at com.carrotsearch.randomizedtesting.rules.StatementAdapter.evaluate(StatementAdapter.java:36)
	at org.apache.lucene.util.TestRuleAssertionsRequired$1.evaluate(TestRuleAssertionsRequired.java:53)
	at org.apache.lucene.util.TestRuleMarkFailure$1.evaluate(TestRuleMarkFailure.java:47)
	at org.apache.lucene.util.TestRuleIgnoreAfterMaxFailures$1.evaluate(TestRuleIgnoreAfterMaxFailures.java:64)
	at org.apache.lucene.util.TestRuleIgnoreTestSuites$1.evaluate(TestRuleIgnoreTestSuites.java:54)
	at com.carrotsearch.randomizedtesting.rules.StatementAdapter.evaluate(StatementAdapter.java:36)
	at com.carrotsearch.randomizedtesting.ThreadLeakControl$StatementRunner.run(ThreadLeakControl.java:367)
	at java.base/java.lang.Thread.run(Thread.java:844)




Build Log:
[...truncated 11647 lines...]
   [junit4] Suite: org.apache.solr.security.hadoop.TestSolrCloudWithHadoopAuthPlugin
   [junit4]   2> Creating dataDir: /home/jenkins/workspace/Lucene-Solr-master-Linux/solr/build/solr-core/test/J2/temp/solr.security.hadoop.TestSolrCloudWithHadoopAuthPlugin_AFF024E1892A1E18-001/init-core-data-001
   [junit4]   2> 1057717 INFO  (SUITE-TestSolrCloudWithHadoopAuthPlugin-seed#[AFF024E1892A1E18]-worker)
[    ] o.a.s.SolrTestCaseJ4 Randomized ssl (true) and clientAuth (false) via: @org.apache.solr.util.RandomizeSSL(reason="",
ssl=0.0/0.0, value=0.0/0.0, clientAuth=0.0/0.0)
   [junit4]   2> 1057719 INFO  (SUITE-TestSolrCloudWithHadoopAuthPlugin-seed#[AFF024E1892A1E18]-worker)
[    ] o.a.s.SolrTestCaseJ4 ###deleteCore
   [junit4]   2> NOTE: test params are: codec=Asserting(Lucene70): {}, docValues:{}, maxPointsInLeafNode=686,
maxMBSortInHeap=5.149224188877082, sim=RandomSimilarity(queryNorm=false): {}, locale=fr-BJ,
timezone=Indian/Comoro
   [junit4]   2> NOTE: Linux 4.4.0-53-generic i386/Oracle Corporation 9-ea (32-bit)/cpus=12,threads=1,free=85363280,total=445120512
   [junit4]   2> NOTE: All tests run in this JVM: [TestHdfsUpdateLog, TestManagedStopFilterFactory,
HdfsChaosMonkeySafeLeaderTest, TestOnReconnectListenerSupport, StatsComponentTest, LeaderElectionTest,
BasicAuthIntegrationTest, TestConfigSets, TestBinaryField, TestHdfsBackupRestoreCore, TestFieldTypeResource,
ClassificationUpdateProcessorTest, DeleteReplicaTest, TestHashQParserPlugin, SharedFSAutoReplicaFailoverUtilsTest,
BinaryUpdateRequestHandlerTest, FieldAnalysisRequestHandlerTest, OverseerTest, TestClusterStateMutator,
CollectionStateFormat2Test, DistributedFacetPivotLargeTest, TestBulkSchemaAPI, SolrCoreCheckLockOnStartupTest,
UnloadDistributedZkTest, BlockCacheTest, TestLMDirichletSimilarityFactory, TestScoreJoinQPNoScore,
TlogReplayBufferedWhileIndexingTest, TestCollationField, SimpleFacetsTest, TestHdfsCloudBackupRestore,
ExternalFileFieldSortTest, DirectUpdateHandlerOptimizeTest, TestSolrQueryParser, SolrPluginUtilsTest,
DistributedQueueTest, TestWriterPerf, ForceLeaderTest, TestLuceneMatchVersion, SuggestComponentContextFilterQueryTest,
NoCacheHeaderTest, CloudMLTQParserTest, TestFieldCacheWithThreads, AutoCommitTest, DistribCursorPagingTest,
FieldMutatingUpdateProcessorTest, TestSubQueryTransformer, TermVectorComponentDistributedTest,
TestCloudManagedSchema, TestShardHandlerFactory, TestMergePolicyConfig, DirectUpdateHandlerTest,
ResourceLoaderTest, TestRawTransformer, TestStandardQParsers, SecurityConfHandlerTest, LeaderInitiatedRecoveryOnShardRestartTest,
TestDynamicLoading, HdfsRecoverLeaseTest, HdfsBasicDistributedZk2Test, IgnoreCommitOptimizeUpdateProcessorFactoryTest,
AssignTest, SaslZkACLProviderTest, SliceStateTest, HdfsDirectoryTest, BasicDistributedZk2Test,
CoreSorterTest, RecoveryZkTest, TestMiniSolrCloudCluster, TestFastOutputStream, PreAnalyzedFieldManagedSchemaCloudTest,
TestStressReorder, HighlighterConfigTest, RestartWhileUpdatingTest, URLClassifyProcessorTest,
TestCollationFieldDocValues, OutOfBoxZkACLAndCredentialsProvidersTest, ReplicaListTransformerTest,
XmlUpdateRequestHandlerTest, UUIDUpdateProcessorFallbackTest, CursorMarkTest, HdfsUnloadDistributedZkTest,
TestCloudPseudoReturnFields, TestManagedResource, DebugComponentTest, UtilsToolTest, SolrIndexConfigTest,
SolrCloudExampleTest, TestAuthorizationFramework, TestConfigSetsAPIZkFailure, OverseerTaskQueueTest,
TestInitParams, TemplateUpdateProcessorTest, CdcrBootstrapTest, TestPhraseSuggestions, TestCollectionAPI,
TestSolrCloudWithHadoopAuthPlugin]
   [junit4]   2> NOTE: reproduce with: ant test  -Dtestcase=TestSolrCloudWithHadoopAuthPlugin
-Dtests.seed=AFF024E1892A1E18 -Dtests.multiplier=3 -Dtests.slow=true -Dtests.locale=fr-BJ
-Dtests.timezone=Indian/Comoro -Dtests.asserts=true -Dtests.file.encoding=UTF-8
   [junit4] ERROR   0.00s J2 | TestSolrCloudWithHadoopAuthPlugin (suite) <<<
   [junit4]    > Assumption #1: FIXME: SOLR-8182: This test fails under Java 9Throwable
#2: java.lang.NullPointerException
   [junit4]    > 	at __randomizedtesting.SeedInfo.seed([AFF024E1892A1E18]:0)
   [junit4]    > 	at org.apache.solr.security.hadoop.TestSolrCloudWithHadoopAuthPlugin.tearDownClass(TestSolrCloudWithHadoopAuthPlugin.java:62)
   [junit4]    > 	at java.base/jdk.internal.reflect.NativeMethodAccessorImpl.invoke0(Native
Method)
   [junit4]    > 	at java.base/jdk.internal.reflect.NativeMethodAccessorImpl.invoke(NativeMethodAccessorImpl.java:62)
   [junit4]    > 	at java.base/jdk.internal.reflect.DelegatingMethodAccessorImpl.invoke(DelegatingMethodAccessorImpl.java:43)
   [junit4]    > 	at java.base/java.lang.reflect.Method.invoke(Method.java:538)
   [junit4]    > 	at java.base/java.lang.Thread.run(Thread.java:844)
   [junit4] Completed [309/663 (1!)] on J2 in 0.02s, 0 tests, 1 error <<< FAILURES!

[...truncated 52589 lines...]


Mime
View raw message